FailedConsole Output

Skipping 233 KB.. Full Log
1w2p/llvm-build/projects/libcxx/__config_site -std=c++14 -MD -MT projects/libcxx/src/CMakeFiles/cxx_shared.dir/iostream.cpp.o -MF projects/libcxx/src/CMakeFiles/cxx_shared.dir/iostream.cpp.o.d -o projects/libcxx/src/CMakeFiles/cxx_shared.dir/iostream.cpp.o -c /Users/buildslave/jenkins/libcxx_libcxxabi_trunk_testing/CI_ARCH/64/CI_EXCEPTIONS/ON/CI_STD/c++17/llvm-project/libcxx/src/iostream.cpp
[232/257] /Users/buildslave/jenkins/libcxx_libcxxabi_trunk_testing/CI_ARCH/64/CI_EXCEPTIONS/ON/CI_STD/c++17/host-compiler/bin/clang++  -D_DEBUG -D_LIBCPP_BUILDING_LIBRARY -D_LIBCPP_DEBUG=0 -D_LIBCPP_DISABLE_NEW_DELETE_DEFINITIONS -D_LIBCPP_HAS_NO_PRAGMA_SYSTEM_HEADER -D__STDC_CONSTANT_MACROS -D__STDC_FORMAT_MACROS -D__STDC_LIMIT_MACROS -Iprojects/libcxx/src -I/Users/buildslave/jenkins/libcxx_libcxxabi_trunk_testing/CI_ARCH/64/CI_EXCEPTIONS/ON/CI_STD/c++17/llvm-project/libcxx/src -I/Applications/Xcode.app/Contents/Developer/Platforms/MacOSX.platform/Developer/SDKs/MacOSX10.13.sdk/usr/include/libxml2 -Iinclude -I/Users/buildslave/jenkins/libcxx_libcxxabi_trunk_testing/CI_ARCH/64/CI_EXCEPTIONS/ON/CI_STD/c++17/llvm-project/llvm/include -Iprojects/libcxx/include/c++build -I/Users/buildslave/jenkins/libcxx_libcxxabi_trunk_testing/CI_ARCH/64/CI_EXCEPTIONS/ON/CI_STD/c++17/llvm-project/libcxx/include -fPIC -fvisibility-inlines-hidden -Werror=date-time -Werror=unguarded-availability-new -Wall -Wextra -Wno-unused-parameter -Wwrite-strings -Wcast-qual -Wmissing-field-initializers  -Wno-long-long -Wimplicit-fallthrough -Wcovered-switch-default -Wno-noexcept-type -Wnon-virtual-dtor -Wdelete-non-virtual-dtor -Wstring-conversion -fdiagnostics-color -Os  -arch i386 -arch x86_64 -isysroot /Applications/Xcode.app/Contents/Developer/Platforms/MacOSX.platform/Developer/SDKs/MacOSX10.13.sdk   -UNDEBUG -DLIBCXX_BUILDING_LIBCXXABI -nostdinc++ -fvisibility-inlines-hidden -fvisibility=hidden -Wall -Wextra -W -Wwrite-strings -Wno-unused-parameter -Wno-long-long -Werror=return-type -Wextra-semi -Wno-user-defined-literals -Wno-covered-switch-default -Wno-ignored-attributes -Wno-error -include /var/folders/9t/lrs73ptj6lv644zvh1fk2_gc0000gn/T/tmp.wC1Y1w2p/llvm-build/projects/libcxx/__config_site -std=c++14 -MD -MT projects/libcxx/src/CMakeFiles/cxx_shared.dir/stdexcept.cpp.o -MF projects/libcxx/src/CMakeFiles/cxx_shared.dir/stdexcept.cpp.o.d -o projects/libcxx/src/CMakeFiles/cxx_shared.dir/stdexcept.cpp.o -c /Users/buildslave/jenkins/libcxx_libcxxabi_trunk_testing/CI_ARCH/64/CI_EXCEPTIONS/ON/CI_STD/c++17/llvm-project/libcxx/src/stdexcept.cpp
[233/257] /Users/buildslave/jenkins/libcxx_libcxxabi_trunk_testing/CI_ARCH/64/CI_EXCEPTIONS/ON/CI_STD/c++17/host-compiler/bin/clang++  -D_LIBCPP_DISABLE_EXTERN_TEMPLATE -D_LIBCPP_ENABLE_CXX17_REMOVED_UNEXPECTED_FUNCTIONS -D_LIBCXXABI_BUILDING_LIBRARY -D__STDC_CONSTANT_MACROS -D__STDC_FORMAT_MACROS -D__STDC_LIMIT_MACROS -Iprojects/libcxxabi/src -I/Users/buildslave/jenkins/libcxx_libcxxabi_trunk_testing/CI_ARCH/64/CI_EXCEPTIONS/ON/CI_STD/c++17/llvm-project/libcxxabi/src -I/Applications/Xcode.app/Contents/Developer/Platforms/MacOSX.platform/Developer/SDKs/MacOSX10.13.sdk/usr/include/libxml2 -Iinclude -I/Users/buildslave/jenkins/libcxx_libcxxabi_trunk_testing/CI_ARCH/64/CI_EXCEPTIONS/ON/CI_STD/c++17/llvm-project/llvm/include -I/Users/buildslave/jenkins/libcxx_libcxxabi_trunk_testing/CI_ARCH/64/CI_EXCEPTIONS/ON/CI_STD/c++17/llvm-project/libcxxabi/include -I/Users/buildslave/jenkins/libcxx_libcxxabi_trunk_testing/CI_ARCH/64/CI_EXCEPTIONS/ON/CI_STD/c++17/llvm-project/libcxx/include -fPIC -fvisibility-inlines-hidden -Werror=date-time -Werror=unguarded-availability-new -Wall -Wextra -Wno-unused-parameter -Wwrite-strings -Wcast-qual -Wmissing-field-initializers -pedantic -Wno-long-long -Wimplicit-fallthrough -Wcovered-switch-default -Wno-noexcept-type -Wnon-virtual-dtor -Wdelete-non-virtual-dtor -Wstring-conversion -fdiagnostics-color  -Os -DNDEBUG -arch i386 -arch x86_64 -isysroot /Applications/Xcode.app/Contents/Developer/Platforms/MacOSX.platform/Developer/SDKs/MacOSX10.13.sdk -fPIC   -nostdinc++ -Werror=return-type -W -Wall -Wchar-subscripts -Wconversion -Wmismatched-tags -Wmissing-braces -Wnewline-eof -Wunused-function -Wshadow -Wshorten-64-to-32 -Wsign-compare -Wsign-conversion -Wstrict-aliasing=2 -Wstrict-overflow=4 -Wunused-parameter -Wunused-variable -Wwrite-strings -Wundef -Wno-error -pedantic -fstrict-aliasing -funwind-tables -D_DEBUG -std=c++11 -MD -MT projects/libcxxabi/src/CMakeFiles/cxxabi_shared.dir/cxa_demangle.cpp.o -MF projects/libcxxabi/src/CMakeFiles/cxxabi_shared.dir/cxa_demangle.cpp.o.d -o projects/libcxxabi/src/CMakeFiles/cxxabi_shared.dir/cxa_demangle.cpp.o -c /Users/buildslave/jenkins/libcxx_libcxxabi_trunk_testing/CI_ARCH/64/CI_EXCEPTIONS/ON/CI_STD/c++17/llvm-project/libcxxabi/src/cxa_demangle.cpp
[234/257] /Users/buildslave/jenkins/libcxx_libcxxabi_trunk_testing/CI_ARCH/64/CI_EXCEPTIONS/ON/CI_STD/c++17/host-compiler/bin/clang++  -D_DEBUG -D_LIBCPP_BUILDING_LIBRARY -D_LIBCPP_DEBUG=0 -D_LIBCPP_DISABLE_NEW_DELETE_DEFINITIONS -D_LIBCPP_HAS_NO_PRAGMA_SYSTEM_HEADER -D__STDC_CONSTANT_MACROS -D__STDC_FORMAT_MACROS -D__STDC_LIMIT_MACROS -Iprojects/libcxx/src -I/Users/buildslave/jenkins/libcxx_libcxxabi_trunk_testing/CI_ARCH/64/CI_EXCEPTIONS/ON/CI_STD/c++17/llvm-project/libcxx/src -I/Applications/Xcode.app/Contents/Developer/Platforms/MacOSX.platform/Developer/SDKs/MacOSX10.13.sdk/usr/include/libxml2 -Iinclude -I/Users/buildslave/jenkins/libcxx_libcxxabi_trunk_testing/CI_ARCH/64/CI_EXCEPTIONS/ON/CI_STD/c++17/llvm-project/llvm/include -Iprojects/libcxx/include/c++build -I/Users/buildslave/jenkins/libcxx_libcxxabi_trunk_testing/CI_ARCH/64/CI_EXCEPTIONS/ON/CI_STD/c++17/llvm-project/libcxx/include -fPIC -fvisibility-inlines-hidden -Werror=date-time -Werror=unguarded-availability-new -Wall -Wextra -Wno-unused-parameter -Wwrite-strings -Wcast-qual -Wmissing-field-initializers  -Wno-long-long -Wimplicit-fallthrough -Wcovered-switch-default -Wno-noexcept-type -Wnon-virtual-dtor -Wdelete-non-virtual-dtor -Wstring-conversion -fdiagnostics-color -Os  -arch i386 -arch x86_64 -isysroot /Applications/Xcode.app/Contents/Developer/Platforms/MacOSX.platform/Developer/SDKs/MacOSX10.13.sdk   -UNDEBUG -DLIBCXX_BUILDING_LIBCXXABI -nostdinc++ -fvisibility-inlines-hidden -fvisibility=hidden -Wall -Wextra -W -Wwrite-strings -Wno-unused-parameter -Wno-long-long -Werror=return-type -Wextra-semi -Wno-user-defined-literals -Wno-covered-switch-default -Wno-ignored-attributes -Wno-error -include /var/folders/9t/lrs73ptj6lv644zvh1fk2_gc0000gn/T/tmp.wC1Y1w2p/llvm-build/projects/libcxx/__config_site -std=c++14 -MD -MT projects/libcxx/src/CMakeFiles/cxx_shared.dir/shared_mutex.cpp.o -MF projects/libcxx/src/CMakeFiles/cxx_shared.dir/shared_mutex.cpp.o.d -o projects/libcxx/src/CMakeFiles/cxx_shared.dir/shared_mutex.cpp.o -c /Users/buildslave/jenkins/libcxx_libcxxabi_trunk_testing/CI_ARCH/64/CI_EXCEPTIONS/ON/CI_STD/c++17/llvm-project/libcxx/src/shared_mutex.cpp
[235/257] : && /Users/buildslave/jenkins/libcxx_libcxxabi_trunk_testing/CI_ARCH/64/CI_EXCEPTIONS/ON/CI_STD/c++17/host-compiler/bin/clang++ -fPIC -fvisibility-inlines-hidden -Werror=date-time -Werror=unguarded-availability-new -Wall -Wextra -Wno-unused-parameter -Wwrite-strings -Wcast-qual -Wmissing-field-initializers -pedantic -Wno-long-long -Wimplicit-fallthrough -Wcovered-switch-default -Wno-noexcept-type -Wnon-virtual-dtor -Wdelete-non-virtual-dtor -Wstring-conversion -fdiagnostics-color  -Os -DNDEBUG -arch i386 -arch x86_64 -isysroot /Applications/Xcode.app/Contents/Developer/Platforms/MacOSX.platform/Developer/SDKs/MacOSX10.13.sdk -dynamiclib -Wl,-headerpad_max_install_names -nodefaultlibs  -compatibility_version 1.0.0 -current_version 1.0.0 -o lib/libc++abi.1.0.dylib -install_name @rpath/libc++abi.1.dylib projects/libcxxabi/src/CMakeFiles/cxxabi_shared.dir/cxa_aux_runtime.cpp.o projects/libcxxabi/src/CMakeFiles/cxxabi_shared.dir/cxa_default_handlers.cpp.o projects/libcxxabi/src/CMakeFiles/cxxabi_shared.dir/cxa_demangle.cpp.o projects/libcxxabi/src/CMakeFiles/cxxabi_shared.dir/cxa_exception_storage.cpp.o projects/libcxxabi/src/CMakeFiles/cxxabi_shared.dir/cxa_guard.cpp.o projects/libcxxabi/src/CMakeFiles/cxxabi_shared.dir/cxa_handlers.cpp.o projects/libcxxabi/src/CMakeFiles/cxxabi_shared.dir/cxa_unexpected.cpp.o projects/libcxxabi/src/CMakeFiles/cxxabi_shared.dir/cxa_vector.cpp.o projects/libcxxabi/src/CMakeFiles/cxxabi_shared.dir/cxa_virtual.cpp.o projects/libcxxabi/src/CMakeFiles/cxxabi_shared.dir/stdlib_exception.cpp.o projects/libcxxabi/src/CMakeFiles/cxxabi_shared.dir/stdlib_stdexcept.cpp.o projects/libcxxabi/src/CMakeFiles/cxxabi_shared.dir/stdlib_typeinfo.cpp.o projects/libcxxabi/src/CMakeFiles/cxxabi_shared.dir/abort_message.cpp.o projects/libcxxabi/src/CMakeFiles/cxxabi_shared.dir/fallback_malloc.cpp.o projects/libcxxabi/src/CMakeFiles/cxxabi_shared.dir/private_typeinfo.cpp.o projects/libcxxabi/src/CMakeFiles/cxxabi_shared.dir/stdlib_new_delete.cpp.o projects/libcxxabi/src/CMakeFiles/cxxabi_shared.dir/cxa_exception.cpp.o projects/libcxxabi/src/CMakeFiles/cxxabi_shared.dir/cxa_personality.cpp.o  -Wl,-rpath,@loader_path/../lib -lSystem -Wl,-exported_symbols_list,/Users/buildslave/jenkins/libcxx_libcxxabi_trunk_testing/CI_ARCH/64/CI_EXCEPTIONS/ON/CI_STD/c++17/llvm-project/libcxxabi/src/../lib/itanium-base.exp -Wl,-exported_symbols_list,/Users/buildslave/jenkins/libcxx_libcxxabi_trunk_testing/CI_ARCH/64/CI_EXCEPTIONS/ON/CI_STD/c++17/llvm-project/libcxxabi/src/../lib/new-delete.exp -Wl,-exported_symbols_list,/Users/buildslave/jenkins/libcxx_libcxxabi_trunk_testing/CI_ARCH/64/CI_EXCEPTIONS/ON/CI_STD/c++17/llvm-project/libcxxabi/src/../lib/personality-v0.exp && :
[236/257] /usr/local/Cellar/cmake/3.13.1/bin/cmake -E cmake_symlink_library lib/libc++abi.1.0.dylib  lib/libc++abi.1.dylib lib/libc++abi.dylib && :
[237/257] /Users/buildslave/jenkins/libcxx_libcxxabi_trunk_testing/CI_ARCH/64/CI_EXCEPTIONS/ON/CI_STD/c++17/host-compiler/bin/clang++  -D_DEBUG -D_LIBCPP_BUILDING_LIBRARY -D_LIBCPP_DEBUG=0 -D_LIBCPP_DISABLE_NEW_DELETE_DEFINITIONS -D_LIBCPP_HAS_NO_PRAGMA_SYSTEM_HEADER -D__STDC_CONSTANT_MACROS -D__STDC_FORMAT_MACROS -D__STDC_LIMIT_MACROS -Iprojects/libcxx/src -I/Users/buildslave/jenkins/libcxx_libcxxabi_trunk_testing/CI_ARCH/64/CI_EXCEPTIONS/ON/CI_STD/c++17/llvm-project/libcxx/src -I/Applications/Xcode.app/Contents/Developer/Platforms/MacOSX.platform/Developer/SDKs/MacOSX10.13.sdk/usr/include/libxml2 -Iinclude -I/Users/buildslave/jenkins/libcxx_libcxxabi_trunk_testing/CI_ARCH/64/CI_EXCEPTIONS/ON/CI_STD/c++17/llvm-project/llvm/include -Iprojects/libcxx/include/c++build -I/Users/buildslave/jenkins/libcxx_libcxxabi_trunk_testing/CI_ARCH/64/CI_EXCEPTIONS/ON/CI_STD/c++17/llvm-project/libcxx/include -fPIC -fvisibility-inlines-hidden -Werror=date-time -Werror=unguarded-availability-new -Wall -Wextra -Wno-unused-parameter -Wwrite-strings -Wcast-qual -Wmissing-field-initializers  -Wno-long-long -Wimplicit-fallthrough -Wcovered-switch-default -Wno-noexcept-type -Wnon-virtual-dtor -Wdelete-non-virtual-dtor -Wstring-conversion -fdiagnostics-color -Os  -arch i386 -arch x86_64 -isysroot /Applications/Xcode.app/Contents/Developer/Platforms/MacOSX.platform/Developer/SDKs/MacOSX10.13.sdk   -UNDEBUG -DLIBCXX_BUILDING_LIBCXXABI -nostdinc++ -fvisibility-inlines-hidden -fvisibility=hidden -Wall -Wextra -W -Wwrite-strings -Wno-unused-parameter -Wno-long-long -Werror=return-type -Wextra-semi -Wno-user-defined-literals -Wno-covered-switch-default -Wno-ignored-attributes -Wno-error -include /var/folders/9t/lrs73ptj6lv644zvh1fk2_gc0000gn/T/tmp.wC1Y1w2p/llvm-build/projects/libcxx/__config_site -std=c++14 -MD -MT projects/libcxx/src/CMakeFiles/cxx_shared.dir/utility.cpp.o -MF projects/libcxx/src/CMakeFiles/cxx_shared.dir/utility.cpp.o.d -o projects/libcxx/src/CMakeFiles/cxx_shared.dir/utility.cpp.o -c /Users/buildslave/jenkins/libcxx_libcxxabi_trunk_testing/CI_ARCH/64/CI_EXCEPTIONS/ON/CI_STD/c++17/llvm-project/libcxx/src/utility.cpp
[238/257] /Users/buildslave/jenkins/libcxx_libcxxabi_trunk_testing/CI_ARCH/64/CI_EXCEPTIONS/ON/CI_STD/c++17/host-compiler/bin/clang++  -D_DEBUG -D_LIBCPP_BUILDING_LIBRARY -D_LIBCPP_DEBUG=0 -D_LIBCPP_DISABLE_NEW_DELETE_DEFINITIONS -D_LIBCPP_HAS_NO_PRAGMA_SYSTEM_HEADER -D__STDC_CONSTANT_MACROS -D__STDC_FORMAT_MACROS -D__STDC_LIMIT_MACROS -Iprojects/libcxx/src -I/Users/buildslave/jenkins/libcxx_libcxxabi_trunk_testing/CI_ARCH/64/CI_EXCEPTIONS/ON/CI_STD/c++17/llvm-project/libcxx/src -I/Applications/Xcode.app/Contents/Developer/Platforms/MacOSX.platform/Developer/SDKs/MacOSX10.13.sdk/usr/include/libxml2 -Iinclude -I/Users/buildslave/jenkins/libcxx_libcxxabi_trunk_testing/CI_ARCH/64/CI_EXCEPTIONS/ON/CI_STD/c++17/llvm-project/llvm/include -Iprojects/libcxx/include/c++build -I/Users/buildslave/jenkins/libcxx_libcxxabi_trunk_testing/CI_ARCH/64/CI_EXCEPTIONS/ON/CI_STD/c++17/llvm-project/libcxx/include -fPIC -fvisibility-inlines-hidden -Werror=date-time -Werror=unguarded-availability-new -Wall -Wextra -Wno-unused-parameter -Wwrite-strings -Wcast-qual -Wmissing-field-initializers  -Wno-long-long -Wimplicit-fallthrough -Wcovered-switch-default -Wno-noexcept-type -Wnon-virtual-dtor -Wdelete-non-virtual-dtor -Wstring-conversion -fdiagnostics-color -Os  -arch i386 -arch x86_64 -isysroot /Applications/Xcode.app/Contents/Developer/Platforms/MacOSX.platform/Developer/SDKs/MacOSX10.13.sdk   -UNDEBUG -DLIBCXX_BUILDING_LIBCXXABI -nostdinc++ -fvisibility-inlines-hidden -fvisibility=hidden -Wall -Wextra -W -Wwrite-strings -Wno-unused-parameter -Wno-long-long -Werror=return-type -Wextra-semi -Wno-user-defined-literals -Wno-covered-switch-default -Wno-ignored-attributes -Wno-error -include /var/folders/9t/lrs73ptj6lv644zvh1fk2_gc0000gn/T/tmp.wC1Y1w2p/llvm-build/projects/libcxx/__config_site -std=c++14 -MD -MT projects/libcxx/src/CMakeFiles/cxx_shared.dir/regex.cpp.o -MF projects/libcxx/src/CMakeFiles/cxx_shared.dir/regex.cpp.o.d -o projects/libcxx/src/CMakeFiles/cxx_shared.dir/regex.cpp.o -c /Users/buildslave/jenkins/libcxx_libcxxabi_trunk_testing/CI_ARCH/64/CI_EXCEPTIONS/ON/CI_STD/c++17/llvm-project/libcxx/src/regex.cpp
[239/257] /Users/buildslave/jenkins/libcxx_libcxxabi_trunk_testing/CI_ARCH/64/CI_EXCEPTIONS/ON/CI_STD/c++17/host-compiler/bin/clang++  -D_LIBCPP_DISABLE_EXTERN_TEMPLATE -D_LIBCPP_ENABLE_CXX17_REMOVED_UNEXPECTED_FUNCTIONS -D_LIBCXXABI_BUILDING_LIBRARY -D__STDC_CONSTANT_MACROS -D__STDC_FORMAT_MACROS -D__STDC_LIMIT_MACROS -Iprojects/libcxxabi/src -I/Users/buildslave/jenkins/libcxx_libcxxabi_trunk_testing/CI_ARCH/64/CI_EXCEPTIONS/ON/CI_STD/c++17/llvm-project/libcxxabi/src -I/Applications/Xcode.app/Contents/Developer/Platforms/MacOSX.platform/Developer/SDKs/MacOSX10.13.sdk/usr/include/libxml2 -Iinclude -I/Users/buildslave/jenkins/libcxx_libcxxabi_trunk_testing/CI_ARCH/64/CI_EXCEPTIONS/ON/CI_STD/c++17/llvm-project/llvm/include -I/Users/buildslave/jenkins/libcxx_libcxxabi_trunk_testing/CI_ARCH/64/CI_EXCEPTIONS/ON/CI_STD/c++17/llvm-project/libcxxabi/include -I/Users/buildslave/jenkins/libcxx_libcxxabi_trunk_testing/CI_ARCH/64/CI_EXCEPTIONS/ON/CI_STD/c++17/llvm-project/libcxx/include -fPIC -fvisibility-inlines-hidden -Werror=date-time -Werror=unguarded-availability-new -Wall -Wextra -Wno-unused-parameter -Wwrite-strings -Wcast-qual -Wmissing-field-initializers -pedantic -Wno-long-long -Wimplicit-fallthrough -Wcovered-switch-default -Wno-noexcept-type -Wnon-virtual-dtor -Wdelete-non-virtual-dtor -Wstring-conversion -fdiagnostics-color  -Os -DNDEBUG -arch i386 -arch x86_64 -isysroot /Applications/Xcode.app/Contents/Developer/Platforms/MacOSX.platform/Developer/SDKs/MacOSX10.13.sdk -fPIC   -nostdinc++ -Werror=return-type -W -Wall -Wchar-subscripts -Wconversion -Wmismatched-tags -Wmissing-braces -Wnewline-eof -Wunused-function -Wshadow -Wshorten-64-to-32 -Wsign-compare -Wsign-conversion -Wstrict-aliasing=2 -Wstrict-overflow=4 -Wunused-parameter -Wunused-variable -Wwrite-strings -Wundef -Wno-error -pedantic -fstrict-aliasing -funwind-tables -D_DEBUG -std=c++11 -MD -MT projects/libcxxabi/src/CMakeFiles/cxxabi_static.dir/cxa_demangle.cpp.o -MF projects/libcxxabi/src/CMakeFiles/cxxabi_static.dir/cxa_demangle.cpp.o.d -o projects/libcxxabi/src/CMakeFiles/cxxabi_static.dir/cxa_demangle.cpp.o -c /Users/buildslave/jenkins/libcxx_libcxxabi_trunk_testing/CI_ARCH/64/CI_EXCEPTIONS/ON/CI_STD/c++17/llvm-project/libcxxabi/src/cxa_demangle.cpp
[240/257] : && "/Applications/Xcode.app/Contents/Developer/Toolchains/XcodeDefault.xctoolchain/usr/bin/libtool" -static -no_warning_for_no_symbols -o lib/libc++abi.a  projects/libcxxabi/src/CMakeFiles/cxxabi_static.dir/cxa_aux_runtime.cpp.o projects/libcxxabi/src/CMakeFiles/cxxabi_static.dir/cxa_default_handlers.cpp.o projects/libcxxabi/src/CMakeFiles/cxxabi_static.dir/cxa_demangle.cpp.o projects/libcxxabi/src/CMakeFiles/cxxabi_static.dir/cxa_exception_storage.cpp.o projects/libcxxabi/src/CMakeFiles/cxxabi_static.dir/cxa_guard.cpp.o projects/libcxxabi/src/CMakeFiles/cxxabi_static.dir/cxa_handlers.cpp.o projects/libcxxabi/src/CMakeFiles/cxxabi_static.dir/cxa_unexpected.cpp.o projects/libcxxabi/src/CMakeFiles/cxxabi_static.dir/cxa_vector.cpp.o projects/libcxxabi/src/CMakeFiles/cxxabi_static.dir/cxa_virtual.cpp.o projects/libcxxabi/src/CMakeFiles/cxxabi_static.dir/stdlib_exception.cpp.o projects/libcxxabi/src/CMakeFiles/cxxabi_static.dir/stdlib_stdexcept.cpp.o projects/libcxxabi/src/CMakeFiles/cxxabi_static.dir/stdlib_typeinfo.cpp.o projects/libcxxabi/src/CMakeFiles/cxxabi_static.dir/abort_message.cpp.o projects/libcxxabi/src/CMakeFiles/cxxabi_static.dir/fallback_malloc.cpp.o projects/libcxxabi/src/CMakeFiles/cxxabi_static.dir/private_typeinfo.cpp.o projects/libcxxabi/src/CMakeFiles/cxxabi_static.dir/stdlib_new_delete.cpp.o projects/libcxxabi/src/CMakeFiles/cxxabi_static.dir/cxa_exception.cpp.o projects/libcxxabi/src/CMakeFiles/cxxabi_static.dir/cxa_personality.cpp.o && :
[241/257] /Users/buildslave/jenkins/libcxx_libcxxabi_trunk_testing/CI_ARCH/64/CI_EXCEPTIONS/ON/CI_STD/c++17/host-compiler/bin/clang++  -D_DEBUG -D_LIBCPP_BUILDING_LIBRARY -D_LIBCPP_DEBUG=0 -D_LIBCPP_DISABLE_NEW_DELETE_DEFINITIONS -D_LIBCPP_HAS_NO_PRAGMA_SYSTEM_HEADER -D__STDC_CONSTANT_MACROS -D__STDC_FORMAT_MACROS -D__STDC_LIMIT_MACROS -Iprojects/libcxx/src -I/Users/buildslave/jenkins/libcxx_libcxxabi_trunk_testing/CI_ARCH/64/CI_EXCEPTIONS/ON/CI_STD/c++17/llvm-project/libcxx/src -I/Applications/Xcode.app/Contents/Developer/Platforms/MacOSX.platform/Developer/SDKs/MacOSX10.13.sdk/usr/include/libxml2 -Iinclude -I/Users/buildslave/jenkins/libcxx_libcxxabi_trunk_testing/CI_ARCH/64/CI_EXCEPTIONS/ON/CI_STD/c++17/llvm-project/llvm/include -Iprojects/libcxx/include/c++build -I/Users/buildslave/jenkins/libcxx_libcxxabi_trunk_testing/CI_ARCH/64/CI_EXCEPTIONS/ON/CI_STD/c++17/llvm-project/libcxx/include -fPIC -fvisibility-inlines-hidden -Werror=date-time -Werror=unguarded-availability-new -Wall -Wextra -Wno-unused-parameter -Wwrite-strings -Wcast-qual -Wmissing-field-initializers  -Wno-long-long -Wimplicit-fallthrough -Wcovered-switch-default -Wno-noexcept-type -Wnon-virtual-dtor -Wdelete-non-virtual-dtor -Wstring-conversion -fdiagnostics-color -Os  -arch i386 -arch x86_64 -isysroot /Applications/Xcode.app/Contents/Developer/Platforms/MacOSX.platform/Developer/SDKs/MacOSX10.13.sdk   -UNDEBUG -DLIBCXX_BUILDING_LIBCXXABI -nostdinc++ -fvisibility-inlines-hidden -fvisibility=hidden -Wall -Wextra -W -Wwrite-strings -Wno-unused-parameter -Wno-long-long -Werror=return-type -Wextra-semi -Wno-user-defined-literals -Wno-covered-switch-default -Wno-ignored-attributes -Wno-error -include /var/folders/9t/lrs73ptj6lv644zvh1fk2_gc0000gn/T/tmp.wC1Y1w2p/llvm-build/projects/libcxx/__config_site -std=c++14 -MD -MT projects/libcxx/src/CMakeFiles/cxx_shared.dir/random.cpp.o -MF projects/libcxx/src/CMakeFiles/cxx_shared.dir/random.cpp.o.d -o projects/libcxx/src/CMakeFiles/cxx_shared.dir/random.cpp.o -c /Users/buildslave/jenkins/libcxx_libcxxabi_trunk_testing/CI_ARCH/64/CI_EXCEPTIONS/ON/CI_STD/c++17/llvm-project/libcxx/src/random.cpp
[242/257] /Users/buildslave/jenkins/libcxx_libcxxabi_trunk_testing/CI_ARCH/64/CI_EXCEPTIONS/ON/CI_STD/c++17/host-compiler/bin/clang++  -D_DEBUG -D_LIBCPP_BUILDING_LIBRARY -D_LIBCPP_DEBUG=0 -D_LIBCPP_DISABLE_NEW_DELETE_DEFINITIONS -D_LIBCPP_HAS_NO_PRAGMA_SYSTEM_HEADER -D__STDC_CONSTANT_MACROS -D__STDC_FORMAT_MACROS -D__STDC_LIMIT_MACROS -Iprojects/libcxx/src -I/Users/buildslave/jenkins/libcxx_libcxxabi_trunk_testing/CI_ARCH/64/CI_EXCEPTIONS/ON/CI_STD/c++17/llvm-project/libcxx/src -I/Applications/Xcode.app/Contents/Developer/Platforms/MacOSX.platform/Developer/SDKs/MacOSX10.13.sdk/usr/include/libxml2 -Iinclude -I/Users/buildslave/jenkins/libcxx_libcxxabi_trunk_testing/CI_ARCH/64/CI_EXCEPTIONS/ON/CI_STD/c++17/llvm-project/llvm/include -Iprojects/libcxx/include/c++build -I/Users/buildslave/jenkins/libcxx_libcxxabi_trunk_testing/CI_ARCH/64/CI_EXCEPTIONS/ON/CI_STD/c++17/llvm-project/libcxx/include -fPIC -fvisibility-inlines-hidden -Werror=date-time -Werror=unguarded-availability-new -Wall -Wextra -Wno-unused-parameter -Wwrite-strings -Wcast-qual -Wmissing-field-initializers  -Wno-long-long -Wimplicit-fallthrough -Wcovered-switch-default -Wno-noexcept-type -Wnon-virtual-dtor -Wdelete-non-virtual-dtor -Wstring-conversion -fdiagnostics-color -Os  -arch i386 -arch x86_64 -isysroot /Applications/Xcode.app/Contents/Developer/Platforms/MacOSX.platform/Developer/SDKs/MacOSX10.13.sdk   -UNDEBUG -DLIBCXX_BUILDING_LIBCXXABI -nostdinc++ -fvisibility-inlines-hidden -fvisibility=hidden -Wall -Wextra -W -Wwrite-strings -Wno-unused-parameter -Wno-long-long -Werror=return-type -Wextra-semi -Wno-user-defined-literals -Wno-covered-switch-default -Wno-ignored-attributes -Wno-error -include /var/folders/9t/lrs73ptj6lv644zvh1fk2_gc0000gn/T/tmp.wC1Y1w2p/llvm-build/projects/libcxx/__config_site -std=c++14 -MD -MT projects/libcxx/src/CMakeFiles/cxx_shared.dir/typeinfo.cpp.o -MF projects/libcxx/src/CMakeFiles/cxx_shared.dir/typeinfo.cpp.o.d -o projects/libcxx/src/CMakeFiles/cxx_shared.dir/typeinfo.cpp.o -c /Users/buildslave/jenkins/libcxx_libcxxabi_trunk_testing/CI_ARCH/64/CI_EXCEPTIONS/ON/CI_STD/c++17/llvm-project/libcxx/src/typeinfo.cpp
[243/257] cd /var/folders/9t/lrs73ptj6lv644zvh1fk2_gc0000gn/T/tmp.wC1Y1w2p/llvm-build/projects/libcxxabi/src && /usr/local/Cellar/cmake/3.13.1/bin/cmake -DCMAKE_INSTALL_COMPONENT=cxxabi -P /var/folders/9t/lrs73ptj6lv644zvh1fk2_gc0000gn/T/tmp.wC1Y1w2p/llvm-build/projects/libcxxabi/cmake_install.cmake
-- Install configuration: "MinSizeRel"
-- Installing: /var/folders/9t/lrs73ptj6lv644zvh1fk2_gc0000gn/T/tmp.wC1Y1w2p/llvm-install/lib/libc++abi.1.0.dylib
-- Installing: /var/folders/9t/lrs73ptj6lv644zvh1fk2_gc0000gn/T/tmp.wC1Y1w2p/llvm-install/lib/libc++abi.1.dylib
-- Installing: /var/folders/9t/lrs73ptj6lv644zvh1fk2_gc0000gn/T/tmp.wC1Y1w2p/llvm-install/lib/libc++abi.dylib
-- Installing: /var/folders/9t/lrs73ptj6lv644zvh1fk2_gc0000gn/T/tmp.wC1Y1w2p/llvm-install/lib/libc++abi.a
/Applications/Xcode.app/Contents/Developer/Toolchains/XcodeDefault.xctoolchain/usr/bin/ranlib: for architecture: i386 file: /var/folders/9t/lrs73ptj6lv644zvh1fk2_gc0000gn/T/tmp.wC1Y1w2p/llvm-install/lib/libc++abi.a(cxa_unexpected.cpp.o) has no symbols
/Applications/Xcode.app/Contents/Developer/Toolchains/XcodeDefault.xctoolchain/usr/bin/ranlib: for architecture: x86_64 file: /var/folders/9t/lrs73ptj6lv644zvh1fk2_gc0000gn/T/tmp.wC1Y1w2p/llvm-install/lib/libc++abi.a(cxa_unexpected.cpp.o) has no symbols
[244/257] /Users/buildslave/jenkins/libcxx_libcxxabi_trunk_testing/CI_ARCH/64/CI_EXCEPTIONS/ON/CI_STD/c++17/host-compiler/bin/clang++  -D_DEBUG -D_LIBCPP_BUILDING_LIBRARY -D_LIBCPP_DEBUG=0 -D_LIBCPP_DISABLE_NEW_DELETE_DEFINITIONS -D_LIBCPP_HAS_NO_PRAGMA_SYSTEM_HEADER -D__STDC_CONSTANT_MACROS -D__STDC_FORMAT_MACROS -D__STDC_LIMIT_MACROS -Iprojects/libcxx/src -I/Users/buildslave/jenkins/libcxx_libcxxabi_trunk_testing/CI_ARCH/64/CI_EXCEPTIONS/ON/CI_STD/c++17/llvm-project/libcxx/src -I/Applications/Xcode.app/Contents/Developer/Platforms/MacOSX.platform/Developer/SDKs/MacOSX10.13.sdk/usr/include/libxml2 -Iinclude -I/Users/buildslave/jenkins/libcxx_libcxxabi_trunk_testing/CI_ARCH/64/CI_EXCEPTIONS/ON/CI_STD/c++17/llvm-project/llvm/include -Iprojects/libcxx/include/c++build -I/Users/buildslave/jenkins/libcxx_libcxxabi_trunk_testing/CI_ARCH/64/CI_EXCEPTIONS/ON/CI_STD/c++17/llvm-project/libcxx/include -fPIC -fvisibility-inlines-hidden -Werror=date-time -Werror=unguarded-availability-new -Wall -Wextra -Wno-unused-parameter -Wwrite-strings -Wcast-qual -Wmissing-field-initializers  -Wno-long-long -Wimplicit-fallthrough -Wcovered-switch-default -Wno-noexcept-type -Wnon-virtual-dtor -Wdelete-non-virtual-dtor -Wstring-conversion -fdiagnostics-color -Os  -arch i386 -arch x86_64 -isysroot /Applications/Xcode.app/Contents/Developer/Platforms/MacOSX.platform/Developer/SDKs/MacOSX10.13.sdk   -UNDEBUG -DLIBCXX_BUILDING_LIBCXXABI -nostdinc++ -fvisibility-inlines-hidden -fvisibility=hidden -Wall -Wextra -W -Wwrite-strings -Wno-unused-parameter -Wno-long-long -Werror=return-type -Wextra-semi -Wno-user-defined-literals -Wno-covered-switch-default -Wno-ignored-attributes -Wno-error -include /var/folders/9t/lrs73ptj6lv644zvh1fk2_gc0000gn/T/tmp.wC1Y1w2p/llvm-build/projects/libcxx/__config_site -std=c++14 -MD -MT projects/libcxx/src/CMakeFiles/cxx_shared.dir/strstream.cpp.o -MF projects/libcxx/src/CMakeFiles/cxx_shared.dir/strstream.cpp.o.d -o projects/libcxx/src/CMakeFiles/cxx_shared.dir/strstream.cpp.o -c /Users/buildslave/jenkins/libcxx_libcxxabi_trunk_testing/CI_ARCH/64/CI_EXCEPTIONS/ON/CI_STD/c++17/llvm-project/libcxx/src/strstream.cpp
[245/257] /Users/buildslave/jenkins/libcxx_libcxxabi_trunk_testing/CI_ARCH/64/CI_EXCEPTIONS/ON/CI_STD/c++17/host-compiler/bin/clang++  -D_DEBUG -D_LIBCPP_BUILDING_LIBRARY -D_LIBCPP_DEBUG=0 -D_LIBCPP_DISABLE_NEW_DELETE_DEFINITIONS -D_LIBCPP_HAS_NO_PRAGMA_SYSTEM_HEADER -D__STDC_CONSTANT_MACROS -D__STDC_FORMAT_MACROS -D__STDC_LIMIT_MACROS -Iprojects/libcxx/src -I/Users/buildslave/jenkins/libcxx_libcxxabi_trunk_testing/CI_ARCH/64/CI_EXCEPTIONS/ON/CI_STD/c++17/llvm-project/libcxx/src -I/Applications/Xcode.app/Contents/Developer/Platforms/MacOSX.platform/Developer/SDKs/MacOSX10.13.sdk/usr/include/libxml2 -Iinclude -I/Users/buildslave/jenkins/libcxx_libcxxabi_trunk_testing/CI_ARCH/64/CI_EXCEPTIONS/ON/CI_STD/c++17/llvm-project/llvm/include -Iprojects/libcxx/include/c++build -I/Users/buildslave/jenkins/libcxx_libcxxabi_trunk_testing/CI_ARCH/64/CI_EXCEPTIONS/ON/CI_STD/c++17/llvm-project/libcxx/include -fPIC -fvisibility-inlines-hidden -Werror=date-time -Werror=unguarded-availability-new -Wall -Wextra -Wno-unused-parameter -Wwrite-strings -Wcast-qual -Wmissing-field-initializers  -Wno-long-long -Wimplicit-fallthrough -Wcovered-switch-default -Wno-noexcept-type -Wnon-virtual-dtor -Wdelete-non-virtual-dtor -Wstring-conversion -fdiagnostics-color -Os  -arch i386 -arch x86_64 -isysroot /Applications/Xcode.app/Contents/Developer/Platforms/MacOSX.platform/Developer/SDKs/MacOSX10.13.sdk   -UNDEBUG -DLIBCXX_BUILDING_LIBCXXABI -nostdinc++ -fvisibility-inlines-hidden -fvisibility=hidden -Wall -Wextra -W -Wwrite-strings -Wno-unused-parameter -Wno-long-long -Werror=return-type -Wextra-semi -Wno-user-defined-literals -Wno-covered-switch-default -Wno-ignored-attributes -Wno-error -include /var/folders/9t/lrs73ptj6lv644zvh1fk2_gc0000gn/T/tmp.wC1Y1w2p/llvm-build/projects/libcxx/__config_site -std=c++14 -MD -MT projects/libcxx/src/CMakeFiles/cxx_shared.dir/variant.cpp.o -MF projects/libcxx/src/CMakeFiles/cxx_shared.dir/variant.cpp.o.d -o projects/libcxx/src/CMakeFiles/cxx_shared.dir/variant.cpp.o -c /Users/buildslave/jenkins/libcxx_libcxxabi_trunk_testing/CI_ARCH/64/CI_EXCEPTIONS/ON/CI_STD/c++17/llvm-project/libcxx/src/variant.cpp
[246/257] /Users/buildslave/jenkins/libcxx_libcxxabi_trunk_testing/CI_ARCH/64/CI_EXCEPTIONS/ON/CI_STD/c++17/host-compiler/bin/clang++  -D_DEBUG -D_LIBCPP_BUILDING_LIBRARY -D_LIBCPP_DEBUG=0 -D_LIBCPP_DISABLE_NEW_DELETE_DEFINITIONS -D_LIBCPP_HAS_NO_PRAGMA_SYSTEM_HEADER -D__STDC_CONSTANT_MACROS -D__STDC_FORMAT_MACROS -D__STDC_LIMIT_MACROS -Iprojects/libcxx/src -I/Users/buildslave/jenkins/libcxx_libcxxabi_trunk_testing/CI_ARCH/64/CI_EXCEPTIONS/ON/CI_STD/c++17/llvm-project/libcxx/src -I/Applications/Xcode.app/Contents/Developer/Platforms/MacOSX.platform/Developer/SDKs/MacOSX10.13.sdk/usr/include/libxml2 -Iinclude -I/Users/buildslave/jenkins/libcxx_libcxxabi_trunk_testing/CI_ARCH/64/CI_EXCEPTIONS/ON/CI_STD/c++17/llvm-project/llvm/include -Iprojects/libcxx/include/c++build -I/Users/buildslave/jenkins/libcxx_libcxxabi_trunk_testing/CI_ARCH/64/CI_EXCEPTIONS/ON/CI_STD/c++17/llvm-project/libcxx/include -fPIC -fvisibility-inlines-hidden -Werror=date-time -Werror=unguarded-availability-new -Wall -Wextra -Wno-unused-parameter -Wwrite-strings -Wcast-qual -Wmissing-field-initializers  -Wno-long-long -Wimplicit-fallthrough -Wcovered-switch-default -Wno-noexcept-type -Wnon-virtual-dtor -Wdelete-non-virtual-dtor -Wstring-conversion -fdiagnostics-color -Os  -arch i386 -arch x86_64 -isysroot /Applications/Xcode.app/Contents/Developer/Platforms/MacOSX.platform/Developer/SDKs/MacOSX10.13.sdk   -UNDEBUG -DLIBCXX_BUILDING_LIBCXXABI -nostdinc++ -fvisibility-inlines-hidden -fvisibility=hidden -Wall -Wextra -W -Wwrite-strings -Wno-unused-parameter -Wno-long-long -Werror=return-type -Wextra-semi -Wno-user-defined-literals -Wno-covered-switch-default -Wno-ignored-attributes -Wno-error -include /var/folders/9t/lrs73ptj6lv644zvh1fk2_gc0000gn/T/tmp.wC1Y1w2p/llvm-build/projects/libcxx/__config_site -std=c++14 -MD -MT projects/libcxx/src/CMakeFiles/cxx_shared.dir/system_error.cpp.o -MF projects/libcxx/src/CMakeFiles/cxx_shared.dir/system_error.cpp.o.d -o projects/libcxx/src/CMakeFiles/cxx_shared.dir/system_error.cpp.o -c /Users/buildslave/jenkins/libcxx_libcxxabi_trunk_testing/CI_ARCH/64/CI_EXCEPTIONS/ON/CI_STD/c++17/llvm-project/libcxx/src/system_error.cpp
[247/257] /Users/buildslave/jenkins/libcxx_libcxxabi_trunk_testing/CI_ARCH/64/CI_EXCEPTIONS/ON/CI_STD/c++17/host-compiler/bin/clang++  -D_DEBUG -D_LIBCPP_BUILDING_LIBRARY -D_LIBCPP_DEBUG=0 -D_LIBCPP_DISABLE_NEW_DELETE_DEFINITIONS -D_LIBCPP_HAS_NO_PRAGMA_SYSTEM_HEADER -D__STDC_CONSTANT_MACROS -D__STDC_FORMAT_MACROS -D__STDC_LIMIT_MACROS -Iprojects/libcxx/src -I/Users/buildslave/jenkins/libcxx_libcxxabi_trunk_testing/CI_ARCH/64/CI_EXCEPTIONS/ON/CI_STD/c++17/llvm-project/libcxx/src -I/Applications/Xcode.app/Contents/Developer/Platforms/MacOSX.platform/Developer/SDKs/MacOSX10.13.sdk/usr/include/libxml2 -Iinclude -I/Users/buildslave/jenkins/libcxx_libcxxabi_trunk_testing/CI_ARCH/64/CI_EXCEPTIONS/ON/CI_STD/c++17/llvm-project/llvm/include -Iprojects/libcxx/include/c++build -I/Users/buildslave/jenkins/libcxx_libcxxabi_trunk_testing/CI_ARCH/64/CI_EXCEPTIONS/ON/CI_STD/c++17/llvm-project/libcxx/include -fPIC -fvisibility-inlines-hidden -Werror=date-time -Werror=unguarded-availability-new -Wall -Wextra -Wno-unused-parameter -Wwrite-strings -Wcast-qual -Wmissing-field-initializers  -Wno-long-long -Wimplicit-fallthrough -Wcovered-switch-default -Wno-noexcept-type -Wnon-virtual-dtor -Wdelete-non-virtual-dtor -Wstring-conversion -fdiagnostics-color -Os  -arch i386 -arch x86_64 -isysroot /Applications/Xcode.app/Contents/Developer/Platforms/MacOSX.platform/Developer/SDKs/MacOSX10.13.sdk   -UNDEBUG -DLIBCXX_BUILDING_LIBCXXABI -nostdinc++ -fvisibility-inlines-hidden -fvisibility=hidden -Wall -Wextra -W -Wwrite-strings -Wno-unused-parameter -Wno-long-long -Werror=return-type -Wextra-semi -Wno-user-defined-literals -Wno-covered-switch-default -Wno-ignored-attributes -Wno-error -include /var/folders/9t/lrs73ptj6lv644zvh1fk2_gc0000gn/T/tmp.wC1Y1w2p/llvm-build/projects/libcxx/__config_site -std=c++14 -MD -MT projects/libcxx/src/CMakeFiles/cxx_shared.dir/vector.cpp.o -MF projects/libcxx/src/CMakeFiles/cxx_shared.dir/vector.cpp.o.d -o projects/libcxx/src/CMakeFiles/cxx_shared.dir/vector.cpp.o -c /Users/buildslave/jenkins/libcxx_libcxxabi_trunk_testing/CI_ARCH/64/CI_EXCEPTIONS/ON/CI_STD/c++17/llvm-project/libcxx/src/vector.cpp
[248/257] /Users/buildslave/jenkins/libcxx_libcxxabi_trunk_testing/CI_ARCH/64/CI_EXCEPTIONS/ON/CI_STD/c++17/host-compiler/bin/clang++  -D_DEBUG -D_LIBCPP_BUILDING_LIBRARY -D_LIBCPP_DEBUG=0 -D_LIBCPP_DISABLE_NEW_DELETE_DEFINITIONS -D_LIBCPP_HAS_NO_PRAGMA_SYSTEM_HEADER -D__STDC_CONSTANT_MACROS -D__STDC_FORMAT_MACROS -D__STDC_LIMIT_MACROS -Iprojects/libcxx/src -I/Users/buildslave/jenkins/libcxx_libcxxabi_trunk_testing/CI_ARCH/64/CI_EXCEPTIONS/ON/CI_STD/c++17/llvm-project/libcxx/src -I/Applications/Xcode.app/Contents/Developer/Platforms/MacOSX.platform/Developer/SDKs/MacOSX10.13.sdk/usr/include/libxml2 -Iinclude -I/Users/buildslave/jenkins/libcxx_libcxxabi_trunk_testing/CI_ARCH/64/CI_EXCEPTIONS/ON/CI_STD/c++17/llvm-project/llvm/include -Iprojects/libcxx/include/c++build -I/Users/buildslave/jenkins/libcxx_libcxxabi_trunk_testing/CI_ARCH/64/CI_EXCEPTIONS/ON/CI_STD/c++17/llvm-project/libcxx/include -fPIC -fvisibility-inlines-hidden -Werror=date-time -Werror=unguarded-availability-new -Wall -Wextra -Wno-unused-parameter -Wwrite-strings -Wcast-qual -Wmissing-field-initializers  -Wno-long-long -Wimplicit-fallthrough -Wcovered-switch-default -Wno-noexcept-type -Wnon-virtual-dtor -Wdelete-non-virtual-dtor -Wstring-conversion -fdiagnostics-color -Os  -arch i386 -arch x86_64 -isysroot /Applications/Xcode.app/Contents/Developer/Platforms/MacOSX.platform/Developer/SDKs/MacOSX10.13.sdk   -UNDEBUG -DLIBCXX_BUILDING_LIBCXXABI -nostdinc++ -fvisibility-inlines-hidden -fvisibility=hidden -Wall -Wextra -W -Wwrite-strings -Wno-unused-parameter -Wno-long-long -Werror=return-type -Wextra-semi -Wno-user-defined-literals -Wno-covered-switch-default -Wno-ignored-attributes -Wno-error -include /var/folders/9t/lrs73ptj6lv644zvh1fk2_gc0000gn/T/tmp.wC1Y1w2p/llvm-build/projects/libcxx/__config_site -std=c++14 -MD -MT projects/libcxx/src/CMakeFiles/cxx_shared.dir/valarray.cpp.o -MF projects/libcxx/src/CMakeFiles/cxx_shared.dir/valarray.cpp.o.d -o projects/libcxx/src/CMakeFiles/cxx_shared.dir/valarray.cpp.o -c /Users/buildslave/jenkins/libcxx_libcxxabi_trunk_testing/CI_ARCH/64/CI_EXCEPTIONS/ON/CI_STD/c++17/llvm-project/libcxx/src/valarray.cpp
[249/257] /Users/buildslave/jenkins/libcxx_libcxxabi_trunk_testing/CI_ARCH/64/CI_EXCEPTIONS/ON/CI_STD/c++17/host-compiler/bin/clang++  -D_DEBUG -D_LIBCPP_BUILDING_LIBRARY -D_LIBCPP_DEBUG=0 -D_LIBCPP_DISABLE_NEW_DELETE_DEFINITIONS -D_LIBCPP_HAS_NO_PRAGMA_SYSTEM_HEADER -D__STDC_CONSTANT_MACROS -D__STDC_FORMAT_MACROS -D__STDC_LIMIT_MACROS -Iprojects/libcxx/src -I/Users/buildslave/jenkins/libcxx_libcxxabi_trunk_testing/CI_ARCH/64/CI_EXCEPTIONS/ON/CI_STD/c++17/llvm-project/libcxx/src -I/Applications/Xcode.app/Contents/Developer/Platforms/MacOSX.platform/Developer/SDKs/MacOSX10.13.sdk/usr/include/libxml2 -Iinclude -I/Users/buildslave/jenkins/libcxx_libcxxabi_trunk_testing/CI_ARCH/64/CI_EXCEPTIONS/ON/CI_STD/c++17/llvm-project/llvm/include -Iprojects/libcxx/include/c++build -I/Users/buildslave/jenkins/libcxx_libcxxabi_trunk_testing/CI_ARCH/64/CI_EXCEPTIONS/ON/CI_STD/c++17/llvm-project/libcxx/include -fPIC -fvisibility-inlines-hidden -Werror=date-time -Werror=unguarded-availability-new -Wall -Wextra -Wno-unused-parameter -Wwrite-strings -Wcast-qual -Wmissing-field-initializers  -Wno-long-long -Wimplicit-fallthrough -Wcovered-switch-default -Wno-noexcept-type -Wnon-virtual-dtor -Wdelete-non-virtual-dtor -Wstring-conversion -fdiagnostics-color -Os  -arch i386 -arch x86_64 -isysroot /Applications/Xcode.app/Contents/Developer/Platforms/MacOSX.platform/Developer/SDKs/MacOSX10.13.sdk   -UNDEBUG -DLIBCXX_BUILDING_LIBCXXABI -nostdinc++ -fvisibility-inlines-hidden -fvisibility=hidden -Wall -Wextra -W -Wwrite-strings -Wno-unused-parameter -Wno-long-long -Werror=return-type -Wextra-semi -Wno-user-defined-literals -Wno-covered-switch-default -Wno-ignored-attributes -Wno-error -include /var/folders/9t/lrs73ptj6lv644zvh1fk2_gc0000gn/T/tmp.wC1Y1w2p/llvm-build/projects/libcxx/__config_site -std=c++14 -MD -MT projects/libcxx/src/CMakeFiles/cxx_shared.dir/thread.cpp.o -MF projects/libcxx/src/CMakeFiles/cxx_shared.dir/thread.cpp.o.d -o projects/libcxx/src/CMakeFiles/cxx_shared.dir/thread.cpp.o -c /Users/buildslave/jenkins/libcxx_libcxxabi_trunk_testing/CI_ARCH/64/CI_EXCEPTIONS/ON/CI_STD/c++17/llvm-project/libcxx/src/thread.cpp
[250/257] /Users/buildslave/jenkins/libcxx_libcxxabi_trunk_testing/CI_ARCH/64/CI_EXCEPTIONS/ON/CI_STD/c++17/host-compiler/bin/clang++  -D_DEBUG -D_LIBCPP_BUILDING_LIBRARY -D_LIBCPP_DEBUG=0 -D_LIBCPP_DISABLE_NEW_DELETE_DEFINITIONS -D_LIBCPP_HAS_NO_PRAGMA_SYSTEM_HEADER -D__STDC_CONSTANT_MACROS -D__STDC_FORMAT_MACROS -D__STDC_LIMIT_MACROS -Iprojects/libcxx/src -I/Users/buildslave/jenkins/libcxx_libcxxabi_trunk_testing/CI_ARCH/64/CI_EXCEPTIONS/ON/CI_STD/c++17/llvm-project/libcxx/src -I/Applications/Xcode.app/Contents/Developer/Platforms/MacOSX.platform/Developer/SDKs/MacOSX10.13.sdk/usr/include/libxml2 -Iinclude -I/Users/buildslave/jenkins/libcxx_libcxxabi_trunk_testing/CI_ARCH/64/CI_EXCEPTIONS/ON/CI_STD/c++17/llvm-project/llvm/include -Iprojects/libcxx/include/c++build -I/Users/buildslave/jenkins/libcxx_libcxxabi_trunk_testing/CI_ARCH/64/CI_EXCEPTIONS/ON/CI_STD/c++17/llvm-project/libcxx/include -fPIC -fvisibility-inlines-hidden -Werror=date-time -Werror=unguarded-availability-new -Wall -Wextra -Wno-unused-parameter -Wwrite-strings -Wcast-qual -Wmissing-field-initializers  -Wno-long-long -Wimplicit-fallthrough -Wcovered-switch-default -Wno-noexcept-type -Wnon-virtual-dtor -Wdelete-non-virtual-dtor -Wstring-conversion -fdiagnostics-color -Os  -arch i386 -arch x86_64 -isysroot /Applications/Xcode.app/Contents/Developer/Platforms/MacOSX.platform/Developer/SDKs/MacOSX10.13.sdk   -UNDEBUG -DLIBCXX_BUILDING_LIBCXXABI -nostdinc++ -fvisibility-inlines-hidden -fvisibility=hidden -Wall -Wextra -W -Wwrite-strings -Wno-unused-parameter -Wno-long-long -Werror=return-type -Wextra-semi -Wno-user-defined-literals -Wno-covered-switch-default -Wno-ignored-attributes -Wno-error -include /var/folders/9t/lrs73ptj6lv644zvh1fk2_gc0000gn/T/tmp.wC1Y1w2p/llvm-build/projects/libcxx/__config_site -std=c++14 -MD -MT projects/libcxx/src/CMakeFiles/cxx_shared.dir/ios.cpp.o -MF projects/libcxx/src/CMakeFiles/cxx_shared.dir/ios.cpp.o.d -o projects/libcxx/src/CMakeFiles/cxx_shared.dir/ios.cpp.o -c /Users/buildslave/jenkins/libcxx_libcxxabi_trunk_testing/CI_ARCH/64/CI_EXCEPTIONS/ON/CI_STD/c++17/llvm-project/libcxx/src/ios.cpp
[251/257] /Users/buildslave/jenkins/libcxx_libcxxabi_trunk_testing/CI_ARCH/64/CI_EXCEPTIONS/ON/CI_STD/c++17/host-compiler/bin/clang++  -D_DEBUG -D_LIBCPP_BUILDING_LIBRARY -D_LIBCPP_DEBUG=0 -D_LIBCPP_DISABLE_NEW_DELETE_DEFINITIONS -D_LIBCPP_HAS_NO_PRAGMA_SYSTEM_HEADER -D__STDC_CONSTANT_MACROS -D__STDC_FORMAT_MACROS -D__STDC_LIMIT_MACROS -Iprojects/libcxx/src -I/Users/buildslave/jenkins/libcxx_libcxxabi_trunk_testing/CI_ARCH/64/CI_EXCEPTIONS/ON/CI_STD/c++17/llvm-project/libcxx/src -I/Applications/Xcode.app/Contents/Developer/Platforms/MacOSX.platform/Developer/SDKs/MacOSX10.13.sdk/usr/include/libxml2 -Iinclude -I/Users/buildslave/jenkins/libcxx_libcxxabi_trunk_testing/CI_ARCH/64/CI_EXCEPTIONS/ON/CI_STD/c++17/llvm-project/llvm/include -Iprojects/libcxx/include/c++build -I/Users/buildslave/jenkins/libcxx_libcxxabi_trunk_testing/CI_ARCH/64/CI_EXCEPTIONS/ON/CI_STD/c++17/llvm-project/libcxx/include -fPIC -fvisibility-inlines-hidden -Werror=date-time -Werror=unguarded-availability-new -Wall -Wextra -Wno-unused-parameter -Wwrite-strings -Wcast-qual -Wmissing-field-initializers  -Wno-long-long -Wimplicit-fallthrough -Wcovered-switch-default -Wno-noexcept-type -Wnon-virtual-dtor -Wdelete-non-virtual-dtor -Wstring-conversion -fdiagnostics-color -Os  -arch i386 -arch x86_64 -isysroot /Applications/Xcode.app/Contents/Developer/Platforms/MacOSX.platform/Developer/SDKs/MacOSX10.13.sdk   -UNDEBUG -DLIBCXX_BUILDING_LIBCXXABI -nostdinc++ -fvisibility-inlines-hidden -fvisibility=hidden -Wall -Wextra -W -Wwrite-strings -Wno-unused-parameter -Wno-long-long -Werror=return-type -Wextra-semi -Wno-user-defined-literals -Wno-covered-switch-default -Wno-ignored-attributes -Wno-error -include /var/folders/9t/lrs73ptj6lv644zvh1fk2_gc0000gn/T/tmp.wC1Y1w2p/llvm-build/projects/libcxx/__config_site -std=c++14 -MD -MT projects/libcxx/src/CMakeFiles/cxx_shared.dir/string.cpp.o -MF projects/libcxx/src/CMakeFiles/cxx_shared.dir/string.cpp.o.d -o projects/libcxx/src/CMakeFiles/cxx_shared.dir/string.cpp.o -c /Users/buildslave/jenkins/libcxx_libcxxabi_trunk_testing/CI_ARCH/64/CI_EXCEPTIONS/ON/CI_STD/c++17/llvm-project/libcxx/src/string.cpp
[252/257] /Users/buildslave/jenkins/libcxx_libcxxabi_trunk_testing/CI_ARCH/64/CI_EXCEPTIONS/ON/CI_STD/c++17/host-compiler/bin/clang++  -D_DEBUG -D_LIBCPP_BUILDING_LIBRARY -D_LIBCPP_DEBUG=0 -D_LIBCPP_DISABLE_NEW_DELETE_DEFINITIONS -D_LIBCPP_HAS_NO_PRAGMA_SYSTEM_HEADER -D__STDC_CONSTANT_MACROS -D__STDC_FORMAT_MACROS -D__STDC_LIMIT_MACROS -Iprojects/libcxx/src -I/Users/buildslave/jenkins/libcxx_libcxxabi_trunk_testing/CI_ARCH/64/CI_EXCEPTIONS/ON/CI_STD/c++17/llvm-project/libcxx/src -I/Applications/Xcode.app/Contents/Developer/Platforms/MacOSX.platform/Developer/SDKs/MacOSX10.13.sdk/usr/include/libxml2 -Iinclude -I/Users/buildslave/jenkins/libcxx_libcxxabi_trunk_testing/CI_ARCH/64/CI_EXCEPTIONS/ON/CI_STD/c++17/llvm-project/llvm/include -Iprojects/libcxx/include/c++build -I/Users/buildslave/jenkins/libcxx_libcxxabi_trunk_testing/CI_ARCH/64/CI_EXCEPTIONS/ON/CI_STD/c++17/llvm-project/libcxx/include -fPIC -fvisibility-inlines-hidden -Werror=date-time -Werror=unguarded-availability-new -Wall -Wextra -Wno-unused-parameter -Wwrite-strings -Wcast-qual -Wmissing-field-initializers  -Wno-long-long -Wimplicit-fallthrough -Wcovered-switch-default -Wno-noexcept-type -Wnon-virtual-dtor -Wdelete-non-virtual-dtor -Wstring-conversion -fdiagnostics-color -Os  -arch i386 -arch x86_64 -isysroot /Applications/Xcode.app/Contents/Developer/Platforms/MacOSX.platform/Developer/SDKs/MacOSX10.13.sdk   -UNDEBUG -DLIBCXX_BUILDING_LIBCXXABI -nostdinc++ -fvisibility-inlines-hidden -fvisibility=hidden -Wall -Wextra -W -Wwrite-strings -Wno-unused-parameter -Wno-long-long -Werror=return-type -Wextra-semi -Wno-user-defined-literals -Wno-covered-switch-default -Wno-ignored-attributes -Wno-error -include /var/folders/9t/lrs73ptj6lv644zvh1fk2_gc0000gn/T/tmp.wC1Y1w2p/llvm-build/projects/libcxx/__config_site -std=c++14 -MD -MT projects/libcxx/src/CMakeFiles/cxx_shared.dir/filesystem/directory_iterator.cpp.o -MF projects/libcxx/src/CMakeFiles/cxx_shared.dir/filesystem/directory_iterator.cpp.o.d -o projects/libcxx/src/CMakeFiles/cxx_shared.dir/filesystem/directory_iterator.cpp.o -c /Users/buildslave/jenkins/libcxx_libcxxabi_trunk_testing/CI_ARCH/64/CI_EXCEPTIONS/ON/CI_STD/c++17/llvm-project/libcxx/src/filesystem/directory_iterator.cpp
[253/257] /Users/buildslave/jenkins/libcxx_libcxxabi_trunk_testing/CI_ARCH/64/CI_EXCEPTIONS/ON/CI_STD/c++17/host-compiler/bin/clang++  -D_DEBUG -D_LIBCPP_BUILDING_LIBRARY -D_LIBCPP_DEBUG=0 -D_LIBCPP_DISABLE_NEW_DELETE_DEFINITIONS -D_LIBCPP_HAS_NO_PRAGMA_SYSTEM_HEADER -D__STDC_CONSTANT_MACROS -D__STDC_FORMAT_MACROS -D__STDC_LIMIT_MACROS -Iprojects/libcxx/src -I/Users/buildslave/jenkins/libcxx_libcxxabi_trunk_testing/CI_ARCH/64/CI_EXCEPTIONS/ON/CI_STD/c++17/llvm-project/libcxx/src -I/Applications/Xcode.app/Contents/Developer/Platforms/MacOSX.platform/Developer/SDKs/MacOSX10.13.sdk/usr/include/libxml2 -Iinclude -I/Users/buildslave/jenkins/libcxx_libcxxabi_trunk_testing/CI_ARCH/64/CI_EXCEPTIONS/ON/CI_STD/c++17/llvm-project/llvm/include -Iprojects/libcxx/include/c++build -I/Users/buildslave/jenkins/libcxx_libcxxabi_trunk_testing/CI_ARCH/64/CI_EXCEPTIONS/ON/CI_STD/c++17/llvm-project/libcxx/include -fPIC -fvisibility-inlines-hidden -Werror=date-time -Werror=unguarded-availability-new -Wall -Wextra -Wno-unused-parameter -Wwrite-strings -Wcast-qual -Wmissing-field-initializers  -Wno-long-long -Wimplicit-fallthrough -Wcovered-switch-default -Wno-noexcept-type -Wnon-virtual-dtor -Wdelete-non-virtual-dtor -Wstring-conversion -fdiagnostics-color -Os  -arch i386 -arch x86_64 -isysroot /Applications/Xcode.app/Contents/Developer/Platforms/MacOSX.platform/Developer/SDKs/MacOSX10.13.sdk   -UNDEBUG -DLIBCXX_BUILDING_LIBCXXABI -nostdinc++ -fvisibility-inlines-hidden -fvisibility=hidden -Wall -Wextra -W -Wwrite-strings -Wno-unused-parameter -Wno-long-long -Werror=return-type -Wextra-semi -Wno-user-defined-literals -Wno-covered-switch-default -Wno-ignored-attributes -Wno-error -include /var/folders/9t/lrs73ptj6lv644zvh1fk2_gc0000gn/T/tmp.wC1Y1w2p/llvm-build/projects/libcxx/__config_site -std=c++14 -MD -MT projects/libcxx/src/CMakeFiles/cxx_shared.dir/filesystem/operations.cpp.o -MF projects/libcxx/src/CMakeFiles/cxx_shared.dir/filesystem/operations.cpp.o.d -o projects/libcxx/src/CMakeFiles/cxx_shared.dir/filesystem/operations.cpp.o -c /Users/buildslave/jenkins/libcxx_libcxxabi_trunk_testing/CI_ARCH/64/CI_EXCEPTIONS/ON/CI_STD/c++17/llvm-project/libcxx/src/filesystem/operations.cpp
[254/257] /Users/buildslave/jenkins/libcxx_libcxxabi_trunk_testing/CI_ARCH/64/CI_EXCEPTIONS/ON/CI_STD/c++17/host-compiler/bin/clang++  -D_DEBUG -D_LIBCPP_BUILDING_LIBRARY -D_LIBCPP_DEBUG=0 -D_LIBCPP_DISABLE_NEW_DELETE_DEFINITIONS -D_LIBCPP_HAS_NO_PRAGMA_SYSTEM_HEADER -D__STDC_CONSTANT_MACROS -D__STDC_FORMAT_MACROS -D__STDC_LIMIT_MACROS -Iprojects/libcxx/src -I/Users/buildslave/jenkins/libcxx_libcxxabi_trunk_testing/CI_ARCH/64/CI_EXCEPTIONS/ON/CI_STD/c++17/llvm-project/libcxx/src -I/Applications/Xcode.app/Contents/Developer/Platforms/MacOSX.platform/Developer/SDKs/MacOSX10.13.sdk/usr/include/libxml2 -Iinclude -I/Users/buildslave/jenkins/libcxx_libcxxabi_trunk_testing/CI_ARCH/64/CI_EXCEPTIONS/ON/CI_STD/c++17/llvm-project/llvm/include -Iprojects/libcxx/include/c++build -I/Users/buildslave/jenkins/libcxx_libcxxabi_trunk_testing/CI_ARCH/64/CI_EXCEPTIONS/ON/CI_STD/c++17/llvm-project/libcxx/include -fPIC -fvisibility-inlines-hidden -Werror=date-time -Werror=unguarded-availability-new -Wall -Wextra -Wno-unused-parameter -Wwrite-strings -Wcast-qual -Wmissing-field-initializers  -Wno-long-long -Wimplicit-fallthrough -Wcovered-switch-default -Wno-noexcept-type -Wnon-virtual-dtor -Wdelete-non-virtual-dtor -Wstring-conversion -fdiagnostics-color -Os  -arch i386 -arch x86_64 -isysroot /Applications/Xcode.app/Contents/Developer/Platforms/MacOSX.platform/Developer/SDKs/MacOSX10.13.sdk   -UNDEBUG -DLIBCXX_BUILDING_LIBCXXABI -nostdinc++ -fvisibility-inlines-hidden -fvisibility=hidden -Wall -Wextra -W -Wwrite-strings -Wno-unused-parameter -Wno-long-long -Werror=return-type -Wextra-semi -Wno-user-defined-literals -Wno-covered-switch-default -Wno-ignored-attributes -Wno-error -include /var/folders/9t/lrs73ptj6lv644zvh1fk2_gc0000gn/T/tmp.wC1Y1w2p/llvm-build/projects/libcxx/__config_site -std=c++14 -MD -MT projects/libcxx/src/CMakeFiles/cxx_shared.dir/locale.cpp.o -MF projects/libcxx/src/CMakeFiles/cxx_shared.dir/locale.cpp.o.d -o projects/libcxx/src/CMakeFiles/cxx_shared.dir/locale.cpp.o -c /Users/buildslave/jenkins/libcxx_libcxxabi_trunk_testing/CI_ARCH/64/CI_EXCEPTIONS/ON/CI_STD/c++17/llvm-project/libcxx/src/locale.cpp
[255/257] : && /Users/buildslave/jenkins/libcxx_libcxxabi_trunk_testing/CI_ARCH/64/CI_EXCEPTIONS/ON/CI_STD/c++17/host-compiler/bin/clang++ -fPIC -fvisibility-inlines-hidden -Werror=date-time -Werror=unguarded-availability-new -Wall -Wextra -Wno-unused-parameter -Wwrite-strings -Wcast-qual -Wmissing-field-initializers  -Wno-long-long -Wimplicit-fallthrough -Wcovered-switch-default -Wno-noexcept-type -Wnon-virtual-dtor -Wdelete-non-virtual-dtor -Wstring-conversion -fdiagnostics-color -Os -arch i386 -arch x86_64 -isysroot /Applications/Xcode.app/Contents/Developer/Platforms/MacOSX.platform/Developer/SDKs/MacOSX10.13.sdk -dynamiclib -Wl,-headerpad_max_install_names -compatibility_version 1.0.0 -current_version 1.0.0 -o lib/libc++.1.0.dylib -install_name @rpath/libc++.1.dylib projects/libcxx/src/CMakeFiles/cxx_shared.dir/algorithm.cpp.o projects/libcxx/src/CMakeFiles/cxx_shared.dir/any.cpp.o projects/libcxx/src/CMakeFiles/cxx_shared.dir/bind.cpp.o projects/libcxx/src/CMakeFiles/cxx_shared.dir/charconv.cpp.o projects/libcxx/src/CMakeFiles/cxx_shared.dir/chrono.cpp.o projects/libcxx/src/CMakeFiles/cxx_shared.dir/condition_variable.cpp.o projects/libcxx/src/CMakeFiles/cxx_shared.dir/condition_variable_destructor.cpp.o projects/libcxx/src/CMakeFiles/cxx_shared.dir/debug.cpp.o projects/libcxx/src/CMakeFiles/cxx_shared.dir/exception.cpp.o projects/libcxx/src/CMakeFiles/cxx_shared.dir/functional.cpp.o projects/libcxx/src/CMakeFiles/cxx_shared.dir/future.cpp.o projects/libcxx/src/CMakeFiles/cxx_shared.dir/hash.cpp.o projects/libcxx/src/CMakeFiles/cxx_shared.dir/ios.cpp.o projects/libcxx/src/CMakeFiles/cxx_shared.dir/iostream.cpp.o projects/libcxx/src/CMakeFiles/cxx_shared.dir/locale.cpp.o projects/libcxx/src/CMakeFiles/cxx_shared.dir/memory.cpp.o projects/libcxx/src/CMakeFiles/cxx_shared.dir/mutex.cpp.o projects/libcxx/src/CMakeFiles/cxx_shared.dir/mutex_destructor.cpp.o projects/libcxx/src/CMakeFiles/cxx_shared.dir/new.cpp.o projects/libcxx/src/CMakeFiles/cxx_shared.dir/optional.cpp.o projects/libcxx/src/CMakeFiles/cxx_shared.dir/random.cpp.o projects/libcxx/src/CMakeFiles/cxx_shared.dir/regex.cpp.o projects/libcxx/src/CMakeFiles/cxx_shared.dir/shared_mutex.cpp.o projects/libcxx/src/CMakeFiles/cxx_shared.dir/stdexcept.cpp.o projects/libcxx/src/CMakeFiles/cxx_shared.dir/string.cpp.o projects/libcxx/src/CMakeFiles/cxx_shared.dir/strstream.cpp.o projects/libcxx/src/CMakeFiles/cxx_shared.dir/system_error.cpp.o projects/libcxx/src/CMakeFiles/cxx_shared.dir/thread.cpp.o projects/libcxx/src/CMakeFiles/cxx_shared.dir/typeinfo.cpp.o projects/libcxx/src/CMakeFiles/cxx_shared.dir/utility.cpp.o projects/libcxx/src/CMakeFiles/cxx_shared.dir/valarray.cpp.o projects/libcxx/src/CMakeFiles/cxx_shared.dir/variant.cpp.o projects/libcxx/src/CMakeFiles/cxx_shared.dir/vector.cpp.o projects/libcxx/src/CMakeFiles/cxx_shared.dir/filesystem/operations.cpp.o projects/libcxx/src/CMakeFiles/cxx_shared.dir/filesystem/directory_iterator.cpp.o  -Wl,-rpath,@loader_path/../lib -nodefaultlibs -lSystem -lc lib/libc++abi.1.0.dylib -Wl,-unexported_symbols_list,/Users/buildslave/jenkins/libcxx_libcxxabi_trunk_testing/CI_ARCH/64/CI_EXCEPTIONS/ON/CI_STD/c++17/llvm-project/libcxx/src/../lib/libc++unexp.exp -Wl,-reexported_symbols_list,/Users/buildslave/jenkins/libcxx_libcxxabi_trunk_testing/CI_ARCH/64/CI_EXCEPTIONS/ON/CI_STD/c++17/llvm-project/libcxx/src/../lib/libc++abi.v2.exp -Wl,-force_symbols_not_weak_list,/Users/buildslave/jenkins/libcxx_libcxxabi_trunk_testing/CI_ARCH/64/CI_EXCEPTIONS/ON/CI_STD/c++17/llvm-project/libcxx/src/../lib/notweak.exp -Wl,-force_symbols_weak_list,/Users/buildslave/jenkins/libcxx_libcxxabi_trunk_testing/CI_ARCH/64/CI_EXCEPTIONS/ON/CI_STD/c++17/llvm-project/libcxx/src/../lib/weak.exp -Wl,-reexported_symbols_list,/Users/buildslave/jenkins/libcxx_libcxxabi_trunk_testing/CI_ARCH/64/CI_EXCEPTIONS/ON/CI_STD/c++17/llvm-project/libcxx/src/../lib/libc++abi-new-delete.exp && :
[256/257] /usr/local/Cellar/cmake/3.13.1/bin/cmake -E cmake_symlink_library lib/libc++.1.0.dylib  lib/libc++.1.dylib lib/libc++.dylib && :
[257/257] cd /var/folders/9t/lrs73ptj6lv644zvh1fk2_gc0000gn/T/tmp.wC1Y1w2p/llvm-build/projects/libcxx/src && /usr/local/Cellar/cmake/3.13.1/bin/cmake -DCMAKE_INSTALL_COMPONENT=cxx -P /var/folders/9t/lrs73ptj6lv644zvh1fk2_gc0000gn/T/tmp.wC1Y1w2p/llvm-build/projects/libcxx/cmake_install.cmake
-- Install configuration: "MinSizeRel"
-- Installing: /var/folders/9t/lrs73ptj6lv644zvh1fk2_gc0000gn/T/tmp.wC1Y1w2p/llvm-install/lib/libc++.1.0.dylib
-- Installing: /var/folders/9t/lrs73ptj6lv644zvh1fk2_gc0000gn/T/tmp.wC1Y1w2p/llvm-install/lib/libc++.1.dylib
-- Installing: /var/folders/9t/lrs73ptj6lv644zvh1fk2_gc0000gn/T/tmp.wC1Y1w2p/llvm-install/lib/libc++.dylib
+ echo @@@@@@
@@@@@@
+ echo '@@@ Running tests for libc++ @@@'
Running tests for libc++

Hide Details

@@@ Running tests for libc++ @@@ + ninja -C /var/folders/9t/lrs73ptj6lv644zvh1fk2_gc0000gn/T/tmp.wC1Y1w2p/llvm-build check-cxx ninja: Entering directory `/var/folders/9t/lrs73ptj6lv644zvh1fk2_gc0000gn/T/tmp.wC1Y1w2p/llvm-build' [0/1] Running libcxx tests llvm-lit: /Users/buildslave/jenkins/libcxx_libcxxabi_trunk_testing/CI_ARCH/64/CI_EXCEPTIONS/ON/CI_STD/c++17/llvm-project/libcxx/test/lit.cfg:45: note: Using configuration variant: libcxx llvm-lit: /Users/buildslave/jenkins/libcxx_libcxxabi_trunk_testing/CI_ARCH/64/CI_EXCEPTIONS/ON/CI_STD/c++17/llvm-project/libcxx/utils/libcxx/test/config.py:322: note: inferred use_system_cxx_lib as: None llvm-lit: /Users/buildslave/jenkins/libcxx_libcxxabi_trunk_testing/CI_ARCH/64/CI_EXCEPTIONS/ON/CI_STD/c++17/llvm-project/libcxx/utils/libcxx/test/config.py:1166: note: inferred arch as: 'x86_64' llvm-lit: /Users/buildslave/jenkins/libcxx_libcxxabi_trunk_testing/CI_ARCH/64/CI_EXCEPTIONS/ON/CI_STD/c++17/llvm-project/libcxx/utils/libcxx/test/config.py:1170: note: inferred platform as: 'macosx10.13' llvm-lit: /Users/buildslave/jenkins/libcxx_libcxxabi_trunk_testing/CI_ARCH/64/CI_EXCEPTIONS/ON/CI_STD/c++17/llvm-project/libcxx/utils/libcxx/test/config.py:1176: note: computed target_triple as: 'x86_64-apple-macosx10.13' llvm-lit: /Users/buildslave/jenkins/libcxx_libcxxabi_trunk_testing/CI_ARCH/64/CI_EXCEPTIONS/ON/CI_STD/c++17/llvm-project/libcxx/utils/libcxx/test/config.py:349: note: inferred use_clang_verify as: True llvm-lit: /Users/buildslave/jenkins/libcxx_libcxxabi_trunk_testing/CI_ARCH/64/CI_EXCEPTIONS/ON/CI_STD/c++17/llvm-project/libcxx/utils/libcxx/test/config.py:359: note: enabling thread-safety annotations llvm-lit: /Users/buildslave/jenkins/libcxx_libcxxabi_trunk_testing/CI_ARCH/64/CI_EXCEPTIONS/ON/CI_STD/c++17/llvm-project/libcxx/utils/libcxx/test/config.py:654: note: Using __config_site header /var/folders/9t/lrs73ptj6lv644zvh1fk2_gc0000gn/T/tmp.wC1Y1w2p/llvm-build/projects/libcxx/__config_site with macros: {'_LIBCPP_HAS_MERGED_TYPEINFO_NAMES_DEFAULT': '0', '_LIBCPP_HIDE_FROM_ABI_PER_TU_BY_DEFAULT': ''} llvm-lit: /Users/buildslave/jenkins/libcxx_libcxxabi_trunk_testing/CI_ARCH/64/CI_EXCEPTIONS/ON/CI_STD/c++17/llvm-project/libcxx/utils/libcxx/test/target_info.py:151: note: using SDKROOT: '/Applications/Xcode.app/Contents/Developer/Platforms/MacOSX.platform/Developer/SDKs/MacOSX10.13.sdk' llvm-lit: /Users/buildslave/jenkins/libcxx_libcxxabi_trunk_testing/CI_ARCH/64/CI_EXCEPTIONS/ON/CI_STD/c++17/llvm-project/libcxx/utils/libcxx/test/config.py:438: note: inferred long_tests as: True llvm-lit: /Users/buildslave/jenkins/libcxx_libcxxabi_trunk_testing/CI_ARCH/64/CI_EXCEPTIONS/ON/CI_STD/c++17/llvm-project/libcxx/utils/libcxx/test/config.py:158: note: Using compiler: /Users/buildslave/jenkins/libcxx_libcxxabi_trunk_testing/CI_ARCH/64/CI_EXCEPTIONS/ON/CI_STD/c++17/host-compiler/bin/clang++ llvm-lit: /Users/buildslave/jenkins/libcxx_libcxxabi_trunk_testing/CI_ARCH/64/CI_EXCEPTIONS/ON/CI_STD/c++17/llvm-project/libcxx/utils/libcxx/test/config.py:159: note: Using flags: ['-D_LIBCPP_DISABLE_AVAILABILITY', '-v', '-arch', 'x86_64', '-mmacosx-version-min=10.13', '-ftemplate-depth=270'] llvm-lit: /Users/buildslave/jenkins/libcxx_libcxxabi_trunk_testing/CI_ARCH/64/CI_EXCEPTIONS/ON/CI_STD/c++17/llvm-project/libcxx/utils/libcxx/test/config.py:164: note: Using compile flags: ['-Werror=thread-safety', '-std=c++17', '-Wno-macro-redefined', '-include', '/var/folders/9t/lrs73ptj6lv644zvh1fk2_gc0000gn/T/tmp.wC1Y1w2p/llvm-build/projects/libcxx/__config_site', '-include', '/Users/buildslave/jenkins/libcxx_libcxxabi_trunk_testing/CI_ARCH/64/CI_EXCEPTIONS/ON/CI_STD/c++17/llvm-project/libcxx/test/support/nasty_macros.h', '-nostdinc++', '-I/Users/buildslave/jenkins/libcxx_libcxxabi_trunk_testing/CI_ARCH/64/CI_EXCEPTIONS/ON/CI_STD/c++17/llvm-project/libcxx/include', '-I/var/folders/9t/lrs73ptj6lv644zvh1fk2_gc0000gn/T/tmp.wC1Y1w2p/llvm-build/projects/libcxx/include/c++build', '-isysroot', '/Applications/Xcode.app/Contents/Developer/Platforms/MacOSX.platform/Developer/SDKs/MacOSX10.13.sdk', '-I/Users/buildslave/jenkins/libcxx_libcxxabi_trunk_testing/CI_ARCH/64/CI_EXCEPTIONS/ON/CI_STD/c++17/llvm-project/libcxx/test/support', '-DLIBCXX_FILESYSTEM_STATIC_TEST_ROOT="/Users/buildslave/jenkins/libcxx_libcxxabi_trunk_testing/CI_ARCH/64/CI_EXCEPTIONS/ON/CI_STD/c++17/llvm-project/libcxx/test/std/input.output/filesystems/Inputs/static_test_env"', '-DLIBCXX_FILESYSTEM_DYNAMIC_TEST_ROOT="/private/var/folders/9t/lrs73ptj6lv644zvh1fk2_gc0000gn/T/tmp.wC1Y1w2p/llvm-build/projects/libcxx/test/filesystem/Output/dynamic_env"', '-DLIBCXX_FILESYSTEM_DYNAMIC_TEST_HELPER="/usr/local/opt/python@2/bin/python2.7 /Users/buildslave/jenkins/libcxx_libcxxabi_trunk_testing/CI_ARCH/64/CI_EXCEPTIONS/ON/CI_STD/c++17/llvm-project/libcxx/test/support/filesystem_dynamic_test_helper.py"'] llvm-lit: /Users/buildslave/jenkins/libcxx_libcxxabi_trunk_testing/CI_ARCH/64/CI_EXCEPTIONS/ON/CI_STD/c++17/llvm-project/libcxx/utils/libcxx/test/config.py:166: note: Using warnings: ['-D_LIBCPP_HAS_NO_PRAGMA_SYSTEM_HEADER', '-Wall', '-Wextra', '-Werror', '-Wuser-defined-warnings', '-Wshadow', '-Wno-unused-command-line-argument', '-Wno-attributes', '-Wno-pessimizing-move', '-Wno-c++11-extensions', '-Wno-user-defined-literals', '-Wno-noexcept-type', '-Wsign-compare', '-Wunused-variable', '-Wunused-parameter', '-Wunreachable-code'] llvm-lit: /Users/buildslave/jenkins/libcxx_libcxxabi_trunk_testing/CI_ARCH/64/CI_EXCEPTIONS/ON/CI_STD/c++17/llvm-project/libcxx/utils/libcxx/test/config.py:167: note: Using link flags: ['-L/var/folders/9t/lrs73ptj6lv644zvh1fk2_gc0000gn/T/tmp.wC1Y1w2p/llvm-build/./lib', '-Wl,-rpath,/var/folders/9t/lrs73ptj6lv644zvh1fk2_gc0000gn/T/tmp.wC1Y1w2p/llvm-build/./lib', '-nodefaultlibs', '-lc++', '-lSystem'] llvm-lit: /Users/buildslave/jenkins/libcxx_libcxxabi_trunk_testing/CI_ARCH/64/CI_EXCEPTIONS/ON/CI_STD/c++17/llvm-project/libcxx/utils/libcxx/test/config.py:170: note: Using available_features: ['libc++', 'verify-support', 'c++17', '-fsized-deallocation', 'modules-support', 'locale.en_US.UTF-8', 'diagnose-if-support', 'long_tests', 'libcpp-has-merged-typeinfo-names-default', 'objective-c++', 'fdelayed-template-parsing', '-faligned-allocation', 'clang-11.0.0', 'darwin', 'locale.fr_CA.ISO8859-1', 'clang-11.0', 'clang-11', 'clang', 'locale.fr_FR.UTF-8', 'locale.ru_RU.UTF-8', 'locale.zh_CN.UTF-8', 'fcoroutines-ts', 'locale.cs_CZ.ISO8859-2', 'apple-darwin', 'thread-safety'] llvm-lit: /Users/buildslave/jenkins/libcxx_libcxxabi_trunk_testing/CI_ARCH/64/CI_EXCEPTIONS/ON/CI_STD/c++17/llvm-project/libcxx/utils/libcxx/test/config.py:175: note: Adding environment variables: {'DYLD_LIBRARY_PATH': '/var/folders/9t/lrs73ptj6lv644zvh1fk2_gc0000gn/T/tmp.wC1Y1w2p/llvm-build/./lib', 'LIBCXX_FILESYSTEM_DYNAMIC_TEST_ROOT': '/private/var/folders/9t/lrs73ptj6lv644zvh1fk2_gc0000gn/T/tmp.wC1Y1w2p/llvm-build/projects/libcxx/test/filesystem/Output/dynamic_env'} -- Testing: 6395 tests, 8 workers -- Testing: 0 FAIL: libc++ :: libcxx/memory/aligned_allocation_macro.pass.cpp (243 of 6395) ******************** TEST 'libc++ :: libcxx/memory/aligned_allocation_macro.pass.cpp' FAILED ******************** Command: ['/Users/buildslave/jenkins/libcxx_libcxxabi_trunk_testing/CI_ARCH/64/CI_EXCEPTIONS/ON/CI_STD/c++17/host-compiler/bin/clang++', '-o', '/private/var/folders/9t/lrs73ptj6lv644zvh1fk2_gc0000gn/T/tmp.wC1Y1w2p/llvm-build/projects/libcxx/test/libcxx/memory/Output/aligned_allocation_macro.pass.cpp.o', '-x', 'c++', '/Users/buildslave/jenkins/libcxx_libcxxabi_trunk_testing/CI_ARCH/64/CI_EXCEPTIONS/ON/CI_STD/c++17/llvm-project/libcxx/test/libcxx/memory/aligned_allocation_macro.pass.cpp', '-c', '-D_LIBCPP_DISABLE_AVAILABILITY', '-v', '-arch', 'x86_64', '-mmacosx-version-min=10.13', '-ftemplate-depth=270', '-Werror=thread-safety', '-std=c++17', '-Wno-macro-redefined', '-include', '/var/folders/9t/lrs73ptj6lv644zvh1fk2_gc0000gn/T/tmp.wC1Y1w2p/llvm-build/projects/libcxx/__config_site', '-include', '/Users/buildslave/jenkins/libcxx_libcxxabi_trunk_testing/CI_ARCH/64/CI_EXCEPTIONS/ON/CI_STD/c++17/llvm-project/libcxx/test/support/nasty_macros.h', '-nostdinc++', '-I/Users/buildslave/jenkins/libcxx_libcxxabi_trunk_testing/CI_ARCH/64/CI_EXCEPTIONS/ON/CI_STD/c++17/llvm-project/libcxx/include', '-I/var/folders/9t/lrs73ptj6lv644zvh1fk2_gc0000gn/T/tmp.wC1Y1w2p/llvm-build/projects/libcxx/include/c++build', '-isysroot', '/Applications/Xcode.app/Contents/Developer/Platforms/MacOSX.platform/Developer/SDKs/MacOSX10.13.sdk', '-I/Users/buildslave/jenkins/libcxx_libcxxabi_trunk_testing/CI_ARCH/64/CI_EXCEPTIONS/ON/CI_STD/c++17/llvm-project/libcxx/test/support', '-DLIBCXX_FILESYSTEM_STATIC_TEST_ROOT="/Users/buildslave/jenkins/libcxx_libcxxabi_trunk_testing/CI_ARCH/64/CI_EXCEPTIONS/ON/CI_STD/c++17/llvm-project/libcxx/test/std/input.output/filesystems/Inputs/static_test_env"', '-DLIBCXX_FILESYSTEM_DYNAMIC_TEST_ROOT="/private/var/folders/9t/lrs73ptj6lv644zvh1fk2_gc0000gn/T/tmp.wC1Y1w2p/llvm-build/projects/libcxx/test/filesystem/Output/dynamic_env"', '-DLIBCXX_FILESYSTEM_DYNAMIC_TEST_HELPER="/usr/local/opt/python@2/bin/python2.7 /Users/buildslave/jenkins/libcxx_libcxxabi_trunk_testing/CI_ARCH/64/CI_EXCEPTIONS/ON/CI_STD/c++17/llvm-project/libcxx/test/support/filesystem_dynamic_test_helper.py"', '-D_LIBCPP_HAS_NO_PRAGMA_SYSTEM_HEADER', '-Wall', '-Wextra', '-Werror', '-Wuser-defined-warnings', '-Wshadow', '-Wno-unused-command-line-argument', '-Wno-attributes', '-Wno-pessimizing-move', '-Wno-c++11-extensions', '-Wno-user-defined-literals', '-Wno-noexcept-type', '-Wsign-compare', '-Wunused-variable', '-Wunused-parameter', '-Wunreachable-code', '-c'] Exit Code: 1 Standard Error: -- clang version 11.0.0 (https://github.com/llvm/llvm-project.git 07d2cdae11633139947f105888163adfd5646ce7) Target: x86_64-apple-darwin17.5.0 Thread model: posix InstalledDir: /Users/buildslave/jenkins/libcxx_libcxxabi_trunk_testing/CI_ARCH/64/CI_EXCEPTIONS/ON/CI_STD/c++17/host-compiler/bin (in-process) "/Users/buildslave/jenkins/libcxx_libcxxabi_trunk_testing/CI_ARCH/64/CI_EXCEPTIONS/ON/CI_STD/c++17/host-compiler/bin/clang-11" -cc1 -triple x86_64-apple-macosx10.13.0 -Wdeprecated-objc-isa-usage -Werror=deprecated-objc-isa-usage -emit-obj -mrelax-all -disable-free -main-file-name aligned_allocation_macro.pass.cpp -mrelocation-model pic -pic-level 2 -mthread-model posix -mframe-pointer=all -fno-rounding-math -masm-verbose -munwind-tables -faligned-alloc-unavailable -target-cpu penryn -dwarf-column-info -debugger-tuning=lldb -target-linker-version 409.12 -v -nostdinc++ -resource-dir /Users/buildslave/jenkins/libcxx_libcxxabi_trunk_testing/CI_ARCH/64/CI_EXCEPTIONS/ON/CI_STD/c++17/host-compiler/lib/clang/11.0.0 -include /var/folders/9t/lrs73ptj6lv644zvh1fk2_gc0000gn/T/tmp.wC1Y1w2p/llvm-build/projects/libcxx/__config_site -include /Users/buildslave/jenkins/libcxx_libcxxabi_trunk_testing/CI_ARCH/64/CI_EXCEPTIONS/ON/CI_STD/c++17/llvm-project/libcxx/test/support/nasty_macros.h -isysroot /Applications/Xcode.app/Contents/Developer/Platforms/MacOSX.platform/Developer/SDKs/MacOSX10.13.sdk -D _LIBCPP_DISABLE_AVAILABILITY -I /Users/buildslave/jenkins/libcxx_libcxxabi_trunk_testing/CI_ARCH/64/CI_EXCEPTIONS/ON/CI_STD/c++17/llvm-project/libcxx/include -I /var/folders/9t/lrs73ptj6lv644zvh1fk2_gc0000gn/T/tmp.wC1Y1w2p/llvm-build/projects/libcxx/include/c++build -I /Users/buildslave/jenkins/libcxx_libcxxabi_trunk_testing/CI_ARCH/64/CI_EXCEPTIONS/ON/CI_STD/c++17/llvm-project/libcxx/test/support -D "LIBCXX_FILESYSTEM_STATIC_TEST_ROOT=\"/Users/buildslave/jenkins/libcxx_libcxxabi_trunk_testing/CI_ARCH/64/CI_EXCEPTIONS/ON/CI_STD/c++17/llvm-project/libcxx/test/std/input.output/filesystems/Inputs/static_test_env\"" -D "LIBCXX_FILESYSTEM_DYNAMIC_TEST_ROOT=\"/private/var/folders/9t/lrs73ptj6lv644zvh1fk2_gc0000gn/T/tmp.wC1Y1w2p/llvm-build/projects/libcxx/test/filesystem/Output/dynamic_env\"" -D "LIBCXX_FILESYSTEM_DYNAMIC_TEST_HELPER=\"/usr/local/opt/python@2/bin/python2.7 /Users/buildslave/jenkins/libcxx_libcxxabi_trunk_testing/CI_ARCH/64/CI_EXCEPTIONS/ON/CI_STD/c++17/llvm-project/libcxx/test/support/filesystem_dynamic_test_helper.py\"" -D _LIBCPP_HAS_NO_PRAGMA_SYSTEM_HEADER -stdlib=libc++ -internal-isystem /Applications/Xcode.app/Contents/Developer/Platforms/MacOSX.platform/Developer/SDKs/MacOSX10.13.sdk/usr/local/include -internal-isystem /Users/buildslave/jenkins/libcxx_libcxxabi_trunk_testing/CI_ARCH/64/CI_EXCEPTIONS/ON/CI_STD/c++17/host-compiler/lib/clang/11.0.0/include -internal-externc-isystem /Applications/Xcode.app/Contents/Developer/Platforms/MacOSX.platform/Developer/SDKs/MacOSX10.13.sdk/usr/include -Werror=thread-safety -Wno-macro-redefined -Wall -Wextra -Werror -Wuser-defined-warnings -Wshadow -Wno-unused-command-line-argument -Wno-attributes -Wno-pessimizing-move -Wno-c++11-extensions -Wno-user-defined-literals -Wno-noexcept-type -Wsign-compare -Wunused-variable -Wunused-parameter -Wunreachable-code -std=c++17 -fdeprecated-macro -fdebug-compilation-dir /private/var/folders/9t/lrs73ptj6lv644zvh1fk2_gc0000gn/T/tmp.wC1Y1w2p/llvm-build/projects/libcxx/test/libcxx/memory -ftemplate-depth 270 -ferror-limit 19 -fmessage-length 0 -stack-protector 1 -fblocks -fencode-extended-block-signature -fregister-global-dtors-with-atexit -fgnuc-version=4.2.1 -fobjc-runtime=macosx-10.13.0 -fcxx-exceptions -fexceptions -fmax-type-align=16 -fdiagnostics-show-option -o /private/var/folders/9t/lrs73ptj6lv644zvh1fk2_gc0000gn/T/tmp.wC1Y1w2p/llvm-build/projects/libcxx/test/libcxx/memory/Output/aligned_allocation_macro.pass.cpp.o -x c++ /Users/buildslave/jenkins/libcxx_libcxxabi_trunk_testing/CI_ARCH/64/CI_EXCEPTIONS/ON/CI_STD/c++17/llvm-project/libcxx/test/libcxx/memory/aligned_allocation_macro.pass.cpp clang -cc1 version 11.0.0 based upon LLVM 11.0.0git default target x86_64-apple-darwin17.5.0 ignoring nonexistent directory "/Applications/Xcode.app/Contents/Developer/Platforms/MacOSX.platform/Developer/SDKs/MacOSX10.13.sdk/usr/local/include" ignoring nonexistent directory "/Applications/Xcode.app/Contents/Developer/Platforms/MacOSX.platform/Developer/SDKs/MacOSX10.13.sdk/Library/Frameworks" #include "..." search starts here: #include <...> search starts here: /Users/buildslave/jenkins/libcxx_libcxxabi_trunk_testing/CI_ARCH/64/CI_EXCEPTIONS/ON/CI_STD/c++17/llvm-project/libcxx/include /var/folders/9t/lrs73ptj6lv644zvh1fk2_gc0000gn/T/tmp.wC1Y1w2p/llvm-build/projects/libcxx/include/c++build /Users/buildslave/jenkins/libcxx_libcxxabi_trunk_testing/CI_ARCH/64/CI_EXCEPTIONS/ON/CI_STD/c++17/llvm-project/libcxx/test/support /Users/buildslave/jenkins/libcxx_libcxxabi_trunk_testing/CI_ARCH/64/CI_EXCEPTIONS/ON/CI_STD/c++17/host-compiler/lib/clang/11.0.0/include /Applications/Xcode.app/Contents/Developer/Platforms/MacOSX.platform/Developer/SDKs/MacOSX10.13.sdk/usr/include /Applications/Xcode.app/Contents/Developer/Platforms/MacOSX.platform/Developer/SDKs/MacOSX10.13.sdk/System/Library/Frameworks (framework directory) End of search list. /Users/buildslave/jenkins/libcxx_libcxxabi_trunk_testing/CI_ARCH/64/CI_EXCEPTIONS/ON/CI_STD/c++17/llvm-project/libcxx/test/libcxx/memory/aligned_allocation_macro.pass.cpp:29:5: error: "libc++ should have aligned allocation in C++17 and up when targeting a platform that supports it" # error "libc++ should have aligned allocation in C++17 and up when targeting a platform that supports it" ^ 1 error generated. --

Hide Details

Compilation failed unexpectedly! ******************** Testing: 0.. 10.. 20.. 30.. 40 FAIL: libc++ :: std/language.support/support.dynamic/new.delete/new.delete.array/delete_align_val_t_replace.pass.cpp (2870 of 6395) ******************** TEST 'libc++ :: std/language.support/support.dynamic/new.delete/new.delete.array/delete_align_val_t_replace.pass.cpp' FAILED ******************** Command: ['/Users/buildslave/jenkins/libcxx_libcxxabi_trunk_testing/CI_ARCH/64/CI_EXCEPTIONS/ON/CI_STD/c++17/host-compiler/bin/clang++', '-o', '/private/var/folders/9t/lrs73ptj6lv644zvh1fk2_gc0000gn/T/tmp.wC1Y1w2p/llvm-build/projects/libcxx/test/std/language.support/support.dynamic/new.delete/new.delete.array/Output/delete_align_val_t_replace.pass.cpp.o', '-x', 'c++', '/Users/buildslave/jenkins/libcxx_libcxxabi_trunk_testing/CI_ARCH/64/CI_EXCEPTIONS/ON/CI_STD/c++17/llvm-project/libcxx/test/std/language.support/support.dynamic/new.delete/new.delete.array/delete_align_val_t_replace.pass.cpp', '-c', '-D_LIBCPP_DISABLE_AVAILABILITY', '-v', '-arch', 'x86_64', '-mmacosx-version-min=10.13', '-ftemplate-depth=270', '-Werror=thread-safety', '-std=c++17', '-Wno-macro-redefined', '-include', '/var/folders/9t/lrs73ptj6lv644zvh1fk2_gc0000gn/T/tmp.wC1Y1w2p/llvm-build/projects/libcxx/__config_site', '-include', '/Users/buildslave/jenkins/libcxx_libcxxabi_trunk_testing/CI_ARCH/64/CI_EXCEPTIONS/ON/CI_STD/c++17/llvm-project/libcxx/test/support/nasty_macros.h', '-nostdinc++', '-I/Users/buildslave/jenkins/libcxx_libcxxabi_trunk_testing/CI_ARCH/64/CI_EXCEPTIONS/ON/CI_STD/c++17/llvm-project/libcxx/include', '-I/var/folders/9t/lrs73ptj6lv644zvh1fk2_gc0000gn/T/tmp.wC1Y1w2p/llvm-build/projects/libcxx/include/c++build', '-isysroot', '/Applications/Xcode.app/Contents/Developer/Platforms/MacOSX.platform/Developer/SDKs/MacOSX10.13.sdk', '-I/Users/buildslave/jenkins/libcxx_libcxxabi_trunk_testing/CI_ARCH/64/CI_EXCEPTIONS/ON/CI_STD/c++17/llvm-project/libcxx/test/support', '-DLIBCXX_FILESYSTEM_STATIC_TEST_ROOT="/Users/buildslave/jenkins/libcxx_libcxxabi_trunk_testing/CI_ARCH/64/CI_EXCEPTIONS/ON/CI_STD/c++17/llvm-project/libcxx/test/std/input.output/filesystems/Inputs/static_test_env"', '-DLIBCXX_FILESYSTEM_DYNAMIC_TEST_ROOT="/private/var/folders/9t/lrs73ptj6lv644zvh1fk2_gc0000gn/T/tmp.wC1Y1w2p/llvm-build/projects/libcxx/test/filesystem/Output/dynamic_env"', '-DLIBCXX_FILESYSTEM_DYNAMIC_TEST_HELPER="/usr/local/opt/python@2/bin/python2.7 /Users/buildslave/jenkins/libcxx_libcxxabi_trunk_testing/CI_ARCH/64/CI_EXCEPTIONS/ON/CI_STD/c++17/llvm-project/libcxx/test/support/filesystem_dynamic_test_helper.py"', '-D_LIBCPP_HAS_NO_PRAGMA_SYSTEM_HEADER', '-Wall', '-Wextra', '-Werror', '-Wuser-defined-warnings', '-Wshadow', '-Wno-unused-command-line-argument', '-Wno-attributes', '-Wno-pessimizing-move', '-Wno-c++11-extensions', '-Wno-user-defined-literals', '-Wno-noexcept-type', '-Wsign-compare', '-Wunused-variable', '-Wunused-parameter', '-Wunreachable-code', '-c'] Exit Code: 1 Standard Error: -- clang version 11.0.0 (https://github.com/llvm/llvm-project.git 07d2cdae11633139947f105888163adfd5646ce7) Target: x86_64-apple-darwin17.5.0 Thread model: posix InstalledDir: /Users/buildslave/jenkins/libcxx_libcxxabi_trunk_testing/CI_ARCH/64/CI_EXCEPTIONS/ON/CI_STD/c++17/host-compiler/bin (in-process) "/Users/buildslave/jenkins/libcxx_libcxxabi_trunk_testing/CI_ARCH/64/CI_EXCEPTIONS/ON/CI_STD/c++17/host-compiler/bin/clang-11" -cc1 -triple x86_64-apple-macosx10.13.0 -Wdeprecated-objc-isa-usage -Werror=deprecated-objc-isa-usage -emit-obj -mrelax-all -disable-free -main-file-name delete_align_val_t_replace.pass.cpp -mrelocation-model pic -pic-level 2 -mthread-model posix -mframe-pointer=all -fno-rounding-math -masm-verbose -munwind-tables -faligned-alloc-unavailable -target-cpu penryn -dwarf-column-info -debugger-tuning=lldb -target-linker-version 409.12 -v -nostdinc++ -resource-dir /Users/buildslave/jenkins/libcxx_libcxxabi_trunk_testing/CI_ARCH/64/CI_EXCEPTIONS/ON/CI_STD/c++17/host-compiler/lib/clang/11.0.0 -include /var/folders/9t/lrs73ptj6lv644zvh1fk2_gc0000gn/T/tmp.wC1Y1w2p/llvm-build/projects/libcxx/__config_site -include /Users/buildslave/jenkins/libcxx_libcxxabi_trunk_testing/CI_ARCH/64/CI_EXCEPTIONS/ON/CI_STD/c++17/llvm-project/libcxx/test/support/nasty_macros.h -isysroot /Applications/Xcode.app/Contents/Developer/Platforms/MacOSX.platform/Developer/SDKs/MacOSX10.13.sdk -D _LIBCPP_DISABLE_AVAILABILITY -I /Users/buildslave/jenkins/libcxx_libcxxabi_trunk_testing/CI_ARCH/64/CI_EXCEPTIONS/ON/CI_STD/c++17/llvm-project/libcxx/include -I /var/folders/9t/lrs73ptj6lv644zvh1fk2_gc0000gn/T/tmp.wC1Y1w2p/llvm-build/projects/libcxx/include/c++build -I /Users/buildslave/jenkins/libcxx_libcxxabi_trunk_testing/CI_ARCH/64/CI_EXCEPTIONS/ON/CI_STD/c++17/llvm-project/libcxx/test/support -D "LIBCXX_FILESYSTEM_STATIC_TEST_ROOT=\"/Users/buildslave/jenkins/libcxx_libcxxabi_trunk_testing/CI_ARCH/64/CI_EXCEPTIONS/ON/CI_STD/c++17/llvm-project/libcxx/test/std/input.output/filesystems/Inputs/static_test_env\"" -D "LIBCXX_FILESYSTEM_DYNAMIC_TEST_ROOT=\"/private/var/folders/9t/lrs73ptj6lv644zvh1fk2_gc0000gn/T/tmp.wC1Y1w2p/llvm-build/projects/libcxx/test/filesystem/Output/dynamic_env\"" -D "LIBCXX_FILESYSTEM_DYNAMIC_TEST_HELPER=\"/usr/local/opt/python@2/bin/python2.7 /Users/buildslave/jenkins/libcxx_libcxxabi_trunk_testing/CI_ARCH/64/CI_EXCEPTIONS/ON/CI_STD/c++17/llvm-project/libcxx/test/support/filesystem_dynamic_test_helper.py\"" -D _LIBCPP_HAS_NO_PRAGMA_SYSTEM_HEADER -stdlib=libc++ -internal-isystem /Applications/Xcode.app/Contents/Developer/Platforms/MacOSX.platform/Developer/SDKs/MacOSX10.13.sdk/usr/local/include -internal-isystem /Users/buildslave/jenkins/libcxx_libcxxabi_trunk_testing/CI_ARCH/64/CI_EXCEPTIONS/ON/CI_STD/c++17/host-compiler/lib/clang/11.0.0/include -internal-externc-isystem /Applications/Xcode.app/Contents/Developer/Platforms/MacOSX.platform/Developer/SDKs/MacOSX10.13.sdk/usr/include -Werror=thread-safety -Wno-macro-redefined -Wall -Wextra -Werror -Wuser-defined-warnings -Wshadow -Wno-unused-command-line-argument -Wno-attributes -Wno-pessimizing-move -Wno-c++11-extensions -Wno-user-defined-literals -Wno-noexcept-type -Wsign-compare -Wunused-variable -Wunused-parameter -Wunreachable-code -std=c++17 -fdeprecated-macro -fdebug-compilation-dir /private/var/folders/9t/lrs73ptj6lv644zvh1fk2_gc0000gn/T/tmp.wC1Y1w2p/llvm-build/projects/libcxx/test/std/language.support/support.dynamic/new.delete/new.delete.array -ftemplate-depth 270 -ferror-limit 19 -fmessage-length 0 -stack-protector 1 -fblocks -fencode-extended-block-signature -fregister-global-dtors-with-atexit -fgnuc-version=4.2.1 -fobjc-runtime=macosx-10.13.0 -fcxx-exceptions -fexceptions -fmax-type-align=16 -fdiagnostics-show-option -o /private/var/folders/9t/lrs73ptj6lv644zvh1fk2_gc0000gn/T/tmp.wC1Y1w2p/llvm-build/projects/libcxx/test/std/language.support/support.dynamic/new.delete/new.delete.array/Output/delete_align_val_t_replace.pass.cpp.o -x c++ /Users/buildslave/jenkins/libcxx_libcxxabi_trunk_testing/CI_ARCH/64/CI_EXCEPTIONS/ON/CI_STD/c++17/llvm-project/libcxx/test/std/language.support/support.dynamic/new.delete/new.delete.array/delete_align_val_t_replace.pass.cpp clang -cc1 version 11.0.0 based upon LLVM 11.0.0git default target x86_64-apple-darwin17.5.0 ignoring nonexistent directory "/Applications/Xcode.app/Contents/Developer/Platforms/MacOSX.platform/Developer/SDKs/MacOSX10.13.sdk/usr/local/include" ignoring nonexistent directory "/Applications/Xcode.app/Contents/Developer/Platforms/MacOSX.platform/Developer/SDKs/MacOSX10.13.sdk/Library/Frameworks" #include "..." search starts here: #include <...> search starts here: /Users/buildslave/jenkins/libcxx_libcxxabi_trunk_testing/CI_ARCH/64/CI_EXCEPTIONS/ON/CI_STD/c++17/llvm-project/libcxx/include /var/folders/9t/lrs73ptj6lv644zvh1fk2_gc0000gn/T/tmp.wC1Y1w2p/llvm-build/projects/libcxx/include/c++build /Users/buildslave/jenkins/libcxx_libcxxabi_trunk_testing/CI_ARCH/64/CI_EXCEPTIONS/ON/CI_STD/c++17/llvm-project/libcxx/test/support /Users/buildslave/jenkins/libcxx_libcxxabi_trunk_testing/CI_ARCH/64/CI_EXCEPTIONS/ON/CI_STD/c++17/host-compiler/lib/clang/11.0.0/include /Applications/Xcode.app/Contents/Developer/Platforms/MacOSX.platform/Developer/SDKs/MacOSX10.13.sdk/usr/include /Applications/Xcode.app/Contents/Developer/Platforms/MacOSX.platform/Developer/SDKs/MacOSX10.13.sdk/System/Library/Frameworks (framework directory) End of search list. /Users/buildslave/jenkins/libcxx_libcxxabi_trunk_testing/CI_ARCH/64/CI_EXCEPTIONS/ON/CI_STD/c++17/llvm-project/libcxx/test/std/language.support/support.dynamic/new.delete/new.delete.array/delete_align_val_t_replace.pass.cpp:104:16: error: aligned allocation function of type 'void *(std::size_t, std::align_val_t)' is only available on macOS 10.14 or newer A *a = new A[2]; ^ /Users/buildslave/jenkins/libcxx_libcxxabi_trunk_testing/CI_ARCH/64/CI_EXCEPTIONS/ON/CI_STD/c++17/llvm-project/libcxx/test/std/language.support/support.dynamic/new.delete/new.delete.array/delete_align_val_t_replace.pass.cpp:104:16: note: if you supply your own aligned allocation functions, use -faligned-allocation to silence this diagnostic 1 error generated. --

Hide Details

Compilation failed unexpectedly! ******************** Testing: 0.. 10.. 20.. 30.. 40 FAIL: libc++ :: std/language.support/support.dynamic/new.delete/new.delete.array/new_align_val_t.pass.cpp (2871 of 6395) ******************** TEST 'libc++ :: std/language.support/support.dynamic/new.delete/new.delete.array/new_align_val_t.pass.cpp' FAILED ******************** Command: ['/Users/buildslave/jenkins/libcxx_libcxxabi_trunk_testing/CI_ARCH/64/CI_EXCEPTIONS/ON/CI_STD/c++17/host-compiler/bin/clang++', '-o', '/private/var/folders/9t/lrs73ptj6lv644zvh1fk2_gc0000gn/T/tmp.wC1Y1w2p/llvm-build/projects/libcxx/test/std/language.support/support.dynamic/new.delete/new.delete.array/Output/new_align_val_t.pass.cpp.o', '-x', 'c++', '/Users/buildslave/jenkins/libcxx_libcxxabi_trunk_testing/CI_ARCH/64/CI_EXCEPTIONS/ON/CI_STD/c++17/llvm-project/libcxx/test/std/language.support/support.dynamic/new.delete/new.delete.array/new_align_val_t.pass.cpp', '-c', '-D_LIBCPP_DISABLE_AVAILABILITY', '-v', '-arch', 'x86_64', '-mmacosx-version-min=10.13', '-ftemplate-depth=270', '-Werror=thread-safety', '-std=c++17', '-Wno-macro-redefined', '-include', '/var/folders/9t/lrs73ptj6lv644zvh1fk2_gc0000gn/T/tmp.wC1Y1w2p/llvm-build/projects/libcxx/__config_site', '-include', '/Users/buildslave/jenkins/libcxx_libcxxabi_trunk_testing/CI_ARCH/64/CI_EXCEPTIONS/ON/CI_STD/c++17/llvm-project/libcxx/test/support/nasty_macros.h', '-nostdinc++', '-I/Users/buildslave/jenkins/libcxx_libcxxabi_trunk_testing/CI_ARCH/64/CI_EXCEPTIONS/ON/CI_STD/c++17/llvm-project/libcxx/include', '-I/var/folders/9t/lrs73ptj6lv644zvh1fk2_gc0000gn/T/tmp.wC1Y1w2p/llvm-build/projects/libcxx/include/c++build', '-isysroot', '/Applications/Xcode.app/Contents/Developer/Platforms/MacOSX.platform/Developer/SDKs/MacOSX10.13.sdk', '-I/Users/buildslave/jenkins/libcxx_libcxxabi_trunk_testing/CI_ARCH/64/CI_EXCEPTIONS/ON/CI_STD/c++17/llvm-project/libcxx/test/support', '-DLIBCXX_FILESYSTEM_STATIC_TEST_ROOT="/Users/buildslave/jenkins/libcxx_libcxxabi_trunk_testing/CI_ARCH/64/CI_EXCEPTIONS/ON/CI_STD/c++17/llvm-project/libcxx/test/std/input.output/filesystems/Inputs/static_test_env"', '-DLIBCXX_FILESYSTEM_DYNAMIC_TEST_ROOT="/private/var/folders/9t/lrs73ptj6lv644zvh1fk2_gc0000gn/T/tmp.wC1Y1w2p/llvm-build/projects/libcxx/test/filesystem/Output/dynamic_env"', '-DLIBCXX_FILESYSTEM_DYNAMIC_TEST_HELPER="/usr/local/opt/python@2/bin/python2.7 /Users/buildslave/jenkins/libcxx_libcxxabi_trunk_testing/CI_ARCH/64/CI_EXCEPTIONS/ON/CI_STD/c++17/llvm-project/libcxx/test/support/filesystem_dynamic_test_helper.py"', '-D_LIBCPP_HAS_NO_PRAGMA_SYSTEM_HEADER', '-Wall', '-Wextra', '-Werror', '-Wuser-defined-warnings', '-Wshadow', '-Wno-unused-command-line-argument', '-Wno-attributes', '-Wno-pessimizing-move', '-Wno-c++11-extensions', '-Wno-user-defined-literals', '-Wno-noexcept-type', '-Wsign-compare', '-Wunused-variable', '-Wunused-parameter', '-Wunreachable-code', '-c'] Exit Code: 1 Standard Error: -- clang version 11.0.0 (https://github.com/llvm/llvm-project.git 07d2cdae11633139947f105888163adfd5646ce7) Target: x86_64-apple-darwin17.5.0 Thread model: posix InstalledDir: /Users/buildslave/jenkins/libcxx_libcxxabi_trunk_testing/CI_ARCH/64/CI_EXCEPTIONS/ON/CI_STD/c++17/host-compiler/bin (in-process) "/Users/buildslave/jenkins/libcxx_libcxxabi_trunk_testing/CI_ARCH/64/CI_EXCEPTIONS/ON/CI_STD/c++17/host-compiler/bin/clang-11" -cc1 -triple x86_64-apple-macosx10.13.0 -Wdeprecated-objc-isa-usage -Werror=deprecated-objc-isa-usage -emit-obj -mrelax-all -disable-free -main-file-name new_align_val_t.pass.cpp -mrelocation-model pic -pic-level 2 -mthread-model posix -mframe-pointer=all -fno-rounding-math -masm-verbose -munwind-tables -faligned-alloc-unavailable -target-cpu penryn -dwarf-column-info -debugger-tuning=lldb -target-linker-version 409.12 -v -nostdinc++ -resource-dir /Users/buildslave/jenkins/libcxx_libcxxabi_trunk_testing/CI_ARCH/64/CI_EXCEPTIONS/ON/CI_STD/c++17/host-compiler/lib/clang/11.0.0 -include /var/folders/9t/lrs73ptj6lv644zvh1fk2_gc0000gn/T/tmp.wC1Y1w2p/llvm-build/projects/libcxx/__config_site -include /Users/buildslave/jenkins/libcxx_libcxxabi_trunk_testing/CI_ARCH/64/CI_EXCEPTIONS/ON/CI_STD/c++17/llvm-project/libcxx/test/support/nasty_macros.h -isysroot /Applications/Xcode.app/Contents/Developer/Platforms/MacOSX.platform/Developer/SDKs/MacOSX10.13.sdk -D _LIBCPP_DISABLE_AVAILABILITY -I /Users/buildslave/jenkins/libcxx_libcxxabi_trunk_testing/CI_ARCH/64/CI_EXCEPTIONS/ON/CI_STD/c++17/llvm-project/libcxx/include -I /var/folders/9t/lrs73ptj6lv644zvh1fk2_gc0000gn/T/tmp.wC1Y1w2p/llvm-build/projects/libcxx/include/c++build -I /Users/buildslave/jenkins/libcxx_libcxxabi_trunk_testing/CI_ARCH/64/CI_EXCEPTIONS/ON/CI_STD/c++17/llvm-project/libcxx/test/support -D "LIBCXX_FILESYSTEM_STATIC_TEST_ROOT=\"/Users/buildslave/jenkins/libcxx_libcxxabi_trunk_testing/CI_ARCH/64/CI_EXCEPTIONS/ON/CI_STD/c++17/llvm-project/libcxx/test/std/input.output/filesystems/Inputs/static_test_env\"" -D "LIBCXX_FILESYSTEM_DYNAMIC_TEST_ROOT=\"/private/var/folders/9t/lrs73ptj6lv644zvh1fk2_gc0000gn/T/tmp.wC1Y1w2p/llvm-build/projects/libcxx/test/filesystem/Output/dynamic_env\"" -D "LIBCXX_FILESYSTEM_DYNAMIC_TEST_HELPER=\"/usr/local/opt/python@2/bin/python2.7 /Users/buildslave/jenkins/libcxx_libcxxabi_trunk_testing/CI_ARCH/64/CI_EXCEPTIONS/ON/CI_STD/c++17/llvm-project/libcxx/test/support/filesystem_dynamic_test_helper.py\"" -D _LIBCPP_HAS_NO_PRAGMA_SYSTEM_HEADER -stdlib=libc++ -internal-isystem /Applications/Xcode.app/Contents/Developer/Platforms/MacOSX.platform/Developer/SDKs/MacOSX10.13.sdk/usr/local/include -internal-isystem /Users/buildslave/jenkins/libcxx_libcxxabi_trunk_testing/CI_ARCH/64/CI_EXCEPTIONS/ON/CI_STD/c++17/host-compiler/lib/clang/11.0.0/include -internal-externc-isystem /Applications/Xcode.app/Contents/Developer/Platforms/MacOSX.platform/Developer/SDKs/MacOSX10.13.sdk/usr/include -Werror=thread-safety -Wno-macro-redefined -Wall -Wextra -Werror -Wuser-defined-warnings -Wshadow -Wno-unused-command-line-argument -Wno-attributes -Wno-pessimizing-move -Wno-c++11-extensions -Wno-user-defined-literals -Wno-noexcept-type -Wsign-compare -Wunused-variable -Wunused-parameter -Wunreachable-code -std=c++17 -fdeprecated-macro -fdebug-compilation-dir /private/var/folders/9t/lrs73ptj6lv644zvh1fk2_gc0000gn/T/tmp.wC1Y1w2p/llvm-build/projects/libcxx/test/std/language.support/support.dynamic/new.delete/new.delete.array -ftemplate-depth 270 -ferror-limit 19 -fmessage-length 0 -stack-protector 1 -fblocks -fencode-extended-block-signature -fregister-global-dtors-with-atexit -fgnuc-version=4.2.1 -fobjc-runtime=macosx-10.13.0 -fcxx-exceptions -fexceptions -fmax-type-align=16 -fdiagnostics-show-option -o /private/var/folders/9t/lrs73ptj6lv644zvh1fk2_gc0000gn/T/tmp.wC1Y1w2p/llvm-build/projects/libcxx/test/std/language.support/support.dynamic/new.delete/new.delete.array/Output/new_align_val_t.pass.cpp.o -x c++ /Users/buildslave/jenkins/libcxx_libcxxabi_trunk_testing/CI_ARCH/64/CI_EXCEPTIONS/ON/CI_STD/c++17/llvm-project/libcxx/test/std/language.support/support.dynamic/new.delete/new.delete.array/new_align_val_t.pass.cpp clang -cc1 version 11.0.0 based upon LLVM 11.0.0git default target x86_64-apple-darwin17.5.0 ignoring nonexistent directory "/Applications/Xcode.app/Contents/Developer/Platforms/MacOSX.platform/Developer/SDKs/MacOSX10.13.sdk/usr/local/include" ignoring nonexistent directory "/Applications/Xcode.app/Contents/Developer/Platforms/MacOSX.platform/Developer/SDKs/MacOSX10.13.sdk/Library/Frameworks" #include "..." search starts here: #include <...> search starts here: /Users/buildslave/jenkins/libcxx_libcxxabi_trunk_testing/CI_ARCH/64/CI_EXCEPTIONS/ON/CI_STD/c++17/llvm-project/libcxx/include /var/folders/9t/lrs73ptj6lv644zvh1fk2_gc0000gn/T/tmp.wC1Y1w2p/llvm-build/projects/libcxx/include/c++build /Users/buildslave/jenkins/libcxx_libcxxabi_trunk_testing/CI_ARCH/64/CI_EXCEPTIONS/ON/CI_STD/c++17/llvm-project/libcxx/test/support /Users/buildslave/jenkins/libcxx_libcxxabi_trunk_testing/CI_ARCH/64/CI_EXCEPTIONS/ON/CI_STD/c++17/host-compiler/lib/clang/11.0.0/include /Applications/Xcode.app/Contents/Developer/Platforms/MacOSX.platform/Developer/SDKs/MacOSX10.13.sdk/usr/include /Applications/Xcode.app/Contents/Developer/Platforms/MacOSX.platform/Developer/SDKs/MacOSX10.13.sdk/System/Library/Frameworks (framework directory) End of search list. /Users/buildslave/jenkins/libcxx_libcxxabi_trunk_testing/CI_ARCH/64/CI_EXCEPTIONS/ON/CI_STD/c++17/llvm-project/libcxx/test/std/language.support/support.dynamic/new.delete/new.delete.array/new_align_val_t.pass.cpp:77:20: error: aligned allocation function of type 'void *(std::size_t, std::align_val_t)' is only available on macOS 10.14 or newer void* vp = operator new[] (std::numeric_limits<std::size_t>::max(), ^ /Users/buildslave/jenkins/libcxx_libcxxabi_trunk_testing/CI_ARCH/64/CI_EXCEPTIONS/ON/CI_STD/c++17/llvm-project/libcxx/test/std/language.support/support.dynamic/new.delete/new.delete.array/new_align_val_t.pass.cpp:77:20: note: if you supply your own aligned allocation functions, use -faligned-allocation to silence this diagnostic /Users/buildslave/jenkins/libcxx_libcxxabi_trunk_testing/CI_ARCH/64/CI_EXCEPTIONS/ON/CI_STD/c++17/llvm-project/libcxx/test/std/language.support/support.dynamic/new.delete/new.delete.array/new_align_val_t.pass.cpp:96:17: error: aligned allocation function of type 'void *(std::size_t, std::align_val_t)' is only available on macOS 10.14 or newer A* ap = new A[2]; ^ /Users/buildslave/jenkins/libcxx_libcxxabi_trunk_testing/CI_ARCH/64/CI_EXCEPTIONS/ON/CI_STD/c++17/llvm-project/libcxx/test/std/language.support/support.dynamic/new.delete/new.delete.array/new_align_val_t.pass.cpp:96:17: note: if you supply your own aligned allocation functions, use -faligned-allocation to silence this diagnostic /Users/buildslave/jenkins/libcxx_libcxxabi_trunk_testing/CI_ARCH/64/CI_EXCEPTIONS/ON/CI_STD/c++17/llvm-project/libcxx/test/std/language.support/support.dynamic/new.delete/new.delete.array/new_align_val_t.pass.cpp:96:17: error: aligned deallocation function of type 'void (void *, std::align_val_t) noexcept' is only available on macOS 10.14 or newer A* ap = new A[2]; ^ /Users/buildslave/jenkins/libcxx_libcxxabi_trunk_testing/CI_ARCH/64/CI_EXCEPTIONS/ON/CI_STD/c++17/llvm-project/libcxx/test/std/language.support/support.dynamic/new.delete/new.delete.array/new_align_val_t.pass.cpp:96:17: note: if you supply your own aligned allocation functions, use -faligned-allocation to silence this diagnostic /Users/buildslave/jenkins/libcxx_libcxxabi_trunk_testing/CI_ARCH/64/CI_EXCEPTIONS/ON/CI_STD/c++17/llvm-project/libcxx/test/std/language.support/support.dynamic/new.delete/new.delete.array/new_align_val_t.pass.cpp:100:9: error: aligned deallocation function of type 'void (void *, std::align_val_t) noexcept' is only available on macOS 10.14 or newer delete [] ap; ^ /Users/buildslave/jenkins/libcxx_libcxxabi_trunk_testing/CI_ARCH/64/CI_EXCEPTIONS/ON/CI_STD/c++17/llvm-project/libcxx/test/std/language.support/support.dynamic/new.delete/new.delete.array/new_align_val_t.pass.cpp:100:9: note: if you supply your own aligned allocation functions, use -faligned-allocation to silence this diagnostic 4 errors generated. --

Hide Details

Compilation failed unexpectedly! ******************** Testing: 0.. 10.. 20.. 30.. 40 FAIL: libc++ :: std/language.support/support.dynamic/new.delete/new.delete.array/new_align_val_t_nothrow.pass.cpp (2872 of 6395) ******************** TEST 'libc++ :: std/language.support/support.dynamic/new.delete/new.delete.array/new_align_val_t_nothrow.pass.cpp' FAILED ******************** Command: ['/Users/buildslave/jenkins/libcxx_libcxxabi_trunk_testing/CI_ARCH/64/CI_EXCEPTIONS/ON/CI_STD/c++17/host-compiler/bin/clang++', '-o', '/private/var/folders/9t/lrs73ptj6lv644zvh1fk2_gc0000gn/T/tmp.wC1Y1w2p/llvm-build/projects/libcxx/test/std/language.support/support.dynamic/new.delete/new.delete.array/Output/new_align_val_t_nothrow.pass.cpp.o', '-x', 'c++', '/Users/buildslave/jenkins/libcxx_libcxxabi_trunk_testing/CI_ARCH/64/CI_EXCEPTIONS/ON/CI_STD/c++17/llvm-project/libcxx/test/std/language.support/support.dynamic/new.delete/new.delete.array/new_align_val_t_nothrow.pass.cpp', '-c', '-D_LIBCPP_DISABLE_AVAILABILITY', '-v', '-arch', 'x86_64', '-mmacosx-version-min=10.13', '-ftemplate-depth=270', '-Werror=thread-safety', '-std=c++17', '-Wno-macro-redefined', '-include', '/var/folders/9t/lrs73ptj6lv644zvh1fk2_gc0000gn/T/tmp.wC1Y1w2p/llvm-build/projects/libcxx/__config_site', '-include', '/Users/buildslave/jenkins/libcxx_libcxxabi_trunk_testing/CI_ARCH/64/CI_EXCEPTIONS/ON/CI_STD/c++17/llvm-project/libcxx/test/support/nasty_macros.h', '-nostdinc++', '-I/Users/buildslave/jenkins/libcxx_libcxxabi_trunk_testing/CI_ARCH/64/CI_EXCEPTIONS/ON/CI_STD/c++17/llvm-project/libcxx/include', '-I/var/folders/9t/lrs73ptj6lv644zvh1fk2_gc0000gn/T/tmp.wC1Y1w2p/llvm-build/projects/libcxx/include/c++build', '-isysroot', '/Applications/Xcode.app/Contents/Developer/Platforms/MacOSX.platform/Developer/SDKs/MacOSX10.13.sdk', '-I/Users/buildslave/jenkins/libcxx_libcxxabi_trunk_testing/CI_ARCH/64/CI_EXCEPTIONS/ON/CI_STD/c++17/llvm-project/libcxx/test/support', '-DLIBCXX_FILESYSTEM_STATIC_TEST_ROOT="/Users/buildslave/jenkins/libcxx_libcxxabi_trunk_testing/CI_ARCH/64/CI_EXCEPTIONS/ON/CI_STD/c++17/llvm-project/libcxx/test/std/input.output/filesystems/Inputs/static_test_env"', '-DLIBCXX_FILESYSTEM_DYNAMIC_TEST_ROOT="/private/var/folders/9t/lrs73ptj6lv644zvh1fk2_gc0000gn/T/tmp.wC1Y1w2p/llvm-build/projects/libcxx/test/filesystem/Output/dynamic_env"', '-DLIBCXX_FILESYSTEM_DYNAMIC_TEST_HELPER="/usr/local/opt/python@2/bin/python2.7 /Users/buildslave/jenkins/libcxx_libcxxabi_trunk_testing/CI_ARCH/64/CI_EXCEPTIONS/ON/CI_STD/c++17/llvm-project/libcxx/test/support/filesystem_dynamic_test_helper.py"', '-D_LIBCPP_HAS_NO_PRAGMA_SYSTEM_HEADER', '-Wall', '-Wextra', '-Werror', '-Wuser-defined-warnings', '-Wshadow', '-Wno-unused-command-line-argument', '-Wno-attributes', '-Wno-pessimizing-move', '-Wno-c++11-extensions', '-Wno-user-defined-literals', '-Wno-noexcept-type', '-Wsign-compare', '-Wunused-variable', '-Wunused-parameter', '-Wunreachable-code', '-c'] Exit Code: 1 Standard Error: -- clang version 11.0.0 (https://github.com/llvm/llvm-project.git 07d2cdae11633139947f105888163adfd5646ce7) Target: x86_64-apple-darwin17.5.0 Thread model: posix InstalledDir: /Users/buildslave/jenkins/libcxx_libcxxabi_trunk_testing/CI_ARCH/64/CI_EXCEPTIONS/ON/CI_STD/c++17/host-compiler/bin (in-process) "/Users/buildslave/jenkins/libcxx_libcxxabi_trunk_testing/CI_ARCH/64/CI_EXCEPTIONS/ON/CI_STD/c++17/host-compiler/bin/clang-11" -cc1 -triple x86_64-apple-macosx10.13.0 -Wdeprecated-objc-isa-usage -Werror=deprecated-objc-isa-usage -emit-obj -mrelax-all -disable-free -main-file-name new_align_val_t_nothrow.pass.cpp -mrelocation-model pic -pic-level 2 -mthread-model posix -mframe-pointer=all -fno-rounding-math -masm-verbose -munwind-tables -faligned-alloc-unavailable -target-cpu penryn -dwarf-column-info -debugger-tuning=lldb -target-linker-version 409.12 -v -nostdinc++ -resource-dir /Users/buildslave/jenkins/libcxx_libcxxabi_trunk_testing/CI_ARCH/64/CI_EXCEPTIONS/ON/CI_STD/c++17/host-compiler/lib/clang/11.0.0 -include /var/folders/9t/lrs73ptj6lv644zvh1fk2_gc0000gn/T/tmp.wC1Y1w2p/llvm-build/projects/libcxx/__config_site -include /Users/buildslave/jenkins/libcxx_libcxxabi_trunk_testing/CI_ARCH/64/CI_EXCEPTIONS/ON/CI_STD/c++17/llvm-project/libcxx/test/support/nasty_macros.h -isysroot /Applications/Xcode.app/Contents/Developer/Platforms/MacOSX.platform/Developer/SDKs/MacOSX10.13.sdk -D _LIBCPP_DISABLE_AVAILABILITY -I /Users/buildslave/jenkins/libcxx_libcxxabi_trunk_testing/CI_ARCH/64/CI_EXCEPTIONS/ON/CI_STD/c++17/llvm-project/libcxx/include -I /var/folders/9t/lrs73ptj6lv644zvh1fk2_gc0000gn/T/tmp.wC1Y1w2p/llvm-build/projects/libcxx/include/c++build -I /Users/buildslave/jenkins/libcxx_libcxxabi_trunk_testing/CI_ARCH/64/CI_EXCEPTIONS/ON/CI_STD/c++17/llvm-project/libcxx/test/support -D "LIBCXX_FILESYSTEM_STATIC_TEST_ROOT=\"/Users/buildslave/jenkins/libcxx_libcxxabi_trunk_testing/CI_ARCH/64/CI_EXCEPTIONS/ON/CI_STD/c++17/llvm-project/libcxx/test/std/input.output/filesystems/Inputs/static_test_env\"" -D "LIBCXX_FILESYSTEM_DYNAMIC_TEST_ROOT=\"/private/var/folders/9t/lrs73ptj6lv644zvh1fk2_gc0000gn/T/tmp.wC1Y1w2p/llvm-build/projects/libcxx/test/filesystem/Output/dynamic_env\"" -D "LIBCXX_FILESYSTEM_DYNAMIC_TEST_HELPER=\"/usr/local/opt/python@2/bin/python2.7 /Users/buildslave/jenkins/libcxx_libcxxabi_trunk_testing/CI_ARCH/64/CI_EXCEPTIONS/ON/CI_STD/c++17/llvm-project/libcxx/test/support/filesystem_dynamic_test_helper.py\"" -D _LIBCPP_HAS_NO_PRAGMA_SYSTEM_HEADER -stdlib=libc++ -internal-isystem /Applications/Xcode.app/Contents/Developer/Platforms/MacOSX.platform/Developer/SDKs/MacOSX10.13.sdk/usr/local/include -internal-isystem /Users/buildslave/jenkins/libcxx_libcxxabi_trunk_testing/CI_ARCH/64/CI_EXCEPTIONS/ON/CI_STD/c++17/host-compiler/lib/clang/11.0.0/include -internal-externc-isystem /Applications/Xcode.app/Contents/Developer/Platforms/MacOSX.platform/Developer/SDKs/MacOSX10.13.sdk/usr/include -Werror=thread-safety -Wno-macro-redefined -Wall -Wextra -Werror -Wuser-defined-warnings -Wshadow -Wno-unused-command-line-argument -Wno-attributes -Wno-pessimizing-move -Wno-c++11-extensions -Wno-user-defined-literals -Wno-noexcept-type -Wsign-compare -Wunused-variable -Wunused-parameter -Wunreachable-code -std=c++17 -fdeprecated-macro -fdebug-compilation-dir /private/var/folders/9t/lrs73ptj6lv644zvh1fk2_gc0000gn/T/tmp.wC1Y1w2p/llvm-build/projects/libcxx/test/std/language.support/support.dynamic/new.delete/new.delete.array -ftemplate-depth 270 -ferror-limit 19 -fmessage-length 0 -stack-protector 1 -fblocks -fencode-extended-block-signature -fregister-global-dtors-with-atexit -fgnuc-version=4.2.1 -fobjc-runtime=macosx-10.13.0 -fcxx-exceptions -fexceptions -fmax-type-align=16 -fdiagnostics-show-option -o /private/var/folders/9t/lrs73ptj6lv644zvh1fk2_gc0000gn/T/tmp.wC1Y1w2p/llvm-build/projects/libcxx/test/std/language.support/support.dynamic/new.delete/new.delete.array/Output/new_align_val_t_nothrow.pass.cpp.o -x c++ /Users/buildslave/jenkins/libcxx_libcxxabi_trunk_testing/CI_ARCH/64/CI_EXCEPTIONS/ON/CI_STD/c++17/llvm-project/libcxx/test/std/language.support/support.dynamic/new.delete/new.delete.array/new_align_val_t_nothrow.pass.cpp clang -cc1 version 11.0.0 based upon LLVM 11.0.0git default target x86_64-apple-darwin17.5.0 ignoring nonexistent directory "/Applications/Xcode.app/Contents/Developer/Platforms/MacOSX.platform/Developer/SDKs/MacOSX10.13.sdk/usr/local/include" ignoring nonexistent directory "/Applications/Xcode.app/Contents/Developer/Platforms/MacOSX.platform/Developer/SDKs/MacOSX10.13.sdk/Library/Frameworks" #include "..." search starts here: #include <...> search starts here: /Users/buildslave/jenkins/libcxx_libcxxabi_trunk_testing/CI_ARCH/64/CI_EXCEPTIONS/ON/CI_STD/c++17/llvm-project/libcxx/include /var/folders/9t/lrs73ptj6lv644zvh1fk2_gc0000gn/T/tmp.wC1Y1w2p/llvm-build/projects/libcxx/include/c++build /Users/buildslave/jenkins/libcxx_libcxxabi_trunk_testing/CI_ARCH/64/CI_EXCEPTIONS/ON/CI_STD/c++17/llvm-project/libcxx/test/support /Users/buildslave/jenkins/libcxx_libcxxabi_trunk_testing/CI_ARCH/64/CI_EXCEPTIONS/ON/CI_STD/c++17/host-compiler/lib/clang/11.0.0/include /Applications/Xcode.app/Contents/Developer/Platforms/MacOSX.platform/Developer/SDKs/MacOSX10.13.sdk/usr/include /Applications/Xcode.app/Contents/Developer/Platforms/MacOSX.platform/Developer/SDKs/MacOSX10.13.sdk/System/Library/Frameworks (framework directory) End of search list. /Users/buildslave/jenkins/libcxx_libcxxabi_trunk_testing/CI_ARCH/64/CI_EXCEPTIONS/ON/CI_STD/c++17/llvm-project/libcxx/test/std/language.support/support.dynamic/new.delete/new.delete.array/new_align_val_t_nothrow.pass.cpp:75:20: error: aligned allocation function of type 'void *(std::size_t, std::align_val_t, const std::nothrow_t &) noexcept' is only available on macOS 10.14 or newer void* vp = operator new [](std::numeric_limits<std::size_t>::max(), ^ /Users/buildslave/jenkins/libcxx_libcxxabi_trunk_testing/CI_ARCH/64/CI_EXCEPTIONS/ON/CI_STD/c++17/llvm-project/libcxx/test/std/language.support/support.dynamic/new.delete/new.delete.array/new_align_val_t_nothrow.pass.cpp:75:20: note: if you supply your own aligned allocation functions, use -faligned-allocation to silence this diagnostic /Users/buildslave/jenkins/libcxx_libcxxabi_trunk_testing/CI_ARCH/64/CI_EXCEPTIONS/ON/CI_STD/c++17/llvm-project/libcxx/test/std/language.support/support.dynamic/new.delete/new.delete.array/new_align_val_t_nothrow.pass.cpp:98:17: error: aligned allocation function of type 'void *(std::size_t, std::align_val_t, const std::nothrow_t &) noexcept' is only available on macOS 10.14 or newer A* ap = new(std::nothrow) A[3]; ^ /Users/buildslave/jenkins/libcxx_libcxxabi_trunk_testing/CI_ARCH/64/CI_EXCEPTIONS/ON/CI_STD/c++17/llvm-project/libcxx/test/std/language.support/support.dynamic/new.delete/new.delete.array/new_align_val_t_nothrow.pass.cpp:98:17: note: if you supply your own aligned allocation functions, use -faligned-allocation to silence this diagnostic /Users/buildslave/jenkins/libcxx_libcxxabi_trunk_testing/CI_ARCH/64/CI_EXCEPTIONS/ON/CI_STD/c++17/llvm-project/libcxx/test/std/language.support/support.dynamic/new.delete/new.delete.array/new_align_val_t_nothrow.pass.cpp:98:17: error: aligned deallocation function of type 'void (void *, std::align_val_t, const std::nothrow_t &) noexcept' is only available on macOS 10.14 or newer A* ap = new(std::nothrow) A[3]; ^ /Users/buildslave/jenkins/libcxx_libcxxabi_trunk_testing/CI_ARCH/64/CI_EXCEPTIONS/ON/CI_STD/c++17/llvm-project/libcxx/test/std/language.support/support.dynamic/new.delete/new.delete.array/new_align_val_t_nothrow.pass.cpp:98:17: note: if you supply your own aligned allocation functions, use -faligned-allocation to silence this diagnostic /Users/buildslave/jenkins/libcxx_libcxxabi_trunk_testing/CI_ARCH/64/CI_EXCEPTIONS/ON/CI_STD/c++17/llvm-project/libcxx/test/std/language.support/support.dynamic/new.delete/new.delete.array/new_align_val_t_nothrow.pass.cpp:102:9: error: aligned deallocation function of type 'void (void *, std::align_val_t) noexcept' is only available on macOS 10.14 or newer delete [] ap; ^ /Users/buildslave/jenkins/libcxx_libcxxabi_trunk_testing/CI_ARCH/64/CI_EXCEPTIONS/ON/CI_STD/c++17/llvm-project/libcxx/test/std/language.support/support.dynamic/new.delete/new.delete.array/new_align_val_t_nothrow.pass.cpp:102:9: note: if you supply your own aligned allocation functions, use -faligned-allocation to silence this diagnostic 4 errors generated. --

Hide Details

Compilation failed unexpectedly! ******************** Testing: 0.. 10.. 20.. 30.. 40 FAIL: libc++ :: std/language.support/support.dynamic/new.delete/new.delete.array/new_align_val_t_nothrow_replace.pass.cpp (2880 of 6395) ******************** TEST 'libc++ :: std/language.support/support.dynamic/new.delete/new.delete.array/new_align_val_t_nothrow_replace.pass.cpp' FAILED ******************** Command: ['/Users/buildslave/jenkins/libcxx_libcxxabi_trunk_testing/CI_ARCH/64/CI_EXCEPTIONS/ON/CI_STD/c++17/host-compiler/bin/clang++', '-o', '/private/var/folders/9t/lrs73ptj6lv644zvh1fk2_gc0000gn/T/tmp.wC1Y1w2p/llvm-build/projects/libcxx/test/std/language.support/support.dynamic/new.delete/new.delete.array/Output/new_align_val_t_nothrow_replace.pass.cpp.o', '-x', 'c++', '/Users/buildslave/jenkins/libcxx_libcxxabi_trunk_testing/CI_ARCH/64/CI_EXCEPTIONS/ON/CI_STD/c++17/llvm-project/libcxx/test/std/language.support/support.dynamic/new.delete/new.delete.array/new_align_val_t_nothrow_replace.pass.cpp', '-c', '-D_LIBCPP_DISABLE_AVAILABILITY', '-v', '-arch', 'x86_64', '-mmacosx-version-min=10.13', '-ftemplate-depth=270', '-Werror=thread-safety', '-std=c++17', '-Wno-macro-redefined', '-include', '/var/folders/9t/lrs73ptj6lv644zvh1fk2_gc0000gn/T/tmp.wC1Y1w2p/llvm-build/projects/libcxx/__config_site', '-include', '/Users/buildslave/jenkins/libcxx_libcxxabi_trunk_testing/CI_ARCH/64/CI_EXCEPTIONS/ON/CI_STD/c++17/llvm-project/libcxx/test/support/nasty_macros.h', '-nostdinc++', '-I/Users/buildslave/jenkins/libcxx_libcxxabi_trunk_testing/CI_ARCH/64/CI_EXCEPTIONS/ON/CI_STD/c++17/llvm-project/libcxx/include', '-I/var/folders/9t/lrs73ptj6lv644zvh1fk2_gc0000gn/T/tmp.wC1Y1w2p/llvm-build/projects/libcxx/include/c++build', '-isysroot', '/Applications/Xcode.app/Contents/Developer/Platforms/MacOSX.platform/Developer/SDKs/MacOSX10.13.sdk', '-I/Users/buildslave/jenkins/libcxx_libcxxabi_trunk_testing/CI_ARCH/64/CI_EXCEPTIONS/ON/CI_STD/c++17/llvm-project/libcxx/test/support', '-DLIBCXX_FILESYSTEM_STATIC_TEST_ROOT="/Users/buildslave/jenkins/libcxx_libcxxabi_trunk_testing/CI_ARCH/64/CI_EXCEPTIONS/ON/CI_STD/c++17/llvm-project/libcxx/test/std/input.output/filesystems/Inputs/static_test_env"', '-DLIBCXX_FILESYSTEM_DYNAMIC_TEST_ROOT="/private/var/folders/9t/lrs73ptj6lv644zvh1fk2_gc0000gn/T/tmp.wC1Y1w2p/llvm-build/projects/libcxx/test/filesystem/Output/dynamic_env"', '-DLIBCXX_FILESYSTEM_DYNAMIC_TEST_HELPER="/usr/local/opt/python@2/bin/python2.7 /Users/buildslave/jenkins/libcxx_libcxxabi_trunk_testing/CI_ARCH/64/CI_EXCEPTIONS/ON/CI_STD/c++17/llvm-project/libcxx/test/support/filesystem_dynamic_test_helper.py"', '-D_LIBCPP_HAS_NO_PRAGMA_SYSTEM_HEADER', '-Wall', '-Wextra', '-Werror', '-Wuser-defined-warnings', '-Wshadow', '-Wno-unused-command-line-argument', '-Wno-attributes', '-Wno-pessimizing-move', '-Wno-c++11-extensions', '-Wno-user-defined-literals', '-Wno-noexcept-type', '-Wsign-compare', '-Wunused-variable', '-Wunused-parameter', '-Wunreachable-code', '-c'] Exit Code: 1 Standard Error: -- clang version 11.0.0 (https://github.com/llvm/llvm-project.git 07d2cdae11633139947f105888163adfd5646ce7) Target: x86_64-apple-darwin17.5.0 Thread model: posix InstalledDir: /Users/buildslave/jenkins/libcxx_libcxxabi_trunk_testing/CI_ARCH/64/CI_EXCEPTIONS/ON/CI_STD/c++17/host-compiler/bin (in-process) "/Users/buildslave/jenkins/libcxx_libcxxabi_trunk_testing/CI_ARCH/64/CI_EXCEPTIONS/ON/CI_STD/c++17/host-compiler/bin/clang-11" -cc1 -triple x86_64-apple-macosx10.13.0 -Wdeprecated-objc-isa-usage -Werror=deprecated-objc-isa-usage -emit-obj -mrelax-all -disable-free -main-file-name new_align_val_t_nothrow_replace.pass.cpp -mrelocation-model pic -pic-level 2 -mthread-model posix -mframe-pointer=all -fno-rounding-math -masm-verbose -munwind-tables -faligned-alloc-unavailable -target-cpu penryn -dwarf-column-info -debugger-tuning=lldb -target-linker-version 409.12 -v -nostdinc++ -resource-dir /Users/buildslave/jenkins/libcxx_libcxxabi_trunk_testing/CI_ARCH/64/CI_EXCEPTIONS/ON/CI_STD/c++17/host-compiler/lib/clang/11.0.0 -include /var/folders/9t/lrs73ptj6lv644zvh1fk2_gc0000gn/T/tmp.wC1Y1w2p/llvm-build/projects/libcxx/__config_site -include /Users/buildslave/jenkins/libcxx_libcxxabi_trunk_testing/CI_ARCH/64/CI_EXCEPTIONS/ON/CI_STD/c++17/llvm-project/libcxx/test/support/nasty_macros.h -isysroot /Applications/Xcode.app/Contents/Developer/Platforms/MacOSX.platform/Developer/SDKs/MacOSX10.13.sdk -D _LIBCPP_DISABLE_AVAILABILITY -I /Users/buildslave/jenkins/libcxx_libcxxabi_trunk_testing/CI_ARCH/64/CI_EXCEPTIONS/ON/CI_STD/c++17/llvm-project/libcxx/include -I /var/folders/9t/lrs73ptj6lv644zvh1fk2_gc0000gn/T/tmp.wC1Y1w2p/llvm-build/projects/libcxx/include/c++build -I /Users/buildslave/jenkins/libcxx_libcxxabi_trunk_testing/CI_ARCH/64/CI_EXCEPTIONS/ON/CI_STD/c++17/llvm-project/libcxx/test/support -D "LIBCXX_FILESYSTEM_STATIC_TEST_ROOT=\"/Users/buildslave/jenkins/libcxx_libcxxabi_trunk_testing/CI_ARCH/64/CI_EXCEPTIONS/ON/CI_STD/c++17/llvm-project/libcxx/test/std/input.output/filesystems/Inputs/static_test_env\"" -D "LIBCXX_FILESYSTEM_DYNAMIC_TEST_ROOT=\"/private/var/folders/9t/lrs73ptj6lv644zvh1fk2_gc0000gn/T/tmp.wC1Y1w2p/llvm-build/projects/libcxx/test/filesystem/Output/dynamic_env\"" -D "LIBCXX_FILESYSTEM_DYNAMIC_TEST_HELPER=\"/usr/local/opt/python@2/bin/python2.7 /Users/buildslave/jenkins/libcxx_libcxxabi_trunk_testing/CI_ARCH/64/CI_EXCEPTIONS/ON/CI_STD/c++17/llvm-project/libcxx/test/support/filesystem_dynamic_test_helper.py\"" -D _LIBCPP_HAS_NO_PRAGMA_SYSTEM_HEADER -stdlib=libc++ -internal-isystem /Applications/Xcode.app/Contents/Developer/Platforms/MacOSX.platform/Developer/SDKs/MacOSX10.13.sdk/usr/local/include -internal-isystem /Users/buildslave/jenkins/libcxx_libcxxabi_trunk_testing/CI_ARCH/64/CI_EXCEPTIONS/ON/CI_STD/c++17/host-compiler/lib/clang/11.0.0/include -internal-externc-isystem /Applications/Xcode.app/Contents/Developer/Platforms/MacOSX.platform/Developer/SDKs/MacOSX10.13.sdk/usr/include -Werror=thread-safety -Wno-macro-redefined -Wall -Wextra -Werror -Wuser-defined-warnings -Wshadow -Wno-unused-command-line-argument -Wno-attributes -Wno-pessimizing-move -Wno-c++11-extensions -Wno-user-defined-literals -Wno-noexcept-type -Wsign-compare -Wunused-variable -Wunused-parameter -Wunreachable-code -std=c++17 -fdeprecated-macro -fdebug-compilation-dir /private/var/folders/9t/lrs73ptj6lv644zvh1fk2_gc0000gn/T/tmp.wC1Y1w2p/llvm-build/projects/libcxx/test/std/language.support/support.dynamic/new.delete/new.delete.array -ftemplate-depth 270 -ferror-limit 19 -fmessage-length 0 -stack-protector 1 -fblocks -fencode-extended-block-signature -fregister-global-dtors-with-atexit -fgnuc-version=4.2.1 -fobjc-runtime=macosx-10.13.0 -fcxx-exceptions -fexceptions -fmax-type-align=16 -fdiagnostics-show-option -o /private/var/folders/9t/lrs73ptj6lv644zvh1fk2_gc0000gn/T/tmp.wC1Y1w2p/llvm-build/projects/libcxx/test/std/language.support/support.dynamic/new.delete/new.delete.array/Output/new_align_val_t_nothrow_replace.pass.cpp.o -x c++ /Users/buildslave/jenkins/libcxx_libcxxabi_trunk_testing/CI_ARCH/64/CI_EXCEPTIONS/ON/CI_STD/c++17/llvm-project/libcxx/test/std/language.support/support.dynamic/new.delete/new.delete.array/new_align_val_t_nothrow_replace.pass.cpp clang -cc1 version 11.0.0 based upon LLVM 11.0.0git default target x86_64-apple-darwin17.5.0 ignoring nonexistent directory "/Applications/Xcode.app/Contents/Developer/Platforms/MacOSX.platform/Developer/SDKs/MacOSX10.13.sdk/usr/local/include" ignoring nonexistent directory "/Applications/Xcode.app/Contents/Developer/Platforms/MacOSX.platform/Developer/SDKs/MacOSX10.13.sdk/Library/Frameworks" #include "..." search starts here: #include <...> search starts here: /Users/buildslave/jenkins/libcxx_libcxxabi_trunk_testing/CI_ARCH/64/CI_EXCEPTIONS/ON/CI_STD/c++17/llvm-project/libcxx/include /var/folders/9t/lrs73ptj6lv644zvh1fk2_gc0000gn/T/tmp.wC1Y1w2p/llvm-build/projects/libcxx/include/c++build /Users/buildslave/jenkins/libcxx_libcxxabi_trunk_testing/CI_ARCH/64/CI_EXCEPTIONS/ON/CI_STD/c++17/llvm-project/libcxx/test/support /Users/buildslave/jenkins/libcxx_libcxxabi_trunk_testing/CI_ARCH/64/CI_EXCEPTIONS/ON/CI_STD/c++17/host-compiler/lib/clang/11.0.0/include /Applications/Xcode.app/Contents/Developer/Platforms/MacOSX.platform/Developer/SDKs/MacOSX10.13.sdk/usr/include /Applications/Xcode.app/Contents/Developer/Platforms/MacOSX.platform/Developer/SDKs/MacOSX10.13.sdk/System/Library/Frameworks (framework directory) End of search list. /Users/buildslave/jenkins/libcxx_libcxxabi_trunk_testing/CI_ARCH/64/CI_EXCEPTIONS/ON/CI_STD/c++17/llvm-project/libcxx/test/std/language.support/support.dynamic/new.delete/new.delete.array/new_align_val_t_nothrow_replace.pass.cpp:92:17: error: aligned allocation function of type 'void *(std::size_t, std::align_val_t, const std::nothrow_t &) noexcept' is only available on macOS 10.14 or newer A* ap = new (std::nothrow) A[2]; ^ /Users/buildslave/jenkins/libcxx_libcxxabi_trunk_testing/CI_ARCH/64/CI_EXCEPTIONS/ON/CI_STD/c++17/llvm-project/libcxx/test/std/language.support/support.dynamic/new.delete/new.delete.array/new_align_val_t_nothrow_replace.pass.cpp:92:17: note: if you supply your own aligned allocation functions, use -faligned-allocation to silence this diagnostic /Users/buildslave/jenkins/libcxx_libcxxabi_trunk_testing/CI_ARCH/64/CI_EXCEPTIONS/ON/CI_STD/c++17/llvm-project/libcxx/test/std/language.support/support.dynamic/new.delete/new.delete.array/new_align_val_t_nothrow_replace.pass.cpp:92:17: error: aligned deallocation function of type 'void (void *, std::align_val_t, const std::nothrow_t &) noexcept' is only available on macOS 10.14 or newer A* ap = new (std::nothrow) A[2]; ^ /Users/buildslave/jenkins/libcxx_libcxxabi_trunk_testing/CI_ARCH/64/CI_EXCEPTIONS/ON/CI_STD/c++17/llvm-project/libcxx/test/std/language.support/support.dynamic/new.delete/new.delete.array/new_align_val_t_nothrow_replace.pass.cpp:92:17: note: if you supply your own aligned allocation functions, use -faligned-allocation to silence this diagnostic 2 errors generated. --

Hide Details

Compilation failed unexpectedly! ******************** Testing: 0.. 10.. 20.. 30.. 40 FAIL: libc++ :: std/language.support/support.dynamic/new.delete/new.delete.single/delete_align_val_t_replace.pass.cpp (2892 of 6395) ******************** TEST 'libc++ :: std/language.support/support.dynamic/new.delete/new.delete.single/delete_align_val_t_replace.pass.cpp' FAILED ******************** Command: ['/Users/buildslave/jenkins/libcxx_libcxxabi_trunk_testing/CI_ARCH/64/CI_EXCEPTIONS/ON/CI_STD/c++17/host-compiler/bin/clang++', '-o', '/private/var/folders/9t/lrs73ptj6lv644zvh1fk2_gc0000gn/T/tmp.wC1Y1w2p/llvm-build/projects/libcxx/test/std/language.support/support.dynamic/new.delete/new.delete.single/Output/delete_align_val_t_replace.pass.cpp.o', '-x', 'c++', '/Users/buildslave/jenkins/libcxx_libcxxabi_trunk_testing/CI_ARCH/64/CI_EXCEPTIONS/ON/CI_STD/c++17/llvm-project/libcxx/test/std/language.support/support.dynamic/new.delete/new.delete.single/delete_align_val_t_replace.pass.cpp', '-c', '-D_LIBCPP_DISABLE_AVAILABILITY', '-v', '-arch', 'x86_64', '-mmacosx-version-min=10.13', '-ftemplate-depth=270', '-Werror=thread-safety', '-std=c++17', '-Wno-macro-redefined', '-include', '/var/folders/9t/lrs73ptj6lv644zvh1fk2_gc0000gn/T/tmp.wC1Y1w2p/llvm-build/projects/libcxx/__config_site', '-include', '/Users/buildslave/jenkins/libcxx_libcxxabi_trunk_testing/CI_ARCH/64/CI_EXCEPTIONS/ON/CI_STD/c++17/llvm-project/libcxx/test/support/nasty_macros.h', '-nostdinc++', '-I/Users/buildslave/jenkins/libcxx_libcxxabi_trunk_testing/CI_ARCH/64/CI_EXCEPTIONS/ON/CI_STD/c++17/llvm-project/libcxx/include', '-I/var/folders/9t/lrs73ptj6lv644zvh1fk2_gc0000gn/T/tmp.wC1Y1w2p/llvm-build/projects/libcxx/include/c++build', '-isysroot', '/Applications/Xcode.app/Contents/Developer/Platforms/MacOSX.platform/Developer/SDKs/MacOSX10.13.sdk', '-I/Users/buildslave/jenkins/libcxx_libcxxabi_trunk_testing/CI_ARCH/64/CI_EXCEPTIONS/ON/CI_STD/c++17/llvm-project/libcxx/test/support', '-DLIBCXX_FILESYSTEM_STATIC_TEST_ROOT="/Users/buildslave/jenkins/libcxx_libcxxabi_trunk_testing/CI_ARCH/64/CI_EXCEPTIONS/ON/CI_STD/c++17/llvm-project/libcxx/test/std/input.output/filesystems/Inputs/static_test_env"', '-DLIBCXX_FILESYSTEM_DYNAMIC_TEST_ROOT="/private/var/folders/9t/lrs73ptj6lv644zvh1fk2_gc0000gn/T/tmp.wC1Y1w2p/llvm-build/projects/libcxx/test/filesystem/Output/dynamic_env"', '-DLIBCXX_FILESYSTEM_DYNAMIC_TEST_HELPER="/usr/local/opt/python@2/bin/python2.7 /Users/buildslave/jenkins/libcxx_libcxxabi_trunk_testing/CI_ARCH/64/CI_EXCEPTIONS/ON/CI_STD/c++17/llvm-project/libcxx/test/support/filesystem_dynamic_test_helper.py"', '-D_LIBCPP_HAS_NO_PRAGMA_SYSTEM_HEADER', '-Wall', '-Wextra', '-Werror', '-Wuser-defined-warnings', '-Wshadow', '-Wno-unused-command-line-argument', '-Wno-attributes', '-Wno-pessimizing-move', '-Wno-c++11-extensions', '-Wno-user-defined-literals', '-Wno-noexcept-type', '-Wsign-compare', '-Wunused-variable', '-Wunused-parameter', '-Wunreachable-code', '-c'] Exit Code: 1 Standard Error: -- clang version 11.0.0 (https://github.com/llvm/llvm-project.git 07d2cdae11633139947f105888163adfd5646ce7) Target: x86_64-apple-darwin17.5.0 Thread model: posix InstalledDir: /Users/buildslave/jenkins/libcxx_libcxxabi_trunk_testing/CI_ARCH/64/CI_EXCEPTIONS/ON/CI_STD/c++17/host-compiler/bin (in-process) "/Users/buildslave/jenkins/libcxx_libcxxabi_trunk_testing/CI_ARCH/64/CI_EXCEPTIONS/ON/CI_STD/c++17/host-compiler/bin/clang-11" -cc1 -triple x86_64-apple-macosx10.13.0 -Wdeprecated-objc-isa-usage -Werror=deprecated-objc-isa-usage -emit-obj -mrelax-all -disable-free -main-file-name delete_align_val_t_replace.pass.cpp -mrelocation-model pic -pic-level 2 -mthread-model posix -mframe-pointer=all -fno-rounding-math -masm-verbose -munwind-tables -faligned-alloc-unavailable -target-cpu penryn -dwarf-column-info -debugger-tuning=lldb -target-linker-version 409.12 -v -nostdinc++ -resource-dir /Users/buildslave/jenkins/libcxx_libcxxabi_trunk_testing/CI_ARCH/64/CI_EXCEPTIONS/ON/CI_STD/c++17/host-compiler/lib/clang/11.0.0 -include /var/folders/9t/lrs73ptj6lv644zvh1fk2_gc0000gn/T/tmp.wC1Y1w2p/llvm-build/projects/libcxx/__config_site -include /Users/buildslave/jenkins/libcxx_libcxxabi_trunk_testing/CI_ARCH/64/CI_EXCEPTIONS/ON/CI_STD/c++17/llvm-project/libcxx/test/support/nasty_macros.h -isysroot /Applications/Xcode.app/Contents/Developer/Platforms/MacOSX.platform/Developer/SDKs/MacOSX10.13.sdk -D _LIBCPP_DISABLE_AVAILABILITY -I /Users/buildslave/jenkins/libcxx_libcxxabi_trunk_testing/CI_ARCH/64/CI_EXCEPTIONS/ON/CI_STD/c++17/llvm-project/libcxx/include -I /var/folders/9t/lrs73ptj6lv644zvh1fk2_gc0000gn/T/tmp.wC1Y1w2p/llvm-build/projects/libcxx/include/c++build -I /Users/buildslave/jenkins/libcxx_libcxxabi_trunk_testing/CI_ARCH/64/CI_EXCEPTIONS/ON/CI_STD/c++17/llvm-project/libcxx/test/support -D "LIBCXX_FILESYSTEM_STATIC_TEST_ROOT=\"/Users/buildslave/jenkins/libcxx_libcxxabi_trunk_testing/CI_ARCH/64/CI_EXCEPTIONS/ON/CI_STD/c++17/llvm-project/libcxx/test/std/input.output/filesystems/Inputs/static_test_env\"" -D "LIBCXX_FILESYSTEM_DYNAMIC_TEST_ROOT=\"/private/var/folders/9t/lrs73ptj6lv644zvh1fk2_gc0000gn/T/tmp.wC1Y1w2p/llvm-build/projects/libcxx/test/filesystem/Output/dynamic_env\"" -D "LIBCXX_FILESYSTEM_DYNAMIC_TEST_HELPER=\"/usr/local/opt/python@2/bin/python2.7 /Users/buildslave/jenkins/libcxx_libcxxabi_trunk_testing/CI_ARCH/64/CI_EXCEPTIONS/ON/CI_STD/c++17/llvm-project/libcxx/test/support/filesystem_dynamic_test_helper.py\"" -D _LIBCPP_HAS_NO_PRAGMA_SYSTEM_HEADER -stdlib=libc++ -internal-isystem /Applications/Xcode.app/Contents/Developer/Platforms/MacOSX.platform/Developer/SDKs/MacOSX10.13.sdk/usr/local/include -internal-isystem /Users/buildslave/jenkins/libcxx_libcxxabi_trunk_testing/CI_ARCH/64/CI_EXCEPTIONS/ON/CI_STD/c++17/host-compiler/lib/clang/11.0.0/include -internal-externc-isystem /Applications/Xcode.app/Contents/Developer/Platforms/MacOSX.platform/Developer/SDKs/MacOSX10.13.sdk/usr/include -Werror=thread-safety -Wno-macro-redefined -Wall -Wextra -Werror -Wuser-defined-warnings -Wshadow -Wno-unused-command-line-argument -Wno-attributes -Wno-pessimizing-move -Wno-c++11-extensions -Wno-user-defined-literals -Wno-noexcept-type -Wsign-compare -Wunused-variable -Wunused-parameter -Wunreachable-code -std=c++17 -fdeprecated-macro -fdebug-compilation-dir /private/var/folders/9t/lrs73ptj6lv644zvh1fk2_gc0000gn/T/tmp.wC1Y1w2p/llvm-build/projects/libcxx/test/std/language.support/support.dynamic/new.delete/new.delete.single -ftemplate-depth 270 -ferror-limit 19 -fmessage-length 0 -stack-protector 1 -fblocks -fencode-extended-block-signature -fregister-global-dtors-with-atexit -fgnuc-version=4.2.1 -fobjc-runtime=macosx-10.13.0 -fcxx-exceptions -fexceptions -fmax-type-align=16 -fdiagnostics-show-option -o /private/var/folders/9t/lrs73ptj6lv644zvh1fk2_gc0000gn/T/tmp.wC1Y1w2p/llvm-build/projects/libcxx/test/std/language.support/support.dynamic/new.delete/new.delete.single/Output/delete_align_val_t_replace.pass.cpp.o -x c++ /Users/buildslave/jenkins/libcxx_libcxxabi_trunk_testing/CI_ARCH/64/CI_EXCEPTIONS/ON/CI_STD/c++17/llvm-project/libcxx/test/std/language.support/support.dynamic/new.delete/new.delete.single/delete_align_val_t_replace.pass.cpp clang -cc1 version 11.0.0 based upon LLVM 11.0.0git default target x86_64-apple-darwin17.5.0 ignoring nonexistent directory "/Applications/Xcode.app/Contents/Developer/Platforms/MacOSX.platform/Developer/SDKs/MacOSX10.13.sdk/usr/local/include" ignoring nonexistent directory "/Applications/Xcode.app/Contents/Developer/Platforms/MacOSX.platform/Developer/SDKs/MacOSX10.13.sdk/Library/Frameworks" #include "..." search starts here: #include <...> search starts here: /Users/buildslave/jenkins/libcxx_libcxxabi_trunk_testing/CI_ARCH/64/CI_EXCEPTIONS/ON/CI_STD/c++17/llvm-project/libcxx/include /var/folders/9t/lrs73ptj6lv644zvh1fk2_gc0000gn/T/tmp.wC1Y1w2p/llvm-build/projects/libcxx/include/c++build /Users/buildslave/jenkins/libcxx_libcxxabi_trunk_testing/CI_ARCH/64/CI_EXCEPTIONS/ON/CI_STD/c++17/llvm-project/libcxx/test/support /Users/buildslave/jenkins/libcxx_libcxxabi_trunk_testing/CI_ARCH/64/CI_EXCEPTIONS/ON/CI_STD/c++17/host-compiler/lib/clang/11.0.0/include /Applications/Xcode.app/Contents/Developer/Platforms/MacOSX.platform/Developer/SDKs/MacOSX10.13.sdk/usr/include /Applications/Xcode.app/Contents/Developer/Platforms/MacOSX.platform/Developer/SDKs/MacOSX10.13.sdk/System/Library/Frameworks (framework directory) End of search list. /Users/buildslave/jenkins/libcxx_libcxxabi_trunk_testing/CI_ARCH/64/CI_EXCEPTIONS/ON/CI_STD/c++17/llvm-project/libcxx/test/std/language.support/support.dynamic/new.delete/new.delete.single/delete_align_val_t_replace.pass.cpp:103:17: error: aligned allocation function of type 'void *(std::size_t, std::align_val_t)' is only available on macOS 10.14 or newer A *ap = new A; ^ /Users/buildslave/jenkins/libcxx_libcxxabi_trunk_testing/CI_ARCH/64/CI_EXCEPTIONS/ON/CI_STD/c++17/llvm-project/libcxx/test/std/language.support/support.dynamic/new.delete/new.delete.single/delete_align_val_t_replace.pass.cpp:103:17: note: if you supply your own aligned allocation functions, use -faligned-allocation to silence this diagnostic 1 error generated. --

Hide Details

Compilation failed unexpectedly! ******************** Testing: 0.. 10.. 20.. 30.. 40 FAIL: libc++ :: std/language.support/support.dynamic/new.delete/new.delete.single/new_align_val_t_nothrow.pass.cpp (2893 of 6395) ******************** TEST 'libc++ :: std/language.support/support.dynamic/new.delete/new.delete.single/new_align_val_t_nothrow.pass.cpp' FAILED ******************** Command: ['/Users/buildslave/jenkins/libcxx_libcxxabi_trunk_testing/CI_ARCH/64/CI_EXCEPTIONS/ON/CI_STD/c++17/host-compiler/bin/clang++', '-o', '/private/var/folders/9t/lrs73ptj6lv644zvh1fk2_gc0000gn/T/tmp.wC1Y1w2p/llvm-build/projects/libcxx/test/std/language.support/support.dynamic/new.delete/new.delete.single/Output/new_align_val_t_nothrow.pass.cpp.o', '-x', 'c++', '/Users/buildslave/jenkins/libcxx_libcxxabi_trunk_testing/CI_ARCH/64/CI_EXCEPTIONS/ON/CI_STD/c++17/llvm-project/libcxx/test/std/language.support/support.dynamic/new.delete/new.delete.single/new_align_val_t_nothrow.pass.cpp', '-c', '-D_LIBCPP_DISABLE_AVAILABILITY', '-v', '-arch', 'x86_64', '-mmacosx-version-min=10.13', '-ftemplate-depth=270', '-Werror=thread-safety', '-std=c++17', '-Wno-macro-redefined', '-include', '/var/folders/9t/lrs73ptj6lv644zvh1fk2_gc0000gn/T/tmp.wC1Y1w2p/llvm-build/projects/libcxx/__config_site', '-include', '/Users/buildslave/jenkins/libcxx_libcxxabi_trunk_testing/CI_ARCH/64/CI_EXCEPTIONS/ON/CI_STD/c++17/llvm-project/libcxx/test/support/nasty_macros.h', '-nostdinc++', '-I/Users/buildslave/jenkins/libcxx_libcxxabi_trunk_testing/CI_ARCH/64/CI_EXCEPTIONS/ON/CI_STD/c++17/llvm-project/libcxx/include', '-I/var/folders/9t/lrs73ptj6lv644zvh1fk2_gc0000gn/T/tmp.wC1Y1w2p/llvm-build/projects/libcxx/include/c++build', '-isysroot', '/Applications/Xcode.app/Contents/Developer/Platforms/MacOSX.platform/Developer/SDKs/MacOSX10.13.sdk', '-I/Users/buildslave/jenkins/libcxx_libcxxabi_trunk_testing/CI_ARCH/64/CI_EXCEPTIONS/ON/CI_STD/c++17/llvm-project/libcxx/test/support', '-DLIBCXX_FILESYSTEM_STATIC_TEST_ROOT="/Users/buildslave/jenkins/libcxx_libcxxabi_trunk_testing/CI_ARCH/64/CI_EXCEPTIONS/ON/CI_STD/c++17/llvm-project/libcxx/test/std/input.output/filesystems/Inputs/static_test_env"', '-DLIBCXX_FILESYSTEM_DYNAMIC_TEST_ROOT="/private/var/folders/9t/lrs73ptj6lv644zvh1fk2_gc0000gn/T/tmp.wC1Y1w2p/llvm-build/projects/libcxx/test/filesystem/Output/dynamic_env"', '-DLIBCXX_FILESYSTEM_DYNAMIC_TEST_HELPER="/usr/local/opt/python@2/bin/python2.7 /Users/buildslave/jenkins/libcxx_libcxxabi_trunk_testing/CI_ARCH/64/CI_EXCEPTIONS/ON/CI_STD/c++17/llvm-project/libcxx/test/support/filesystem_dynamic_test_helper.py"', '-D_LIBCPP_HAS_NO_PRAGMA_SYSTEM_HEADER', '-Wall', '-Wextra', '-Werror', '-Wuser-defined-warnings', '-Wshadow', '-Wno-unused-command-line-argument', '-Wno-attributes', '-Wno-pessimizing-move', '-Wno-c++11-extensions', '-Wno-user-defined-literals', '-Wno-noexcept-type', '-Wsign-compare', '-Wunused-variable', '-Wunused-parameter', '-Wunreachable-code', '-c'] Exit Code: 1 Standard Error: -- clang version 11.0.0 (https://github.com/llvm/llvm-project.git 07d2cdae11633139947f105888163adfd5646ce7) Target: x86_64-apple-darwin17.5.0 Thread model: posix InstalledDir: /Users/buildslave/jenkins/libcxx_libcxxabi_trunk_testing/CI_ARCH/64/CI_EXCEPTIONS/ON/CI_STD/c++17/host-compiler/bin (in-process) "/Users/buildslave/jenkins/libcxx_libcxxabi_trunk_testing/CI_ARCH/64/CI_EXCEPTIONS/ON/CI_STD/c++17/host-compiler/bin/clang-11" -cc1 -triple x86_64-apple-macosx10.13.0 -Wdeprecated-objc-isa-usage -Werror=deprecated-objc-isa-usage -emit-obj -mrelax-all -disable-free -main-file-name new_align_val_t_nothrow.pass.cpp -mrelocation-model pic -pic-level 2 -mthread-model posix -mframe-pointer=all -fno-rounding-math -masm-verbose -munwind-tables -faligned-alloc-unavailable -target-cpu penryn -dwarf-column-info -debugger-tuning=lldb -target-linker-version 409.12 -v -nostdinc++ -resource-dir /Users/buildslave/jenkins/libcxx_libcxxabi_trunk_testing/CI_ARCH/64/CI_EXCEPTIONS/ON/CI_STD/c++17/host-compiler/lib/clang/11.0.0 -include /var/folders/9t/lrs73ptj6lv644zvh1fk2_gc0000gn/T/tmp.wC1Y1w2p/llvm-build/projects/libcxx/__config_site -include /Users/buildslave/jenkins/libcxx_libcxxabi_trunk_testing/CI_ARCH/64/CI_EXCEPTIONS/ON/CI_STD/c++17/llvm-project/libcxx/test/support/nasty_macros.h -isysroot /Applications/Xcode.app/Contents/Developer/Platforms/MacOSX.platform/Developer/SDKs/MacOSX10.13.sdk -D _LIBCPP_DISABLE_AVAILABILITY -I /Users/buildslave/jenkins/libcxx_libcxxabi_trunk_testing/CI_ARCH/64/CI_EXCEPTIONS/ON/CI_STD/c++17/llvm-project/libcxx/include -I /var/folders/9t/lrs73ptj6lv644zvh1fk2_gc0000gn/T/tmp.wC1Y1w2p/llvm-build/projects/libcxx/include/c++build -I /Users/buildslave/jenkins/libcxx_libcxxabi_trunk_testing/CI_ARCH/64/CI_EXCEPTIONS/ON/CI_STD/c++17/llvm-project/libcxx/test/support -D "LIBCXX_FILESYSTEM_STATIC_TEST_ROOT=\"/Users/buildslave/jenkins/libcxx_libcxxabi_trunk_testing/CI_ARCH/64/CI_EXCEPTIONS/ON/CI_STD/c++17/llvm-project/libcxx/test/std/input.output/filesystems/Inputs/static_test_env\"" -D "LIBCXX_FILESYSTEM_DYNAMIC_TEST_ROOT=\"/private/var/folders/9t/lrs73ptj6lv644zvh1fk2_gc0000gn/T/tmp.wC1Y1w2p/llvm-build/projects/libcxx/test/filesystem/Output/dynamic_env\"" -D "LIBCXX_FILESYSTEM_DYNAMIC_TEST_HELPER=\"/usr/local/opt/python@2/bin/python2.7 /Users/buildslave/jenkins/libcxx_libcxxabi_trunk_testing/CI_ARCH/64/CI_EXCEPTIONS/ON/CI_STD/c++17/llvm-project/libcxx/test/support/filesystem_dynamic_test_helper.py\"" -D _LIBCPP_HAS_NO_PRAGMA_SYSTEM_HEADER -stdlib=libc++ -internal-isystem /Applications/Xcode.app/Contents/Developer/Platforms/MacOSX.platform/Developer/SDKs/MacOSX10.13.sdk/usr/local/include -internal-isystem /Users/buildslave/jenkins/libcxx_libcxxabi_trunk_testing/CI_ARCH/64/CI_EXCEPTIONS/ON/CI_STD/c++17/host-compiler/lib/clang/11.0.0/include -internal-externc-isystem /Applications/Xcode.app/Contents/Developer/Platforms/MacOSX.platform/Developer/SDKs/MacOSX10.13.sdk/usr/include -Werror=thread-safety -Wno-macro-redefined -Wall -Wextra -Werror -Wuser-defined-warnings -Wshadow -Wno-unused-command-line-argument -Wno-attributes -Wno-pessimizing-move -Wno-c++11-extensions -Wno-user-defined-literals -Wno-noexcept-type -Wsign-compare -Wunused-variable -Wunused-parameter -Wunreachable-code -std=c++17 -fdeprecated-macro -fdebug-compilation-dir /private/var/folders/9t/lrs73ptj6lv644zvh1fk2_gc0000gn/T/tmp.wC1Y1w2p/llvm-build/projects/libcxx/test/std/language.support/support.dynamic/new.delete/new.delete.single -ftemplate-depth 270 -ferror-limit 19 -fmessage-length 0 -stack-protector 1 -fblocks -fencode-extended-block-signature -fregister-global-dtors-with-atexit -fgnuc-version=4.2.1 -fobjc-runtime=macosx-10.13.0 -fcxx-exceptions -fexceptions -fmax-type-align=16 -fdiagnostics-show-option -o /private/var/folders/9t/lrs73ptj6lv644zvh1fk2_gc0000gn/T/tmp.wC1Y1w2p/llvm-build/projects/libcxx/test/std/language.support/support.dynamic/new.delete/new.delete.single/Output/new_align_val_t_nothrow.pass.cpp.o -x c++ /Users/buildslave/jenkins/libcxx_libcxxabi_trunk_testing/CI_ARCH/64/CI_EXCEPTIONS/ON/CI_STD/c++17/llvm-project/libcxx/test/std/language.support/support.dynamic/new.delete/new.delete.single/new_align_val_t_nothrow.pass.cpp clang -cc1 version 11.0.0 based upon LLVM 11.0.0git default target x86_64-apple-darwin17.5.0 ignoring nonexistent directory "/Applications/Xcode.app/Contents/Developer/Platforms/MacOSX.platform/Developer/SDKs/MacOSX10.13.sdk/usr/local/include" ignoring nonexistent directory "/Applications/Xcode.app/Contents/Developer/Platforms/MacOSX.platform/Developer/SDKs/MacOSX10.13.sdk/Library/Frameworks" #include "..." search starts here: #include <...> search starts here: /Users/buildslave/jenkins/libcxx_libcxxabi_trunk_testing/CI_ARCH/64/CI_EXCEPTIONS/ON/CI_STD/c++17/llvm-project/libcxx/include /var/folders/9t/lrs73ptj6lv644zvh1fk2_gc0000gn/T/tmp.wC1Y1w2p/llvm-build/projects/libcxx/include/c++build /Users/buildslave/jenkins/libcxx_libcxxabi_trunk_testing/CI_ARCH/64/CI_EXCEPTIONS/ON/CI_STD/c++17/llvm-project/libcxx/test/support /Users/buildslave/jenkins/libcxx_libcxxabi_trunk_testing/CI_ARCH/64/CI_EXCEPTIONS/ON/CI_STD/c++17/host-compiler/lib/clang/11.0.0/include /Applications/Xcode.app/Contents/Developer/Platforms/MacOSX.platform/Developer/SDKs/MacOSX10.13.sdk/usr/include /Applications/Xcode.app/Contents/Developer/Platforms/MacOSX.platform/Developer/SDKs/MacOSX10.13.sdk/System/Library/Frameworks (framework directory) End of search list. /Users/buildslave/jenkins/libcxx_libcxxabi_trunk_testing/CI_ARCH/64/CI_EXCEPTIONS/ON/CI_STD/c++17/llvm-project/libcxx/test/std/language.support/support.dynamic/new.delete/new.delete.single/new_align_val_t_nothrow.pass.cpp:75:20: error: aligned allocation function of type 'void *(std::size_t, std::align_val_t, const std::nothrow_t &) noexcept' is only available on macOS 10.14 or newer void* vp = operator new (std::numeric_limits<std::size_t>::max(), ^ /Users/buildslave/jenkins/libcxx_libcxxabi_trunk_testing/CI_ARCH/64/CI_EXCEPTIONS/ON/CI_STD/c++17/llvm-project/libcxx/test/std/language.support/support.dynamic/new.delete/new.delete.single/new_align_val_t_nothrow.pass.cpp:75:20: note: if you supply your own aligned allocation functions, use -faligned-allocation to silence this diagnostic /Users/buildslave/jenkins/libcxx_libcxxabi_trunk_testing/CI_ARCH/64/CI_EXCEPTIONS/ON/CI_STD/c++17/llvm-project/libcxx/test/std/language.support/support.dynamic/new.delete/new.delete.single/new_align_val_t_nothrow.pass.cpp:98:17: error: aligned allocation function of type 'void *(std::size_t, std::align_val_t, const std::nothrow_t &) noexcept' is only available on macOS 10.14 or newer A* ap = new(std::nothrow) A; ^ /Users/buildslave/jenkins/libcxx_libcxxabi_trunk_testing/CI_ARCH/64/CI_EXCEPTIONS/ON/CI_STD/c++17/llvm-project/libcxx/test/std/language.support/support.dynamic/new.delete/new.delete.single/new_align_val_t_nothrow.pass.cpp:98:17: note: if you supply your own aligned allocation functions, use -faligned-allocation to silence this diagnostic /Users/buildslave/jenkins/libcxx_libcxxabi_trunk_testing/CI_ARCH/64/CI_EXCEPTIONS/ON/CI_STD/c++17/llvm-project/libcxx/test/std/language.support/support.dynamic/new.delete/new.delete.single/new_align_val_t_nothrow.pass.cpp:98:17: error: aligned deallocation function of type 'void (void *, std::align_val_t, const std::nothrow_t &) noexcept' is only available on macOS 10.14 or newer A* ap = new(std::nothrow) A; ^ /Users/buildslave/jenkins/libcxx_libcxxabi_trunk_testing/CI_ARCH/64/CI_EXCEPTIONS/ON/CI_STD/c++17/llvm-project/libcxx/test/std/language.support/support.dynamic/new.delete/new.delete.single/new_align_val_t_nothrow.pass.cpp:98:17: note: if you supply your own aligned allocation functions, use -faligned-allocation to silence this diagnostic /Users/buildslave/jenkins/libcxx_libcxxabi_trunk_testing/CI_ARCH/64/CI_EXCEPTIONS/ON/CI_STD/c++17/llvm-project/libcxx/test/std/language.support/support.dynamic/new.delete/new.delete.single/new_align_val_t_nothrow.pass.cpp:102:9: error: aligned deallocation function of type 'void (void *, std::align_val_t) noexcept' is only available on macOS 10.14 or newer delete ap; ^ /Users/buildslave/jenkins/libcxx_libcxxabi_trunk_testing/CI_ARCH/64/CI_EXCEPTIONS/ON/CI_STD/c++17/llvm-project/libcxx/test/std/language.support/support.dynamic/new.delete/new.delete.single/new_align_val_t_nothrow.pass.cpp:102:9: note: if you supply your own aligned allocation functions, use -faligned-allocation to silence this diagnostic 4 errors generated. --

Hide Details

Compilation failed unexpectedly! ******************** Testing: 0.. 10.. 20.. 30.. 40 FAIL: libc++ :: std/language.support/support.dynamic/new.delete/new.delete.single/new_align_val_t.pass.cpp (2894 of 6395) ******************** TEST 'libc++ :: std/language.support/support.dynamic/new.delete/new.delete.single/new_align_val_t.pass.cpp' FAILED ******************** Command: ['/Users/buildslave/jenkins/libcxx_libcxxabi_trunk_testing/CI_ARCH/64/CI_EXCEPTIONS/ON/CI_STD/c++17/host-compiler/bin/clang++', '-o', '/private/var/folders/9t/lrs73ptj6lv644zvh1fk2_gc0000gn/T/tmp.wC1Y1w2p/llvm-build/projects/libcxx/test/std/language.support/support.dynamic/new.delete/new.delete.single/Output/new_align_val_t.pass.cpp.o', '-x', 'c++', '/Users/buildslave/jenkins/libcxx_libcxxabi_trunk_testing/CI_ARCH/64/CI_EXCEPTIONS/ON/CI_STD/c++17/llvm-project/libcxx/test/std/language.support/support.dynamic/new.delete/new.delete.single/new_align_val_t.pass.cpp', '-c', '-D_LIBCPP_DISABLE_AVAILABILITY', '-v', '-arch', 'x86_64', '-mmacosx-version-min=10.13', '-ftemplate-depth=270', '-Werror=thread-safety', '-std=c++17', '-Wno-macro-redefined', '-include', '/var/folders/9t/lrs73ptj6lv644zvh1fk2_gc0000gn/T/tmp.wC1Y1w2p/llvm-build/projects/libcxx/__config_site', '-include', '/Users/buildslave/jenkins/libcxx_libcxxabi_trunk_testing/CI_ARCH/64/CI_EXCEPTIONS/ON/CI_STD/c++17/llvm-project/libcxx/test/support/nasty_macros.h', '-nostdinc++', '-I/Users/buildslave/jenkins/libcxx_libcxxabi_trunk_testing/CI_ARCH/64/CI_EXCEPTIONS/ON/CI_STD/c++17/llvm-project/libcxx/include', '-I/var/folders/9t/lrs73ptj6lv644zvh1fk2_gc0000gn/T/tmp.wC1Y1w2p/llvm-build/projects/libcxx/include/c++build', '-isysroot', '/Applications/Xcode.app/Contents/Developer/Platforms/MacOSX.platform/Developer/SDKs/MacOSX10.13.sdk', '-I/Users/buildslave/jenkins/libcxx_libcxxabi_trunk_testing/CI_ARCH/64/CI_EXCEPTIONS/ON/CI_STD/c++17/llvm-project/libcxx/test/support', '-DLIBCXX_FILESYSTEM_STATIC_TEST_ROOT="/Users/buildslave/jenkins/libcxx_libcxxabi_trunk_testing/CI_ARCH/64/CI_EXCEPTIONS/ON/CI_STD/c++17/llvm-project/libcxx/test/std/input.output/filesystems/Inputs/static_test_env"', '-DLIBCXX_FILESYSTEM_DYNAMIC_TEST_ROOT="/private/var/folders/9t/lrs73ptj6lv644zvh1fk2_gc0000gn/T/tmp.wC1Y1w2p/llvm-build/projects/libcxx/test/filesystem/Output/dynamic_env"', '-DLIBCXX_FILESYSTEM_DYNAMIC_TEST_HELPER="/usr/local/opt/python@2/bin/python2.7 /Users/buildslave/jenkins/libcxx_libcxxabi_trunk_testing/CI_ARCH/64/CI_EXCEPTIONS/ON/CI_STD/c++17/llvm-project/libcxx/test/support/filesystem_dynamic_test_helper.py"', '-D_LIBCPP_HAS_NO_PRAGMA_SYSTEM_HEADER', '-Wall', '-Wextra', '-Werror', '-Wuser-defined-warnings', '-Wshadow', '-Wno-unused-command-line-argument', '-Wno-attributes', '-Wno-pessimizing-move', '-Wno-c++11-extensions', '-Wno-user-defined-literals', '-Wno-noexcept-type', '-Wsign-compare', '-Wunused-variable', '-Wunused-parameter', '-Wunreachable-code', '-c'] Exit Code: 1 Standard Error: -- clang version 11.0.0 (https://github.com/llvm/llvm-project.git 07d2cdae11633139947f105888163adfd5646ce7) Target: x86_64-apple-darwin17.5.0 Thread model: posix InstalledDir: /Users/buildslave/jenkins/libcxx_libcxxabi_trunk_testing/CI_ARCH/64/CI_EXCEPTIONS/ON/CI_STD/c++17/host-compiler/bin (in-process) "/Users/buildslave/jenkins/libcxx_libcxxabi_trunk_testing/CI_ARCH/64/CI_EXCEPTIONS/ON/CI_STD/c++17/host-compiler/bin/clang-11" -cc1 -triple x86_64-apple-macosx10.13.0 -Wdeprecated-objc-isa-usage -Werror=deprecated-objc-isa-usage -emit-obj -mrelax-all -disable-free -main-file-name new_align_val_t.pass.cpp -mrelocation-model pic -pic-level 2 -mthread-model posix -mframe-pointer=all -fno-rounding-math -masm-verbose -munwind-tables -faligned-alloc-unavailable -target-cpu penryn -dwarf-column-info -debugger-tuning=lldb -target-linker-version 409.12 -v -nostdinc++ -resource-dir /Users/buildslave/jenkins/libcxx_libcxxabi_trunk_testing/CI_ARCH/64/CI_EXCEPTIONS/ON/CI_STD/c++17/host-compiler/lib/clang/11.0.0 -include /var/folders/9t/lrs73ptj6lv644zvh1fk2_gc0000gn/T/tmp.wC1Y1w2p/llvm-build/projects/libcxx/__config_site -include /Users/buildslave/jenkins/libcxx_libcxxabi_trunk_testing/CI_ARCH/64/CI_EXCEPTIONS/ON/CI_STD/c++17/llvm-project/libcxx/test/support/nasty_macros.h -isysroot /Applications/Xcode.app/Contents/Developer/Platforms/MacOSX.platform/Developer/SDKs/MacOSX10.13.sdk -D _LIBCPP_DISABLE_AVAILABILITY -I /Users/buildslave/jenkins/libcxx_libcxxabi_trunk_testing/CI_ARCH/64/CI_EXCEPTIONS/ON/CI_STD/c++17/llvm-project/libcxx/include -I /var/folders/9t/lrs73ptj6lv644zvh1fk2_gc0000gn/T/tmp.wC1Y1w2p/llvm-build/projects/libcxx/include/c++build -I /Users/buildslave/jenkins/libcxx_libcxxabi_trunk_testing/CI_ARCH/64/CI_EXCEPTIONS/ON/CI_STD/c++17/llvm-project/libcxx/test/support -D "LIBCXX_FILESYSTEM_STATIC_TEST_ROOT=\"/Users/buildslave/jenkins/libcxx_libcxxabi_trunk_testing/CI_ARCH/64/CI_EXCEPTIONS/ON/CI_STD/c++17/llvm-project/libcxx/test/std/input.output/filesystems/Inputs/static_test_env\"" -D "LIBCXX_FILESYSTEM_DYNAMIC_TEST_ROOT=\"/private/var/folders/9t/lrs73ptj6lv644zvh1fk2_gc0000gn/T/tmp.wC1Y1w2p/llvm-build/projects/libcxx/test/filesystem/Output/dynamic_env\"" -D "LIBCXX_FILESYSTEM_DYNAMIC_TEST_HELPER=\"/usr/local/opt/python@2/bin/python2.7 /Users/buildslave/jenkins/libcxx_libcxxabi_trunk_testing/CI_ARCH/64/CI_EXCEPTIONS/ON/CI_STD/c++17/llvm-project/libcxx/test/support/filesystem_dynamic_test_helper.py\"" -D _LIBCPP_HAS_NO_PRAGMA_SYSTEM_HEADER -stdlib=libc++ -internal-isystem /Applications/Xcode.app/Contents/Developer/Platforms/MacOSX.platform/Developer/SDKs/MacOSX10.13.sdk/usr/local/include -internal-isystem /Users/buildslave/jenkins/libcxx_libcxxabi_trunk_testing/CI_ARCH/64/CI_EXCEPTIONS/ON/CI_STD/c++17/host-compiler/lib/clang/11.0.0/include -internal-externc-isystem /Applications/Xcode.app/Contents/Developer/Platforms/MacOSX.platform/Developer/SDKs/MacOSX10.13.sdk/usr/include -Werror=thread-safety -Wno-macro-redefined -Wall -Wextra -Werror -Wuser-defined-warnings -Wshadow -Wno-unused-command-line-argument -Wno-attributes -Wno-pessimizing-move -Wno-c++11-extensions -Wno-user-defined-literals -Wno-noexcept-type -Wsign-compare -Wunused-variable -Wunused-parameter -Wunreachable-code -std=c++17 -fdeprecated-macro -fdebug-compilation-dir /private/var/folders/9t/lrs73ptj6lv644zvh1fk2_gc0000gn/T/tmp.wC1Y1w2p/llvm-build/projects/libcxx/test/std/language.support/support.dynamic/new.delete/new.delete.single -ftemplate-depth 270 -ferror-limit 19 -fmessage-length 0 -stack-protector 1 -fblocks -fencode-extended-block-signature -fregister-global-dtors-with-atexit -fgnuc-version=4.2.1 -fobjc-runtime=macosx-10.13.0 -fcxx-exceptions -fexceptions -fmax-type-align=16 -fdiagnostics-show-option -o /private/var/folders/9t/lrs73ptj6lv644zvh1fk2_gc0000gn/T/tmp.wC1Y1w2p/llvm-build/projects/libcxx/test/std/language.support/support.dynamic/new.delete/new.delete.single/Output/new_align_val_t.pass.cpp.o -x c++ /Users/buildslave/jenkins/libcxx_libcxxabi_trunk_testing/CI_ARCH/64/CI_EXCEPTIONS/ON/CI_STD/c++17/llvm-project/libcxx/test/std/language.support/support.dynamic/new.delete/new.delete.single/new_align_val_t.pass.cpp clang -cc1 version 11.0.0 based upon LLVM 11.0.0git default target x86_64-apple-darwin17.5.0 ignoring nonexistent directory "/Applications/Xcode.app/Contents/Developer/Platforms/MacOSX.platform/Developer/SDKs/MacOSX10.13.sdk/usr/local/include" ignoring nonexistent directory "/Applications/Xcode.app/Contents/Developer/Platforms/MacOSX.platform/Developer/SDKs/MacOSX10.13.sdk/Library/Frameworks" #include "..." search starts here: #include <...> search starts here: /Users/buildslave/jenkins/libcxx_libcxxabi_trunk_testing/CI_ARCH/64/CI_EXCEPTIONS/ON/CI_STD/c++17/llvm-project/libcxx/include /var/folders/9t/lrs73ptj6lv644zvh1fk2_gc0000gn/T/tmp.wC1Y1w2p/llvm-build/projects/libcxx/include/c++build /Users/buildslave/jenkins/libcxx_libcxxabi_trunk_testing/CI_ARCH/64/CI_EXCEPTIONS/ON/CI_STD/c++17/llvm-project/libcxx/test/support /Users/buildslave/jenkins/libcxx_libcxxabi_trunk_testing/CI_ARCH/64/CI_EXCEPTIONS/ON/CI_STD/c++17/host-compiler/lib/clang/11.0.0/include /Applications/Xcode.app/Contents/Developer/Platforms/MacOSX.platform/Developer/SDKs/MacOSX10.13.sdk/usr/include /Applications/Xcode.app/Contents/Developer/Platforms/MacOSX.platform/Developer/SDKs/MacOSX10.13.sdk/System/Library/Frameworks (framework directory) End of search list. /Users/buildslave/jenkins/libcxx_libcxxabi_trunk_testing/CI_ARCH/64/CI_EXCEPTIONS/ON/CI_STD/c++17/llvm-project/libcxx/test/std/language.support/support.dynamic/new.delete/new.delete.single/new_align_val_t.pass.cpp:77:20: error: aligned allocation function of type 'void *(std::size_t, std::align_val_t)' is only available on macOS 10.14 or newer void* vp = operator new (std::numeric_limits<std::size_t>::max(), ^ /Users/buildslave/jenkins/libcxx_libcxxabi_trunk_testing/CI_ARCH/64/CI_EXCEPTIONS/ON/CI_STD/c++17/llvm-project/libcxx/test/std/language.support/support.dynamic/new.delete/new.delete.single/new_align_val_t.pass.cpp:77:20: note: if you supply your own aligned allocation functions, use -faligned-allocation to silence this diagnostic /Users/buildslave/jenkins/libcxx_libcxxabi_trunk_testing/CI_ARCH/64/CI_EXCEPTIONS/ON/CI_STD/c++17/llvm-project/libcxx/test/std/language.support/support.dynamic/new.delete/new.delete.single/new_align_val_t.pass.cpp:96:17: error: aligned allocation function of type 'void *(std::size_t, std::align_val_t)' is only available on macOS 10.14 or newer A* ap = new A; ^ /Users/buildslave/jenkins/libcxx_libcxxabi_trunk_testing/CI_ARCH/64/CI_EXCEPTIONS/ON/CI_STD/c++17/llvm-project/libcxx/test/std/language.support/support.dynamic/new.delete/new.delete.single/new_align_val_t.pass.cpp:96:17: note: if you supply your own aligned allocation functions, use -faligned-allocation to silence this diagnostic /Users/buildslave/jenkins/libcxx_libcxxabi_trunk_testing/CI_ARCH/64/CI_EXCEPTIONS/ON/CI_STD/c++17/llvm-project/libcxx/test/std/language.support/support.dynamic/new.delete/new.delete.single/new_align_val_t.pass.cpp:96:17: error: aligned deallocation function of type 'void (void *, std::align_val_t) noexcept' is only available on macOS 10.14 or newer A* ap = new A; ^ /Users/buildslave/jenkins/libcxx_libcxxabi_trunk_testing/CI_ARCH/64/CI_EXCEPTIONS/ON/CI_STD/c++17/llvm-project/libcxx/test/std/language.support/support.dynamic/new.delete/new.delete.single/new_align_val_t.pass.cpp:96:17: note: if you supply your own aligned allocation functions, use -faligned-allocation to silence this diagnostic /Users/buildslave/jenkins/libcxx_libcxxabi_trunk_testing/CI_ARCH/64/CI_EXCEPTIONS/ON/CI_STD/c++17/llvm-project/libcxx/test/std/language.support/support.dynamic/new.delete/new.delete.single/new_align_val_t.pass.cpp:100:9: error: aligned deallocation function of type 'void (void *, std::align_val_t) noexcept' is only available on macOS 10.14 or newer delete ap; ^ /Users/buildslave/jenkins/libcxx_libcxxabi_trunk_testing/CI_ARCH/64/CI_EXCEPTIONS/ON/CI_STD/c++17/llvm-project/libcxx/test/std/language.support/support.dynamic/new.delete/new.delete.single/new_align_val_t.pass.cpp:100:9: note: if you supply your own aligned allocation functions, use -faligned-allocation to silence this diagnostic 4 errors generated. --

Hide Details

Compilation failed unexpectedly! ******************** Testing: 0.. 10.. 20.. 30.. 40 FAIL: libc++ :: std/language.support/support.dynamic/new.delete/new.delete.single/new_align_val_t_nothrow_replace.pass.cpp (2895 of 6395) ******************** TEST 'libc++ :: std/language.support/support.dynamic/new.delete/new.delete.single/new_align_val_t_nothrow_replace.pass.cpp' FAILED ******************** Command: ['/Users/buildslave/jenkins/libcxx_libcxxabi_trunk_testing/CI_ARCH/64/CI_EXCEPTIONS/ON/CI_STD/c++17/host-compiler/bin/clang++', '-o', '/private/var/folders/9t/lrs73ptj6lv644zvh1fk2_gc0000gn/T/tmp.wC1Y1w2p/llvm-build/projects/libcxx/test/std/language.support/support.dynamic/new.delete/new.delete.single/Output/new_align_val_t_nothrow_replace.pass.cpp.o', '-x', 'c++', '/Users/buildslave/jenkins/libcxx_libcxxabi_trunk_testing/CI_ARCH/64/CI_EXCEPTIONS/ON/CI_STD/c++17/llvm-project/libcxx/test/std/language.support/support.dynamic/new.delete/new.delete.single/new_align_val_t_nothrow_replace.pass.cpp', '-c', '-D_LIBCPP_DISABLE_AVAILABILITY', '-v', '-arch', 'x86_64', '-mmacosx-version-min=10.13', '-ftemplate-depth=270', '-Werror=thread-safety', '-std=c++17', '-Wno-macro-redefined', '-include', '/var/folders/9t/lrs73ptj6lv644zvh1fk2_gc0000gn/T/tmp.wC1Y1w2p/llvm-build/projects/libcxx/__config_site', '-include', '/Users/buildslave/jenkins/libcxx_libcxxabi_trunk_testing/CI_ARCH/64/CI_EXCEPTIONS/ON/CI_STD/c++17/llvm-project/libcxx/test/support/nasty_macros.h', '-nostdinc++', '-I/Users/buildslave/jenkins/libcxx_libcxxabi_trunk_testing/CI_ARCH/64/CI_EXCEPTIONS/ON/CI_STD/c++17/llvm-project/libcxx/include', '-I/var/folders/9t/lrs73ptj6lv644zvh1fk2_gc0000gn/T/tmp.wC1Y1w2p/llvm-build/projects/libcxx/include/c++build', '-isysroot', '/Applications/Xcode.app/Contents/Developer/Platforms/MacOSX.platform/Developer/SDKs/MacOSX10.13.sdk', '-I/Users/buildslave/jenkins/libcxx_libcxxabi_trunk_testing/CI_ARCH/64/CI_EXCEPTIONS/ON/CI_STD/c++17/llvm-project/libcxx/test/support', '-DLIBCXX_FILESYSTEM_STATIC_TEST_ROOT="/Users/buildslave/jenkins/libcxx_libcxxabi_trunk_testing/CI_ARCH/64/CI_EXCEPTIONS/ON/CI_STD/c++17/llvm-project/libcxx/test/std/input.output/filesystems/Inputs/static_test_env"', '-DLIBCXX_FILESYSTEM_DYNAMIC_TEST_ROOT="/private/var/folders/9t/lrs73ptj6lv644zvh1fk2_gc0000gn/T/tmp.wC1Y1w2p/llvm-build/projects/libcxx/test/filesystem/Output/dynamic_env"', '-DLIBCXX_FILESYSTEM_DYNAMIC_TEST_HELPER="/usr/local/opt/python@2/bin/python2.7 /Users/buildslave/jenkins/libcxx_libcxxabi_trunk_testing/CI_ARCH/64/CI_EXCEPTIONS/ON/CI_STD/c++17/llvm-project/libcxx/test/support/filesystem_dynamic_test_helper.py"', '-D_LIBCPP_HAS_NO_PRAGMA_SYSTEM_HEADER', '-Wall', '-Wextra', '-Werror', '-Wuser-defined-warnings', '-Wshadow', '-Wno-unused-command-line-argument', '-Wno-attributes', '-Wno-pessimizing-move', '-Wno-c++11-extensions', '-Wno-user-defined-literals', '-Wno-noexcept-type', '-Wsign-compare', '-Wunused-variable', '-Wunused-parameter', '-Wunreachable-code', '-c'] Exit Code: 1 Standard Error: -- clang version 11.0.0 (https://github.com/llvm/llvm-project.git 07d2cdae11633139947f105888163adfd5646ce7) Target: x86_64-apple-darwin17.5.0 Thread model: posix InstalledDir: /Users/buildslave/jenkins/libcxx_libcxxabi_trunk_testing/CI_ARCH/64/CI_EXCEPTIONS/ON/CI_STD/c++17/host-compiler/bin (in-process) "/Users/buildslave/jenkins/libcxx_libcxxabi_trunk_testing/CI_ARCH/64/CI_EXCEPTIONS/ON/CI_STD/c++17/host-compiler/bin/clang-11" -cc1 -triple x86_64-apple-macosx10.13.0 -Wdeprecated-objc-isa-usage -Werror=deprecated-objc-isa-usage -emit-obj -mrelax-all -disable-free -main-file-name new_align_val_t_nothrow_replace.pass.cpp -mrelocation-model pic -pic-level 2 -mthread-model posix -mframe-pointer=all -fno-rounding-math -masm-verbose -munwind-tables -faligned-alloc-unavailable -target-cpu penryn -dwarf-column-info -debugger-tuning=lldb -target-linker-version 409.12 -v -nostdinc++ -resource-dir /Users/buildslave/jenkins/libcxx_libcxxabi_trunk_testing/CI_ARCH/64/CI_EXCEPTIONS/ON/CI_STD/c++17/host-compiler/lib/clang/11.0.0 -include /var/folders/9t/lrs73ptj6lv644zvh1fk2_gc0000gn/T/tmp.wC1Y1w2p/llvm-build/projects/libcxx/__config_site -include /Users/buildslave/jenkins/libcxx_libcxxabi_trunk_testing/CI_ARCH/64/CI_EXCEPTIONS/ON/CI_STD/c++17/llvm-project/libcxx/test/support/nasty_macros.h -isysroot /Applications/Xcode.app/Contents/Developer/Platforms/MacOSX.platform/Developer/SDKs/MacOSX10.13.sdk -D _LIBCPP_DISABLE_AVAILABILITY -I /Users/buildslave/jenkins/libcxx_libcxxabi_trunk_testing/CI_ARCH/64/CI_EXCEPTIONS/ON/CI_STD/c++17/llvm-project/libcxx/include -I /var/folders/9t/lrs73ptj6lv644zvh1fk2_gc0000gn/T/tmp.wC1Y1w2p/llvm-build/projects/libcxx/include/c++build -I /Users/buildslave/jenkins/libcxx_libcxxabi_trunk_testing/CI_ARCH/64/CI_EXCEPTIONS/ON/CI_STD/c++17/llvm-project/libcxx/test/support -D "LIBCXX_FILESYSTEM_STATIC_TEST_ROOT=\"/Users/buildslave/jenkins/libcxx_libcxxabi_trunk_testing/CI_ARCH/64/CI_EXCEPTIONS/ON/CI_STD/c++17/llvm-project/libcxx/test/std/input.output/filesystems/Inputs/static_test_env\"" -D "LIBCXX_FILESYSTEM_DYNAMIC_TEST_ROOT=\"/private/var/folders/9t/lrs73ptj6lv644zvh1fk2_gc0000gn/T/tmp.wC1Y1w2p/llvm-build/projects/libcxx/test/filesystem/Output/dynamic_env\"" -D "LIBCXX_FILESYSTEM_DYNAMIC_TEST_HELPER=\"/usr/local/opt/python@2/bin/python2.7 /Users/buildslave/jenkins/libcxx_libcxxabi_trunk_testing/CI_ARCH/64/CI_EXCEPTIONS/ON/CI_STD/c++17/llvm-project/libcxx/test/support/filesystem_dynamic_test_helper.py\"" -D _LIBCPP_HAS_NO_PRAGMA_SYSTEM_HEADER -stdlib=libc++ -internal-isystem /Applications/Xcode.app/Contents/Developer/Platforms/MacOSX.platform/Developer/SDKs/MacOSX10.13.sdk/usr/local/include -internal-isystem /Users/buildslave/jenkins/libcxx_libcxxabi_trunk_testing/CI_ARCH/64/CI_EXCEPTIONS/ON/CI_STD/c++17/host-compiler/lib/clang/11.0.0/include -internal-externc-isystem /Applications/Xcode.app/Contents/Developer/Platforms/MacOSX.platform/Developer/SDKs/MacOSX10.13.sdk/usr/include -Werror=thread-safety -Wno-macro-redefined -Wall -Wextra -Werror -Wuser-defined-warnings -Wshadow -Wno-unused-command-line-argument -Wno-attributes -Wno-pessimizing-move -Wno-c++11-extensions -Wno-user-defined-literals -Wno-noexcept-type -Wsign-compare -Wunused-variable -Wunused-parameter -Wunreachable-code -std=c++17 -fdeprecated-macro -fdebug-compilation-dir /private/var/folders/9t/lrs73ptj6lv644zvh1fk2_gc0000gn/T/tmp.wC1Y1w2p/llvm-build/projects/libcxx/test/std/language.support/support.dynamic/new.delete/new.delete.single -ftemplate-depth 270 -ferror-limit 19 -fmessage-length 0 -stack-protector 1 -fblocks -fencode-extended-block-signature -fregister-global-dtors-with-atexit -fgnuc-version=4.2.1 -fobjc-runtime=macosx-10.13.0 -fcxx-exceptions -fexceptions -fmax-type-align=16 -fdiagnostics-show-option -o /private/var/folders/9t/lrs73ptj6lv644zvh1fk2_gc0000gn/T/tmp.wC1Y1w2p/llvm-build/projects/libcxx/test/std/language.support/support.dynamic/new.delete/new.delete.single/Output/new_align_val_t_nothrow_replace.pass.cpp.o -x c++ /Users/buildslave/jenkins/libcxx_libcxxabi_trunk_testing/CI_ARCH/64/CI_EXCEPTIONS/ON/CI_STD/c++17/llvm-project/libcxx/test/std/language.support/support.dynamic/new.delete/new.delete.single/new_align_val_t_nothrow_replace.pass.cpp clang -cc1 version 11.0.0 based upon LLVM 11.0.0git default target x86_64-apple-darwin17.5.0 ignoring nonexistent directory "/Applications/Xcode.app/Contents/Developer/Platforms/MacOSX.platform/Developer/SDKs/MacOSX10.13.sdk/usr/local/include" ignoring nonexistent directory "/Applications/Xcode.app/Contents/Developer/Platforms/MacOSX.platform/Developer/SDKs/MacOSX10.13.sdk/Library/Frameworks" #include "..." search starts here: #include <...> search starts here: /Users/buildslave/jenkins/libcxx_libcxxabi_trunk_testing/CI_ARCH/64/CI_EXCEPTIONS/ON/CI_STD/c++17/llvm-project/libcxx/include /var/folders/9t/lrs73ptj6lv644zvh1fk2_gc0000gn/T/tmp.wC1Y1w2p/llvm-build/projects/libcxx/include/c++build /Users/buildslave/jenkins/libcxx_libcxxabi_trunk_testing/CI_ARCH/64/CI_EXCEPTIONS/ON/CI_STD/c++17/llvm-project/libcxx/test/support /Users/buildslave/jenkins/libcxx_libcxxabi_trunk_testing/CI_ARCH/64/CI_EXCEPTIONS/ON/CI_STD/c++17/host-compiler/lib/clang/11.0.0/include /Applications/Xcode.app/Contents/Developer/Platforms/MacOSX.platform/Developer/SDKs/MacOSX10.13.sdk/usr/include /Applications/Xcode.app/Contents/Developer/Platforms/MacOSX.platform/Developer/SDKs/MacOSX10.13.sdk/System/Library/Frameworks (framework directory) End of search list. /Users/buildslave/jenkins/libcxx_libcxxabi_trunk_testing/CI_ARCH/64/CI_EXCEPTIONS/ON/CI_STD/c++17/llvm-project/libcxx/test/std/language.support/support.dynamic/new.delete/new.delete.single/new_align_val_t_nothrow_replace.pass.cpp:94:17: error: aligned allocation function of type 'void *(std::size_t, std::align_val_t, const std::nothrow_t &) noexcept' is only available on macOS 10.14 or newer A* ap = new (std::nothrow) A; ^ /Users/buildslave/jenkins/libcxx_libcxxabi_trunk_testing/CI_ARCH/64/CI_EXCEPTIONS/ON/CI_STD/c++17/llvm-project/libcxx/test/std/language.support/support.dynamic/new.delete/new.delete.single/new_align_val_t_nothrow_replace.pass.cpp:94:17: note: if you supply your own aligned allocation functions, use -faligned-allocation to silence this diagnostic /Users/buildslave/jenkins/libcxx_libcxxabi_trunk_testing/CI_ARCH/64/CI_EXCEPTIONS/ON/CI_STD/c++17/llvm-project/libcxx/test/std/language.support/support.dynamic/new.delete/new.delete.single/new_align_val_t_nothrow_replace.pass.cpp:94:17: error: aligned deallocation function of type 'void (void *, std::align_val_t, const std::nothrow_t &) noexcept' is only available on macOS 10.14 or newer A* ap = new (std::nothrow) A; ^ /Users/buildslave/jenkins/libcxx_libcxxabi_trunk_testing/CI_ARCH/64/CI_EXCEPTIONS/ON/CI_STD/c++17/llvm-project/libcxx/test/std/language.support/support.dynamic/new.delete/new.delete.single/new_align_val_t_nothrow_replace.pass.cpp:94:17: note: if you supply your own aligned allocation functions, use -faligned-allocation to silence this diagnostic 2 errors generated. --

Hide Details

Compilation failed unexpectedly! ******************** Testing: 0.. 10.. 20.. 30.. 40.. 50.. 60.. 70.. 80.. 90..

Hide Details

Testing Time: 1730.93s ******************** Failing Tests (9): libc++ :: libcxx/memory/aligned_allocation_macro.pass.cpp libc++ :: std/language.support/support.dynamic/new.delete/new.delete.array/delete_align_val_t_replace.pass.cpp libc++ :: std/language.support/support.dynamic/new.delete/new.delete.array/new_align_val_t.pass.cpp libc++ :: std/language.support/support.dynamic/new.delete/new.delete.array/new_align_val_t_nothrow.pass.cpp libc++ :: std/language.support/support.dynamic/new.delete/new.delete.array/new_align_val_t_nothrow_replace.pass.cpp libc++ :: std/language.support/support.dynamic/new.delete/new.delete.single/delete_align_val_t_replace.pass.cpp libc++ :: std/language.support/support.dynamic/new.delete/new.delete.single/new_align_val_t.pass.cpp libc++ :: std/language.support/support.dynamic/new.delete/new.delete.single/new_align_val_t_nothrow.pass.cpp libc++ :: std/language.support/support.dynamic/new.delete/new.delete.single/new_align_val_t_nothrow_replace.pass.cpp

Hide Details

Expected Passes : 5649 Expected Failures : 19 Unsupported Tests : 718 Unexpected Failures: 9 FAILED: projects/libcxx/test/CMakeFiles/check-cxx cd /var/folders/9t/lrs73ptj6lv644zvh1fk2_gc0000gn/T/tmp.wC1Y1w2p/llvm-build/projects/libcxx/test && /usr/local/bin/python /var/folders/9t/lrs73ptj6lv644zvh1fk2_gc0000gn/T/tmp.wC1Y1w2p/llvm-build/./bin/llvm-lit -sv --param=std=c++17 /var/folders/9t/lrs73ptj6lv644zvh1fk2_gc0000gn/T/tmp.wC1Y1w2p/llvm-build/projects/libcxx/test ninja: build stopped: subcommand failed. + cleanup + [[ -z '' ]] + echo 'Removing temporary directory /var/folders/9t/lrs73ptj6lv644zvh1fk2_gc0000gn/T/tmp.wC1Y1w2p' Removing temporary directory /var/folders/9t/lrs73ptj6lv644zvh1fk2_gc0000gn/T/tmp.wC1Y1w2p + rm -rf /var/folders/9t/lrs73ptj6lv644zvh1fk2_gc0000gn/T/tmp.wC1Y1w2p Build step 'Execute shell' marked build as failure New run name is '#457 std=c++17 arch=64 exceptions=ON' Finished: FAILURE