FailedConsole Output

Skipping 7,371 KB.. Full Log
ts/StreamTest.PutCStringWithStringRef (863 of 1979)
PASS: lldb-unit :: Interpreter/./InterpreterTests/CompletionTest.DirCompletionUsername (864 of 1979)
PASS: lldb-api :: lang/objc/objc-ivar-offsets/TestObjCIvarOffsets.py (865 of 1979)
PASS: lldb-api :: functionalities/data-formatter/pyobjsynthprovider/TestPyObjSynthProvider.py (866 of 1979)
PASS: lldb-unit :: Expression/./ExpressionTests/CppModuleConfigurationTest.Linux (867 of 1979)
PASS: lldb-unit :: Utility/./UtilityTests/ArchSpecTest.Compatibility (868 of 1979)
PASS: lldb-unit :: Utility/./UtilityTests/StringListTest.ShiftCString (869 of 1979)
PASS: lldb-unit :: Utility/./UtilityTests/Flags.AllSet (870 of 1979)
PASS: lldb-api :: python_api/target/TestTargetAPI.py (871 of 1979)
PASS: lldb-api :: commands/register/register/register_command/TestRegisters.py (872 of 1979)
PASS: lldb-shell :: Register/x86-64-gp-read.test (873 of 1979)
UNSUPPORTED: lldb-shell :: SymbolFile/PDB/calling-conventions.test (874 of 1979)
PASS: lldb-api :: functionalities/postmortem/elf-core/TestLinuxCore.py (875 of 1979)
PASS: lldb-api :: commands/expression/rdar44436068/Test128BitsInteger.py (876 of 1979)
PASS: lldb-unit :: SymbolFile/NativePDB/./SymbolFileNativePDBTests/PDBFPOProgramToDWARFExpressionTests.UnsupportedRASearch (877 of 1979)
PASS: lldb-api :: commands/expression/inline-namespace/TestInlineNamespace.py (878 of 1979)
PASS: lldb-api :: commands/process/launch/TestProcessLaunch.py (879 of 1979)
PASS: lldb-unit :: Symbol/./SymbolTests/Type.GetTypeScopeAndBasename (880 of 1979)
PASS: lldb-api :: tools/lldb-vscode/breakpoint/TestVSCode_setBreakpoints.py (881 of 1979)
PASS: lldb-shell :: ObjectFile/PECOFF/basic-info.yaml (882 of 1979)
PASS: lldb-shell :: SymbolFile/DWARF/find-basic-function.cpp (883 of 1979)
PASS: lldb-shell :: SymbolFile/Breakpad/line-table-missing-file.test (884 of 1979)
PASS: lldb-unit :: Utility/./UtilityTests/DataExtractorTest.GetCStrEmpty (885 of 1979)
PASS: lldb-unit :: Utility/./UtilityTests/CompletionRequest.TestCompletionOwnership (886 of 1979)
PASS: lldb-unit :: ObjectFile/Breakpad/./ObjectFileBreakpadTests/PublicRecord.parse (887 of 1979)
PASS: lldb-api :: functionalities/breakpoint/address_breakpoints/TestAddressBreakpoints.py (888 of 1979)
PASS: lldb-unit :: Utility/./UtilityTests/OptionsWithRawTest.QuotedSuffix (889 of 1979)
PASS: lldb-unit :: Expression/./ExpressionTests/CppModuleConfigurationTest.IgnoreLibStdCpp (890 of 1979)
PASS: lldb-api :: lang/c/local_variables/TestLocalVariables.py (891 of 1979)
PASS: lldb-unit :: Symbol/./SymbolTests/PostfixExpression.ParseOneExpression (892 of 1979)
PASS: lldb-api :: python_api/get-value-32bit-int/TestGetValue32BitInt.py (893 of 1979)
PASS: lldb-shell :: Settings/TestModuleCacheSanity.test (894 of 1979)
PASS: lldb-unit :: Utility/./UtilityTests/SerializationRountripTest.SerializeDeserializePodPointers (895 of 1979)
PASS: lldb-unit :: Utility/./UtilityTests/CompletionRequest.Constructor (896 of 1979)
PASS: lldb-api :: lang/cpp/type_lookup/TestCppTypeLookup.py (897 of 1979)
PASS: lldb-unit :: Utility/./UtilityTests/RangeTest.DefaultConstructor (898 of 1979)
PASS: lldb-unit :: ScriptInterpreter/Python/./ScriptInterpreterPythonTests/PythonDataObjectsTest.TestPythonByteArray (899 of 1979)
UNSUPPORTED: lldb-shell :: Unwind/unwind-plan-dwarf-dump.test (900 of 1979)
PASS: lldb-api :: lang/c/step-target/TestStepTarget.py (901 of 1979)
PASS: lldb-shell :: Expr/TestTypeOfDeclTypeExpr.test (902 of 1979)
PASS: lldb-api :: functionalities/data-formatter/data-formatter-stl/libcxx/multimap/TestDataFormatterLibccMultiMap.py (903 of 1979)
PASS: lldb-unit :: Utility/./UtilityTests/StreamTeeTest.Assignment (904 of 1979)
PASS: lldb-shell :: Expr/TestIRMemoryMap.test (905 of 1979)
PASS: lldb-unit :: Utility/./UtilityTests/StreamTest.PutRawBytesToBigEndian (906 of 1979)
PASS: lldb-unit :: Process/minidump/./LLDBMinidumpTests/RegisterContextMinidump.ConvertMinidumpContext_x86_32 (907 of 1979)
PASS: lldb-api :: tools/lldb-vscode/launch/TestVSCode_launch.py (908 of 1979)
PASS: lldb-shell :: ObjectFile/ELF/section-permissions.yaml (909 of 1979)
PASS: lldb-api :: functionalities/avoids-fd-leak/TestFdLeak.py (910 of 1979)
PASS: lldb-api :: lang/objc/foundation/TestConstStrings.py (911 of 1979)
PASS: lldb-api :: functionalities/data-formatter/data-formatter-stl/libcxx/vbool/TestDataFormatterLibcxxVBool.py (912 of 1979)
PASS: lldb-api :: lang/objc/self/TestObjCSelf.py (913 of 1979)
PASS: lldb-api :: lang/objc/objc-baseclass-sbtype/TestObjCBaseClassSBType.py (914 of 1979)
PASS: lldb-unit :: Utility/./UtilityTests/OptionsWithRawTest.SingleWordSuffix (915 of 1979)
UNSUPPORTED: lldb-shell :: Breakpoint/ppc64-localentry.test (916 of 1979)
PASS: lldb-unit :: Utility/./UtilityTests/StreamTest.PutPtr (917 of 1979)
PASS: lldb-api :: functionalities/data-formatter/var-in-aggregate-misuse/TestVarInAggregateMisuse.py (918 of 1979)
PASS: lldb-api :: lang/objc/objc-checker/TestObjCCheckers.py (919 of 1979)
PASS: lldb-api :: functionalities/data-formatter/data-formatter-globals/TestDataFormatterGlobals.py (920 of 1979)
PASS: lldb-shell :: Breakpoint/implicit_const_form_support.test (921 of 1979)
PASS: lldb-unit :: UnwindAssembly/x86/./UnwindAssemblyx86Tests/Testx86AssemblyInspectionEngine.TestPushR14 (922 of 1979)
PASS: lldb-unit :: Utility/./UtilityTests/StringExtractorTest.GetHexBytesAvail_FullString (923 of 1979)
PASS: lldb-unit :: ScriptInterpreter/Python/./ScriptInterpreterPythonTests/PythonDataObjectsTest.TestRun (924 of 1979)
PASS: lldb-api :: commands/expression/result_numbering/TestResultNumbering.py (925 of 1979)
PASS: lldb-shell :: SymbolFile/NativePDB/bitfields.cpp (926 of 1979)
PASS: lldb-unit :: Utility/./UtilityTests/RangeTest.Copy (927 of 1979)
UNSUPPORTED: lldb-api :: functionalities/darwin_log/filter/regex/category/TestDarwinLogFilterRegexCategory.py (928 of 1979)
PASS: lldb-shell :: ObjectFile/Breakpad/uuid-matching-mac.test (929 of 1979)
PASS: lldb-unit :: Utility/./UtilityTests/ArgsTest.TestMultipleArgs (930 of 1979)
PASS: lldb-unit :: UnwindAssembly/x86/./UnwindAssemblyx86Tests/Testx86AssemblyInspectionEngine.TestPopESI (931 of 1979)
PASS: lldb-unit :: Expression/./ExpressionTests/CppModuleConfigurationTest.AmbiguousCLib (932 of 1979)
PASS: lldb-unit :: ScriptInterpreter/Python/./ScriptInterpreterPythonTests/PythonDataObjectsTest.TestPythonListToStructuredList (933 of 1979)
UNSUPPORTED: lldb-shell :: SymbolFile/target-symbols-add-unwind.test (934 of 1979)
PASS: lldb-api :: functionalities/thread/concurrent_events/TestConcurrentWatchpointDelayWatchpointOneBreakpoint.py (935 of 1979)
PASS: lldb-api :: functionalities/thread/step_until/TestStepUntil.py (936 of 1979)
PASS: lldb-unit :: Utility/./UtilityTests/StringListTest.Clear (937 of 1979)
PASS: lldb-unit :: Symbol/./SymbolTests/TestClangASTImporter.CopyTypeTagDecl (938 of 1979)
PASS: lldb-unit :: ScriptInterpreter/Python/./ScriptInterpreterPythonTests/PythonDataObjectsTest.TestPythonDictionaryManipulation (939 of 1979)
PASS: lldb-api :: functionalities/thread/concurrent_events/TestConcurrentWatchBreakDelay.py (940 of 1979)
PASS: lldb-unit :: Utility/./UtilityTests/StringListTest.SplitIntoLinesSingleTrailingCR (941 of 1979)
PASS: lldb-unit :: Utility/./UtilityTests/StringListTest.RemoveBlankLines (942 of 1979)
UNSUPPORTED: lldb-api :: functionalities/tsan/cpp_global_location/TestTsanCPPGlobalLocation.py (943 of 1979)
PASS: lldb-unit :: Language/Highlighting/./HighlighterTests/HighlighterTest.ClangScalarLiterals (944 of 1979)
PASS: lldb-unit :: UnwindAssembly/x86/./UnwindAssemblyx86Tests/Testx86AssemblyInspectionEngine.Test32bitFramelessBigStackFrame (945 of 1979)
PASS: lldb-api :: commands/watchpoints/watchpoint_disable/TestWatchpointDisable.py (946 of 1979)
PASS: lldb-unit :: Utility/./UtilityTests/DeserializerTest.HasData (947 of 1979)
PASS: lldb-unit :: Symbol/./SymbolTests/TestTypeSystemClang.TestGetTypeClassTypeOf (948 of 1979)
PASS: lldb-api :: commands/expression/import-std-module/shared_ptr-dbg-info-content/TestSharedPtrDbgInfoContentFromStdModule.py (949 of 1979)
PASS: lldb-api :: functionalities/breakpoint/step_over_breakpoint/TestStepOverBreakpoint.py (950 of 1979)
PASS: lldb-shell :: SymbolFile/NativePDB/function-types-classes.cpp (951 of 1979)
PASS: lldb-unit :: SymbolFile/NativePDB/./SymbolFileNativePDBTests/PDBFPOProgramToDWARFExpressionTests.UnresolvedRegisterReference (952 of 1979)
PASS: lldb-unit :: Utility/./UtilityTests/DataExtractorTest.PeekData (953 of 1979)
PASS: lldb-unit :: SymbolFile/NativePDB/./SymbolFileNativePDBTests/PDBFPOProgramToDWARFExpressionTests.UnresolvedCyclicRegisterAssignmentReference (954 of 1979)
PASS: lldb-api :: functionalities/breakpoint/breakpoint_ignore_count/TestBreakpointIgnoreCount.py (955 of 1979)
PASS: lldb-api :: tools/lldb-vscode/breakpoint/TestVSCode_setFunctionBreakpoints.py (956 of 1979)
PASS: lldb-shell :: SymbolFile/DWARF/debug_ranges_and_rnglists.test (957 of 1979)
PASS: lldb-api :: lang/objc/forward-decl/TestForwardDecl.py (958 of 1979)
PASS: lldb-api :: lang/objc/objc-new-syntax/TestObjCNewSyntaxArray.py (959 of 1979)
PASS: lldb-unit :: ScriptInterpreter/Python/./ScriptInterpreterPythonTests/PythonDataObjectsTest.TestPythonTupleValues (960 of 1979)
PASS: lldb-api :: commands/expression/import-std-module/forward_list-dbg-info-content/TestDbgInfoContentForwardListFromStdModule.py (961 of 1979)
PASS: lldb-unit :: ScriptInterpreter/Python/./ScriptInterpreterPythonTests/PythonDataObjectsTest.TestTypeNameResolutionNoDot (962 of 1979)
PASS: lldb-unit :: SymbolFile/DWARF/./SymbolFileDWARFTests/SymbolFileDWARFTests.TestAbbrevOrder1Start1 (963 of 1979)
PASS: lldb-shell :: SymbolFile/Breakpad/line-table-discontinuous-file-ids.test (964 of 1979)
PASS: lldb-unit :: SymbolFile/NativePDB/./SymbolFileNativePDBTests/PDBFPOProgramToDWARFExpressionTests.UnresolvedRegisterAssignmentReference (965 of 1979)
PASS: lldb-unit :: Utility/./UtilityTests/Flags.Reset (966 of 1979)
PASS: lldb-unit :: Target/./TargetTests/PathMappingListTest.RemapRoot (967 of 1979)
PASS: lldb-unit :: Utility/./UtilityTests/StringExtractorTest.GetHexBytesAvail_Partial (968 of 1979)
PASS: lldb-api :: functionalities/data-formatter/typedef_array/TestTypedefArray.py (969 of 1979)
PASS: lldb-shell :: SymbolFile/Breakpad/line-table-edgecases.test (970 of 1979)
PASS: lldb-unit :: Utility/./UtilityTests/StreamTest.PutSLEB128 (971 of 1979)
PASS: lldb-shell :: SymbolFile/DWARF/dwp.s (972 of 1979)
PASS: lldb-unit :: ObjectFile/Breakpad/./ObjectFileBreakpadTests/InfoRecord.parse (973 of 1979)
PASS: lldb-unit :: Utility/./UtilityTests/RangeTest.SetRangeBase (974 of 1979)
PASS: lldb-api :: functionalities/breakpoint/move_nearest/TestMoveNearest.py (975 of 1979)
PASS: lldb-unit :: Utility/./UtilityTests/OptionsWithRawTest.MultiWordSuffix (976 of 1979)
PASS: lldb-unit :: Utility/./UtilityTests/ScalarTest.ComparisonFloat (977 of 1979)
PASS: lldb-unit :: Host/./HostTests/SocketTest.TCPListen0ConnectAccept (978 of 1979)
PASS: lldb-api :: functionalities/thread/concurrent_events/TestConcurrentCrashWithWatchpointBreakpointSignal.py (979 of 1979)
PASS: lldb-api :: functionalities/thread/concurrent_events/TestConcurrentDelayWatchBreak.py (980 of 1979)
PASS: lldb-api :: commands/expression/import-std-module/no-std-module/TestMissingStdModule.py (981 of 1979)
PASS: lldb-api :: commands/source/info/TestSourceInfo.py (982 of 1979)
PASS: lldb-unit :: Symbol/./SymbolTests/TestTypeSystemClang.TestFunctionTemplateConstruction (983 of 1979)
PASS: lldb-api :: functionalities/thread/concurrent_events/TestConcurrentBreakpointDelayBreakpointOneSignal.py (984 of 1979)
PASS: lldb-api :: lang/cpp/constructors/TestCppConstructors.py (985 of 1979)
PASS: lldb-api :: lang/c/offsetof/TestOffsetof.py (986 of 1979)
PASS: lldb-api :: commands/settings/TestSettings.py (987 of 1979)
PASS: lldb-unit :: Utility/./UtilityTests/ArchSpecTest.OperatorBool (988 of 1979)
UNSUPPORTED: lldb-api :: functionalities/darwin_log/format/TestDarwinLogMessageFormat.py (989 of 1979)
PASS: lldb-unit :: Utility/./UtilityTests/StringLexerTest.Next (990 of 1979)
UNSUPPORTED: lldb-api :: tools/lldb-server/signal-filtering/TestGdbRemote_QPassSignals.py (991 of 1979)
PASS: lldb-shell :: ObjectFile/ELF/PT_TLS-overlap-PT_LOAD.yaml (992 of 1979)
PASS: lldb-unit :: Utility/./UtilityTests/Flags.Clear (993 of 1979)
PASS: lldb-unit :: Core/./LLDBCoreTests/RichManglingContextTest.FromCxxMethodName (994 of 1979)
PASS: lldb-unit :: tools/lldb-server/tests/./LLDBServerTests/TestBase.DebugserverEnv (995 of 1979)
PASS: lldb-api :: commands/target/create-no-such-arch/TestNoSuchArch.py (996 of 1979)
PASS: lldb-unit :: UnwindAssembly/x86/./UnwindAssemblyx86Tests/Testx86AssemblyInspectionEngine.Test32bitFramelessSmallStackFrame (997 of 1979)
PASS: lldb-api :: lang/objc/foundation/TestObjCMethods.py (998 of 1979)
PASS: lldb-unit :: Process/minidump/./LLDBMinidumpTests/MinidumpParserTest.GetFilteredModuleList (999 of 1979)
PASS: lldb-api :: functionalities/gdb_remote_client/TestNoGPacketSupported.py (1000 of 1979)
PASS: lldb-api :: functionalities/completion/TestCompletion.py (1001 of 1979)
PASS: lldb-shell :: ObjectFile/PECOFF/sections.yaml (1002 of 1979)
PASS: lldb-unit :: Utility/./UtilityTests/SerializationRountripTest.SerializeDeserializeCStringArrayNullptrElem (1003 of 1979)
PASS: lldb-unit :: UnwindAssembly/x86/./UnwindAssemblyx86Tests/Testx86AssemblyInspectionEngine.TestPushRBP (1004 of 1979)
PASS: lldb-shell :: ObjectFile/ELF/section-types-edgecases.yaml (1005 of 1979)
UNSUPPORTED: lldb-api :: functionalities/asan/TestReportData.py (1006 of 1979)
PASS: lldb-unit :: UnwindAssembly/x86/./UnwindAssemblyx86Tests/Testx86AssemblyInspectionEngine.TestPopRBP (1007 of 1979)
PASS: lldb-unit :: Process/minidump/./LLDBMinidumpTests/MinidumpParserTest.FindMemoryRange (1008 of 1979)
PASS: lldb-unit :: Utility/./UtilityTests/StringExtractorTest.InitMisc (1009 of 1979)
PASS: lldb-unit :: Language/CPlusPlus/./LanguageCPlusPlusTests/CPlusPlusLanguage.FindAlternateFunctionManglings (1010 of 1979)
PASS: lldb-api :: lang/cpp/dynamic-value/TestDynamicValue.py (1011 of 1979)
UNSUPPORTED: lldb-api :: commands/watchpoints/variable_out_of_scope/TestWatchedVarHitWhenInScope.py (1012 of 1979)
UNSUPPORTED: lldb-api :: lang/objc/foundation/TestFoundationDisassembly.py (1013 of 1979)
PASS: lldb-api :: commands/watchpoints/watchpoint_commands/command/TestWatchpointCommandPython.py (1014 of 1979)
PASS: lldb-api :: commands/expression/char/TestExprsChar.py (1015 of 1979)
UNSUPPORTED: lldb-shell :: ScriptInterpreter/Lua/bindings.test (1016 of 1979)
PASS: lldb-unit :: Host/./HostTests/SocketTest.UDPConnect (1017 of 1979)
PASS: lldb-api :: tools/lldb-server/commandline/TestStubSetSID.py (1018 of 1979)
PASS: lldb-shell :: SymbolFile/DWARF/array-sizes.s (1019 of 1979)
PASS: lldb-unit :: ScriptInterpreter/Python/./ScriptInterpreterPythonTests/PythonDataObjectsTest.TestResetting (1020 of 1979)
PASS: lldb-unit :: Core/./LLDBCoreTests/RichManglingContextTest.IPDRealloc (1021 of 1979)
PASS: lldb-unit :: ObjectFile/Breakpad/./ObjectFileBreakpadTests/LineRecord.parse (1022 of 1979)
PASS: lldb-api :: commands/watchpoints/watchpoint_size/TestWatchpointSizes.py (1023 of 1979)
PASS: lldb-shell :: Minidump/no-process-id.yaml (1024 of 1979)
PASS: lldb-api :: source-manager/TestSourceManager.py (1025 of 1979)
PASS: lldb-api :: tools/lldb-server/TestGdbRemoteRegisterState.py (1026 of 1979)
PASS: lldb-api :: types/TestFloatTypes.py (1027 of 1979)
PASS: lldb-unit :: Utility/./UtilityTests/Predicate.WaitForValueNotEqualTo (1028 of 1979)
PASS: lldb-unit :: Utility/./UtilityTests/RangeTest.SizeTypes (1029 of 1979)
PASS: lldb-api :: functionalities/gdb_remote_client/TestGDBRemoteLoad.py (1030 of 1979)
PASS: lldb-api :: functionalities/tail_call_frames/cross_dso/TestCrossDSOTailCalls.py (1031 of 1979)
PASS: lldb-unit :: Utility/./UtilityTests/BinaryStreamTest.PutSLEB128ThreeBytes (1032 of 1979)
PASS: lldb-api :: commands/frame/diagnose/dereference-this/TestDiagnoseDereferenceThis.py (1033 of 1979)
PASS: lldb-api :: python_api/module_section/TestModuleAndSection.py (1034 of 1979)
PASS: lldb-unit :: Utility/./UtilityTests/BinaryStreamTest.PutULEB128FourBytes (1035 of 1979)
PASS: lldb-api :: macosx/find-dsym/bundle-with-dot-in-filename/TestBundleWithDotInFilename.py (1036 of 1979)
PASS: lldb-shell :: BuildScript/modes.test (1037 of 1979)
PASS: lldb-api :: commands/expression/calculator_mode/TestCalculatorMode.py (1038 of 1979)
PASS: lldb-unit :: Utility/./UtilityTests/RangeTest.SlideZero (1039 of 1979)
PASS: lldb-shell :: ObjectFile/ELF/PT_LOAD-overlap-PT_TLS.yaml (1040 of 1979)
PASS: lldb-api :: functionalities/breakpoint/breakpoint_set_restart/TestBreakpointSetRestart.py (1041 of 1979)
PASS: lldb-shell :: SymbolFile/DWARF/dir-separator-windows.s (1042 of 1979)
UNSUPPORTED: lldb-api :: lang/cpp/function-template-parameter-pack/TestFunctionTemplateParameterPack.py (1043 of 1979)
PASS: lldb-unit :: Host/./HostTests/ConnectionFileDescriptorTest.TCPGetURIv4 (1044 of 1979)
PASS: lldb-unit :: Utility/./UtilityTests/StringExtractorTest.GetU32BigEndian (1045 of 1979)
PASS: lldb-shell :: SymbolFile/DWARF/find-method-local-struct.cpp (1046 of 1979)
UNSUPPORTED: lldb-shell :: SymbolFile/PDB/variables-locations.test (1047 of 1979)
PASS: lldb-shell :: Minidump/disassemble-no-module.yaml (1048 of 1979)
PASS: lldb-unit :: SymbolFile/DWARF/./SymbolFileDWARFTests/SymbolFileDWARFTests.TestAbbrevInvalidNULLTag (1049 of 1979)
PASS: lldb-api :: lang/cpp/exceptions/TestCPPExceptionBreakpoints.py (1050 of 1979)
PASS: lldb-unit :: ScriptInterpreter/Python/./ScriptInterpreterPythonTests/PythonDataObjectsTest.TestPythonTupleInitializerList (1051 of 1979)
PASS: lldb-api :: lang/c/array_types/TestArrayTypes.py (1052 of 1979)
PASS: lldb-api :: lang/cpp/operators/TestCppOperators.py (1053 of 1979)
PASS: lldb-api :: functionalities/data-formatter/compactvectors/TestCompactVectors.py (1054 of 1979)
PASS: lldb-unit :: Utility/./UtilityTests/GeneratorTest.GetOrCreate (1055 of 1979)
PASS: lldb-api :: functionalities/thread/concurrent_events/TestConcurrentTwoBreakpointsOneWatchpoint.py (1056 of 1979)
PASS: lldb-api :: tools/lldb-vscode/attach/TestVSCode_attach.py (1057 of 1979)
PASS: lldb-unit :: ObjectFile/Breakpad/./ObjectFileBreakpadTests/ModuleRecord.parse (1058 of 1979)
PASS: lldb-api :: functionalities/step-avoids-no-debug/TestStepNoDebug.py (1059 of 1979)
PASS: lldb-unit :: Utility/./UtilityTests/LogChannelTest.EnableOptions (1060 of 1979)
PASS: lldb-shell :: SymbolFile/DWARF/find-function-regex.cpp (1061 of 1979)
PASS: lldb-unit :: Symbol/./SymbolTests/TestClangASTImporter.DeportDeclTagDecl (1062 of 1979)
PASS: lldb-unit :: Utility/./UtilityTests/CompletionRequest.ShiftArguments (1063 of 1979)
PASS: lldb-api :: lang/objc/foundation/TestObjCMethodsString.py (1064 of 1979)
PASS: lldb-unit :: Utility/./UtilityTests/Flags.IsClear (1065 of 1979)
PASS: lldb-unit :: Utility/./UtilityTests/StringListTest.CopyList (1066 of 1979)
PASS: lldb-api :: functionalities/data-formatter/boolreference/TestFormattersBoolRefPtr.py (1067 of 1979)
PASS: lldb-unit :: Utility/./UtilityTests/ProcessInstanceInfo.Yaml (1068 of 1979)
PASS: lldb-unit :: ObjectFile/PECOFF/./ObjectFilePECOFFTests/PECallFrameInfoTest.Chained_eh (1069 of 1979)
PASS: lldb-api :: functionalities/gdb_remote_client/TestRecognizeBreakpoint.py (1070 of 1979)
PASS: lldb-api :: lang/objc/rdar-11355592/TestRdar11355592.py (1071 of 1979)
PASS: lldb-api :: python_api/watchpoint/TestWatchpointIter.py (1072 of 1979)
PASS: lldb-api :: api/multithreaded/TestMultithreaded.py (1073 of 1979)
PASS: lldb-api :: lang/objc/rdar-10967107/TestRdar10967107.py (1074 of 1979)
PASS: lldb-unit :: Target/./TargetTests/ModuleCacheTest.GetAndPutStrangeHostname (1075 of 1979)
PASS: lldb-shell :: ObjectFile/ELF/compressed-sections.yaml (1076 of 1979)
PASS: lldb-unit :: SymbolFile/NativePDB/./SymbolFileNativePDBTests/PDBFPOProgramToDWARFExpressionTests.InvalidAssignmentSingle (1077 of 1979)
UNSUPPORTED: lldb-api :: tools/lldb-server/thread-name/TestGdbRemoteThreadName.py (1078 of 1979)
PASS: lldb-unit :: Utility/./UtilityTests/StreamTeeTest.Write (1079 of 1979)
PASS: lldb-unit :: Utility/./UtilityTests/VMRange.Comparison (1080 of 1979)
PASS: lldb-api :: commands/expression/persistent_ptr_update/TestPersistentPtrUpdate.py (1081 of 1979)
PASS: lldb-unit :: SymbolFile/DWARF/./SymbolFileDWARFTests/SymbolFileDWARFTests.TestAbbrevNullAttrValidForm (1082 of 1979)
PASS: lldb-shell :: Heap/heap-cstr.test (1083 of 1979)
PASS: lldb-api :: commands/expression/persistent_variables/TestPersistentVariables.py (1084 of 1979)
PASS: lldb-api :: functionalities/thread/concurrent_events/TestConcurrentTwoWatchpointsOneBreakpoint.py (1085 of 1979)
PASS: lldb-unit :: Utility/./UtilityTests/FileSpecTest.IsRelative (1086 of 1979)
PASS: lldb-unit :: Utility/./UtilityTests/DataExtractorTest.GetCStrAtEnd (1087 of 1979)
PASS: lldb-unit :: Utility/./UtilityTests/Flags.GetBitSize (1088 of 1979)
PASS: lldb-unit :: Symbol/./SymbolTests/SymbolsTest.LocateExecutableSymbolFileForUnknownExecutableAndMissingSymbolFile (1089 of 1979)
PASS: lldb-shell :: SymbolFile/DWARF/debug-types-dwarf5.s (1090 of 1979)
PASS: lldb-shell :: ObjectFile/ELF/short-build-id.yaml (1091 of 1979)
PASS: lldb-api :: python_api/sbstructureddata/TestStructuredDataAPI.py (1092 of 1979)
PASS: lldb-unit :: Utility/./UtilityTests/RangeDataVector.FindEntryIndexesThatContain (1093 of 1979)
PASS: lldb-api :: tools/lldb-vscode/breakpoint-events/TestVSCode_breakpointEvents.py (1094 of 1979)
PASS: lldb-api :: functionalities/data-formatter/nssetsynth/TestNSSetSynthetic.py (1095 of 1979)
PASS: lldb-unit :: Utility/./UtilityTests/TimeoutTest.Construction (1096 of 1979)
PASS: lldb-unit :: Process/gdb-remote/./ProcessGdbRemoteTests/GDBRemoteCommunicationClientTest.GetQOffsets (1097 of 1979)
PASS: lldb-unit :: Utility/./UtilityTests/StringListTest.ShiftMove (1098 of 1979)
PASS: lldb-api :: functionalities/data-formatter/poarray/TestPrintObjectArray.py (1099 of 1979)
PASS: lldb-api :: functionalities/thread/concurrent_events/TestConcurrentSignalBreak.py (1100 of 1979)
PASS: lldb-api :: functionalities/multiword-commands/TestMultiWordCommands.py (1101 of 1979)
PASS: lldb-unit :: Host/./HostTests/FileSystemTest.EnumerateDirectory (1102 of 1979)
PASS: lldb-api :: functionalities/thread/concurrent_events/TestConcurrentCrashWithBreak.py (1103 of 1979)
PASS: lldb-api :: functionalities/breakpoint/breakpoint_command/TestBreakpointCommand.py (1104 of 1979)
PASS: lldb-api :: python_api/type/TestTypeList.py (1105 of 1979)
PASS: lldb-api :: functionalities/signal/handle-abrt/TestHandleAbort.py (1106 of 1979)
PASS: lldb-unit :: Utility/./UtilityTests/UriParserTest.BadPort2 (1107 of 1979)
PASS: lldb-api :: tools/lldb-vscode/step/TestVSCode_step.py (1108 of 1979)
PASS: lldb-api :: driver/batch_mode/TestBatchMode.py (1109 of 1979)
PASS: lldb-shell :: Register/x86-64-read.test (1110 of 1979)
PASS: lldb-api :: commands/expression/import-std-module/vector-bool/TestVectorBoolFromStdModule.py (1111 of 1979)
PASS: lldb-api :: python_api/breakpoint/TestBreakpointAPI.py (1112 of 1979)
PASS: lldb-unit :: Host/./HostTests/NativeProcessProtocolTest.SetBreakpoint (1113 of 1979)
PASS: lldb-shell :: SymbolFile/DWARF/dwarf5-partial-index.cpp (1114 of 1979)
UNSUPPORTED: lldb-api :: functionalities/signal/handle-segv/TestHandleSegv.py (1115 of 1979)
PASS: lldb-unit :: Utility/./UtilityTests/Flags.Test (1116 of 1979)
PASS: lldb-api :: commands/expression/namespace_local_var_same_name_cpp_and_c/TestNamespaceLocalVarSameNameCppAndC.py (1117 of 1979)
PASS: lldb-api :: functionalities/data-formatter/data-formatter-stl/libcxx/iterator/TestDataFormatterLibccIterator.py (1118 of 1979)
PASS: lldb-unit :: Utility/./UtilityTests/StreamTest.PutCharNull (1119 of 1979)
PASS: lldb-unit :: Symbol/./SymbolTests/TestClangASTImporter.MetadataPropagation (1120 of 1979)
UNSUPPORTED: lldb-api :: lang/c/typedef/Testtypedef.py (1121 of 1979)
PASS: lldb-api :: lang/objc/objc-struct-return/TestObjCStructReturn.py (1122 of 1979)
PASS: lldb-unit :: Utility/./UtilityTests/AnsiTerminal.Empty (1123 of 1979)
PASS: lldb-unit :: Utility/./UtilityTests/StringExtractorTest.GetHexBytes_Underflow (1124 of 1979)
PASS: lldb-api :: api/check_public_api_headers/TestPublicAPIHeaders.py (1125 of 1979)
PASS: lldb-shell :: SymbolFile/DWARF/debug_loc_and_loclists.s (1126 of 1979)
PASS: lldb-unit :: Target/./TargetTests/StackFrameRecognizerTest.NullModuleRegex (1127 of 1979)
PASS: lldb-unit :: UnwindAssembly/x86/./UnwindAssemblyx86Tests/Testx86AssemblyInspectionEngine.TestSpArithx86_64Augmented (1128 of 1979)
PASS: lldb-unit :: Utility/./UtilityTests/VMRange.Ordering (1129 of 1979)
PASS: lldb-api :: functionalities/data-formatter/data-formatter-synthtype/TestDataFormatterSynthType.py (1130 of 1979)
XFAIL: lldb-shell :: SymbolFile/DWARF/find-type-in-function.cpp (1131 of 1979)
UNSUPPORTED: lldb-shell :: SymbolFile/PDB/pointers.test (1132 of 1979)
PASS: lldb-api :: functionalities/data-formatter/data-formatter-synthval/TestDataFormatterSynthVal.py (1133 of 1979)
PASS: lldb-unit :: Process/minidump/./LLDBMinidumpTests/RegisterContextMinidump.ConvertMinidumpContext_x86_64 (1134 of 1979)
PASS: lldb-shell :: Breakpoint/debug_rnglist_basic.test (1135 of 1979)
PASS: lldb-api :: functionalities/show_location/TestShowLocationDwarf5.py (1136 of 1979)
PASS: lldb-api :: functionalities/abbreviation/TestCommonShortSpellings.py (1137 of 1979)
PASS: lldb-api :: functionalities/thread/backtrace_all/TestBacktraceAll.py (1138 of 1979)
PASS: lldb-shell :: ObjectFile/Breakpad/breakpad-identification.test (1139 of 1979)
PASS: lldb-api :: commands/frame/diagnose/complicated-expression/TestComplicatedExpression.py (1140 of 1979)
PASS: lldb-api :: commands/process/launch-with-shellexpand/TestLaunchWithShellExpand.py (1141 of 1979)
PASS: lldb-unit :: Utility/./UtilityTests/ProcessInstanceInfoList.Yaml (1142 of 1979)
PASS: lldb-shell :: ExecControl/StopHook/stop-hook.test (1143 of 1979)
PASS: lldb-unit :: Utility/./UtilityTests/BinaryStreamTest.PutSLEB128EightBytes (1144 of 1979)
PASS: lldb-api :: lang/c/step_over_no_deadlock/TestStepOverDoesntBlock.py (1145 of 1979)
PASS: lldb-unit :: Utility/./UtilityTests/StreamTest.PutHex16ByteOrderBig (1146 of 1979)
PASS: lldb-shell :: ObjectFile/ELF/PT_LOAD.yaml (1147 of 1979)
PASS: lldb-shell :: SymbolFile/DWARF/inline-function-address.ll (1148 of 1979)
PASS: lldb-api :: commands/expression/options/TestExprOptions.py (1149 of 1979)
PASS: lldb-unit :: Utility/./UtilityTests/FileSpecTest.FormatFileSpec (1150 of 1979)
UNSUPPORTED: lldb-api :: functionalities/darwin_log/filter/regex/activity-chain/TestDarwinLogFilterRegexActivityChain.py (1151 of 1979)
PASS: lldb-unit :: ScriptInterpreter/Python/./ScriptInterpreterPythonTests/PythonDataObjectsTest.TestPythonTupleToStructuredList (1152 of 1979)
PASS: lldb-api :: functionalities/data-formatter/data-formatter-stl/libcxx/optional/TestDataFormatterLibcxxOptional.py (1153 of 1979)
PASS: lldb-unit :: Utility/./UtilityTests/Flags.AllClear (1154 of 1979)
PASS: lldb-shell :: ObjectFile/ELF/netbsd-core-amd64.test (1155 of 1979)
PASS: lldb-unit :: UnwindAssembly/x86/./UnwindAssemblyx86Tests/Testx86AssemblyInspectionEngine.TestPopR15 (1156 of 1979)
UNSUPPORTED: lldb-api :: functionalities/breakpoint/breakpoint_callback_command_source/TestBreakpointCallbackCommandSource.py (1157 of 1979)
PASS: lldb-api :: lang/cpp/template-function/TestTemplateFunctions.py (1158 of 1979)
PASS: lldb-api :: commands/watchpoints/watchpoint_set_command/TestWatchLocationWithWatchSet.py (1159 of 1979)
PASS: lldb-unit :: Process/gdb-remote/./ProcessGdbRemoteTests/GDBRemoteClientBaseTest.SendContinueAndWait (1160 of 1979)
PASS: lldb-shell :: SymbolFile/Breakpad/line-table-mixed-path-styles.test (1161 of 1979)
PASS: lldb-api :: types/TestCharTypeExpr.py (1162 of 1979)
UNSUPPORTED: lldb-api :: tools/lldb-server/TestGdbRemoteAuxvSupport.py (1163 of 1979)
PASS: lldb-unit :: Utility/./UtilityTests/LogChannelTest.Enable (1164 of 1979)
PASS: lldb-unit :: Language/Highlighting/./HighlighterTests/HighlighterTest.ClangOperators (1165 of 1979)
PASS: lldb-api :: macosx/function-starts/TestFunctionStarts.py (1166 of 1979)
PASS: lldb-unit :: Utility/./UtilityTests/StringExtractorTest.InitEmpty (1167 of 1979)
PASS: lldb-unit :: Utility/./UtilityTests/StringExtractorTest.GetU64LittleEndian (1168 of 1979)
PASS: lldb-shell :: Driver/TestRepl.test (1169 of 1979)
PASS: lldb-api :: functionalities/data-formatter/data-formatter-stl/libcxx/tuple/TestDataFormatterLibcxxTuple.py (1170 of 1979)
PASS: lldb-unit :: Utility/./UtilityTests/ArgsTest.TestSingleQuotedArgWithSpace (1171 of 1979)
PASS: lldb-api :: functionalities/non-overlapping-index-variable-i/TestIndexVariable.py (1172 of 1979)
PASS: lldb-api :: python_api/interpreter/TestCommandInterpreterAPI.py (1173 of 1979)
PASS: lldb-api :: functionalities/var_path/TestVarPath.py (1174 of 1979)
PASS: lldb-api :: tools/lldb-vscode/variables/TestVSCode_variables.py (1175 of 1979)
PASS: lldb-unit :: Signals/./SignalsTests/UnixSignalsTest.GetInfo (1176 of 1979)
PASS: lldb-unit :: Utility/./UtilityTests/StateTest.Formatv (1177 of 1979)
PASS: lldb-unit :: SymbolFile/NativePDB/./SymbolFileNativePDBTests/PDBFPOProgramToDWARFExpressionTests.MultipleIndependentAssignments (1178 of 1979)
PASS: lldb-unit :: Expression/./ExpressionTests/CppModuleConfigurationTest.Sysroot (1179 of 1979)
PASS: lldb-unit :: Utility/./UtilityTests/ArgsTest.AppendArguments (1180 of 1979)
UNSUPPORTED: lldb-shell :: Watchpoint/netbsd-nouserdbregs.test (1181 of 1979)
XFAIL: lldb-shell :: Register/x86-64-ymm-write.test (1182 of 1979)
PASS: lldb-api :: python_api/process/io/TestProcessIO.py (1183 of 1979)
PASS: lldb-unit :: ObjectFile/ELF/./ObjectFileELFTests/ObjectFileELFTest.GetSymtab_NoSymEntryPointArmThumbAddressClass (1184 of 1979)
PASS: lldb-unit :: Utility/./UtilityTests/StringListTest.DefaultConstructor (1185 of 1979)
PASS: lldb-unit :: Host/./HostTests/SocketAddressTest.Set (1186 of 1979)
PASS: lldb-unit :: Utility/./UtilityTests/StringListTest.GetMaxStringLengthEmpty (1187 of 1979)
UNSUPPORTED: lldb-api :: benchmarks/startup/TestStartupDelays.py (1188 of 1979)
PASS: lldb-api :: functionalities/data-formatter/ostypeformatting/TestFormattersOsType.py (1189 of 1979)
PASS: lldb-api :: tools/lldb-server/TestGdbRemoteExitCode.py (1190 of 1979)
PASS: lldb-api :: lang/objc/objc-stepping/TestObjCStepping.py (1191 of 1979)
UNSUPPORTED: lldb-shell :: Unwind/eh-frame-small-fde.test (1192 of 1979)
PASS: lldb-unit :: Language/Highlighting/./HighlighterTests/HighlighterTest.ClangCursorOutOfBounds (1193 of 1979)
PASS: lldb-api :: lang/mixed/TestMixedLanguages.py (1194 of 1979)
UNSUPPORTED: lldb-api :: functionalities/darwin_log/filter/regex/activity/TestDarwinLogFilterRegexActivity.py (1195 of 1979)
PASS: lldb-api :: commands/frame/recognizer/TestFrameRecognizer.py (1196 of 1979)
PASS: lldb-unit :: ScriptInterpreter/Python/./ScriptInterpreterPythonTests/PythonDataObjectsTest.TestPythonStringToStr (1197 of 1979)
PASS: lldb-api :: lang/cpp/enum_types/TestCPP11EnumTypes.py (1198 of 1979)
PASS: lldb-shell :: SymbolFile/NativePDB/tag-types.cpp (1199 of 1979)
PASS: lldb-api :: functionalities/thread/concurrent_events/TestConcurrentCrashWithSignal.py (1200 of 1979)
PASS: lldb-unit :: Utility/./UtilityTests/SubsystemRAIITest.NormalSubsystem (1201 of 1979)
PASS: lldb-unit :: Core/./LLDBCoreTests/MangledTest.NameIndexes_FindFunctionSymbols (1202 of 1979)
PASS: lldb-unit :: Utility/./UtilityTests/TimerTest.CategoryTimesNested (1203 of 1979)
PASS: lldb-unit :: SymbolFile/NativePDB/./SymbolFileNativePDBTests/PDBFPOProgramToDWARFExpressionTests.UnresolvedDependentCyclicRegisterAssignmentReference (1204 of 1979)
PASS: lldb-unit :: Utility/./UtilityTests/UserIDResolver.GetUserName (1205 of 1979)
PASS: lldb-unit :: Symbol/./SymbolTests/SymbolsTest.TerminateLocateExecutableSymbolFileForUnknownExecutableAndUnknownSymbolFile (1206 of 1979)
PASS: lldb-shell :: ObjectFile/ELF/PT_LOAD-overlap-section.yaml (1207 of 1979)
PASS: lldb-unit :: Utility/./UtilityTests/RangeTest.Equal (1208 of 1979)
PASS: lldb-shell :: Commands/command-thread-select.test (1209 of 1979)
PASS: lldb-unit :: Utility/./UtilityTests/StreamTest.Indent (1210 of 1979)
PASS: lldb-api :: functionalities/breakpoint/breakpoint_ids/TestBreakpointIDs.py (1211 of 1979)
PASS: lldb-unit :: Utility/./UtilityTests/StreamTeeTest.Constructor1Stream (1212 of 1979)
PASS: lldb-shell :: SymbolFile/DWARF/find-inline-method.s (1213 of 1979)
PASS: lldb-api :: lang/cpp/multiple-inheritance/TestCppMultipleInheritance.py (1214 of 1979)
PASS: lldb-unit :: SymbolFile/NativePDB/./SymbolFileNativePDBTests/PDBFPOProgramToDWARFExpressionTests.InvalidAssignmentMultiple (1215 of 1979)
PASS: lldb-unit :: tools/lldb-server/tests/./LLDBServerTests/StandardStartupTest.TestStopReplyContainsThreadPcs (1216 of 1979)
PASS: lldb-unit :: Utility/./UtilityTests/StreamTeeTest.Constructor2Streams (1217 of 1979)
PASS: lldb-unit :: Utility/./UtilityTests/RegularExpression.Valid (1218 of 1979)
PASS: lldb-api :: functionalities/postmortem/wow64_minidump/TestWow64MiniDump.py (1219 of 1979)
PASS: lldb-api :: macosx/order/TestOrderFile.py (1220 of 1979)
UNSUPPORTED: lldb-api :: functionalities/data-formatter/data-formatter-stl/libstdcpp/vector/TestDataFormatterStdVector.py (1221 of 1979)
PASS: lldb-unit :: Utility/./UtilityTests/DataExtractorTest.GetCStrUnterminated (1222 of 1979)
PASS: lldb-unit :: Expression/./ExpressionTests/DiagnosticManagerTest.PutString (1223 of 1979)
PASS: lldb-unit :: Utility/./UtilityTests/ScalarTest.CastOperations (1224 of 1979)
PASS: lldb-unit :: Utility/./UtilityTests/StreamTest.ShiftOperatorPtr (1225 of 1979)
PASS: lldb-api :: lang/cpp/template/TestTemplateArgs.py (1226 of 1979)
PASS: lldb-api :: lang/objc/modules-non-objc-target/TestObjCModulesNonObjCTarget.py (1227 of 1979)
PASS: lldb-api :: functionalities/data-formatter/data-formatter-python-synth/TestDataFormatterPythonSynth.py (1228 of 1979)
PASS: lldb-api :: macosx/version_zero/TestGetVersionZeroVersion.py (1229 of 1979)
PASS: lldb-api :: functionalities/data-formatter/vector-types/TestVectorTypesFormatting.py (1230 of 1979)
PASS: lldb-unit :: Utility/./UtilityTests/RangeTest.DoesAdjoinOrIntersect (1231 of 1979)
PASS: lldb-unit :: Utility/./UtilityTests/BinaryStreamTest.PutULEB128FiveBytes (1232 of 1979)
PASS: lldb-unit :: Utility/./UtilityTests/StringExtractorTest.GetHexBytes_Partial (1233 of 1979)
PASS: lldb-api :: commands/expression/cast_int_to_anonymous_enum/TestCastIntToAnonymousEnum.py (1234 of 1979)
PASS: lldb-api :: functionalities/wrong_commands/TestWrongCommands.py (1235 of 1979)
PASS: lldb-unit :: Utility/./UtilityTests/LogChannelTest.List (1236 of 1979)
PASS: lldb-api :: commands/version/TestVersion.py (1237 of 1979)
PASS: lldb-unit :: Utility/./UtilityTests/ScalarTest.APIntConstructor (1238 of 1979)
PASS: lldb-api :: lang/c/stepping/TestStepAndBreakpoints.py (1239 of 1979)
PASS: lldb-unit :: Utility/./UtilityTests/BinaryStreamTest.PutSLEB128FourBytes (1240 of 1979)
PASS: lldb-unit :: Utility/./UtilityTests/StringListTest.AppendListCStringArray (1241 of 1979)
PASS: lldb-unit :: Utility/./UtilityTests/SharedCluster.ClusterManager (1242 of 1979)
PASS: lldb-api :: functionalities/breakpoint/breakpoint_locations/TestBreakpointLocations.py (1243 of 1979)
PASS: lldb-unit :: ObjectFile/PECOFF/./ObjectFilePECOFFTests/PECallFrameInfoTest.Frame_reg_eh (1244 of 1979)
PASS: lldb-unit :: Symbol/./SymbolTests/LineEntryTest.GetSameLineContiguousAddressRangeOneInline (1245 of 1979)
PASS: lldb-unit :: Utility/./UtilityTests/ConstStringTest.format_provider (1246 of 1979)
PASS: lldb-unit :: Utility/./UtilityTests/NameMatchesTest.EndsWith (1247 of 1979)
PASS: lldb-shell :: Quit/TestQuitExitCodeNonInt.test (1248 of 1979)
PASS: lldb-unit :: Process/gdb-remote/./ProcessGdbRemoteTests/GDBRemoteCommunicationClientTest.SendGetMetaDataPacket (1249 of 1979)
PASS: lldb-unit :: Utility/./UtilityTests/StringListTest.SplitIntoLinesEmpty (1250 of 1979)
PASS: lldb-api :: commands/apropos/with-process/TestAproposWithProcess.py (1251 of 1979)
PASS: lldb-unit :: UnwindAssembly/x86/./UnwindAssemblyx86Tests/Testx86AssemblyInspectionEngine.TestPushESI (1252 of 1979)
PASS: lldb-api :: types/TestLongTypesExpr.py (1253 of 1979)
PASS: lldb-api :: python_api/function_symbol/TestSymbolAPI.py (1254 of 1979)
UNSUPPORTED: lldb-shell :: ScriptInterpreter/Lua/breakpoint_callback.test (1255 of 1979)
PASS: lldb-unit :: Utility/./UtilityTests/OptionsWithRawTest.EmptyInput (1256 of 1979)
PASS: lldb-unit :: Utility/./UtilityTests/RangeTest.Union (1257 of 1979)
PASS: lldb-api :: python_api/lldbutil/iter/TestRegistersIterator.py (1258 of 1979)
PASS: lldb-api :: functionalities/breakpoint/comp_dir_symlink/TestCompDirSymLink.py (1259 of 1979)
PASS: lldb-unit :: Utility/./UtilityTests/StringExtractorTest.GetNameColonValueNoColon (1260 of 1979)
PASS: lldb-unit :: Utility/./UtilityTests/ProcessInstanceInfoMatch.Name (1261 of 1979)
UNSUPPORTED: lldb-api :: tools/lldb-server/libraries-svr4/TestGdbRemoteLibrariesSvr4Support.py (1262 of 1979)
PASS: lldb-api :: commands/breakpoint/command/list/TestBreakpointCommandList.py (1263 of 1979)
PASS: lldb-api :: lang/cpp/namespace_conflicts/TestNamespaceConflicts.py (1264 of 1979)
PASS: lldb-api :: functionalities/data-formatter/type_summary_list_script/TestTypeSummaryListScript.py (1265 of 1979)
PASS: lldb-api :: macosx/safe-to-func-call/TestSafeFuncCalls.py (1266 of 1979)
PASS: lldb-shell :: ObjectFile/Breakpad/sections-trailing-func.test (1267 of 1979)
PASS: lldb-unit :: Utility/./UtilityTests/StreamTeeTest.GetStreamAtIndexOutOfBoundsEmpty (1268 of 1979)
PASS: lldb-unit :: Utility/./UtilityTests/StreamTest.AddressRangeSize (1269 of 1979)
PASS: lldb-unit :: Utility/./UtilityTests/StreamTest.PutHex64ByteOrderLittle (1270 of 1979)
PASS: lldb-api :: lang/cpp/gmodules/TestWithModuleDebugging.py (1271 of 1979)
PASS: lldb-unit :: Process/gdb-remote/./ProcessGdbRemoteTests/GDBRemoteCommunicationClientTest.SendGetDataPacket (1272 of 1979)
PASS: lldb-shell :: Reproducer/Functionalities/TestStepping.test (1273 of 1979)
PASS: lldb-api :: commands/frame/select/TestFrameSelect.py (1274 of 1979)
UNSUPPORTED: lldb-shell :: ObjectFile/ELF/minidebuginfo-no-lzma.yaml (1275 of 1979)
PASS: lldb-unit :: Utility/./UtilityTests/OptionsWithRawTest.EmptyArgsOnlySuffix (1276 of 1979)
PASS: lldb-api :: commands/expression/import_builtin_fileid/TestImportBuiltinFileID.py (1277 of 1979)
UNSUPPORTED: lldb-shell :: Register/x86-64-ymm16-write.test (1278 of 1979)
PASS: lldb-api :: functionalities/load_using_paths/TestLoadUsingPaths.py (1279 of 1979)
PASS: lldb-api :: commands/expression/formatters/TestFormatters.py (1280 of 1979)
PASS: lldb-api :: functionalities/breakpoint/cpp/TestCPPBreakpointLocations.py (1281 of 1979)
PASS: lldb-api :: lang/objc/objc-property/TestObjCProperty.py (1282 of 1979)
UNSUPPORTED: lldb-shell :: SymbolFile/Breakpad/stack-cfi-arm.yaml (1283 of 1979)
PASS: lldb-unit :: Utility/./UtilityTests/SerializationRountripTest.SerializeDeserializeObjectReference (1284 of 1979)
PASS: lldb-api :: types/TestDoubleTypesExpr.py (1285 of 1979)
PASS: lldb-unit :: Process/gdb-remote/./ProcessGdbRemoteTests/GDBRemoteClientBaseTest.InterruptNoResponse (1286 of 1979)
PASS: lldb-unit :: UnwindAssembly/x86/./UnwindAssemblyx86Tests/Testx86AssemblyInspectionEngine.TestPopR12 (1287 of 1979)
PASS: lldb-unit :: Utility/./UtilityTests/BinaryStreamTest.PutSLEB128Zero (1288 of 1979)
PASS: lldb-api :: functionalities/data-formatter/refpointer-recursion/TestDataFormatterRefPtrRecursion.py (1289 of 1979)
PASS: lldb-api :: commands/frame/diagnose/dereference-argument/TestDiagnoseDereferenceArgument.py (1290 of 1979)
PASS: lldb-api :: functionalities/tail_call_frames/cross_object/TestCrossObjectTailCalls.py (1291 of 1979)
PASS: lldb-api :: python_api/value/empty_class/TestValueAPIEmptyClass.py (1292 of 1979)
PASS: lldb-shell :: Settings/TestStopCommandSourceOnError.test (1293 of 1979)
PASS: lldb-api :: functionalities/breakpoint/source_regexp/TestSourceRegexBreakpoints.py (1294 of 1979)
PASS: lldb-api :: functionalities/data-formatter/user-format-vs-summary/TestUserFormatVsSummary.py (1295 of 1979)
PASS: lldb-unit :: UnwindAssembly/x86/./UnwindAssemblyx86Tests/Testx86AssemblyInspectionEngine.Test32BitOnlyInstruction (1296 of 1979)
PASS: lldb-unit :: Utility/./UtilityTests/StringExtractorTest.GetHexBytesAvail_Underflow (1297 of 1979)
PASS: lldb-unit :: Host/./HostTests/SocketTest.TCPGetConnectURI (1298 of 1979)
PASS: lldb-unit :: Utility/./UtilityTests/ArchSpecTest.TripleComponentsWereSpecified (1299 of 1979)
PASS: lldb-api :: functionalities/data-formatter/frameformat_smallstruct/TestFrameFormatSmallStruct.py (1300 of 1979)
PASS: lldb-unit :: Utility/./UtilityTests/RangeTest.LessThanInvalid (1301 of 1979)
PASS: lldb-unit :: Target/./TargetTests/MemoryRegionInfoTest.Formatv (1302 of 1979)
PASS: lldb-api :: macosx/add-dsym/TestAddDsymMidExecutionCommand.py (1303 of 1979)
PASS: lldb-unit :: Utility/./UtilityTests/RangeTest.Clear (1304 of 1979)
PASS: lldb-unit :: Symbol/./SymbolTests/TestTypeSystemClang.TestConvertAccessTypeToAccessSpecifier (1305 of 1979)
PASS: lldb-unit :: ScriptInterpreter/Python/./ScriptInterpreterPythonTests/PythonDataObjectsTest.TestExtractingUInt64ThroughStructuredData (1306 of 1979)
PASS: lldb-api :: functionalities/lazy-loading/TestLazyLoading.py (1307 of 1979)
PASS: lldb-api :: commands/expression/ignore-artificial-constructors/TestIgnoreArtificialConstructors.py (1308 of 1979)
PASS: lldb-unit :: Utility/./UtilityTests/BinaryStreamTest.PutULEB128OneByte (1309 of 1979)
PASS: lldb-api :: commands/disassemble/basic/TestDisassembleBreakpoint.py (1310 of 1979)
UNSUPPORTED: lldb-shell :: SymbolFile/NativePDB/typedefs.cpp (1311 of 1979)
PASS: lldb-shell :: SymbolFile/DWARF/debug_aranges-empty-section.s (1312 of 1979)
PASS: lldb-api :: functionalities/dynamic_value_child_count/TestDynamicValueChildCount.py (1313 of 1979)
PASS: lldb-unit :: Utility/./UtilityTests/StringExtractorTest.GetHexU8_Underflow2 (1314 of 1979)
PASS: lldb-unit :: Utility/./UtilityTests/StreamTest.PutNHex8 (1315 of 1979)
PASS: lldb-api :: lang/objc/objc_direct-methods/TestObjCDirectMethods.py (1316 of 1979)
PASS: lldb-shell :: Settings/TestDisassemblyFormat.test (1317 of 1979)
PASS: lldb-shell :: Driver/TestCommands.test (1318 of 1979)
PASS: lldb-unit :: Host/./HostTests/SocketTest.UDPGetConnectURI (1319 of 1979)
PASS: lldb-api :: functionalities/deleted-executable/TestDeletedExecutable.py (1320 of 1979)
PASS: lldb-api :: functionalities/tail_call_frames/ambiguous_tail_call_seq1/TestAmbiguousTailCallSeq1.py (1321 of 1979)
PASS: lldb-api :: lang/cpp/auto/TestCPPAuto.py (1322 of 1979)
PASS: lldb-unit :: UnwindAssembly/x86/./UnwindAssemblyx86Tests/Testx86AssemblyInspectionEngine.TestStackRealign8BitDisp_i386 (1323 of 1979)
PASS: lldb-unit :: Utility/./UtilityTests/StringListTest.AppendStringStdString (1324 of 1979)
PASS: lldb-api :: commands/expression/import-std-module/vector/TestVectorFromStdModule.py (1325 of 1979)
PASS: lldb-unit :: Utility/./UtilityTests/StreamTest.AddressRangeInvalidRange (1326 of 1979)
PASS: lldb-api :: functionalities/data-formatter/varscript_formatting/TestDataFormatterVarScriptFormatting.py (1327 of 1979)
PASS: lldb-api :: lang/cpp/modules-import/TestCXXModulesImport.py (1328 of 1979)
PASS: lldb-shell :: Commands/command-breakpoint-col.test (1329 of 1979)
PASS: lldb-api :: types/TestShortType.py (1330 of 1979)
PASS: lldb-api :: commands/watchpoints/watchpoint_events/TestWatchpointEvents.py (1331 of 1979)
PASS: lldb-unit :: Target/./TargetTests/ModuleCacheTest.GetAndPutUuidExists (1332 of 1979)
PASS: lldb-unit :: Host/./HostTests/MainLoopTest.TerminatesImmediately (1333 of 1979)
PASS: lldb-unit :: Utility/./UtilityTests/StreamTest.PutHex32ByteOrderBig (1334 of 1979)
PASS: lldb-unit :: Utility/./UtilityTests/VASprintfTest.BufferResize (1335 of 1979)
PASS: lldb-unit :: Utility/./UtilityTests/UriParserTest.SchemeHostSeparator4 (1336 of 1979)
PASS: lldb-unit :: Utility/./UtilityTests/VASprintfTest.EncodingError (1337 of 1979)
PASS: lldb-unit :: Symbol/./SymbolTests/TestClangASTImporter.CompleteFwdDeclWithOtherOrigin (1338 of 1979)
PASS: lldb-unit :: UnwindAssembly/x86/./UnwindAssemblyx86Tests/Testx86AssemblyInspectionEngine.TestPopRBX (1339 of 1979)
PASS: lldb-shell :: Driver/TestTarget.test (1340 of 1979)
PASS: lldb-unit :: ScriptInterpreter/Python/./ScriptInterpreterPythonTests/PythonDataObjectsTest.TestDictionaryResolutionWithDot (1341 of 1979)
PASS: lldb-api :: lang/cpp/offsetof/TestOffsetofCpp.py (1342 of 1979)
PASS: lldb-api :: lang/c/strings/TestCStrings.py (1343 of 1979)
PASS: lldb-unit :: UnwindAssembly/x86/./UnwindAssemblyx86Tests/Testx86AssemblyInspectionEngine.TestPopEBX (1344 of 1979)
PASS: lldb-unit :: ScriptInterpreter/Python/./ScriptInterpreterPythonTests/PythonDataObjectsTest.TestPythonBytes (1345 of 1979)
PASS: lldb-unit :: Utility/./UtilityTests/BinaryStreamTest.PutSLEB128One (1346 of 1979)
PASS: lldb-unit :: Utility/./UtilityTests/StatusTest.Formatv (1347 of 1979)
PASS: lldb-unit :: Utility/./UtilityTests/BinaryStreamTest.PutSLEB128SevenBytes (1348 of 1979)
PASS: lldb-api :: functionalities/data-formatter/data-formatter-stl/libcxx/function/TestLibCxxFunction.py (1349 of 1979)
PASS: lldb-unit :: Utility/./UtilityTests/CompletionRequest.FakeLastArg (1350 of 1979)
PASS: lldb-api :: functionalities/data-formatter/data-formatter-enum-format/TestDataFormatterEnumFormat.py (1351 of 1979)
PASS: lldb-api :: functionalities/data-formatter/data-formatter-caching/TestDataFormatterCaching.py (1352 of 1979)
PASS: lldb-shell :: ObjectFile/PECOFF/dep-modules.yaml (1353 of 1979)
PASS: lldb-unit :: Utility/./UtilityTests/ArgsTest.ReplaceArgumentAtIndexEqual (1354 of 1979)
PASS: lldb-unit :: Utility/./UtilityTests/StringListTest.JoinNonSpace (1355 of 1979)
PASS: lldb-unit :: Utility/./UtilityTests/FileSpecTest.FileAndDirectoryComponents (1356 of 1979)
PASS: lldb-api :: functionalities/gdb_remote_client/TestStopPCs.py (1357 of 1979)
PASS: lldb-api :: functionalities/data-formatter/cstring-utf8-summary/TestCstringUnicode.py (1358 of 1979)
PASS: lldb-shell :: ObjectFile/ELF/gnu-debuglink.yaml (1359 of 1979)
UNSUPPORTED: lldb-shell :: SymbolFile/PDB/function-level-linking.test (1360 of 1979)
PASS: lldb-unit :: Language/Highlighting/./HighlighterTests/HighlighterTest.ClangCursorPos (1361 of 1979)
PASS: lldb-api :: functionalities/postmortem/elf-core/gcore/TestGCore.py (1362 of 1979)
PASS: lldb-api :: functionalities/data-formatter/data-formatter-objc/TestDataFormatterObjCNSError.py (1363 of 1979)
FAIL: lldb-api :: python_api/thread/TestThreadAPI.py (1364 of 1979)
******************** TEST 'lldb-api :: python_api/thread/TestThreadAPI.py' FAILED ********************
Script:
--
/usr/local/bin/python /Users/buildslave/jenkins/workspace/lldb-cmake-sanitized/llvm-project/lldb/test/API/dotest.py --arch x86_64 -s /Users/buildslave/jenkins/workspace/lldb-cmake-sanitized/lldb-build/lldb-test-traces -S nm -u CXXFLAGS -u CFLAGS --codesign-identity lldb_codesign --server /Users/buildslave/jenkins/workspace/lldb-cmake-sanitized/lldb-build/./bin/debugserver --arch x86_64 --build-dir /Users/buildslave/jenkins/workspace/lldb-cmake-sanitized/lldb-build/lldb-test-build.noindex -s=/Users/buildslave/jenkins/workspace/lldb-cmake-sanitized/test/logs -t --env TERM=vt100 --env LLVM_LIBS_DIR=/Users/buildslave/jenkins/workspace/lldb-cmake-sanitized/lldb-build/./lib --inferior-env ASAN_OPTIONS=detect_stack_use_after_return=1 --inferior-env DYLD_INSERT_LIBRARIES=/Users/buildslave/jenkins/workspace/lldb-cmake-sanitized/host-compiler/lib/clang/11.0.0/lib/darwin/libclang_rt.asan_osx_dynamic.dylib --build-dir /Users/buildslave/jenkins/workspace/lldb-cmake-sanitized/lldb-build/lldb-test-build.noindex --lldb-module-cache-dir /Users/buildslave/jenkins/workspace/lldb-cmake-sanitized/lldb-build/lldb-test-build.noindex/module-cache-lldb/lldb-api --clang-module-cache-dir /Users/buildslave/jenkins/workspace/lldb-cmake-sanitized/lldb-build/lldb-test-build.noindex/module-cache-clang/lldb-api --executable /Users/buildslave/jenkins/workspace/lldb-cmake-sanitized/lldb-build/./bin/lldb --compiler /Users/buildslave/jenkins/workspace/lldb-cmake-sanitized/lldb-build/./bin/clang --dsymutil /Users/buildslave/jenkins/workspace/lldb-cmake-sanitized/lldb-build/./bin/dsymutil --filecheck /Users/buildslave/jenkins/workspace/lldb-cmake-sanitized/lldb-build/./bin/FileCheck --lldb-libs-dir /Users/buildslave/jenkins/workspace/lldb-cmake-sanitized/lldb-build/./lib /Users/buildslave/jenkins/workspace/lldb-cmake-sanitized/llvm-project/lldb/test/API/python_api/thread -p TestThreadAPI.py
--
Exit Code: 1

Hide Details

Command Output (stdout): -- lldb version 11.0.99 clang revision 4af7560b3751259c4acf63411f42ab5c9989ef26 llvm revision 4af7560b3751259c4acf63411f42ab5c9989ef26 LLDB library dir: /Users/buildslave/jenkins/workspace/lldb-cmake-sanitized/lldb-build/bin LLDB import library dir: /Users/buildslave/jenkins/workspace/lldb-cmake-sanitized/lldb-build/./lib libstdcxx tests will not be run because: Don't know how to build with libstdcxx on macosx Skipping following debug info categories: ['dwo'] start addr: 0x1010dbe66 end addr: 0x1010dbe70 start addr: 0x101a4be66 end addr: 0x101a4be70 start addr: 0x108ab7e66 end addr: 0x108ab7e70

Hide Details

-- Command Output (stderr): --

Hide Details

Session logs for test failures/errors/unexpected successes will go into directory '/Users/buildslave/jenkins/workspace/lldb-cmake-sanitized/test/logs' Command invoked: /Users/buildslave/jenkins/workspace/lldb-cmake-sanitized/llvm-project/lldb/test/API/dotest.py --arch x86_64 -s /Users/buildslave/jenkins/workspace/lldb-cmake-sanitized/lldb-build/lldb-test-traces -S nm -u CXXFLAGS -u CFLAGS --codesign-identity lldb_codesign --server /Users/buildslave/jenkins/workspace/lldb-cmake-sanitized/lldb-build/./bin/debugserver --arch x86_64 --build-dir /Users/buildslave/jenkins/workspace/lldb-cmake-sanitized/lldb-build/lldb-test-build.noindex -s=/Users/buildslave/jenkins/workspace/lldb-cmake-sanitized/test/logs -t --env TERM=vt100 --env LLVM_LIBS_DIR=/Users/buildslave/jenkins/workspace/lldb-cmake-sanitized/lldb-build/./lib --inferior-env ASAN_OPTIONS=detect_stack_use_after_return=1 --inferior-env DYLD_INSERT_LIBRARIES=/Users/buildslave/jenkins/workspace/lldb-cmake-sanitized/host-compiler/lib/clang/11.0.0/lib/darwin/libclang_rt.asan_osx_dynamic.dylib --build-dir /Users/buildslave/jenkins/workspace/lldb-cmake-sanitized/lldb-build/lldb-test-build.noindex --lldb-module-cache-dir /Users/buildslave/jenkins/workspace/lldb-cmake-sanitized/lldb-build/lldb-test-build.noindex/module-cache-lldb/lldb-api --clang-module-cache-dir /Users/buildslave/jenkins/workspace/lldb-cmake-sanitized/lldb-build/lldb-test-build.noindex/module-cache-clang/lldb-api --executable /Users/buildslave/jenkins/workspace/lldb-cmake-sanitized/lldb-build/./bin/lldb --compiler /Users/buildslave/jenkins/workspace/lldb-cmake-sanitized/lldb-build/./bin/clang --dsymutil /Users/buildslave/jenkins/workspace/lldb-cmake-sanitized/lldb-build/./bin/dsymutil --filecheck /Users/buildslave/jenkins/workspace/lldb-cmake-sanitized/lldb-build/./bin/FileCheck --lldb-libs-dir /Users/buildslave/jenkins/workspace/lldb-cmake-sanitized/lldb-build/./lib /Users/buildslave/jenkins/workspace/lldb-cmake-sanitized/llvm-project/lldb/test/API/python_api/thread -p TestThreadAPI.py Change dir to: /Users/buildslave/jenkins/workspace/lldb-cmake-sanitized/llvm-project/lldb/test/API/python_api/thread runCmd: settings clear -all output:

Hide Details

runCmd: settings set symbols.enable-external-lookup false output:

Hide Details

runCmd: settings set target.auto-apply-fixits false output:

Hide Details

runCmd: settings set plugin.process.gdb-remote.packet-timeout 60 output:

Hide Details

runCmd: settings set symbols.clang-modules-cache-path "/Users/buildslave/jenkins/workspace/lldb-cmake-sanitized/lldb-build/lldb-test-build.noindex/module-cache-lldb/lldb-api" output:

Hide Details

runCmd: settings set use-color false output:

Hide Details

runCmd: setting set target.prefer-dynamic-value no-dynamic-values output:

Hide Details

runCmd: settings set target.env-vars ASAN_OPTIONS=detect_stack_use_after_return=1 DYLD_INSERT_LIBRARIES=/Users/buildslave/jenkins/workspace/lldb-cmake-sanitized/host-compiler/lib/clang/11.0.0/lib/darwin/libclang_rt.asan_osx_dynamic.dylib output:

Hide Details

runCmd: breakpoint list output: Current breakpoints: 1: file = 'main.cpp', line = 17, exact_match = 0, locations = 1 1.1: where = a.out`main + 115 at main.cpp:17:5, address = a.out[0x0000000100000f53], unresolved, hit count = 0

Hide Details

Hide Details

Hide Details

runCmd: process status output: Process 1046 stopped * thread #1, queue = 'com.apple.main-thread', stop reason = breakpoint 1.1 frame #0: 0x0000000106298f53 a.out`main(argc=1, argv=0x00007ffee99674c8) at main.cpp:17:5 14 15 printf("after the loop: my_char='%c'\n", my_char); // 'my_char' should print out as 'x'. 16 -> 17 return 0; // Set break point at this line and check variable 'my_char'. ^ 18 }

Hide Details

Hide Details

<bound method SBProcess.Kill of <lldb.SBProcess; proxy of <Swig Object of type 'lldb::SBProcess *' at 0x10a77fab0> >>: success

Hide Details

PASS: LLDB (/Users/buildslave/jenkins/workspace/lldb-cmake-sanitized/lldb-build/bin/clang-11-x86_64) :: test_get_process_dsym (TestThreadAPI.ThreadAPITestCase) runCmd: settings clear -all output:

Hide Details

runCmd: settings set symbols.enable-external-lookup false output:

Hide Details

runCmd: settings set target.auto-apply-fixits false output:

Hide Details

runCmd: settings set plugin.process.gdb-remote.packet-timeout 60 output:

Hide Details

runCmd: settings set symbols.clang-modules-cache-path "/Users/buildslave/jenkins/workspace/lldb-cmake-sanitized/lldb-build/lldb-test-build.noindex/module-cache-lldb/lldb-api" output:

Hide Details

runCmd: settings set use-color false output:

Hide Details

runCmd: setting set target.prefer-dynamic-value no-dynamic-values output:

Hide Details

runCmd: settings set target.env-vars ASAN_OPTIONS=detect_stack_use_after_return=1 DYLD_INSERT_LIBRARIES=/Users/buildslave/jenkins/workspace/lldb-cmake-sanitized/host-compiler/lib/clang/11.0.0/lib/darwin/libclang_rt.asan_osx_dynamic.dylib output:

Hide Details

runCmd: breakpoint list output: Current breakpoints: 1: file = 'main.cpp', line = 17, exact_match = 0, locations = 1 1.1: where = a.out`main + 115 at main.cpp:17:5, address = a.out[0x0000000100000f53], unresolved, hit count = 0

Hide Details

Hide Details

Hide Details

runCmd: process status output: Process 1120 stopped * thread #1, queue = 'com.apple.main-thread', stop reason = breakpoint 1.1 frame #0: 0x0000000108ba7f53 a.out`main(argc=1, argv=0x00007ffee7058498) at main.cpp:17:5 14 15 printf("after the loop: my_char='%c'\n", my_char); // 'my_char' should print out as 'x'. 16 -> 17 return 0; // Set break point at this line and check variable 'my_char'. ^ 18 }

Hide Details

Hide Details

<bound method SBProcess.Kill of <lldb.SBProcess; proxy of <Swig Object of type 'lldb::SBProcess *' at 0x109b03990> >>: success

Hide Details

PASS: LLDB (/Users/buildslave/jenkins/workspace/lldb-cmake-sanitized/lldb-build/bin/clang-11-x86_64) :: test_get_process_dwarf (TestThreadAPI.ThreadAPITestCase) UNSUPPORTED: LLDB (/Users/buildslave/jenkins/workspace/lldb-cmake-sanitized/lldb-build/bin/clang-11-x86_64) :: test_get_process_dwo (TestThreadAPI.ThreadAPITestCase) (test case does not fall in any category of interest for this run) runCmd: settings clear -all output:

Hide Details

runCmd: settings set symbols.enable-external-lookup false output:

Hide Details

runCmd: settings set target.auto-apply-fixits false output:

Hide Details

runCmd: settings set plugin.process.gdb-remote.packet-timeout 60 output:

Hide Details

runCmd: settings set symbols.clang-modules-cache-path "/Users/buildslave/jenkins/workspace/lldb-cmake-sanitized/lldb-build/lldb-test-build.noindex/module-cache-lldb/lldb-api" output:

Hide Details

runCmd: settings set use-color false output:

Hide Details

runCmd: setting set target.prefer-dynamic-value no-dynamic-values output:

Hide Details

runCmd: settings set target.env-vars ASAN_OPTIONS=detect_stack_use_after_return=1 DYLD_INSERT_LIBRARIES=/Users/buildslave/jenkins/workspace/lldb-cmake-sanitized/host-compiler/lib/clang/11.0.0/lib/darwin/libclang_rt.asan_osx_dynamic.dylib output:

Hide Details

runCmd: breakpoint list output: Current breakpoints: 1: file = 'main.cpp', line = 17, exact_match = 0, locations = 1 1.1: where = a.out`main + 115 at main.cpp:17:5, address = a.out[0x0000000100000f53], unresolved, hit count = 0

Hide Details

Hide Details

Hide Details

runCmd: process status output: Process 1230 stopped * thread #1, queue = 'com.apple.main-thread', stop reason = breakpoint 1.1 frame #0: 0x000000010c5f9f53 a.out`main(argc=1, argv=0x00007ffee3606498) at main.cpp:17:5 14 15 printf("after the loop: my_char='%c'\n", my_char); // 'my_char' should print out as 'x'. 16 -> 17 return 0; // Set break point at this line and check variable 'my_char'. ^ 18 }

Hide Details

Hide Details

<bound method SBProcess.Kill of <lldb.SBProcess; proxy of <Swig Object of type 'lldb::SBProcess *' at 0x10a77f8d0> >>: success

Hide Details

PASS: LLDB (/Users/buildslave/jenkins/workspace/lldb-cmake-sanitized/lldb-build/bin/clang-11-x86_64) :: test_get_process_gmodules (TestThreadAPI.ThreadAPITestCase) runCmd: settings clear -all output:

Hide Details

runCmd: settings set symbols.enable-external-lookup false output:

Hide Details

runCmd: settings set target.auto-apply-fixits false output:

Hide Details

runCmd: settings set plugin.process.gdb-remote.packet-timeout 60 output:

Hide Details

runCmd: settings set symbols.clang-modules-cache-path "/Users/buildslave/jenkins/workspace/lldb-cmake-sanitized/lldb-build/lldb-test-build.noindex/module-cache-lldb/lldb-api" output:

Hide Details

runCmd: settings set use-color false output:

Hide Details

runCmd: setting set target.prefer-dynamic-value no-dynamic-values output:

Hide Details

runCmd: settings set target.env-vars ASAN_OPTIONS=detect_stack_use_after_return=1 DYLD_INSERT_LIBRARIES=/Users/buildslave/jenkins/workspace/lldb-cmake-sanitized/host-compiler/lib/clang/11.0.0/lib/darwin/libclang_rt.asan_osx_dynamic.dylib output:

Hide Details

<bound method SBProcess.Kill of <lldb.SBProcess; proxy of <Swig Object of type 'lldb::SBProcess *' at 0x109b03960> >>: success

Hide Details

PASS: LLDB (/Users/buildslave/jenkins/workspace/lldb-cmake-sanitized/lldb-build/bin/clang-11-x86_64) :: test_get_stop_description_dsym (TestThreadAPI.ThreadAPITestCase) runCmd: settings clear -all output:

Hide Details

runCmd: settings set symbols.enable-external-lookup false output:

Hide Details

runCmd: settings set target.auto-apply-fixits false output:

Hide Details

runCmd: settings set plugin.process.gdb-remote.packet-timeout 60 output:

Hide Details

runCmd: settings set symbols.clang-modules-cache-path "/Users/buildslave/jenkins/workspace/lldb-cmake-sanitized/lldb-build/lldb-test-build.noindex/module-cache-lldb/lldb-api" output:

Hide Details

runCmd: settings set use-color false output:

Hide Details

runCmd: setting set target.prefer-dynamic-value no-dynamic-values output:

Hide Details

runCmd: settings set target.env-vars ASAN_OPTIONS=detect_stack_use_after_return=1 DYLD_INSERT_LIBRARIES=/Users/buildslave/jenkins/workspace/lldb-cmake-sanitized/host-compiler/lib/clang/11.0.0/lib/darwin/libclang_rt.asan_osx_dynamic.dylib output:

Hide Details

<bound method SBProcess.Kill of <lldb.SBProcess; proxy of <Swig Object of type 'lldb::SBProcess *' at 0x10a19a2d0> >>: success

Hide Details

PASS: LLDB (/Users/buildslave/jenkins/workspace/lldb-cmake-sanitized/lldb-build/bin/clang-11-x86_64) :: test_get_stop_description_dwarf (TestThreadAPI.ThreadAPITestCase) UNSUPPORTED: LLDB (/Users/buildslave/jenkins/workspace/lldb-cmake-sanitized/lldb-build/bin/clang-11-x86_64) :: test_get_stop_description_dwo (TestThreadAPI.ThreadAPITestCase) (test case does not fall in any category of interest for this run) runCmd: settings clear -all output:

Hide Details

runCmd: settings set symbols.enable-external-lookup false output:

Hide Details

runCmd: settings set target.auto-apply-fixits false output:

Hide Details

runCmd: settings set plugin.process.gdb-remote.packet-timeout 60 output:

Hide Details

runCmd: settings set symbols.clang-modules-cache-path "/Users/buildslave/jenkins/workspace/lldb-cmake-sanitized/lldb-build/lldb-test-build.noindex/module-cache-lldb/lldb-api" output:

Hide Details

runCmd: settings set use-color false output:

Hide Details

runCmd: setting set target.prefer-dynamic-value no-dynamic-values output:

Hide Details

runCmd: settings set target.env-vars ASAN_OPTIONS=detect_stack_use_after_return=1 DYLD_INSERT_LIBRARIES=/Users/buildslave/jenkins/workspace/lldb-cmake-sanitized/host-compiler/lib/clang/11.0.0/lib/darwin/libclang_rt.asan_osx_dynamic.dylib output:

Hide Details

<bound method SBProcess.Kill of <lldb.SBProcess; proxy of <Swig Object of type 'lldb::SBProcess *' at 0x109b03990> >>: success

Hide Details

PASS: LLDB (/Users/buildslave/jenkins/workspace/lldb-cmake-sanitized/lldb-build/bin/clang-11-x86_64) :: test_get_stop_description_gmodules (TestThreadAPI.ThreadAPITestCase) runCmd: settings clear -all output:

Hide Details

runCmd: settings set symbols.enable-external-lookup false output:

Hide Details

runCmd: settings set target.auto-apply-fixits false output:

Hide Details

runCmd: settings set plugin.process.gdb-remote.packet-timeout 60 output:

Hide Details

runCmd: settings set symbols.clang-modules-cache-path "/Users/buildslave/jenkins/workspace/lldb-cmake-sanitized/lldb-build/lldb-test-build.noindex/module-cache-lldb/lldb-api" output:

Hide Details

runCmd: settings set use-color false output:

Hide Details

runCmd: setting set target.prefer-dynamic-value no-dynamic-values output:

Hide Details

runCmd: settings set target.env-vars ASAN_OPTIONS=detect_stack_use_after_return=1 DYLD_INSERT_LIBRARIES=/Users/buildslave/jenkins/workspace/lldb-cmake-sanitized/host-compiler/lib/clang/11.0.0/lib/darwin/libclang_rt.asan_osx_dynamic.dylib output:

Hide Details

runCmd: breakpoint list output: Current breakpoints: 1: file = 'main2.cpp', line = 21, exact_match = 0, locations = 1 1.1: where = test_run_to_address_dsym`b(int) + 22 at main2.cpp:21:17, address = test_run_to_address_dsym[0x0000000100000e66], unresolved, hit count = 0

Hide Details

Hide Details

Hide Details

runCmd: thread backtrace output: * thread #1, queue = 'com.apple.main-thread', stop reason = breakpoint 1.1 * frame #0: 0x00000001010dbe66 test_run_to_address_dsym`b(val=1) at main2.cpp:21:17 frame #1: 0x00000001010dbe0d test_run_to_address_dsym`a(val=1) at main2.cpp:11:16 frame #2: 0x00000001010dbee0 test_run_to_address_dsym`main(argc=1, argv=0x00007ffeeeb24470) at main2.cpp:36:14 frame #3: 0x00007fff6966e085 libdyld.dylib`start + 1

Hide Details

Hide Details

runCmd: breakpoint list output: Current breakpoints: 1: file = 'main2.cpp', line = 21, exact_match = 0, locations = 1 Options: disabled 1.1: where = test_run_to_address_dsym`b(int) + 22 at main2.cpp:21:17, address = 0x00000001010dbe66, unresolved, hit count = 1

Hide Details

Hide Details

Hide Details

runCmd: thread backtrace output: * thread #1, queue = 'com.apple.main-thread', stop reason = step over * frame #0: 0x00000001010dbe9d test_run_to_address_dsym`b(val=1) at main2.cpp:26:12 frame #1: 0x00000001010dbe0d test_run_to_address_dsym`a(val=1) at main2.cpp:11:16 frame #2: 0x00000001010dbee0 test_run_to_address_dsym`main(argc=1, argv=0x00007ffeeeb24470) at main2.cpp:36:14 frame #3: 0x00007fff6966e085 libdyld.dylib`start + 1

Hide Details

Hide Details

runCmd: process status output: Process 1645 stopped * thread #1, queue = 'com.apple.main-thread', stop reason = run to address: 0x00000001010dbe66 frame #0: 0x00000001010dbe66 test_run_to_address_dsym`b(val=2) at main2.cpp:21:17 18 int b(int val) 19 { 20 int rc = c(val); -> 21 void *ptr = malloc(1024); // thread step-out of malloc into function b. ^ 22 if (!ptr) 23 return -1; 24 else

Hide Details

Hide Details

<bound method SBProcess.Kill of <lldb.SBProcess; proxy of <Swig Object of type 'lldb::SBProcess *' at 0x109f9ade0> >>: success

Hide Details

PASS: LLDB (/Users/buildslave/jenkins/workspace/lldb-cmake-sanitized/lldb-build/bin/clang-11-x86_64) :: test_run_to_address_dsym (TestThreadAPI.ThreadAPITestCase) runCmd: settings clear -all output:

Hide Details

runCmd: settings set symbols.enable-external-lookup false output:

Hide Details

runCmd: settings set target.auto-apply-fixits false output:

Hide Details

runCmd: settings set plugin.process.gdb-remote.packet-timeout 60 output:

Hide Details

runCmd: settings set symbols.clang-modules-cache-path "/Users/buildslave/jenkins/workspace/lldb-cmake-sanitized/lldb-build/lldb-test-build.noindex/module-cache-lldb/lldb-api" output:

Hide Details

runCmd: settings set use-color false output:

Hide Details

runCmd: setting set target.prefer-dynamic-value no-dynamic-values output:

Hide Details

runCmd: settings set target.env-vars ASAN_OPTIONS=detect_stack_use_after_return=1 DYLD_INSERT_LIBRARIES=/Users/buildslave/jenkins/workspace/lldb-cmake-sanitized/host-compiler/lib/clang/11.0.0/lib/darwin/libclang_rt.asan_osx_dynamic.dylib output:

Hide Details

runCmd: breakpoint list output: Current breakpoints: 1: file = 'main2.cpp', line = 21, exact_match = 0, locations = 1 1.1: where = test_run_to_address_dwarf`b(int) + 22 at main2.cpp:21:17, address = test_run_to_address_dwarf[0x0000000100000e66], unresolved, hit count = 0

Hide Details

Hide Details

Hide Details

runCmd: thread backtrace output: * thread #1, queue = 'com.apple.main-thread', stop reason = breakpoint 1.1 * frame #0: 0x0000000101a4be66 test_run_to_address_dwarf`b(val=1) at main2.cpp:21:17 frame #1: 0x0000000101a4be0d test_run_to_address_dwarf`a(val=1) at main2.cpp:11:16 frame #2: 0x0000000101a4bee0 test_run_to_address_dwarf`main(argc=1, argv=0x00007ffeee1b4470) at main2.cpp:36:14 frame #3: 0x00007fff6966e085 libdyld.dylib`start + 1

Hide Details

Hide Details

runCmd: breakpoint list output: Current breakpoints: 1: file = 'main2.cpp', line = 21, exact_match = 0, locations = 1 Options: disabled 1.1: where = test_run_to_address_dwarf`b(int) + 22 at main2.cpp:21:17, address = 0x0000000101a4be66, unresolved, hit count = 1

Hide Details

Hide Details

Hide Details

runCmd: thread backtrace output: * thread #1, queue = 'com.apple.main-thread', stop reason = step over * frame #0: 0x0000000101a4be9d test_run_to_address_dwarf`b(val=1) at main2.cpp:26:12 frame #1: 0x0000000101a4be0d test_run_to_address_dwarf`a(val=1) at main2.cpp:11:16 frame #2: 0x0000000101a4bee0 test_run_to_address_dwarf`main(argc=1, argv=0x00007ffeee1b4470) at main2.cpp:36:14 frame #3: 0x00007fff6966e085 libdyld.dylib`start + 1

Hide Details

Hide Details

runCmd: process status output: Process 1702 stopped * thread #1, queue = 'com.apple.main-thread', stop reason = run to address: 0x0000000101a4be66 frame #0: 0x0000000101a4be66 test_run_to_address_dwarf`b(val=2) at main2.cpp:21:17 18 int b(int val) 19 { 20 int rc = c(val); -> 21 void *ptr = malloc(1024); // thread step-out of malloc into function b. ^ 22 if (!ptr) 23 return -1; 24 else

Hide Details

Hide Details

<bound method SBProcess.Kill of <lldb.SBProcess; proxy of <Swig Object of type 'lldb::SBProcess *' at 0x109b03960> >>: success

Hide Details

PASS: LLDB (/Users/buildslave/jenkins/workspace/lldb-cmake-sanitized/lldb-build/bin/clang-11-x86_64) :: test_run_to_address_dwarf (TestThreadAPI.ThreadAPITestCase) UNSUPPORTED: LLDB (/Users/buildslave/jenkins/workspace/lldb-cmake-sanitized/lldb-build/bin/clang-11-x86_64) :: test_run_to_address_dwo (TestThreadAPI.ThreadAPITestCase) (test case does not fall in any category of interest for this run) runCmd: settings clear -all output:

Hide Details

runCmd: settings set symbols.enable-external-lookup false output:

Hide Details

runCmd: settings set target.auto-apply-fixits false output:

Hide Details

runCmd: settings set plugin.process.gdb-remote.packet-timeout 60 output:

Hide Details

runCmd: settings set symbols.clang-modules-cache-path "/Users/buildslave/jenkins/workspace/lldb-cmake-sanitized/lldb-build/lldb-test-build.noindex/module-cache-lldb/lldb-api" output:

Hide Details

runCmd: settings set use-color false output:

Hide Details

runCmd: setting set target.prefer-dynamic-value no-dynamic-values output:

Hide Details

runCmd: settings set target.env-vars ASAN_OPTIONS=detect_stack_use_after_return=1 DYLD_INSERT_LIBRARIES=/Users/buildslave/jenkins/workspace/lldb-cmake-sanitized/host-compiler/lib/clang/11.0.0/lib/darwin/libclang_rt.asan_osx_dynamic.dylib output:

Hide Details

runCmd: breakpoint list output: Current breakpoints: 1: file = 'main2.cpp', line = 21, exact_match = 0, locations = 1 1.1: where = test_run_to_address_gmodules`b(int) + 22 at main2.cpp:21:17, address = test_run_to_address_gmodules[0x0000000100000e66], unresolved, hit count = 0

Hide Details

Hide Details

Hide Details

runCmd: thread backtrace output: * thread #1, queue = 'com.apple.main-thread', stop reason = breakpoint 1.1 * frame #0: 0x0000000108ab7e66 test_run_to_address_gmodules`b(val=1) at main2.cpp:21:17 frame #1: 0x0000000108ab7e0d test_run_to_address_gmodules`a(val=1) at main2.cpp:11:16 frame #2: 0x0000000108ab7ee0 test_run_to_address_gmodules`main(argc=1, argv=0x00007ffee7148460) at main2.cpp:36:14 frame #3: 0x00007fff6966e085 libdyld.dylib`start + 1

Hide Details

Hide Details

runCmd: breakpoint list output: Current breakpoints: 1: file = 'main2.cpp', line = 21, exact_match = 0, locations = 1 Options: disabled 1.1: where = test_run_to_address_gmodules`b(int) + 22 at main2.cpp:21:17, address = 0x0000000108ab7e66, unresolved, hit count = 1

Hide Details

Hide Details

Hide Details

runCmd: thread backtrace output: * thread #1, queue = 'com.apple.main-thread', stop reason = step over * frame #0: 0x0000000108ab7e9d test_run_to_address_gmodules`b(val=1) at main2.cpp:26:12 frame #1: 0x0000000108ab7e0d test_run_to_address_gmodules`a(val=1) at main2.cpp:11:16 frame #2: 0x0000000108ab7ee0 test_run_to_address_gmodules`main(argc=1, argv=0x00007ffee7148460) at main2.cpp:36:14 frame #3: 0x00007fff6966e085 libdyld.dylib`start + 1

Hide Details

Hide Details

runCmd: process status output: Process 1759 stopped * thread #1, queue = 'com.apple.main-thread', stop reason = run to address: 0x0000000108ab7e66 frame #0: 0x0000000108ab7e66 test_run_to_address_gmodules`b(val=2) at main2.cpp:21:17 18 int b(int val) 19 { 20 int rc = c(val); -> 21 void *ptr = malloc(1024); // thread step-out of malloc into function b. ^ 22 if (!ptr) 23 return -1; 24 else

Hide Details

Hide Details

<bound method SBProcess.Kill of <lldb.SBProcess; proxy of <Swig Object of type 'lldb::SBProcess *' at 0x10a19a2d0> >>: success

Hide Details

PASS: LLDB (/Users/buildslave/jenkins/workspace/lldb-cmake-sanitized/lldb-build/bin/clang-11-x86_64) :: test_run_to_address_gmodules (TestThreadAPI.ThreadAPITestCase) runCmd: settings clear -all output:

Hide Details

runCmd: settings set symbols.enable-external-lookup false output:

Hide Details

runCmd: settings set target.auto-apply-fixits false output:

Hide Details

runCmd: settings set plugin.process.gdb-remote.packet-timeout 60 output:

Hide Details

runCmd: settings set symbols.clang-modules-cache-path "/Users/buildslave/jenkins/workspace/lldb-cmake-sanitized/lldb-build/lldb-test-build.noindex/module-cache-lldb/lldb-api" output:

Hide Details

runCmd: settings set use-color false output:

Hide Details

runCmd: setting set target.prefer-dynamic-value no-dynamic-values output:

Hide Details

runCmd: settings set target.env-vars ASAN_OPTIONS=detect_stack_use_after_return=1 DYLD_INSERT_LIBRARIES=/Users/buildslave/jenkins/workspace/lldb-cmake-sanitized/host-compiler/lib/clang/11.0.0/lib/darwin/libclang_rt.asan_osx_dynamic.dylib output:

Hide Details

FAIL: LLDB (/Users/buildslave/jenkins/workspace/lldb-cmake-sanitized/lldb-build/bin/clang-11-x86_64) :: test_step_out_of_malloc_into_function_b_dsym (TestThreadAPI.ThreadAPITestCase) <bound method SBProcess.Kill of <lldb.SBProcess; proxy of <Swig Object of type 'lldb::SBProcess *' at 0x109b03990> >>: success

Hide Details

runCmd: settings clear -all output:

Hide Details

runCmd: settings set symbols.enable-external-lookup false output:

Hide Details

runCmd: settings set target.auto-apply-fixits false output:

Hide Details

runCmd: settings set plugin.process.gdb-remote.packet-timeout 60 output:

Hide Details

runCmd: settings set symbols.clang-modules-cache-path "/Users/buildslave/jenkins/workspace/lldb-cmake-sanitized/lldb-build/lldb-test-build.noindex/module-cache-lldb/lldb-api" output:

Hide Details

runCmd: settings set use-color false output:

Hide Details

runCmd: setting set target.prefer-dynamic-value no-dynamic-values output:

Hide Details

runCmd: settings set target.env-vars ASAN_OPTIONS=detect_stack_use_after_return=1 DYLD_INSERT_LIBRARIES=/Users/buildslave/jenkins/workspace/lldb-cmake-sanitized/host-compiler/lib/clang/11.0.0/lib/darwin/libclang_rt.asan_osx_dynamic.dylib output:

Hide Details

FAIL: LLDB (/Users/buildslave/jenkins/workspace/lldb-cmake-sanitized/lldb-build/bin/clang-11-x86_64) :: test_step_out_of_malloc_into_function_b_dwarf (TestThreadAPI.ThreadAPITestCase) <bound method SBProcess.Kill of <lldb.SBProcess; proxy of <Swig Object of type 'lldb::SBProcess *' at 0x109f9ade0> >>: success

Hide Details

UNSUPPORTED: LLDB (/Users/buildslave/jenkins/workspace/lldb-cmake-sanitized/lldb-build/bin/clang-11-x86_64) :: test_step_out_of_malloc_into_function_b_dwo (TestThreadAPI.ThreadAPITestCase) (test case does not fall in any category of interest for this run) runCmd: settings clear -all output:

Hide Details

runCmd: settings set symbols.enable-external-lookup false output:

Hide Details

runCmd: settings set target.auto-apply-fixits false output:

Hide Details

runCmd: settings set plugin.process.gdb-remote.packet-timeout 60 output:

Hide Details

runCmd: settings set symbols.clang-modules-cache-path "/Users/buildslave/jenkins/workspace/lldb-cmake-sanitized/lldb-build/lldb-test-build.noindex/module-cache-lldb/lldb-api" output:

Hide Details

runCmd: settings set use-color false output:

Hide Details

runCmd: setting set target.prefer-dynamic-value no-dynamic-values output:

Hide Details

runCmd: settings set target.env-vars ASAN_OPTIONS=detect_stack_use_after_return=1 DYLD_INSERT_LIBRARIES=/Users/buildslave/jenkins/workspace/lldb-cmake-sanitized/host-compiler/lib/clang/11.0.0/lib/darwin/libclang_rt.asan_osx_dynamic.dylib output:

Hide Details

FAIL: LLDB (/Users/buildslave/jenkins/workspace/lldb-cmake-sanitized/lldb-build/bin/clang-11-x86_64) :: test_step_out_of_malloc_into_function_b_gmodules (TestThreadAPI.ThreadAPITestCase) <bound method SBProcess.Kill of <lldb.SBProcess; proxy of <Swig Object of type 'lldb::SBProcess *' at 0x109b03990> >>: success

Hide Details

runCmd: settings clear -all output:

Hide Details

runCmd: settings set symbols.enable-external-lookup false output:

Hide Details

runCmd: settings set target.auto-apply-fixits false output:

Hide Details

runCmd: settings set plugin.process.gdb-remote.packet-timeout 60 output:

Hide Details

runCmd: settings set symbols.clang-modules-cache-path "/Users/buildslave/jenkins/workspace/lldb-cmake-sanitized/lldb-build/lldb-test-build.noindex/module-cache-lldb/lldb-api" output:

Hide Details

runCmd: settings set use-color false output:

Hide Details

runCmd: setting set target.prefer-dynamic-value no-dynamic-values output:

Hide Details

runCmd: settings set target.env-vars ASAN_OPTIONS=detect_stack_use_after_return=1 DYLD_INSERT_LIBRARIES=/Users/buildslave/jenkins/workspace/lldb-cmake-sanitized/host-compiler/lib/clang/11.0.0/lib/darwin/libclang_rt.asan_osx_dynamic.dylib output:

Hide Details

runCmd: breakpoint list output: Current breakpoints: 1: file = 'main2.cpp', line = 21, exact_match = 0, locations = 1 1.1: where = test_step_over_3_times_dsym`b(int) + 22 at main2.cpp:21:17, address = test_step_over_3_times_dsym[0x0000000100000e66], unresolved, hit count = 0

Hide Details

Hide Details

Hide Details

runCmd: thread backtrace output: * thread #1, queue = 'com.apple.main-thread', stop reason = breakpoint 1.1 * frame #0: 0x0000000106951e66 test_step_over_3_times_dsym`b(val=1) at main2.cpp:21:17 frame #1: 0x0000000106951e0d test_step_over_3_times_dsym`a(val=1) at main2.cpp:11:16 frame #2: 0x0000000106951ee0 test_step_over_3_times_dsym`main(argc=1, argv=0x00007ffee92ae468) at main2.cpp:36:14 frame #3: 0x00007fff6966e085 libdyld.dylib`start + 1 frame #4: 0x00007fff6966e085 libdyld.dylib`start + 1

Hide Details

Hide Details

runCmd: thread backtrace output: * thread #1, queue = 'com.apple.main-thread', stop reason = step over * frame #0: 0x0000000106951e9d test_step_over_3_times_dsym`b(val=1) at main2.cpp:26:12 frame #1: 0x0000000106951e0d test_step_over_3_times_dsym`a(val=1) at main2.cpp:11:16 frame #2: 0x0000000106951ee0 test_step_over_3_times_dsym`main(argc=1, argv=0x00007ffee92ae468) at main2.cpp:36:14 frame #3: 0x00007fff6966e085 libdyld.dylib`start + 1 frame #4: 0x00007fff6966e085 libdyld.dylib`start + 1

Hide Details

Hide Details

<bound method SBProcess.Kill of <lldb.SBProcess; proxy of <Swig Object of type 'lldb::SBProcess *' at 0x109f9ade0> >>: success

Hide Details

PASS: LLDB (/Users/buildslave/jenkins/workspace/lldb-cmake-sanitized/lldb-build/bin/clang-11-x86_64) :: test_step_over_3_times_dsym (TestThreadAPI.ThreadAPITestCase) runCmd: settings clear -all output:

Hide Details

runCmd: settings set symbols.enable-external-lookup false output:

Hide Details

runCmd: settings set target.auto-apply-fixits false output:

Hide Details

runCmd: settings set plugin.process.gdb-remote.packet-timeout 60 output:

Hide Details

runCmd: settings set symbols.clang-modules-cache-path "/Users/buildslave/jenkins/workspace/lldb-cmake-sanitized/lldb-build/lldb-test-build.noindex/module-cache-lldb/lldb-api" output:

Hide Details

runCmd: settings set use-color false output:

Hide Details

runCmd: setting set target.prefer-dynamic-value no-dynamic-values output:

Hide Details

runCmd: settings set target.env-vars ASAN_OPTIONS=detect_stack_use_after_return=1 DYLD_INSERT_LIBRARIES=/Users/buildslave/jenkins/workspace/lldb-cmake-sanitized/host-compiler/lib/clang/11.0.0/lib/darwin/libclang_rt.asan_osx_dynamic.dylib output:

Hide Details

runCmd: breakpoint list output: Current breakpoints: 1: file = 'main2.cpp', line = 21, exact_match = 0, locations = 1 1.1: where = test_step_over_3_times_dwarf`b(int) + 22 at main2.cpp:21:17, address = test_step_over_3_times_dwarf[0x0000000100000e66], unresolved, hit count = 0

Hide Details

Hide Details

Hide Details

runCmd: thread backtrace output: * thread #1, queue = 'com.apple.main-thread', stop reason = breakpoint 1.1 * frame #0: 0x0000000100471e66 test_step_over_3_times_dwarf`b(val=1) at main2.cpp:21:17 frame #1: 0x0000000100471e0d test_step_over_3_times_dwarf`a(val=1) at main2.cpp:11:16 frame #2: 0x0000000100471ee0 test_step_over_3_times_dwarf`main(argc=1, argv=0x00007ffeef78e460) at main2.cpp:36:14 frame #3: 0x00007fff6966e085 libdyld.dylib`start + 1

Hide Details

Hide Details

runCmd: thread backtrace output: * thread #1, queue = 'com.apple.main-thread', stop reason = step over * frame #0: 0x0000000100471e9d test_step_over_3_times_dwarf`b(val=1) at main2.cpp:26:12 frame #1: 0x0000000100471e0d test_step_over_3_times_dwarf`a(val=1) at main2.cpp:11:16 frame #2: 0x0000000100471ee0 test_step_over_3_times_dwarf`main(argc=1, argv=0x00007ffeef78e460) at main2.cpp:36:14 frame #3: 0x00007fff6966e085 libdyld.dylib`start + 1

Hide Details

Hide Details

<bound method SBProcess.Kill of <lldb.SBProcess; proxy of <Swig Object of type 'lldb::SBProcess *' at 0x109b03990> >>: success

Hide Details

PASS: LLDB (/Users/buildslave/jenkins/workspace/lldb-cmake-sanitized/lldb-build/bin/clang-11-x86_64) :: test_step_over_3_times_dwarf (TestThreadAPI.ThreadAPITestCase) UNSUPPORTED: LLDB (/Users/buildslave/jenkins/workspace/lldb-cmake-sanitized/lldb-build/bin/clang-11-x86_64) :: test_step_over_3_times_dwo (TestThreadAPI.ThreadAPITestCase) (test case does not fall in any category of interest for this run) runCmd: settings clear -all output:

Hide Details

runCmd: settings set symbols.enable-external-lookup false output:

Hide Details

runCmd: settings set target.auto-apply-fixits false output:

Hide Details

runCmd: settings set plugin.process.gdb-remote.packet-timeout 60 output:

Hide Details

runCmd: settings set symbols.clang-modules-cache-path "/Users/buildslave/jenkins/workspace/lldb-cmake-sanitized/lldb-build/lldb-test-build.noindex/module-cache-lldb/lldb-api" output:

Hide Details

runCmd: settings set use-color false output:

Hide Details

runCmd: setting set target.prefer-dynamic-value no-dynamic-values output:

Hide Details

runCmd: settings set target.env-vars ASAN_OPTIONS=detect_stack_use_after_return=1 DYLD_INSERT_LIBRARIES=/Users/buildslave/jenkins/workspace/lldb-cmake-sanitized/host-compiler/lib/clang/11.0.0/lib/darwin/libclang_rt.asan_osx_dynamic.dylib output:

Hide Details

runCmd: breakpoint list output: Current breakpoints: 1: file = 'main2.cpp', line = 21, exact_match = 0, locations = 1 1.1: where = test_step_over_3_times_gmodules`b(int) + 22 at main2.cpp:21:17, address = test_step_over_3_times_gmodules[0x0000000100000e66], unresolved, hit count = 0

Hide Details

Hide Details

Hide Details

runCmd: thread backtrace output: * thread #1, queue = 'com.apple.main-thread', stop reason = breakpoint 1.1 * frame #0: 0x0000000108be7e66 test_step_over_3_times_gmodules`b(val=1) at main2.cpp:21:17 frame #1: 0x0000000108be7e0d test_step_over_3_times_gmodules`a(val=1) at main2.cpp:11:16 frame #2: 0x0000000108be7ee0 test_step_over_3_times_gmodules`main(argc=1, argv=0x00007ffee7018458) at main2.cpp:36:14 frame #3: 0x00007fff6966e085 libdyld.dylib`start + 1 frame #4: 0x00007fff6966e085 libdyld.dylib`start + 1

Hide Details

Hide Details

runCmd: thread backtrace output: * thread #1, queue = 'com.apple.main-thread', stop reason = step over * frame #0: 0x0000000108be7e9d test_step_over_3_times_gmodules`b(val=1) at main2.cpp:26:12 frame #1: 0x0000000108be7e0d test_step_over_3_times_gmodules`a(val=1) at main2.cpp:11:16 frame #2: 0x0000000108be7ee0 test_step_over_3_times_gmodules`main(argc=1, argv=0x00007ffee7018458) at main2.cpp:36:14 frame #3: 0x00007fff6966e085 libdyld.dylib`start + 1 frame #4: 0x00007fff6966e085 libdyld.dylib`start + 1

Hide Details

Hide Details

<bound method SBProcess.Kill of <lldb.SBProcess; proxy of <Swig Object of type 'lldb::SBProcess *' at 0x10a19a2d0> >>: success

Hide Details

PASS: LLDB (/Users/buildslave/jenkins/workspace/lldb-cmake-sanitized/lldb-build/bin/clang-11-x86_64) :: test_step_over_3_times_gmodules (TestThreadAPI.ThreadAPITestCase) Restore dir to: /Users/buildslave/jenkins/workspace/lldb-cmake-sanitized/lldb-build/tools/lldb/test ====================================================================== ERROR: test_step_out_of_malloc_into_function_b_dsym (TestThreadAPI.ThreadAPITestCase) Test Python SBThread.StepOut() API to step out of a malloc call where the call site is at function b(). ---------------------------------------------------------------------- Traceback (most recent call last): File "/Users/buildslave/jenkins/workspace/lldb-cmake-sanitized/llvm-project/lldb/packages/Python/lldbsuite/test/lldbtest.py", line 1751, in test_method return attrvalue(self) File "/Users/buildslave/jenkins/workspace/lldb-cmake-sanitized/llvm-project/lldb/packages/Python/lldbsuite/test/decorators.py", line 110, in wrapper func(*args, **kwargs) File "/Users/buildslave/jenkins/workspace/lldb-cmake-sanitized/llvm-project/lldb/packages/Python/lldbsuite/test/decorators.py", line 110, in wrapper func(*args, **kwargs) File "/Users/buildslave/jenkins/workspace/lldb-cmake-sanitized/llvm-project/lldb/packages/Python/lldbsuite/test/decorators.py", line 110, in wrapper func(*args, **kwargs) File "/Users/buildslave/jenkins/workspace/lldb-cmake-sanitized/llvm-project/lldb/test/API/python_api/thread/TestThreadAPI.py", line 50, in test_step_out_of_malloc_into_function_b self.step_out_of_malloc_into_function_b(self.exe_name) File "/Users/buildslave/jenkins/workspace/lldb-cmake-sanitized/llvm-project/lldb/test/API/python_api/thread/TestThreadAPI.py", line 157, in step_out_of_malloc_into_function_b thread.IsValid(), AttributeError: 'NoneType' object has no attribute 'IsValid' Config=x86_64-/Users/buildslave/jenkins/workspace/lldb-cmake-sanitized/lldb-build/bin/clang-11 ====================================================================== ERROR: test_step_out_of_malloc_into_function_b_dwarf (TestThreadAPI.ThreadAPITestCase) Test Python SBThread.StepOut() API to step out of a malloc call where the call site is at function b(). ---------------------------------------------------------------------- Traceback (most recent call last): File "/Users/buildslave/jenkins/workspace/lldb-cmake-sanitized/llvm-project/lldb/packages/Python/lldbsuite/test/lldbtest.py", line 1751, in test_method return attrvalue(self) File "/Users/buildslave/jenkins/workspace/lldb-cmake-sanitized/llvm-project/lldb/packages/Python/lldbsuite/test/decorators.py", line 110, in wrapper func(*args, **kwargs) File "/Users/buildslave/jenkins/workspace/lldb-cmake-sanitized/llvm-project/lldb/packages/Python/lldbsuite/test/decorators.py", line 110, in wrapper func(*args, **kwargs) File "/Users/buildslave/jenkins/workspace/lldb-cmake-sanitized/llvm-project/lldb/packages/Python/lldbsuite/test/decorators.py", line 110, in wrapper func(*args, **kwargs) File "/Users/buildslave/jenkins/workspace/lldb-cmake-sanitized/llvm-project/lldb/test/API/python_api/thread/TestThreadAPI.py", line 50, in test_step_out_of_malloc_into_function_b self.step_out_of_malloc_into_function_b(self.exe_name) File "/Users/buildslave/jenkins/workspace/lldb-cmake-sanitized/llvm-project/lldb/test/API/python_api/thread/TestThreadAPI.py", line 157, in step_out_of_malloc_into_function_b thread.IsValid(), AttributeError: 'NoneType' object has no attribute 'IsValid' Config=x86_64-/Users/buildslave/jenkins/workspace/lldb-cmake-sanitized/lldb-build/bin/clang-11 ====================================================================== ERROR: test_step_out_of_malloc_into_function_b_gmodules (TestThreadAPI.ThreadAPITestCase) Test Python SBThread.StepOut() API to step out of a malloc call where the call site is at function b(). ---------------------------------------------------------------------- Traceback (most recent call last): File "/Users/buildslave/jenkins/workspace/lldb-cmake-sanitized/llvm-project/lldb/packages/Python/lldbsuite/test/lldbtest.py", line 1751, in test_method return attrvalue(self) File "/Users/buildslave/jenkins/workspace/lldb-cmake-sanitized/llvm-project/lldb/packages/Python/lldbsuite/test/decorators.py", line 110, in wrapper func(*args, **kwargs) File "/Users/buildslave/jenkins/workspace/lldb-cmake-sanitized/llvm-project/lldb/packages/Python/lldbsuite/test/decorators.py", line 110, in wrapper func(*args, **kwargs) File "/Users/buildslave/jenkins/workspace/lldb-cmake-sanitized/llvm-project/lldb/packages/Python/lldbsuite/test/decorators.py", line 110, in wrapper func(*args, **kwargs) File "/Users/buildslave/jenkins/workspace/lldb-cmake-sanitized/llvm-project/lldb/test/API/python_api/thread/TestThreadAPI.py", line 50, in test_step_out_of_malloc_into_function_b self.step_out_of_malloc_into_function_b(self.exe_name) File "/Users/buildslave/jenkins/workspace/lldb-cmake-sanitized/llvm-project/lldb/test/API/python_api/thread/TestThreadAPI.py", line 157, in step_out_of_malloc_into_function_b thread.IsValid(), AttributeError: 'NoneType' object has no attribute 'IsValid' Config=x86_64-/Users/buildslave/jenkins/workspace/lldb-cmake-sanitized/lldb-build/bin/clang-11 ---------------------------------------------------------------------- Ran 20 tests in 40.370s

Hide Details

RESULT: FAILED (12 passes, 0 failures, 3 errors, 5 skipped, 0 expected failures, 0 unexpected successes)

Hide Details

--

Hide Details

******************** PASS: lldb-api :: functionalities/thread/jump/TestThreadJump.py (1365 of 1979) PASS: lldb-unit :: Host/./HostTests/File.GetWaitableHandleFileno (1366 of 1979) PASS: lldb-api :: functionalities/recursion/TestValueObjectRecursion.py (1367 of 1979) PASS: lldb-api :: functionalities/memory/read/TestMemoryRead.py (1368 of 1979) PASS: lldb-unit :: Utility/./UtilityTests/ArchSpecTest.MergeFrom (1369 of 1979) PASS: lldb-api :: python_api/default-constructor/TestDefaultConstructorForAPIObjects.py (1370 of 1979) PASS: lldb-api :: lang/c/find_struct_type/TestFindStructTypes.py (1371 of 1979) PASS: lldb-shell :: Reproducer/Functionalities/TestExpressionEvaluation.test (1372 of 1979) PASS: lldb-api :: functionalities/tail_call_frames/sbapi_support/TestTailCallFrameSBAPI.py (1373 of 1979) PASS: lldb-api :: python_api/sbvalue_persist/TestSBValuePersist.py (1374 of 1979) PASS: lldb-shell :: SymbolFile/DWARF/anon_class_w_and_wo_export_symbols.ll (1375 of 1979) PASS: lldb-api :: functionalities/data-formatter/data-formatter-stl/libcxx/unordered/TestDataFormatterUnordered.py (1376 of 1979) PASS: lldb-unit :: Language/Highlighting/./HighlighterTests/HighlighterTest.Keywords (1377 of 1979) PASS: lldb-api :: commands/gui/invalid-args/TestInvalidArgsGui.py (1378 of 1979) PASS: lldb-api :: functionalities/breakpoint/breakpoint_command/TestRegexpBreakCommand.py (1379 of 1979) PASS: lldb-api :: lang/objc/objc-ivar-protocols/TestIvarProtocols.py (1380 of 1979) PASS: lldb-api :: lang/c/local_types/TestUseClosestType.py (1381 of 1979) PASS: lldb-shell :: SymbolFile/DWARF/debug_rnglists-dwo.s (1382 of 1979) PASS: lldb-unit :: Utility/./UtilityTests/RangeTest.ContainsAddrInvalid (1383 of 1979) PASS: lldb-unit :: Utility/./UtilityTests/UriParserTest.BracketedHostname (1384 of 1979) PASS: lldb-api :: macosx/queues/TestQueues.py (1385 of 1979) PASS: lldb-unit :: Utility/./UtilityTests/IndexToObjectTest.ObjectForIndex (1386 of 1979) PASS: lldb-shell :: SymbolFile/DWARF/debug_ranges-missing-section.s (1387 of 1979) PASS: lldb-api :: lang/c/anonymous/TestAnonymous.py (1388 of 1979) PASS: lldb-api :: python_api/section/TestSectionAPI.py (1389 of 1979) PASS: lldb-unit :: UnwindAssembly/x86/./UnwindAssemblyx86Tests/Testx86AssemblyInspectionEngine.TestPushRBPWithREX (1390 of 1979) PASS: lldb-unit :: Host/./HostTests/NativeProcessProtocolTest.ReadMemoryWithoutTrap (1391 of 1979) PASS: lldb-shell :: Reproducer/TestDSYM.test (1392 of 1979) PASS: lldb-api :: arm/emulation/TestEmulations.py (1393 of 1979) PASS: lldb-unit :: Process/gdb-remote/./ProcessGdbRemoteTests/GDBRemoteCommunicationClientTest.TestPacketSpeedJSON (1394 of 1979) PASS: lldb-api :: lang/c/tls_globals/TestTlsGlobals.py (1395 of 1979) PASS: lldb-api :: commands/expression/completion-in-lambda-and-unnamed-class/TestCompletionInLambdaAndUnnamedClass.py (1396 of 1979) PASS: lldb-unit :: Process/gdb-remote/./ProcessGdbRemoteTests/GDBRemoteClientBaseTest.SendContinueAndAsyncPacket (1397 of 1979) PASS: lldb-unit :: Host/./HostTests/SocketTest.TCPListen0GetPort (1398 of 1979) UNSUPPORTED: lldb-shell :: Register/x86-gp-write.test (1399 of 1979) PASS: lldb-unit :: Process/minidump/./LLDBMinidumpTests/MinidumpParserTest.GetPidWow64 (1400 of 1979) PASS: lldb-api :: macosx/universal/TestUniversal.py (1401 of 1979) PASS: lldb-api :: functionalities/data-formatter/data-formatter-stl/libcxx/initializerlist/TestInitializerList.py (1402 of 1979) PASS: lldb-api :: commands/expression/completion-crash-incomplete-record/TestCompletionCrashIncompleteRecord.py (1403 of 1979) PASS: lldb-unit :: Utility/./UtilityTests/FileSpecTest.Equal (1404 of 1979) PASS: lldb-unit :: Process/minidump/./LLDBMinidumpTests/MinidumpParserTest.GetExceptionStream (1405 of 1979) PASS: lldb-unit :: Host/./HostTests/FileSystemTest.FileAndDirectoryComponents (1406 of 1979) PASS: lldb-api :: commands/expression/import-std-module/conflicts/TestStdModuleWithConflicts.py (1407 of 1979) PASS: lldb-unit :: Utility/./UtilityTests/StructuredDataTest.ParseJSONFromFile (1408 of 1979) PASS: lldb-unit :: Utility/./UtilityTests/ConstStringTest.UpdateMangledCounterpart (1409 of 1979) PASS: lldb-unit :: ScriptInterpreter/Python/./ScriptInterpreterPythonTests/PythonDataObjectsTest.TestPythonString (1410 of 1979) PASS: lldb-api :: lang/objc/objc++/TestObjCXX.py (1411 of 1979) PASS: lldb-api :: lang/objc/objc-foundation-dictionary-empty/TestNSDictionary0.py (1412 of 1979) PASS: lldb-unit :: Utility/./UtilityTests/StreamTest.PutULEB128 (1413 of 1979) UNSUPPORTED: lldb-shell :: SymbolFile/PDB/function-nested-block.test (1414 of 1979) PASS: lldb-unit :: debugserver/./debugserverTests/RNBSocket.LoopBackConnectIPv4 (1415 of 1979) PASS: lldb-unit :: Utility/./UtilityTests/DataExtractorTest.GetMaxU64_unchecked (1416 of 1979) PASS: lldb-api :: lang/objc/objc-builtin-types/TestObjCBuiltinTypes.py (1417 of 1979) PASS: lldb-unit :: Utility/./UtilityTests/NameMatchesTest.Contains (1418 of 1979) PASS: lldb-api :: lang/objc/foundation/TestObjCMethodsNSError.py (1419 of 1979) PASS: lldb-unit :: Utility/./UtilityTests/StreamTeeTest.SetStreamAtIndexOverwrite (1420 of 1979) PASS: lldb-api :: commands/expression/import-std-module/empty-module/TestEmptyStdModule.py (1421 of 1979) PASS: lldb-unit :: UnwindAssembly/x86/./UnwindAssemblyx86Tests/Testx86AssemblyInspectionEngine.TestSpillRegToStackViaMOVi386 (1422 of 1979) PASS: lldb-api :: commands/expression/import-std-module/weak_ptr/TestWeakPtrFromStdModule.py (1423 of 1979) PASS: lldb-api :: commands/expression/deleting-implicit-copy-constructor/TestDeletingImplicitCopyConstructor.py (1424 of 1979) PASS: lldb-api :: functionalities/data-formatter/data-formatter-stl/libcxx/variant/TestDataFormatterLibcxxVariant.py (1425 of 1979) PASS: lldb-api :: python_api/watchpoint/watchlocation/TestSetWatchlocation.py (1426 of 1979) PASS: lldb-api :: python_api/lldbutil/TestSwigVersion.py (1427 of 1979) PASS: lldb-unit :: Utility/./UtilityTests/RangeTest.ContainsEndInclusive (1428 of 1979) PASS: lldb-unit :: Process/minidump/./LLDBMinidumpTests/RegisterContextMinidump.CheckRegisterContextMinidump_ARM (1429 of 1979) UNSUPPORTED: lldb-api :: commands/register/register/intel_xtended_registers/TestMPXRegisters.py (1430 of 1979) UNSUPPORTED: lldb-api :: python_api/event/TestEvents.py (1431 of 1979) PASS: lldb-api :: python_api/sbtype_typeclass/TestSBTypeTypeClass.py (1432 of 1979) UNSUPPORTED: lldb-shell :: SymbolFile/NativePDB/local-variables.cpp (1433 of 1979) UNSUPPORTED: lldb-shell :: Register/aarch64-fp-read.test (1434 of 1979) PASS: lldb-unit :: Language/Highlighting/./HighlighterTests/HighlighterTest.ClangIdentifiers (1435 of 1979) PASS: lldb-shell :: SymbolFile/DWARF/forward-declarations.s (1436 of 1979) PASS: lldb-unit :: Language/Highlighting/./HighlighterTests/HighlighterTest.ClangCursorPosInOtherToken (1437 of 1979) PASS: lldb-api :: python_api/watchpoint/condition/TestWatchpointConditionAPI.py (1438 of 1979) PASS: lldb-unit :: Utility/./UtilityTests/ArgsTest.TestArgv (1439 of 1979) PASS: lldb-shell :: SymbolFile/NativePDB/global-classes.cpp (1440 of 1979) PASS: lldb-unit :: Host/./HostTests/FileSystemTest.MakeAbsolute (1441 of 1979) PASS: lldb-unit :: Utility/./UtilityTests/VASprintfTest.NoBufferResize (1442 of 1979) PASS: lldb-api :: functionalities/thread/concurrent_events/TestConcurrentCrashWithWatchpoint.py (1443 of 1979) PASS: lldb-unit :: Expression/./ExpressionTests/DiagnosticManagerTest.GetStringMultipleDiags (1444 of 1979) PASS: lldb-unit :: Process/gdb-remote/./ProcessGdbRemoteTests/GDBRemoteCommunicationClientTest.SendSignalsToIgnore (1445 of 1979) UNSUPPORTED: lldb-api :: functionalities/darwin_log/filter/exact_match/message/TestDarwinLogFilterMatchMessage.py (1446 of 1979) PASS: lldb-shell :: ObjectFile/ELF/netbsd-exec-8.99.30-amd64.yaml (1447 of 1979) UNSUPPORTED: lldb-shell :: Register/x86-ymm-read.test (1448 of 1979) PASS: lldb-unit :: UnwindAssembly/x86/./UnwindAssemblyx86Tests/Testx86AssemblyInspectionEngine.TestPopEDI (1449 of 1979) PASS: lldb-unit :: UnwindAssembly/x86/./UnwindAssemblyx86Tests/Testx86AssemblyInspectionEngine.TestDisassemblyMidFunctionEpilogues (1450 of 1979) PASS: lldb-shell :: SymbolFile/DWARF/DW_AT_loclists_base.s (1451 of 1979) PASS: lldb-unit :: Process/gdb-remote/./ProcessGdbRemoteTests/GDBRemoteCommunicationServerTest.SendErrorResponse_StringError (1452 of 1979) PASS: lldb-shell :: Reproducer/TestCaptureEnvOverride.test (1453 of 1979) PASS: lldb-api :: functionalities/thread/create_after_attach/TestCreateAfterAttach.py (1454 of 1979) PASS: lldb-shell :: BuildScript/compiler-full-path.test (1455 of 1979) PASS: lldb-api :: tools/lldb-server/TestGdbRemote_qThreadStopInfo.py (1456 of 1979) PASS: lldb-shell :: SymbolFile/DWARF/DW_OP_piece-smaller-than-struct.s (1457 of 1979) PASS: lldb-unit :: SymbolFile/DWARF/./SymbolFileDWARFTests/SymbolFileDWARFTests.TestAbbrevOutOfOrder (1458 of 1979) PASS: lldb-unit :: Utility/./UtilityTests/StreamTest.PutChar (1459 of 1979) PASS: lldb-unit :: Expression/./ExpressionTests/DiagnosticManagerTest.GetStringMultiline (1460 of 1979) PASS: lldb-api :: lang/c/stepping/TestThreadStepping.py (1461 of 1979) PASS: lldb-api :: functionalities/gdb_remote_client/TestJLink6Armv7RegisterDefinition.py (1462 of 1979) PASS: lldb-shell :: ObjectFile/ELF/PT_LOAD-overlap-PT_INTERP.yaml (1463 of 1979) PASS: lldb-shell :: Commands/command-regex-delete.test (1464 of 1979) PASS: lldb-api :: functionalities/data-formatter/data-formatter-objc/TestDataFormatterObjCKVO.py (1465 of 1979) PASS: lldb-unit :: Utility/./UtilityTests/RangeDataVector.FindEntryThatContains_Overlap (1466 of 1979) PASS: lldb-api :: lang/cpp/class-template-parameter-pack/TestClassTemplateParameterPack.py (1467 of 1979) PASS: lldb-unit :: Utility/./UtilityTests/StringExtractorTest.GetHexU8_Exact (1468 of 1979) PASS: lldb-shell :: Breakpoint/single-file-split-dwarf.test (1469 of 1979) PASS: lldb-unit :: Utility/./UtilityTests/OptionsWithRawTest.EmptySuffixSingleWhitespace (1470 of 1979) PASS: lldb-unit :: Host/./HostTests/MainLoopTest.Signal (1471 of 1979) PASS: lldb-shell :: ObjectFile/PECOFF/section-types.yaml (1472 of 1979) PASS: lldb-shell :: Minidump/memory-region-from-module.yaml (1473 of 1979) PASS: lldb-api :: functionalities/tail_call_frames/disambiguate_tail_call_seq/TestDisambiguateTailCallSeq.py (1474 of 1979) PASS: lldb-api :: functionalities/archives/TestBSDArchives.py (1475 of 1979) PASS: lldb-unit :: Utility/./UtilityTests/DataExtractorTest.GetBitfield (1476 of 1979) PASS: lldb-api :: functionalities/thread/concurrent_events/TestConcurrentTwoBreakpointsOneDelaySignal.py (1477 of 1979) PASS: lldb-api :: functionalities/breakpoint/hardware_breakpoints/hardware_breakpoint_on_multiple_threads/TestHWBreakMultiThread.py (1478 of 1979) PASS: lldb-api :: functionalities/data-formatter/nsarraysynth/TestNSArraySynthetic.py (1479 of 1979) PASS: lldb-unit :: Utility/./UtilityTests/BinaryStreamTest.PutSLEB128SixBytes (1480 of 1979) PASS: lldb-api :: functionalities/tail_call_frames/thread_step_out_message/TestArtificialFrameStepOutMessage.py (1481 of 1979) PASS: lldb-unit :: Process/gdb-remote/./ProcessGdbRemoteTests/GDBRemoteCommunicationClientTest.GetModulesInfo_UUID20 (1482 of 1979) PASS: lldb-api :: lang/cpp/scope/TestCppScope.py (1483 of 1979) PASS: lldb-unit :: debugserver/./debugserverTests/RNBSocket.LoopBackListenIPv6 (1484 of 1979) PASS: lldb-api :: functionalities/data-formatter/array_typedef/TestArrayTypedef.py (1485 of 1979) UNSUPPORTED: lldb-shell :: BuildScript/toolchain-clang-cl.test (1486 of 1979) PASS: lldb-api :: lang/objc/objc-ivar-stripped/TestObjCIvarStripped.py (1487 of 1979) PASS: lldb-api :: tools/lldb-server/TestAppleSimulatorOSType.py (1488 of 1979) UNSUPPORTED: lldb-shell :: SymbolFile/PDB/type-quals.test (1489 of 1979) PASS: lldb-unit :: UnwindAssembly/x86/./UnwindAssemblyx86Tests/Testx86AssemblyInspectionEngine.TestPopRBPWithREX (1490 of 1979) PASS: lldb-unit :: Utility/./UtilityTests/CompletionRequest.TryCompleteCurrentArgBad (1491 of 1979) PASS: lldb-api :: functionalities/thread/backtrace_limit/TestBacktraceLimit.py (1492 of 1979) PASS: lldb-api :: functionalities/thread/concurrent_events/TestConcurrentTwoWatchpointThreads.py (1493 of 1979) PASS: lldb-unit :: Utility/./UtilityTests/UriParserTest.MinimalPort (1494 of 1979) PASS: lldb-api :: functionalities/data-formatter/stringprinter/TestStringPrinter.py (1495 of 1979) PASS: lldb-shell :: Minidump/memory-region.yaml (1496 of 1979) PASS: lldb-unit :: Symbol/./SymbolTests/TestClangASTImporter.DeportTypeTagDecl (1497 of 1979) PASS: lldb-api :: lang/objcxx/class-name-clash/TestNameClash.py (1498 of 1979) PASS: lldb-unit :: SymbolFile/NativePDB/./SymbolFileNativePDBTests/PDBFPOProgramToDWARFExpressionTests.InvalidOpUnary (1499 of 1979) PASS: lldb-api :: commands/expression/test/TestExprs2.py (1500 of 1979) PASS: lldb-unit :: Utility/./UtilityTests/ArgsTest.TestSingleArg (1501 of 1979) PASS: lldb-shell :: SymbolFile/DWARF/find-qualified-variable.cpp (1502 of 1979) PASS: lldb-shell :: SymbolFile/Breakpad/symtab.test (1503 of 1979) PASS: lldb-api :: lang/cpp/inlines/TestInlines.py (1504 of 1979) PASS: lldb-api :: lang/cpp/diamond/TestDiamond.py (1505 of 1979) PASS: lldb-unit :: Language/Highlighting/./HighlighterTests/HighlighterTest.DefaultHighlighterWithCursor (1506 of 1979) PASS: lldb-unit :: Process/gdb-remote/./ProcessGdbRemoteTests/GDBRemoteCommunicationClientTest.SendGetTraceConfigPacket (1507 of 1979) PASS: lldb-api :: lang/objcxx/cxx-bridged-po/TestObjCXXBridgedPO.py (1508 of 1979) PASS: lldb-shell :: Reproducer/TestPythonImport.test (1509 of 1979) PASS: lldb-api :: functionalities/data-formatter/nsdictionarysynth/TestNSDictionarySynthetic.py (1510 of 1979) PASS: lldb-unit :: Utility/./UtilityTests/ArgsTest.TestSingleArgWithQuotedSpace (1511 of 1979) PASS: lldb-api :: functionalities/inline-stepping/TestInlineStepping.py (1512 of 1979) PASS: lldb-unit :: Utility/./UtilityTests/StringLexerTest.GetUnlexed (1513 of 1979) PASS: lldb-shell :: SymbolFile/DWARF/debug-types-basic.test (1514 of 1979) PASS: lldb-unit :: Process/minidump/./LLDBMinidumpTests/MinidumpParserTest.GetMemoryRegionInfo (1515 of 1979) PASS: lldb-unit :: Utility/./UtilityTests/RegisterValueTest.GetSet8 (1516 of 1979) PASS: lldb-unit :: Signals/./SignalsTests/UnixSignalsTest.Iteration (1517 of 1979) PASS: lldb-api :: lang/objcxx/hide-runtime-values/TestObjCXXHideRuntimeValues.py (1518 of 1979) PASS: lldb-unit :: UnwindAssembly/x86/./UnwindAssemblyx86Tests/Testx86AssemblyInspectionEngine.TestStackRealignMSVC_i386 (1519 of 1979) PASS: lldb-shell :: Quit/TestQuitExitCode0.test (1520 of 1979) PASS: lldb-unit :: Utility/./UtilityTests/StreamTest.AddressRangeEmptyRange (1521 of 1979) PASS: lldb-api :: lang/cpp/chained-calls/TestCppChainedCalls.py (1522 of 1979) PASS: lldb-api :: commands/expression/pr35310/TestExprsBug35310.py (1523 of 1979) PASS: lldb-unit :: Language/Highlighting/./HighlighterTests/HighlighterTest.HighlighterSelectionType (1524 of 1979) PASS: lldb-unit :: Utility/./UtilityTests/ScalarTest.Equality (1525 of 1979) PASS: lldb-api :: functionalities/gdb_remote_client/TestIOSSimulator.py (1526 of 1979) PASS: lldb-unit :: Utility/./UtilityTests/UriParserTest.BracketedHostnameWithPortIPv6 (1527 of 1979) PASS: lldb-unit :: ObjectFile/Breakpad/./ObjectFileBreakpadTests/FuncRecord.parse (1528 of 1979) UNSUPPORTED: lldb-shell :: SymbolFile/PDB/compilands.test (1529 of 1979) PASS: lldb-api :: commands/expression/regression-access-function-template-in-record/TestRegressionAccessFunctionTemplateInRecord.py (1530 of 1979) PASS: lldb-unit :: Expression/./ExpressionTests/ClangHostTest.MacOSX (1531 of 1979) PASS: lldb-api :: functionalities/thread/concurrent_events/TestConcurrentDelaySignalBreak.py (1532 of 1979) PASS: lldb-shell :: Reproducer/Functionalities/TestImageList.test (1533 of 1979) PASS: lldb-unit :: Process/minidump/./LLDBMinidumpTests/MinidumpParserTest.GetThreadContext_x86_32_wow64 (1534 of 1979) PASS: lldb-shell :: Quit/TestQuitExitCodeHexA.test (1535 of 1979) PASS: lldb-unit :: Utility/./UtilityTests/OptionsWithRawTest.ArgsButNoDelimiter (1536 of 1979) PASS: lldb-unit :: Utility/./UtilityTests/ReproducerTest.SetCapture (1537 of 1979) PASS: lldb-api :: functionalities/thread/concurrent_events/TestConcurrentWatchpointWithDelayWatchpointThreads.py (1538 of 1979) PASS: lldb-api :: functionalities/breakpoint/consecutive_breakpoints/TestConsecutiveBreakpoints.py (1539 of 1979) UNSUPPORTED: lldb-shell :: Register/x86-64-ymm16-read.test (1540 of 1979) PASS: lldb-unit :: Utility/./UtilityTests/TimeoutTest.Format (1541 of 1979) PASS: lldb-unit :: ScriptInterpreter/Python/./ScriptInterpreterPythonTests/PythonDataObjectsTest.TestPythonListManipulation (1542 of 1979) PASS: lldb-unit :: Utility/./UtilityTests/RangeDataVector.CustomSort (1543 of 1979) PASS: lldb-api :: types/TestFloatTypesExpr.py (1544 of 1979) PASS: lldb-shell :: SymbolFile/Breakpad/symtab-macho.test (1545 of 1979) PASS: lldb-unit :: Utility/./UtilityTests/StringListTest.LongestCommonPrefixEmpty (1546 of 1979) PASS: lldb-unit :: Utility/./UtilityTests/ArgsTest.TestInsertArg (1547 of 1979) PASS: lldb-unit :: Core/./LLDBCoreTests/UniqueCStringMap.NoDefaultConstructor (1548 of 1979) PASS: lldb-unit :: Utility/./UtilityTests/StreamTest.ShiftOperatorChars (1549 of 1979) PASS: lldb-api :: lang/c/function_types/TestFunctionTypes.py (1550 of 1979) UNSUPPORTED: lldb-api :: functionalities/tsan/global_location/TestTsanGlobalLocation.py (1551 of 1979) PASS: lldb-api :: lang/objc/modules-app-update/TestClangModulesAppUpdate.py (1552 of 1979) UNSUPPORTED: lldb-shell :: Register/x86-ymm-write.test (1553 of 1979) UNSUPPORTED: lldb-api :: functionalities/param_entry_vals/basic_entry_values_x86_64/TestBasicEntryValuesX86_64.py (1554 of 1979) PASS: lldb-api :: python_api/symbol-context/TestSymbolContext.py (1555 of 1979) PASS: lldb-api :: functionalities/set-data/TestSetData.py (1556 of 1979) PASS: lldb-api :: tools/lldb-server/TestGdbRemoteSingleStep.py (1557 of 1979) UNSUPPORTED: lldb-shell :: Register/x86-zmm-write.test (1558 of 1979) PASS: lldb-unit :: Symbol/./SymbolTests/TestTypeSystemClang.TestFunctionTemplateInRecordConstruction (1559 of 1979) PASS: lldb-api :: functionalities/gdb_remote_client/TestNoWatchpointSupportInfo.py (1560 of 1979) PASS: lldb-api :: functionalities/data-formatter/data-formatter-objc/TestDataFormatterObjCPlain.py (1561 of 1979) PASS: lldb-unit :: Utility/./UtilityTests/SubsystemRAIITest.SubsystemWithErrorFailure (1562 of 1979) PASS: lldb-api :: functionalities/memory-region/TestMemoryRegion.py (1563 of 1979) PASS: lldb-unit :: Utility/./UtilityTests/ArchSpecTest.TestParseMachCPUDashSubtypeTripleExtra (1564 of 1979) PASS: lldb-api :: functionalities/breakpoint/breakpoint_conditions/TestBreakpointConditions.py (1565 of 1979) PASS: lldb-unit :: Language/Highlighting/./HighlighterTests/HighlighterTest.ClangTrailingBackslashWithWhitespace (1566 of 1979) PASS: lldb-unit :: Utility/./UtilityTests/VMRange.CollectionContains (1567 of 1979) PASS: lldb-shell :: SymbolFile/DWARF/debug_loc.s (1568 of 1979) PASS: lldb-api :: commands/command/nested_alias/TestNestedAlias.py (1569 of 1979) PASS: lldb-unit :: Utility/./UtilityTests/StreamTest.PutHex8 (1570 of 1979) PASS: lldb-unit :: Utility/./UtilityTests/StringListTest.Assignment (1571 of 1979) UNSUPPORTED: lldb-api :: functionalities/darwin_log/filter/exact_match/subsystem/TestDarwinLogFilterMatchSubsystem.py (1572 of 1979) PASS: lldb-unit :: Expression/./ExpressionTests/CppModuleConfigurationTest.MissingLibCpp (1573 of 1979) PASS: lldb-unit :: Host/./HostTests/HostInfoTest.GetAugmentedArchSpec (1574 of 1979) PASS: lldb-api :: functionalities/data-formatter/data-formatter-ptr-to-array/TestPtrToArrayFormatting.py (1575 of 1979) PASS: lldb-api :: lang/c/register_variables/TestRegisterVariables.py (1576 of 1979) PASS: lldb-shell :: Breakpoint/case-sensitive.test (1577 of 1979) PASS: lldb-api :: lang/c/modules/TestCModules.py (1578 of 1979) PASS: lldb-unit :: Utility/./UtilityTests/StringExtractorTest.GetHexU8_InvalidHex (1579 of 1979) PASS: lldb-api :: commands/expression/call-throws/TestCallThatThrows.py (1580 of 1979) PASS: lldb-api :: python_api/sbdata/TestSBData.py (1581 of 1979) PASS: lldb-shell :: SymbolFile/DWARF/debug-types-dwo-cross-reference.cpp (1582 of 1979) PASS: lldb-shell :: ObjectFile/ELF/section-addresses.yaml (1583 of 1979) PASS: lldb-api :: lang/objc/objc-static-method-stripped/TestObjCStaticMethodStripped.py (1584 of 1979) PASS: lldb-api :: api/command-return-object/TestSBCommandReturnObject.py (1585 of 1979) PASS: lldb-unit :: Utility/./UtilityTests/NameMatchesTest.RegularExpression (1586 of 1979) PASS: lldb-api :: functionalities/gdb_remote_client/TestRegDefinitionInParts.py (1587 of 1979) PASS: lldb-unit :: UnwindAssembly/x86/./UnwindAssemblyx86Tests/Testx86AssemblyInspectionEngine.Test64bitFramelessBigStackFrame (1588 of 1979) PASS: lldb-api :: commands/expression/vector_of_enums/TestVectorOfEnums.py (1589 of 1979) PASS: lldb-unit :: Utility/./UtilityTests/StringListTest.Join (1590 of 1979) PASS: lldb-shell :: SymbolFile/NativePDB/function-types-calling-conv.cpp (1591 of 1979) PASS: lldb-unit :: Utility/./UtilityTests/LogChannelTest.Disable (1592 of 1979) PASS: lldb-unit :: Utility/./UtilityTests/UriParserTest.LongPath (1593 of 1979) PASS: lldb-api :: commands/expression/import-std-module/vector-dbg-info-content/TestDbgInfoContentVectorFromStdModule.py (1594 of 1979) PASS: lldb-shell :: Expr/TestMultilineExpr.test (1595 of 1979) PASS: lldb-unit :: Utility/./UtilityTests/StringListTest.AppendList (1596 of 1979) PASS: lldb-unit :: Host/./HostTests/ConnectionFileDescriptorTest.TCPGetURIv6 (1597 of 1979) PASS: lldb-shell :: ObjectFile/ELF/aarch64-relocations.yaml (1598 of 1979) PASS: lldb-api :: functionalities/thread/concurrent_events/TestConcurrentSignalDelayBreak.py (1599 of 1979) PASS: lldb-api :: commands/command/delete/TestCommandDelete.py (1600 of 1979) PASS: lldb-api :: commands/frame/diagnose/virtual-method-call/TestDiagnoseDereferenceVirtualMethodCall.py (1601 of 1979) PASS: lldb-shell :: ObjectFile/PECOFF/invalid-export-table.yaml (1602 of 1979) PASS: lldb-unit :: Process/minidump/./LLDBMinidumpTests/MinidumpParserTest.GetThreadContext_x86_64 (1603 of 1979) UNSUPPORTED: lldb-api :: functionalities/darwin_log/filter/regex/message/TestDarwinLogFilterRegexMessage.py (1604 of 1979) PASS: lldb-unit :: Expression/./ExpressionTests/DiagnosticManagerTest.HasFixits (1605 of 1979) PASS: lldb-shell :: Breakpoint/debug_rnglistx_rlex.test (1606 of 1979) PASS: lldb-unit :: Utility/./UtilityTests/GeneratorTest.Create (1607 of 1979) PASS: lldb-api :: commands/expression/argument_passing_restrictions/TestArgumentPassingRestrictions.py (1608 of 1979) UNSUPPORTED: lldb-shell :: Process/Windows/exception_access_violation.cpp (1609 of 1979) PASS: lldb-api :: functionalities/breakpoint/require_hw_breakpoints/TestRequireHWBreakpoints.py (1610 of 1979) PASS: lldb-unit :: Target/./TargetTests/ModuleCacheTest.GetAndPut (1611 of 1979) PASS: lldb-unit :: Utility/./UtilityTests/SerializationRountripTest.SerializeDeserializeCStringArrayNullptr (1612 of 1979) PASS: lldb-unit :: Utility/./UtilityTests/StringListTest.InsertStringAtIndexMove (1613 of 1979) PASS: lldb-shell :: Settings/TestDisableColor.test (1614 of 1979) PASS: lldb-api :: macosx/duplicate-archive-members/TestDuplicateMembers.py (1615 of 1979) PASS: lldb-api :: commands/expression/ir-interpreter-phi-nodes/TestIRInterpreterPHINodes.py (1616 of 1979) PASS: lldb-unit :: Utility/./UtilityTests/FileSpecTest.Yaml (1617 of 1979) PASS: lldb-unit :: Utility/./UtilityTests/FileSpecTest.EqualSeparator (1618 of 1979) PASS: lldb-unit :: Utility/./UtilityTests/DataExtractorTest.GetMaxS64 (1619 of 1979) PASS: lldb-api :: commands/expression/completion/TestExprCompletion.py (1620 of 1979) UNSUPPORTED: lldb-shell :: Register/aarch64-gp-read.test (1621 of 1979) UNSUPPORTED: lldb-api :: tools/lldb-server/TestGdbRemoteModuleInfo.py (1622 of 1979) UNSUPPORTED: lldb-api :: commands/watchpoints/multi_watchpoint_slots/TestWatchpointMultipleSlots.py (1623 of 1979) PASS: lldb-api :: python_api/interpreter/TestRunCommandInterpreterAPI.py (1624 of 1979) PASS: lldb-unit :: UnwindAssembly/x86/./UnwindAssemblyx86Tests/Testx86AssemblyInspectionEngine.TestMovRSPtoRBP (1625 of 1979) PASS: lldb-unit :: ScriptInterpreter/Python/./ScriptInterpreterPythonTests/PythonDataObjectsTest.TestInstanceNameResolutionNoDot (1626 of 1979) PASS: lldb-unit :: DataFormatter/./LLDBFormatterTests/FormatManagerTests.CompatibleLangs (1627 of 1979) PASS: lldb-unit :: Expression/./ExpressionTests/DiagnosticManagerTest.AddDiagnostic (1628 of 1979) PASS: lldb-unit :: Utility/./UtilityTests/RegularExpression.Match (1629 of 1979) PASS: lldb-shell :: Breakpoint/debug_rnglist_offset_pair.test (1630 of 1979) PASS: lldb-api :: terminal/TestSTTYBeforeAndAfter.py (1631 of 1979) PASS: lldb-shell :: Reproducer/TestFileRepro.test (1632 of 1979) UNSUPPORTED: lldb-shell :: ScriptInterpreter/Lua/persistent_state.test (1633 of 1979) UNSUPPORTED: lldb-shell :: ScriptInterpreter/Lua/command_script_import.test (1634 of 1979) PASS: lldb-unit :: UnwindAssembly/x86/./UnwindAssemblyx86Tests/Testx86AssemblyInspectionEngine.Testi386IgnoredRegisters (1635 of 1979) PASS: lldb-api :: lang/objc/foundation/TestRuntimeTypes.py (1636 of 1979) PASS: lldb-unit :: Process/gdb-remote/./ProcessGdbRemoteTests/GDBRemoteClientBaseTest.SendContinueAndAsyncSignal (1637 of 1979) PASS: lldb-api :: commands/expression/static-initializers/TestStaticInitializers.py (1638 of 1979) PASS: lldb-api :: functionalities/data-formatter/data-formatter-objc/TestDataFormatterObjNSException.py (1639 of 1979) PASS: lldb-unit :: Platform/./LLDBPlatformTests/PlatformDarwinTest.FindXcodeContentsDirectoryInPath (1640 of 1979) PASS: lldb-unit :: Host/./HostTests/NativeProcessProtocolTest.ReadCStringFromMemory (1641 of 1979) UNSUPPORTED: lldb-api :: arm/breakpoint-it/TestBreakpointIt.py (1642 of 1979) PASS: lldb-unit :: Utility/./UtilityTests/ArgsTest.StringListConstructor (1643 of 1979) PASS: lldb-api :: functionalities/fat_archives/TestFatArchives.py (1644 of 1979) PASS: lldb-api :: commands/settings/quoting/TestQuoting.py (1645 of 1979) PASS: lldb-shell :: Reproducer/TestRelativePath.test (1646 of 1979) PASS: lldb-unit :: Utility/./UtilityTests/UriParserTest.BracketedHostnameWithColon (1647 of 1979) UNSUPPORTED: lldb-api :: functionalities/darwin_log/filter/exact_match/category/TestDarwinLogFilterMatchCategory.py (1648 of 1979) PASS: lldb-shell :: ObjectFile/MachO/symtab.yaml (1649 of 1979) PASS: lldb-unit :: Utility/./UtilityTests/ArgsTest.ReplaceArgumentAtIndexShort (1650 of 1979) PASS: lldb-unit :: Utility/./UtilityTests/AnsiTerminal.WhiteSpace (1651 of 1979) PASS: lldb-api :: functionalities/abbreviation/TestAbbreviations.py (1652 of 1979) PASS: lldb-shell :: Quit/TestQuitExitCodeTooManyArgs.test (1653 of 1979) PASS: lldb-unit :: ObjectFile/ELF/./ObjectFileELFTests/ObjectFileELFTest.GetSymtab_NoSymEntryPointArmAddressClass (1654 of 1979) PASS: lldb-unit :: Symbol/./SymbolTests/TestClangASTImporter.MetadataPropagationIndirectImport (1655 of 1979) UNSUPPORTED: lldb-shell :: SymbolFile/PDB/ast-restore.test (1656 of 1979) PASS: lldb-unit :: Breakpoint/./LLDBBreakpointTests/BreakpointIDTest.StringIsBreakpointName (1657 of 1979) PASS: lldb-unit :: Utility/./UtilityTests/VMRange.ContainsAddr (1658 of 1979) PASS: lldb-api :: commands/expression/context-object/TestContextObject.py (1659 of 1979) PASS: lldb-unit :: Symbol/./SymbolTests/TestClangASTImporter.MetadataPropagationAfterCopying (1660 of 1979) PASS: lldb-unit :: Utility/./UtilityTests/StringListTest.ForRange (1661 of 1979) PASS: lldb-unit :: Process/gdb-remote/./ProcessGdbRemoteTests/GDBRemoteCommunicationClientTest.GetMemoryRegionInfoInvalidResponse (1662 of 1979) PASS: lldb-api :: functionalities/gdb_remote_client/TestTargetXMLArch.py (1663 of 1979) PASS: lldb-api :: python_api/debugger/TestDebuggerAPI.py (1664 of 1979) PASS: lldb-unit :: Utility/./UtilityTests/CompletionRequest.TryCompleteCurrentArgMode (1665 of 1979) PASS: lldb-unit :: Utility/./UtilityTests/ConstStringTest.NullAndEmptyStates (1666 of 1979) PASS: lldb-api :: python_api/lldbutil/frame/TestFrameUtils.py (1667 of 1979) PASS: lldb-shell :: VSCode/TestOptions.test (1668 of 1979) PASS: lldb-unit :: Symbol/./SymbolTests/TestTypeSystemClang.TestDeletingImplicitCopyCstrDueToMoveCStr (1669 of 1979) PASS: lldb-api :: functionalities/data-formatter/ptr_ref_typedef/TestPtrRef2Typedef.py (1670 of 1979) PASS: lldb-unit :: Utility/./UtilityTests/LogTest.Register (1671 of 1979) PASS: lldb-api :: commands/expression/import-std-module/forward_list/TestForwardListFromStdModule.py (1672 of 1979) PASS: lldb-api :: functionalities/type_completion/TestTypeCompletion.py (1673 of 1979) PASS: lldb-unit :: Expression/./ExpressionTests/DiagnosticManagerTest.GetStringNoDiags (1674 of 1979) PASS: lldb-unit :: Utility/./UtilityTests/BinaryStreamTest.PutSLEB128MaxValue (1675 of 1979) PASS: lldb-unit :: Utility/./UtilityTests/BinaryStreamTest.PutULEB128SevenBytes (1676 of 1979) PASS: lldb-unit :: Utility/./UtilityTests/FileSpecTest.OperatorBool (1677 of 1979) PASS: lldb-api :: lang/c/conflicting-symbol/TestConflictingSymbol.py (1678 of 1979) PASS: lldb-unit :: ObjectFile/Breakpad/./ObjectFileBreakpadTests/FileRecord.parse (1679 of 1979) PASS: lldb-api :: commands/platform/basic/TestPlatformCommand.py (1680 of 1979) UNSUPPORTED: lldb-api :: linux/thread/create_during_instruction_step/TestCreateDuringInstructionStep.py (1681 of 1979) PASS: lldb-api :: functionalities/postmortem/minidump-new/TestMiniDumpUUID.py (1682 of 1979) PASS: lldb-api :: functionalities/thread/concurrent_events/TestConcurrentNWatchNBreak.py (1683 of 1979) PASS: lldb-unit :: Utility/./UtilityTests/BinaryStreamTest.PutULEB128EightBytes (1684 of 1979) PASS: lldb-unit :: Utility/./UtilityTests/StringExtractorTest.DecodeHexU8_Underflow2 (1685 of 1979) PASS: lldb-shell :: ScriptInterpreter/Python/crashlog.test (1686 of 1979) UNSUPPORTED: lldb-api :: functionalities/data-formatter/data-formatter-stl/libstdcpp/map/TestDataFormatterStdMap.py (1687 of 1979) UNSUPPORTED: lldb-api :: benchmarks/stepping/TestSteppingSpeed.py (1688 of 1979) PASS: lldb-unit :: Process/gdb-remote/./ProcessGdbRemoteTests/GDBRemoteCommunicationServerTest.SendErrorResponse_Status (1689 of 1979) PASS: lldb-unit :: SymbolFile/DWARF/./SymbolFileDWARFTests/SymbolFileDWARFTests.TestAbbrevOrder1Start5 (1690 of 1979) PASS: lldb-api :: functionalities/inferior-assert/TestInferiorAssert.py (1691 of 1979) PASS: lldb-api :: functionalities/gdb_remote_client/TestWriteMemory.py (1692 of 1979) PASS: lldb-api :: functionalities/breakpoint/address_breakpoints/TestBadAddressBreakpoints.py (1693 of 1979) PASS: lldb-unit :: Process/minidump/./LLDBMinidumpTests/MinidumpParserTest.GetMemoryRegionInfoLinuxMaps (1694 of 1979) UNSUPPORTED: lldb-shell :: ScriptInterpreter/Lua/watchpoint_callback.test (1695 of 1979) PASS: lldb-unit :: Utility/./UtilityTests/DataExtractorTest.UncommonAddressSize (1696 of 1979) PASS: lldb-api :: commands/expression/import-std-module/list-dbg-info-content/TestDbgInfoContentListFromStdModule.py (1697 of 1979) PASS: lldb-unit :: Utility/./UtilityTests/FileSpecTest.EqualDotsWindows (1698 of 1979) PASS: lldb-unit :: Utility/./UtilityTests/ArgsTest.TestTrailingBackslash (1699 of 1979) PASS: lldb-api :: lang/objc/objc-struct-argument/TestObjCStructArgument.py (1700 of 1979) PASS: lldb-shell :: Reproducer/Modules/TestModuleCXX.test (1701 of 1979) PASS: lldb-api :: functionalities/data-formatter/data-formatter-disabling/TestDataFormatterDisabling.py (1702 of 1979) PASS: lldb-unit :: Utility/./UtilityTests/AnsiTerminal.Twice (1703 of 1979) PASS: lldb-api :: commands/expression/rdar42038760/TestScalarURem.py (1704 of 1979) PASS: lldb-shell :: BuildScript/script-args.test (1705 of 1979) PASS: lldb-api :: functionalities/tail_call_frames/ambiguous_tail_call_seq2/TestAmbiguousTailCallSeq2.py (1706 of 1979) UNSUPPORTED: lldb-shell :: ScriptInterpreter/Lua/convenience_variables.test (1707 of 1979) PASS: lldb-api :: commands/expression/function_template_specialization_temp_args/TestFunctionTemplateSpecializationTempArgs.py (1708 of 1979) PASS: lldb-unit :: Utility/./UtilityTests/ListenerTest.GetEventImmediate (1709 of 1979) PASS: lldb-api :: functionalities/data-formatter/data-formatter-stl/libcxx/queue/TestDataFormatterLibcxxQueue.py (1710 of 1979) PASS: lldb-unit :: Utility/./UtilityTests/StringExtractorTest.GetHexBytesAvail (1711 of 1979) PASS: lldb-shell :: SymbolFile/NativePDB/globals-fundamental.cpp (1712 of 1979) PASS: lldb-api :: functionalities/conditional_break/TestConditionalBreak.py (1713 of 1979) PASS: lldb-unit :: Utility/./UtilityTests/DataExtractorTest.GetCStr (1714 of 1979) PASS: lldb-api :: commands/expression/two-files/TestObjCTypeQueryFromOtherCompileUnit.py (1715 of 1979) UNSUPPORTED: lldb-api :: macosx/macabi/TestMacABImacOSFramework.py (1716 of 1979) PASS: lldb-api :: commands/expression/import-std-module/unique_ptr/TestUniquePtrFromStdModule.py (1717 of 1979) PASS: lldb-shell :: SymbolFile/DWARF/gnu-style-compression.cpp (1718 of 1979) PASS: lldb-unit :: Utility/./UtilityTests/BinaryStreamTest.PutULEB128SixBytes (1719 of 1979) PASS: lldb-api :: linux/builtin_trap/TestBuiltinTrap.py (1720 of 1979) PASS: lldb-unit :: Utility/./UtilityTests/RecordReplayTest.InstrumentedFoo (1721 of 1979) PASS: lldb-api :: commands/expression/import-std-module/deque-basic/TestDequeFromStdModule.py (1722 of 1979) PASS: lldb-api :: sanity/TestSettingSkipping.py (1723 of 1979) PASS: lldb-api :: python_api/sbvalue_const_addrof/TestSBValueConstAddrOf.py (1724 of 1979) PASS: lldb-api :: python_api/watchpoint/TestWatchpointIgnoreCount.py (1725 of 1979) UNSUPPORTED: lldb-shell :: Register/x86-64-xmm16-read.test (1726 of 1979) PASS: lldb-unit :: Utility/./UtilityTests/StringExtractorTest.GetHexU8_Exact_NoEof (1727 of 1979) PASS: lldb-shell :: ObjectFile/ELF/section-overlap.yaml (1728 of 1979) PASS: lldb-api :: python_api/objc_type/TestObjCType.py (1729 of 1979) PASS: lldb-unit :: Process/minidump/./LLDBMinidumpTests/MinidumpParserTest.GetArchitecture (1730 of 1979) UNSUPPORTED: lldb-api :: benchmarks/libcxxlist/TestBenchmarkLibcxxList.py (1731 of 1979) PASS: lldb-api :: functionalities/stats_api/TestStatisticsAPI.py (1732 of 1979) PASS: lldb-api :: commands/expression/namespace_local_var_same_name_obj_c/TestNamespaceLocalVarSameNameObjC.py (1733 of 1979) PASS: lldb-api :: lang/c/enum_types/TestEnumTypes.py (1734 of 1979) PASS: lldb-shell :: SymbolFile/DWARF/debug_ranges.s (1735 of 1979) PASS: lldb-unit :: Utility/./UtilityTests/StringListTest.GetMaxStringLengthDecreasingSize (1736 of 1979) UNSUPPORTED: lldb-api :: commands/register/register/intel_xtended_registers/mpx_bound_violation/TestBoundViolation.py (1737 of 1979) PASS: lldb-api :: functionalities/inferior-crashing/TestInferiorCrashing.py (1738 of 1979) PASS: lldb-api :: functionalities/thread/concurrent_events/TestConcurrentManyWatchpoints.py (1739 of 1979) PASS: lldb-shell :: Minidump/dump-all.test (1740 of 1979) PASS: lldb-api :: functionalities/data-formatter/data-formatter-cpp/TestDataFormatterCpp.py (1741 of 1979) PASS: lldb-unit :: Expression/./ExpressionTests/DWARFExpression.DW_OP_stack_value (1742 of 1979) UNSUPPORTED: lldb-api :: terminal/TestEditline.py (1743 of 1979) PASS: lldb-unit :: Utility/./UtilityTests/StringExtractorTest.GetHexBytes (1744 of 1979) PASS: lldb-api :: lang/cpp/accelerator-table/TestCPPAccelerator.py (1745 of 1979) PASS: lldb-unit :: Target/./TargetTests/PathMappingListTest.RelativeTests (1746 of 1979) PASS: lldb-unit :: Utility/./UtilityTests/TildeExpressionResolver.ResolveFullPath (1747 of 1979) PASS: lldb-api :: lang/cpp/limit-debug-info/TestWithLimitDebugInfo.py (1748 of 1979) PASS: lldb-unit :: Process/minidump/./LLDBMinidumpTests/MinidumpParserTest.GetMemoryRegionInfoFromMemory64List (1749 of 1979) PASS: lldb-unit :: ScriptInterpreter/Python/./ScriptInterpreterPythonTests/PythonDataObjectsTest.TestGlobalNameResolutionWithDot (1750 of 1979) PASS: lldb-unit :: ScriptInterpreter/Python/./ScriptInterpreterPythonTests/PythonDataObjectsTest.TestPythonInteger (1751 of 1979) PASS: lldb-unit :: Target/./TargetTests/ExecutionContextTest.GetByteOrderProcess (1752 of 1979) PASS: lldb-unit :: Core/./LLDBCoreTests/StreamCallbackTest.Callback (1753 of 1979) PASS: lldb-unit :: Utility/./UtilityTests/UriParserTest.BracketedHostnamePort (1754 of 1979) PASS: lldb-unit :: Utility/./UtilityTests/VMRange.ContainsRange (1755 of 1979) PASS: lldb-unit :: Utility/./UtilityTests/BroadcasterTest.BroadcastEvent (1756 of 1979) PASS: lldb-unit :: Language/Highlighting/./HighlighterTests/HighlighterTest.DefaultHighlighterWithCursorOutOfBounds (1757 of 1979) PASS: lldb-shell :: ObjectFile/PECOFF/basic-info-arm.yaml (1758 of 1979) PASS: lldb-api :: tools/lldb-server/TestGdbRemote_vCont.py (1759 of 1979) PASS: lldb-unit :: Language/Highlighting/./HighlighterTests/HighlighterTest.ClangCursorPosAfterOtherToken (1760 of 1979) PASS: lldb-unit :: Expression/./ExpressionTests/CppModuleConfigurationTest.MissingUsrInclude (1761 of 1979) PASS: lldb-shell :: SymbolFile/DWARF/DW_AT_low_pc-addrx.s (1762 of 1979) UNSUPPORTED: lldb-api :: functionalities/tsan/thread_numbers/TestTsanThreadNumbers.py (1763 of 1979) PASS: lldb-api :: functionalities/gdb_remote_client/TestNestedRegDefinitions.py (1764 of 1979) PASS: lldb-shell :: Reproducer/TestWorkingDir.test (1765 of 1979) PASS: lldb-api :: functionalities/data-formatter/data-formatter-objc/TestDataFormatterObjCNSDate.py (1766 of 1979) PASS: lldb-shell :: Commands/command-source.test (1767 of 1979) UNSUPPORTED: lldb-api :: functionalities/data-formatter/data-formatter-stl/libstdcpp/unique_ptr/TestDataFormatterStdUniquePtr.py (1768 of 1979) PASS: lldb-shell :: SymbolFile/DWARF/compilercontext.ll (1769 of 1979) PASS: lldb-api :: functionalities/thread/concurrent_events/TestConcurrentBreakpointOneDelayBreakpointThreads.py (1770 of 1979) PASS: lldb-unit :: Utility/./UtilityTests/StreamTest.AddressNoSuffix (1771 of 1979) PASS: lldb-unit :: Utility/./UtilityTests/UriParserTest.SchemeHostSeparator3 (1772 of 1979) PASS: lldb-shell :: Driver/TestConvenienceVariables.test (1773 of 1979) PASS: lldb-api :: python_api/hello_world/TestHelloWorld.py (1774 of 1979) PASS: lldb-api :: commands/expression/po_verbosity/TestPoVerbosity.py (1775 of 1979) PASS: lldb-api :: python_api/value/change_values/TestChangeValueAPI.py (1776 of 1979) PASS: lldb-unit :: Utility/./UtilityTests/RangeTest.ContainsAddr (1777 of 1979) UNSUPPORTED: lldb-api :: functionalities/gdb_remote_client/TestWasm.py (1778 of 1979) PASS: lldb-unit :: Utility/./UtilityTests/StringExtractorTest.GetHexU8_Underflow_NoEof (1779 of 1979) UNSUPPORTED: lldb-shell :: Breakpoint/case-insensitive.test (1780 of 1979) PASS: lldb-unit :: Utility/./UtilityTests/GeneratorTest.Get (1781 of 1979) PASS: lldb-unit :: Utility/./UtilityTests/TimerTest.CategoryTimes2 (1782 of 1979) PASS: lldb-shell :: SymbolFile/DWARF/inline-function-address-shared.test (1783 of 1979) PASS: lldb-api :: functionalities/data-formatter/data-formatter-objc/TestDataFormatterObjCExpr.py (1784 of 1979) PASS: lldb-api :: lang/cpp/wchar_t/TestCxxWCharT.py (1785 of 1979) PASS: lldb-unit :: Symbol/./SymbolTests/PostfixExpression.ToDWARF (1786 of 1979) PASS: lldb-api :: lang/cpp/this/TestCPPThis.py (1787 of 1979) PASS: lldb-api :: lang/c/unions/TestUnionMembers.py (1788 of 1979) PASS: lldb-unit :: Host/./HostTests/SocketTest.DomainGetConnectURI (1789 of 1979) UNSUPPORTED: lldb-api :: commands/expression/completion-crash-invalid-iterator/TestInvalidIteratorCompletionCrash.py (1790 of 1979) PASS: lldb-api :: functionalities/thread/step_out/TestThreadStepOut.py (1791 of 1979) PASS: lldb-unit :: Utility/./UtilityTests/ScalarTest.GetBytes (1792 of 1979) PASS: lldb-unit :: Signals/./SignalsTests/UnixSignalsTest.VersionChange (1793 of 1979) PASS: lldb-shell :: SymbolFile/DWARF/dwp-separate-debug-file.cpp (1794 of 1979) PASS: lldb-unit :: Host/./HostTests/SocketAddressTest.GetAddressInfo (1795 of 1979) PASS: lldb-api :: macosx/thread_suspend/TestInternalThreadSuspension.py (1796 of 1979) PASS: lldb-api :: commands/expression/top-level/TestTopLevelExprs.py (1797 of 1979) PASS: lldb-shell :: ObjectFile/MachO/lc_build_version_notools.yaml (1798 of 1979) PASS: lldb-api :: functionalities/target-new-solib-notifications/TestModuleLoadedNotifys.py (1799 of 1979) PASS: lldb-api :: commands/expression/fixits/TestFixIts.py (1800 of 1979) UNSUPPORTED: lldb-api :: api/multiple-debuggers/TestMultipleDebuggers.py (1801 of 1979) PASS: lldb-unit :: Utility/./UtilityTests/StreamTest.PutStringAsRawHex8 (1802 of 1979) PASS: lldb-unit :: Utility/./UtilityTests/UriParserTest.SchemeHostSeparator2 (1803 of 1979) PASS: lldb-api :: functionalities/load_unload/TestLoadUnload.py (1804 of 1979) PASS: lldb-unit :: Core/./LLDBCoreTests/RichManglingContextTest.Basic (1805 of 1979) UNSUPPORTED: lldb-api :: commands/expression/call-restarts/TestCallThatRestarts.py (1806 of 1979) PASS: lldb-unit :: Core/./LLDBCoreTests/MangledTest.ResultForBlockInvocation (1807 of 1979) UNSUPPORTED: lldb-api :: functionalities/data-formatter/data-formatter-stl/libstdcpp/vbool/TestDataFormatterStdVBool.py (1808 of 1979) PASS: lldb-shell :: Minidump/Windows/find-module.test (1809 of 1979) PASS: lldb-unit :: Utility/./UtilityTests/ScalarTest.RightShiftOperator (1810 of 1979) PASS: lldb-shell :: SymbolFile/DWARF/find-basic-namespace.cpp (1811 of 1979) PASS: lldb-api :: functionalities/backticks/TestBackticksWithoutATarget.py (1812 of 1979) PASS: lldb-unit :: Utility/./UtilityTests/ScalarTest.SetValueFromCString (1813 of 1979) PASS: lldb-api :: lang/objc/foundation/TestSymbolTable.py (1814 of 1979) PASS: lldb-api :: functionalities/reproducers/attach/TestReproducerAttach.py (1815 of 1979) PASS: lldb-api :: functionalities/postmortem/minidump/TestMiniDump.py (1816 of 1979) PASS: lldb-unit :: Host/./HostTests/File.GetStreamFromDescriptor (1817 of 1979) PASS: lldb-api :: functionalities/data-formatter/data-formatter-objc/cmtime/TestDataFormatterCMTime.py (1818 of 1979) PASS: lldb-unit :: Process/minidump/./LLDBMinidumpTests/MinidumpParserTest.GetMiscInfoWindows (1819 of 1979) PASS: lldb-unit :: Utility/./UtilityTests/RangeTest.LessThan (1820 of 1979) PASS: lldb-unit :: Utility/./UtilityTests/ArgsTest.ReplaceArgumentAtIndexFarOutOfRange (1821 of 1979) PASS: lldb-unit :: Utility/./UtilityTests/OptionsWithRawTest.TerminatedQuote (1822 of 1979) PASS: lldb-api :: lang/cpp/namespace/TestNamespaceLookup.py (1823 of 1979) PASS: lldb-unit :: Symbol/./SymbolTests/TestTypeSystemClang.TestGetEnumIntegerTypeBasicTypes (1824 of 1979) PASS: lldb-unit :: Utility/./UtilityTests/RangeDataVector.FindEntryIndexesThatContain_Overlap (1825 of 1979) PASS: lldb-api :: lang/objc/single-entry-dictionary/TestObjCSingleEntryDictionary.py (1826 of 1979) PASS: lldb-unit :: Process/minidump/./LLDBMinidumpTests/MinidumpParserTest.GetMiscInfo_no_stream (1827 of 1979) PASS: lldb-api :: commands/expression/import-std-module/deque-dbg-info-content/TestDbgInfoContentDequeFromStdModule.py (1828 of 1979) PASS: lldb-unit :: Utility/./UtilityTests/BinaryStreamTest.PutSLEB128TwoBytes (1829 of 1979) PASS: lldb-unit :: Utility/./UtilityTests/ConstStringTest.YAML (1830 of 1979) PASS: lldb-unit :: Utility/./UtilityTests/StringExtractorTest.GetNameColonValueNoSemicolon (1831 of 1979) PASS: lldb-shell :: Settings/TestEchoCommands.test (1832 of 1979) PASS: lldb-unit :: Utility/./UtilityTests/Flags.AnyClear (1833 of 1979) PASS: lldb-unit :: Utility/./UtilityTests/RangeTest.ClearWithStarAddress (1834 of 1979) UNSUPPORTED: lldb-api :: tools/lldb-server/platform-process-connect/TestPlatformProcessConnect.py (1835 of 1979) PASS: lldb-unit :: Utility/./UtilityTests/ArgsTest.TestUnknownEscape (1836 of 1979) PASS: lldb-unit :: Target/./TargetTests/ExecutionContextTest.GetByteOrder (1837 of 1979) PASS: lldb-api :: lang/c/inlines/TestRedefinitionsInInlines.py (1838 of 1979) PASS: lldb-api :: functionalities/inferior-crashing/recursive-inferior/TestRecursiveInferiorStep.py (1839 of 1979) PASS: lldb-shell :: Driver/TestFile.test (1840 of 1979) PASS: lldb-api :: lang/cpp/class_types/TestClassTypes.py (1841 of 1979) PASS: lldb-unit :: UnwindAssembly/x86/./UnwindAssemblyx86Tests/Testx86AssemblyInspectionEngine.TestPushRBX (1842 of 1979) PASS: lldb-shell :: ObjectFile/PECOFF/sections-names.yaml (1843 of 1979) PASS: lldb-unit :: Symbol/./SymbolTests/TestTypeSystemClang.TestBuiltinTypeForEncodingAndBitSize (1844 of 1979) PASS: lldb-shell :: Breakpoint/jitbp_elf.test (1845 of 1979) PASS: lldb-unit :: Utility/./UtilityTests/EnvironmentTest.EnvpConstruction (1846 of 1979) PASS: lldb-api :: lang/cpp/namespace_definitions/TestNamespaceDefinitions.py (1847 of 1979) PASS: lldb-unit :: Utility/./UtilityTests/StringExtractorTest.GetHexBytesAvail_OddPair (1848 of 1979) PASS: lldb-shell :: SymbolFile/DWARF/find-basic-variable.cpp (1849 of 1979) PASS: lldb-unit :: Utility/./UtilityTests/ArchSpecTest.TestSetTriple (1850 of 1979) PASS: lldb-api :: python_api/lldbutil/iter/TestLLDBIterator.py (1851 of 1979) PASS: lldb-unit :: Utility/./UtilityTests/ArchSpecTest.TestParseMachCPUDashSubtypeTripleSimple (1852 of 1979) PASS: lldb-unit :: Utility/./UtilityTests/SerializationRountripTest.SerializeDeserializeCStringArray (1853 of 1979) PASS: lldb-api :: functionalities/data-formatter/data-formatter-script/TestDataFormatterScript.py (1854 of 1979) PASS: lldb-unit :: Utility/./UtilityTests/ListenerTest.GetEventWait (1855 of 1979) PASS: lldb-shell :: SymbolFile/DWARF/debug-types-missing-signature.test (1856 of 1979) PASS: lldb-shell :: ObjectFile/ELF/avr-basic-info.yaml (1857 of 1979) PASS: lldb-api :: functionalities/data-formatter/data-formatter-stl/libcxx/list/TestDataFormatterLibcxxList.py (1858 of 1979) PASS: lldb-shell :: Reproducer/TestVersionCheck.test (1859 of 1979) UNSUPPORTED: lldb-shell :: SymbolFile/PDB/expressions.test (1860 of 1979) PASS: lldb-api :: commands/frame/language/TestGuessLanguage.py (1861 of 1979) PASS: lldb-api :: lang/cpp/rvalue-references/TestRvalueReferences.py (1862 of 1979) PASS: lldb-unit :: SymbolFile/DWARF/./SymbolFileDWARFTests/SymbolFileDWARFTests.ParseArangesNonzeroSegmentSize (1863 of 1979) PASS: lldb-api :: lang/objc/ivar-IMP/TestObjCiVarIMP.py (1864 of 1979) PASS: lldb-shell :: ObjectFile/ELF/PT_LOAD-empty.yaml (1865 of 1979) PASS: lldb-api :: sample_test/TestSampleTest.py (1866 of 1979) UNSUPPORTED: lldb-api :: commands/expression/macros/TestMacros.py (1867 of 1979) PASS: lldb-unit :: UnwindAssembly/x86/./UnwindAssemblyx86Tests/Testx86AssemblyInspectionEngine.TestSimplei386ugmented (1868 of 1979) PASS: lldb-api :: functionalities/breakpoint/serialize/TestBreakpointSerialization.py (1869 of 1979) PASS: lldb-shell :: SymbolFile/DWARF/dir-separator-no-comp-dir.s (1870 of 1979) PASS: lldb-unit :: Core/./LLDBCoreTests/MangledTest.ResultForValidName (1871 of 1979) PASS: lldb-shell :: SymbolFile/DWARF/debug-types-address-ranges.s (1872 of 1979) UNSUPPORTED: lldb-api :: functionalities/asan/TestMemoryHistory.py (1873 of 1979) PASS: lldb-api :: functionalities/breakpoint/inlined_breakpoints/TestInlinedBreakpoints.py (1874 of 1979) PASS: lldb-shell :: SymbolFile/DWARF/find-method.cpp (1875 of 1979) PASS: lldb-api :: lang/cpp/dynamic-value/TestCppValueCast.py (1876 of 1979) PASS: lldb-unit :: tools/lldb-server/tests/./LLDBServerTests/TestBase.LaunchModePreservesEnvironment (1877 of 1979) PASS: lldb-shell :: SymbolFile/DWARF/clang-ast-from-dwarf-objc-property.m (1878 of 1979) PASS: lldb-unit :: Utility/./UtilityTests/FileSpecTest.AppendPathComponent (1879 of 1979) XFAIL: lldb-shell :: Register/x86-mm-xmm-write.test (1880 of 1979) PASS: lldb-api :: tools/lldb-server/commandline/TestStubReverseConnect.py (1881 of 1979) PASS: lldb-api :: lang/cpp/function_refs/TestFunctionRefs.py (1882 of 1979) PASS: lldb-api :: functionalities/unwind/noreturn/module-end/TestNoReturnModuleEnd.py (1883 of 1979) PASS: lldb-unit :: Utility/./UtilityTests/AnsiTerminal.AtEnd (1884 of 1979) UNSUPPORTED: lldb-api :: android/platform/TestDefaultCacheLineSize.py (1885 of 1979) PASS: lldb-unit :: Process/gdb-remote/./ProcessGdbRemoteTests/GDBRemoteCommunicationServerTest.SendErrorResponse_ErrorNumber (1886 of 1979) PASS: lldb-unit :: Utility/./UtilityTests/StatusTest.ErrorConversion (1887 of 1979) PASS: lldb-unit :: Utility/./UtilityTests/StringListTest.AppendStringCString (1888 of 1979) UNSUPPORTED: lldb-api :: arm/breakpoint-thumb-codesection/TestBreakpointThumbCodesection.py (1889 of 1979) PASS: lldb-unit :: Utility/./UtilityTests/OptionsWithRawTest.WhitespaceInput (1890 of 1979) PASS: lldb-unit :: Utility/./UtilityTests/VMRange.Reset (1891 of 1979) PASS: lldb-shell :: Driver/TestNoUseColor.test (1892 of 1979) PASS: lldb-shell :: SymbolFile/Breakpad/unwind-via-stack-win-no-memory-info.yaml (1893 of 1979) PASS: lldb-api :: commands/expression/unwind_expression/TestUnwindExpression.py (1894 of 1979) PASS: lldb-unit :: Utility/./UtilityTests/StreamTeeTest.GetStreamAtIndexOutOfBounds (1895 of 1979) PASS: lldb-unit :: Utility/./UtilityTests/StringListTest.PopBack (1896 of 1979) PASS: lldb-unit :: Utility/./UtilityTests/ProcessInstanceInfo.DumpTable_invalidUID (1897 of 1979) PASS: lldb-api :: lang/cpp/bool/TestCPPBool.py (1898 of 1979) UNSUPPORTED: lldb-shell :: BuildScript/toolchain-msvc.test (1899 of 1979) PASS: lldb-api :: functionalities/postmortem/netbsd-core/TestNetBSDCore.py (1900 of 1979) PASS: lldb-unit :: Language/Highlighting/./HighlighterTests/HighlighterTest.ClangCursorPosEndOfLine (1901 of 1979) PASS: lldb-api :: python_api/watchpoint/TestSetWatchpoint.py (1902 of 1979) PASS: lldb-api :: commands/watchpoints/step_over_watchpoint/TestStepOverWatchpoint.py (1903 of 1979) PASS: lldb-unit :: Host/./HostTests/HostInfoTest.GetHostname (1904 of 1979) PASS: lldb-unit :: Utility/./UtilityTests/StringLexerTest.HasAtLeast (1905 of 1979) PASS: lldb-shell :: Register/x86-64-ymm-read.test (1906 of 1979) PASS: lldb-api :: commands/expression/import-std-module/shared_ptr/TestSharedPtrFromStdModule.py (1907 of 1979) PASS: lldb-unit :: Utility/./UtilityTests/FileSpecTest.GuessPathStyle (1908 of 1979) PASS: lldb-api :: commands/reproducer/invalid-args/TestInvalidArgsReproducer.py (1909 of 1979) PASS: lldb-unit :: debugserver/./debugserverTests/JSON.Parse (1910 of 1979) PASS: lldb-unit :: Expression/./ExpressionTests/DWARFExpression.DW_OP_convert (1911 of 1979) PASS: lldb-api :: python_api/function_symbol/TestDisasmAPI.py (1912 of 1979) PASS: lldb-shell :: Driver/TestSingleQuote.test (1913 of 1979) PASS: lldb-shell :: SymbolFile/NativePDB/function-types-builtins.cpp (1914 of 1979) PASS: lldb-api :: functionalities/gdb_remote_client/TestPlatformClient.py (1915 of 1979) PASS: lldb-unit :: Host/./HostTests/SocketTest.TCPGetAddress (1916 of 1979) PASS: lldb-unit :: Utility/./UtilityTests/StringListTest.JoinMultiCharSeparator (1917 of 1979) PASS: lldb-unit :: Utility/./UtilityTests/ConstStringTest.FromMidOfBufferStringRef (1918 of 1979) PASS: lldb-api :: lang/objc/objc-static-method/TestObjCStaticMethod.py (1919 of 1979) PASS: lldb-shell :: SymbolFile/DWARF/dwarf5-index-is-used.cpp (1920 of 1979) PASS: lldb-api :: functionalities/thread/crash_during_step/TestCrashDuringStep.py (1921 of 1979) UNSUPPORTED: lldb-api :: functionalities/ubsan/basic/TestUbsanBasic.py (1922 of 1979) PASS: lldb-api :: commands/frame/var/TestFrameVar.py (1923 of 1979) PASS: lldb-api :: python_api/value/TestValueAPI.py (1924 of 1979) PASS: lldb-api :: functionalities/thread/concurrent_events/TestConcurrentSignalDelayWatch.py (1925 of 1979) PASS: lldb-api :: lang/c/global_variables/TestGlobalVariables.py (1926 of 1979) PASS: lldb-unit :: Utility/./UtilityTests/StreamTest.QuotedCString (1927 of 1979) PASS: lldb-api :: commands/expression/dollar-in-variable/TestDollarInVariable.py (1928 of 1979) PASS: lldb-unit :: Process/gdb-remote/./ProcessGdbRemoteTests/GDBRemoteCommunicationClientTest.SyncThreadState (1929 of 1979) PASS: lldb-shell :: Reproducer/Functionalities/TestDataFormatter.test (1930 of 1979) PASS: lldb-shell :: SymbolFile/DWARF/debug_loclists-dwo.s (1931 of 1979) PASS: lldb-api :: lang/objc/modules-inline-functions/TestModulesInlineFunctions.py (1932 of 1979) PASS: lldb-unit :: debugserver/./debugserverTests/RNBSocket.AnyListen (1933 of 1979) PASS: lldb-unit :: Utility/./UtilityTests/StreamTest.PutRawBytesToLittleEndian (1934 of 1979) PASS: lldb-unit :: Utility/./UtilityTests/StringListTest.LongestCommonPrefixSingleElement (1935 of 1979) PASS: lldb-unit :: ScriptInterpreter/Python/./ScriptInterpreterPythonTests/PythonDataObjectsTest.TestPythonStringToStructuredString (1936 of 1979) PASS: lldb-unit :: Symbol/./SymbolTests/TestTypeSystemClang.TestRecordHasFields (1937 of 1979) PASS: lldb-unit :: Host/./HostTests/MainLoopTest.DetectsEOF (1938 of 1979) UNSUPPORTED: lldb-api :: functionalities/tsan/thread_leak/TestTsanThreadLeak.py (1939 of 1979) PASS: lldb-shell :: ObjectFile/PECOFF/symbol.yaml (1940 of 1979) PASS: lldb-api :: commands/process/attach/attach_denied/TestAttachDenied.py (1941 of 1979) PASS: lldb-unit :: Expression/./ExpressionTests/DiagnosticManagerTest.FixedExpression (1942 of 1979) PASS: lldb-shell :: Watchpoint/SetErrorCases.test (1943 of 1979) PASS: lldb-unit :: Host/./HostTests/TaskPoolTest.RunTasks (1944 of 1979) PASS: lldb-api :: functionalities/testid/TestTestId.py (1945 of 1979) PASS: lldb-api :: macosx/DBGSourcePathRemapping/TestDSYMSourcePathRemapping.py (1946 of 1979) PASS: lldb-api :: functionalities/breakpoint/breakpoint_options/TestBreakpointOptions.py (1947 of 1979) PASS: lldb-shell :: SymbolFile/NativePDB/ast-types.cpp (1948 of 1979) PASS: lldb-unit :: Utility/./UtilityTests/StringLexerTest.PutBack (1949 of 1979) PASS: lldb-unit :: Process/gdb-remote/./ProcessGdbRemoteTests/GDBRemoteCommunicationClientTest.GetModulesInfo (1950 of 1979) UNSUPPORTED: lldb-api :: lang/objc/bitfield_ivars/TestBitfieldIvars.py (1951 of 1979) PASS: lldb-api :: functionalities/breakpoint/debugbreak/TestDebugBreak.py (1952 of 1979) PASS: lldb-unit :: Symbol/./SymbolTests/DWARFCallFrameInfoTest.Basic_eh (1953 of 1979) PASS: lldb-api :: functionalities/jitloader_gdb/TestJITLoaderGDB.py (1954 of 1979) PASS: lldb-unit :: ScriptInterpreter/Python/./ScriptInterpreterPythonTests/PythonDataObjectsTest.TestObjectAttributes (1955 of 1979) PASS: lldb-api :: functionalities/data-formatter/data-formatter-smart-array/TestDataFormatterSmartArray.py (1956 of 1979) PASS: lldb-api :: commands/frame/diagnose/inheritance/TestDiagnoseInheritance.py (1957 of 1979) PASS: lldb-unit :: SymbolFile/NativePDB/./SymbolFileNativePDBTests/PDBFPOProgramToDWARFExpressionTests.UnknownOp (1958 of 1979) PASS: lldb-api :: lang/c/shared_lib_stripped_symbols/TestSharedLibStrippedSymbols.py (1959 of 1979) UNSUPPORTED: lldb-shell :: ObjectFile/PECOFF/disassemble-thumb.yaml (1960 of 1979) PASS: lldb-shell :: Breakpoint/dummy-target.test (1961 of 1979) UNSUPPORTED: lldb-shell :: Register/x86-zmm-read.test (1962 of 1979) PASS: lldb-unit :: Utility/./UtilityTests/StringListTest.LongestCommonPrefix (1963 of 1979) PASS: lldb-unit :: Symbol/./SymbolTests/PostfixExpression.ParseFPOProgram (1964 of 1979) PASS: lldb-unit :: Host/./HostTests/SocketTest.DecodeHostAndPort (1965 of 1979) UNSUPPORTED: lldb-shell :: Register/x86-64-xmm16-write.test (1966 of 1979) PASS: lldb-unit :: Platform/./LLDBPlatformTests/PlatformDarwinTest.GetSDKNameForType (1967 of 1979) PASS: lldb-api :: lang/cpp/breakpoint_in_member_func_w_non_primitive_params/TestBreakpointInMemberFuncWNonPrimitiveParams.py (1968 of 1979) PASS: lldb-api :: functionalities/breakpoint/global_constructor/TestBreakpointInGlobalConstructor.py (1969 of 1979) PASS: lldb-api :: functionalities/tail_call_frames/unambiguous_sequence/TestUnambiguousTailCalls.py (1970 of 1979) PASS: lldb-api :: functionalities/tail_call_frames/thread_step_out_or_return/TestSteppingOutWithArtificialFrames.py (1971 of 1979) PASS: lldb-unit :: UnwindAssembly/x86/./UnwindAssemblyx86Tests/Testx86AssemblyInspectionEngine.TestPushEDI (1972 of 1979) PASS: lldb-api :: functionalities/breakpoint/breakpoint_language/TestBreakpointLanguage.py (1973 of 1979) PASS: lldb-unit :: Utility/./UtilityTests/UriParserTest.PortOverflow (1974 of 1979) PASS: lldb-unit :: SymbolFile/DWARF/./SymbolFileDWARFTests/SymbolFileDWARFTests.TestAbbrevValidAttrNullForm (1975 of 1979) PASS: lldb-unit :: UnwindAssembly/x86/./UnwindAssemblyx86Tests/Testx86AssemblyInspectionEngine.TestAddESP (1976 of 1979) PASS: lldb-api :: functionalities/thread/thread_exit/TestThreadExit.py (1977 of 1979) PASS: lldb-api :: functionalities/data-formatter/data-formatter-objc/nsindexpath/TestDataFormatterNSIndexPath.py (1978 of 1979) PASS: lldb-api :: lang/objc/blocks/TestObjCIvarsInBlocks.py (1979 of 1979)

Hide Details

Testing Time: 4491.94s ******************** Failing Tests (3): lldb-api :: lang/objc/ptr_refs/TestPtrRefsObjC.py lldb-api :: functionalities/ptr_refs/TestPtrRefs.py lldb-api :: python_api/thread/TestThreadAPI.py

Hide Details

Hide Details

Slowest Tests: -------------------------------------------------------------------------- 94.56s: lldb-api :: types/TestShortTypeExpr.py 95.85s: lldb-api :: functionalities/type_lookup/TestTypeLookup.py 96.01s: lldb-api :: commands/settings/TestSettings.py 99.93s: lldb-api :: types/TestLongTypes.py 117.97s: lldb-api :: lang/objc/foundation/TestObjCMethodsNSError.py 119.92s: lldb-api :: lang/objc/foundation/TestObjCMethodsString.py 120.34s: lldb-api :: tools/lldb-server/TestGdbRemote_qThreadStopInfo.py 123.27s: lldb-api :: lang/objc/objc-new-syntax/TestObjCNewSyntaxArray.py 125.71s: lldb-api :: lang/objc/objc-new-syntax/TestObjCNewSyntaxDictionary.py 134.58s: lldb-api :: types/TestLongTypesExpr.py 141.65s: lldb-api :: lang/objc/exceptions/TestObjCExceptions.py 146.11s: lldb-api :: lang/objc/real-definition/TestRealDefinition.py 160.19s: lldb-api :: lang/objc/objc-new-syntax/TestObjCNewSyntaxLiteral.py 165.03s: lldb-api :: lang/cpp/namespace/TestNamespaceLookup.py 226.75s: lldb-api :: lang/objc/foundation/TestObjCMethods.py 230.27s: lldb-api :: lang/objc/hidden-ivars/TestHiddenIvars.py 250.45s: lldb-api :: tools/lldb-server/TestGdbRemoteThreadsInStopReply.py 266.96s: lldb-api :: api/multithreaded/TestMultithreaded.py 278.16s: lldb-api :: lang/cpp/enum_types/TestCPP11EnumTypes.py 368.31s: lldb-api :: tools/lldb-server/TestLldbGdbServer.py

Hide Details

Tests Times: -------------------------------------------------------------------------- [ Range ] :: [ Percentage ] :: [ Count ] -------------------------------------------------------------------------- [ 0s, 20s) :: [********************************** ] :: [1724/1979] [ 20s, 40s) :: [** ] :: [ 106/1979] [ 40s, 60s) :: [* ] :: [ 92/1979] [ 60s, 80s) :: [ ] :: [ 27/1979] [ 80s,100s) :: [ ] :: [ 13/1979] [100s,120s) :: [ ] :: [ 1/1979] [120s,140s) :: [ ] :: [ 6/1979] [140s,160s) :: [ ] :: [ 2/1979] [160s,180s) :: [ ] :: [ 2/1979] [180s,200s) :: [ ] :: [ 0/1979] [200s,220s) :: [ ] :: [ 0/1979] [220s,240s) :: [ ] :: [ 2/1979] [240s,260s) :: [ ] :: [ 1/1979] [260s,280s) :: [ ] :: [ 1/1979] [280s,300s) :: [ ] :: [ 1/1979] [300s,320s) :: [ ] :: [ 0/1979] [320s,340s) :: [ ] :: [ 0/1979] [340s,360s) :: [ ] :: [ 0/1979] [360s,380s) :: [ ] :: [ 1/1979] Expected Passes : 1803 Expected Failures : 6 Unsupported Tests : 167 Unexpected Failures: 3 FAILED: tools/lldb/test/CMakeFiles/check-lldb-lit cd /Users/buildslave/jenkins/workspace/lldb-cmake-sanitized/lldb-build/tools/lldb/test && /usr/local/bin/python /Users/buildslave/jenkins/workspace/lldb-cmake-sanitized/lldb-build/./bin/llvm-lit -v --time-tests --shuffle --xunit-xml-output=/Users/buildslave/jenkins/workspace/lldb-cmake-sanitized/test/results.xml -v -j 4 --timeout 1200 /Users/buildslave/jenkins/workspace/lldb-cmake-sanitized/lldb-build/tools/lldb/test ninja: build stopped: subcommand failed. Command failed: Command '['/usr/bin/env', 'TERM=vt100', '/usr/local/bin/ninja', '-v', 'check-lldb']' returned non-zero exit status 1. Command: ['/usr/bin/env', 'TERM=vt100', '/usr/local/bin/ninja', '-v', 'check-lldb'] [Pipeline] } [Pipeline] // timeout [Pipeline] } [Pipeline] // stage [Pipeline] stage [Pipeline] { (Declarative: Post Actions) [Pipeline] scanForIssues [Clang (LLVM based)] Sleeping for 5 seconds due to JENKINS-32191... [Clang (LLVM based)] Parsing console log (workspace: '/Users/buildslave/jenkins/workspace/lldb-cmake-sanitized') [Clang (LLVM based)] Successfully parsed console log [Clang (LLVM based)] -> found 4 issues (skipped 0 duplicates) [Clang (LLVM based)] Post processing issues on 'green-dragon-23' with source code encoding 'UTF-8' [Clang (LLVM based)] Creating SCM blamer to obtain author and commit information for affected files [Clang (LLVM based)] Creating SCM miner to obtain statistics for affected repository files [Clang (LLVM based)] Resolving file names for all issues in source directory '/Users/buildslave/jenkins/workspace/lldb-cmake-sanitized' [Clang (LLVM based)] -> resolved paths in source directory (3 found, 0 not found) [Clang (LLVM based)] Resolving module names from module definitions (build.xml, pom.xml, or Manifest.mf files) [Clang (LLVM based)] -> resolved module names for 4 issues [Clang (LLVM based)] Resolving package names (or namespaces) by parsing the affected files [Clang (LLVM based)] -> resolved package names of 3 affected files [Clang (LLVM based)] No filter has been set, publishing all 4 issues [Clang (LLVM based)] Creating fingerprints for all affected code blocks to track issues over different builds [Clang (LLVM based)] -> created fingerprints for 4 issues (skipped 0 issues) [Clang (LLVM based)] Copying affected files to Jenkins' build folder '/Users/Shared/Jenkins/Home/jobs/lldb-cmake-sanitized/builds/1175/files-with-issues' [Clang (LLVM based)] -> 3 copied, 0 not in workspace, 0 not-found, 0 with I/O error [Pipeline] junit Recording test results [Pipeline] } [Pipeline] // stage [Pipeline] } [Pipeline] // withEnv [Pipeline] } [Pipeline] // node [Pipeline] End of Pipeline ERROR: script returned exit code 1 Finished: FAILURE