FailedConsole Output

Skipping 9,546 KB.. Full Log
ingle-entry-dictionary/TestObjCSingleEntryDictionary.py (733 of 2167)
PASS: lldb-api :: lang/objc/objc-new-syntax/TestObjCNewSyntaxDictionary.py (734 of 2167)
PASS: lldb-api :: macosx/find-app-in-bundle/TestFindAppInBundle.py (735 of 2167)
PASS: lldb-api :: lang/objc/unicode-string/TestUnicodeString.py (736 of 2167)
PASS: lldb-api :: macosx/load-kext/TestLoadKext.py (737 of 2167)
PASS: lldb-api :: macosx/duplicate-archive-members/TestDuplicateMembers.py (738 of 2167)
PASS: lldb-api :: macosx/find-dsym/bundle-with-dot-in-filename/TestBundleWithDotInFilename.py (739 of 2167)
PASS: lldb-api :: macosx/find-dsym/deep-bundle/TestDeepBundle.py (740 of 2167)
PASS: lldb-api :: macosx/lc-note/firmware-corefile/TestFirmwareCorefiles.py (741 of 2167)
PASS: lldb-api :: macosx/dyld-trie-symbols/TestDyldTrieSymbols.py (742 of 2167)
PASS: lldb-api :: macosx/lc-note/kern-ver-str/TestKernVerStrLCNOTE.py (743 of 2167)
PASS: lldb-api :: lang/objc/variadic_methods/TestVariadicMethods.py (744 of 2167)
PASS: lldb-api :: macosx/order/TestOrderFile.py (745 of 2167)
PASS: lldb-api :: macosx/indirect_symbol/TestIndirectSymbols.py (746 of 2167)
PASS: lldb-api :: macosx/save_crashlog/TestSaveCrashlog.py (747 of 2167)
PASS: lldb-api :: macosx/macCatalyst/TestMacCatalyst.py (748 of 2167)
UNSUPPORTED: lldb-api :: macosx/macCatalystAppMacOSFramework/TestMacCatalystAppWithMacOSFramework.py (749 of 2167)
PASS: lldb-api :: lang/objcxx/hide-runtime-values/TestObjCXXHideRuntimeValues.py (750 of 2167)
PASS: lldb-api :: macosx/function-starts/TestFunctionStarts.py (751 of 2167)
PASS: lldb-api :: macosx/version_zero/TestGetVersionZeroVersion.py (752 of 2167)
PASS: lldb-api :: macosx/profile_vrs_detach/TestDetachVrsProfile.py (753 of 2167)
PASS: lldb-api :: python_api/debugger/TestDebuggerAPI.py (754 of 2167)
PASS: lldb-api :: macosx/universal/TestUniversal.py (755 of 2167)
PASS: lldb-api :: python_api/default-constructor/TestDefaultConstructorForAPIObjects.py (756 of 2167)
PASS: lldb-api :: python_api/disassemble-raw-data/TestDisassembleRawData.py (757 of 2167)
PASS: lldb-api :: python_api/breakpoint/TestBreakpointAPI.py (758 of 2167)
PASS: lldb-api :: macosx/thread_suspend/TestInternalThreadSuspension.py (759 of 2167)
UNSUPPORTED: lldb-api :: python_api/disassemble-raw-data/TestDisassemble_VST1_64.py (760 of 2167)
UNSUPPORTED: lldb-api :: python_api/event/TestEvents.py (761 of 2167)
PASS: lldb-api :: lang/objcxx/objcxx-ivar-vector/TestIvarVector.py (762 of 2167)
PASS: lldb-api :: lang/objcxx/class-name-clash/TestNameClash.py (763 of 2167)
PASS: lldb-api :: python_api/file_handle/TestFileHandle.py (764 of 2167)
PASS: lldb-api :: macosx/safe-to-func-call/TestSafeFuncCalls.py (765 of 2167)
PASS: lldb-api :: python_api/findvalue_duplist/TestSBFrameFindValue.py (766 of 2167)
PASS: lldb-api :: lang/objc/hidden-ivars/TestHiddenIvars.py (767 of 2167)
PASS: lldb-api :: macosx/queues/TestQueues.py (768 of 2167)
PASS: lldb-api :: python_api/get-value-32bit-int/TestGetValue32BitInt.py (769 of 2167)
PASS: lldb-api :: macosx/nslog/TestDarwinNSLogOutput.py (770 of 2167)
PASS: lldb-api :: python_api/interpreter/TestRunCommandInterpreterAPI.py (771 of 2167)
PASS: lldb-api :: lang/objc/objc-new-syntax/TestObjCNewSyntaxLiteral.py (772 of 2167)
PASS: lldb-api :: python_api/lldbutil/TestSwigVersion.py (773 of 2167)
PASS: lldb-api :: python_api/interpreter/TestCommandInterpreterAPI.py (774 of 2167)
PASS: lldb-api :: python_api/frame/get-variables/TestGetVariables.py (775 of 2167)
PASS: lldb-api :: python_api/frame/inlines/TestInlinedFrame.py (776 of 2167)
PASS: lldb-api :: python_api/function_symbol/TestDisasmAPI.py (777 of 2167)
PASS: lldb-api :: python_api/function_symbol/TestSymbolAPI.py (778 of 2167)
PASS: lldb-api :: macosx/thread-names/TestInterruptThreadNames.py (779 of 2167)
PASS: lldb-api :: python_api/formatters/TestFormattersSBAPI.py (780 of 2167)
PASS: lldb-api :: python_api/hello_world/TestHelloWorld.py (781 of 2167)
PASS: lldb-api :: python_api/process/read-mem-cstring/TestReadMemCString.py (782 of 2167)
PASS: lldb-api :: python_api/lldbutil/frame/TestFrameUtils.py (783 of 2167)
PASS: lldb-api :: python_api/name_lookup/TestNameLookup.py (784 of 2167)
PASS: lldb-api :: python_api/lldbutil/process/TestPrintStackTraces.py (785 of 2167)
PASS: lldb-api :: python_api/sbenvironment/TestSBEnvironment.py (786 of 2167)
PASS: lldb-api :: python_api/sblaunchinfo/TestSBLaunchInfo.py (787 of 2167)
PASS: lldb-api :: python_api/sbstructureddata/TestStructuredDataAPI.py (788 of 2167)
PASS: lldb-api :: python_api/sbdata/TestSBData.py (789 of 2167)
PASS: lldb-api :: python_api/sbplatform/TestSBPlatform.py (790 of 2167)
PASS: lldb-api :: python_api/frame/TestFrames.py (791 of 2167)
PASS: lldb-api :: python_api/signals/TestSignalsAPI.py (792 of 2167)
PASS: lldb-api :: python_api/process/io/TestProcessIO.py (793 of 2167)
PASS: lldb-api :: python_api/section/TestSectionAPI.py (794 of 2167)
PASS: lldb-api :: python_api/class_members/TestSBTypeClassMembers.py (795 of 2167)
PASS: lldb-api :: python_api/sbvalue_persist/TestSBValuePersist.py (796 of 2167)
PASS: lldb-api :: python_api/sbvalue_const_addrof/TestSBValueConstAddrOf.py (797 of 2167)
PASS: lldb-api :: python_api/symbol-context/TestSymbolContext.py (798 of 2167)
PASS: lldb-api :: python_api/value/change_values/TestChangeValueAPI.py (799 of 2167)
PASS: lldb-api :: python_api/symbol-context/two-files/TestSymbolContextTwoFiles.py (800 of 2167)
PASS: lldb-api :: python_api/module_section/TestModuleAndSection.py (801 of 2167)
PASS: lldb-api :: python_api/value/empty_class/TestValueAPIEmptyClass.py (802 of 2167)
PASS: lldb-api :: python_api/type/TestTypeList.py (803 of 2167)
PASS: lldb-api :: python_api/value/linked_list/TestValueAPILinkedList.py (804 of 2167)
PASS: lldb-api :: python_api/value/TestValueAPI.py (805 of 2167)
PASS: lldb-api :: python_api/watchpoint/TestSetWatchpoint.py (806 of 2167)
PASS: lldb-api :: python_api/watchpoint/TestWatchpointIgnoreCount.py (807 of 2167)
PASS: lldb-api :: python_api/watchpoint/TestWatchpointIter.py (808 of 2167)
PASS: lldb-api :: python_api/value_var_update/TestValueVarUpdate.py (809 of 2167)
PASS: lldb-api :: python_api/objc_type/TestObjCType.py (810 of 2167)
PASS: lldb-api :: python_api/watchpoint/condition/TestWatchpointConditionAPI.py (811 of 2167)
PASS: lldb-api :: sanity/TestModuleCacheSanity.py (812 of 2167)
PASS: lldb-api :: sanity/TestSettingSkipping.py (813 of 2167)
PASS: lldb-api :: sample_test/TestSampleTest.py (814 of 2167)
PASS: lldb-api :: terminal/TestEditline.py (815 of 2167)
UNSUPPORTED: lldb-api :: tools/intel-features/intel-pt/test/TestIntelPTSimpleBinary.py (816 of 2167)
PASS: lldb-api :: terminal/TestSTTYBeforeAndAfter.py (817 of 2167)
PASS: lldb-api :: python_api/exprpath_synthetic/TestExprPathSynthetic.py (818 of 2167)
PASS: lldb-api :: sample_test/TestSampleInlineTest.py (819 of 2167)
PASS: lldb-api :: python_api/lldbutil/iter/TestRegistersIterator.py (820 of 2167)
UNSUPPORTED: lldb-api :: tools/lldb-server/TestGdbRemoteCompletion.py (821 of 2167)
PASS: lldb-api :: python_api/process/TestProcessAPI.py (822 of 2167)
PASS: lldb-api :: python_api/sbtype_typeclass/TestSBTypeTypeClass.py (823 of 2167)
UNSUPPORTED: lldb-api :: tools/lldb-server/TestGdbRemoteModuleInfo.py (824 of 2167)
PASS: lldb-api :: tools/lldb-server/TestGdbRemoteAttach.py (825 of 2167)
PASS: lldb-api :: lang/objc/real-definition/TestRealDefinition.py (826 of 2167)
PASS: lldb-api :: tools/lldb-server/TestGdbRemoteHostInfo.py (827 of 2167)
PASS: lldb-api :: python_api/thread/TestThreadAPI.py (828 of 2167)
PASS: lldb-api :: source-manager/TestSourceManager.py (829 of 2167)
PASS: lldb-api :: tools/lldb-server/TestGdbRemoteSingleStep.py (830 of 2167)
UNSUPPORTED: lldb-api :: tools/lldb-server/TestGdbRemoteAuxvSupport.py (831 of 2167)
UNSUPPORTED: lldb-api :: tools/lldb-server/TestGdbRemote_vContThreads.py (832 of 2167)
PASS: lldb-api :: tools/lldb-server/TestGdbRemoteExitCode.py (833 of 2167)
PASS: lldb-api :: tools/lldb-server/TestGdbRemoteRegisterState.py (834 of 2167)
PASS: lldb-api :: tools/lldb-server/commandline/TestStubReverseConnect.py (835 of 2167)
PASS: lldb-api :: tools/lldb-server/TestGdbRemoteKill.py (836 of 2167)
PASS: lldb-api :: tools/lldb-server/commandline/TestStubSetSID.py (837 of 2167)
UNSUPPORTED: lldb-api :: tools/lldb-server/libraries-svr4/TestGdbRemoteLibrariesSvr4Support.py (838 of 2167)
UNSUPPORTED: lldb-api :: tools/lldb-server/memory-allocation/TestGdbRemoteMemoryAllocation.py (839 of 2167)
UNSUPPORTED: lldb-api :: tools/lldb-server/platform-process-connect/TestPlatformProcessConnect.py (840 of 2167)
PASS: lldb-api :: python_api/watchpoint/watchlocation/TestTargetWatchAddress.py (841 of 2167)
UNSUPPORTED: lldb-api :: tools/lldb-server/registers-target-xml-reading/TestGdbRemoteTargetXmlPacket.py (842 of 2167)
PASS: lldb-api :: tools/lldb-server/register-reading/TestGdbRemoteGPacket.py (843 of 2167)
PASS: lldb-api :: tools/lldb-server/inferior-crash/TestGdbRemoteAbort.py (844 of 2167)
UNSUPPORTED: lldb-api :: tools/lldb-server/signal-filtering/TestGdbRemote_QPassSignals.py (845 of 2167)
UNSUPPORTED: lldb-api :: tools/lldb-server/thread-name/TestGdbRemoteThreadName.py (846 of 2167)
PASS: lldb-api :: tools/lldb-server/inferior-crash/TestGdbRemoteSegFault.py (847 of 2167)
PASS: lldb-api :: python_api/watchpoint/watchlocation/TestSetWatchlocation.py (848 of 2167)
UNSUPPORTED: lldb-api :: tools/lldb-vscode/completions/TestVSCode_completions.py (849 of 2167)
PASS: lldb-api :: tools/lldb-server/TestGdbRemoteExpeditedRegisters.py (850 of 2167)
PASS: lldb-api :: tools/lldb-vscode/breakpoint-events/TestVSCode_breakpointEvents.py (851 of 2167)
PASS: lldb-api :: tools/lldb-vscode/coreFile/TestVSCode_coreFile.py (852 of 2167)
PASS: lldb-api :: tools/lldb-vscode/breakpoint/TestVSCode_setExceptionBreakpoints.py (853 of 2167)
PASS: lldb-api :: python_api/lldbutil/iter/TestLLDBIterator.py (854 of 2167)
UNSUPPORTED: lldb-api :: tools/lldb-vscode/disconnect/TestVSCode_disconnect.py (855 of 2167)
PASS: lldb-api :: tools/lldb-server/TestAppleSimulatorOSType.py (856 of 2167)
PASS: lldb-api :: tools/lldb-vscode/console/TestVSCode_console.py (857 of 2167)
PASS: lldb-api :: tools/lldb-server/TestGdbRemoteProcessInfo.py (858 of 2167)
PASS: lldb-api :: tools/lldb-vscode/stackTrace/TestVSCode_stackTrace.py (859 of 2167)
PASS: lldb-api :: tools/lldb-vscode/runInTerminal/TestVSCode_runInTerminal.py (860 of 2167)
PASS: lldb-api :: tools/lldb-vscode/variables/TestVSCode_variables.py (861 of 2167)
PASS: lldb-api :: tools/lldb-vscode/step/TestVSCode_step.py (862 of 2167)
PASS: lldb-api :: tools/lldb-vscode/breakpoint/TestVSCode_setFunctionBreakpoints.py (863 of 2167)
PASS: lldb-api :: tools/lldb-vscode/breakpoint/TestVSCode_setBreakpoints.py (864 of 2167)
PASS: lldb-api :: tools/lldb-server/TestGdbRemote_qThreadStopInfo.py (865 of 2167)
PASS: lldb-api :: tools/lldb-vscode/attach/TestVSCode_attach.py (866 of 2167)
PASS: lldb-api :: tools/lldb-server/TestGdbRemote_vCont.py (867 of 2167)
PASS: lldb-api :: python_api/target/TestTargetAPI.py (868 of 2167)
PASS: lldb-api :: macosx/simulator/TestSimulatorPlatform.py (869 of 2167)
PASS: lldb-api :: types/TestFloatTypes.py (870 of 2167)
PASS: lldb-api :: types/TestDoubleTypes.py (871 of 2167)
UNSUPPORTED: lldb-shell :: Breakpoint/case-insensitive.test (872 of 2167)
PASS: lldb-api :: tools/lldb-vscode/module/TestVSCode_module.py (873 of 2167)
PASS: lldb-api :: types/TestDoubleTypesExpr.py (874 of 2167)
PASS: lldb-api :: types/TestFloatTypesExpr.py (875 of 2167)
PASS: lldb-shell :: Breakpoint/debug_addrx.test (876 of 2167)
PASS: lldb-shell :: Breakpoint/case-sensitive.test (877 of 2167)
PASS: lldb-shell :: Breakpoint/debug_rnglist_rlestartend.test (878 of 2167)
PASS: lldb-shell :: Breakpoint/debug_rnglistx_rlex.test (879 of 2167)
PASS: lldb-shell :: Breakpoint/implicit_const_form_support.test (880 of 2167)
PASS: lldb-shell :: Breakpoint/dummy-target.test (881 of 2167)
UNSUPPORTED: lldb-shell :: Breakpoint/ppc64-localentry.test (882 of 2167)
PASS: lldb-shell :: Breakpoint/single-file-split-dwarf.test (883 of 2167)
PASS: lldb-shell :: Breakpoint/split-dwarf-5-addrbase.test (884 of 2167)
PASS: lldb-shell :: Breakpoint/split-dwarf5-debug-stroffsets.test (885 of 2167)
PASS: lldb-shell :: BuildScript/compiler-full-path.test (886 of 2167)
PASS: lldb-shell :: BuildScript/modes.test (887 of 2167)
PASS: lldb-shell :: BuildScript/script-args.test (888 of 2167)
UNSUPPORTED: lldb-shell :: BuildScript/toolchain-clang-cl.test (889 of 2167)
PASS: lldb-api :: tools/lldb-vscode/launch/TestVSCode_launch.py (890 of 2167)
UNSUPPORTED: lldb-shell :: BuildScript/toolchain-msvc.test (891 of 2167)
PASS: lldb-shell :: BuildScript/toolchain-clang.test (892 of 2167)
PASS: lldb-shell :: Commands/CommandScriptImmediateOutput/CommandScriptImmediateOutputConsole.test (893 of 2167)
PASS: lldb-shell :: Commands/command-backtrace.test (894 of 2167)
PASS: lldb-shell :: Commands/CommandScriptImmediateOutput/CommandScriptImmediateOutputFile.test (895 of 2167)
PASS: lldb-shell :: Commands/command-disassemble-process.yaml (896 of 2167)
PASS: lldb-shell :: Commands/command-breakpoint-col.test (897 of 2167)
PASS: lldb-shell :: Commands/command-regex-delete.test (898 of 2167)
PASS: lldb-shell :: Commands/command-regex-unalias.test (899 of 2167)
PASS: lldb-shell :: Breakpoint/debug_rnglist_offset_pair.test (900 of 2167)
PASS: lldb-shell :: Breakpoint/debug_rnglist_basic.test (901 of 2167)
PASS: lldb-shell :: Breakpoint/jitbp_elf.test (902 of 2167)
PASS: lldb-shell :: Commands/command-target-modules-dump-sections.yaml (903 of 2167)
PASS: lldb-shell :: Commands/command-script-import.test (904 of 2167)
PASS: lldb-shell :: Commands/command-disassemble.s (905 of 2167)
PASS: lldb-shell :: Commands/command-stop-hook-output.test (906 of 2167)
PASS: lldb-shell :: Commands/command-source.test (907 of 2167)
PASS: lldb-shell :: Driver/TestCore.test (908 of 2167)
PASS: lldb-shell :: Driver/LocalLLDBInit.test (909 of 2167)
PASS: lldb-shell :: Driver/TestError.test (910 of 2167)
PASS: lldb-shell :: Driver/TestCommands.test (911 of 2167)
PASS: lldb-shell :: Commands/command-thread-select.test (912 of 2167)
PASS: lldb-shell :: Driver/TestFile.test (913 of 2167)
PASS: lldb-shell :: Driver/TestHelp.test (914 of 2167)
PASS: lldb-shell :: Driver/TestNoUseColor.test (915 of 2167)
PASS: lldb-shell :: Driver/TestProcessAttach.test (916 of 2167)
PASS: lldb-shell :: Driver/TestRepl.test (917 of 2167)
PASS: lldb-shell :: Driver/TestUseColor.test (918 of 2167)
UNSUPPORTED: lldb-shell :: ExecControl/StopHook/stop-hook-threads.test (919 of 2167)
PASS: lldb-shell :: Driver/TestTarget.test (920 of 2167)
PASS: lldb-shell :: Driver/TestSingleQuote.test (921 of 2167)
UNSUPPORTED: lldb-shell :: Expr/TestIRMemoryMapWindows.test (922 of 2167)
PASS: lldb-shell :: Expr/TestMultilineExpr.test (923 of 2167)
PASS: lldb-shell :: Driver/TestConvenienceVariables.test (924 of 2167)
XFAIL: lldb-shell :: Expr/nodefaultlib.cpp (925 of 2167)
PASS: lldb-shell :: Driver/TestPositionalArgs.test (926 of 2167)
PASS: lldb-api :: types/TestRecursiveTypes.py (927 of 2167)
UNSUPPORTED: lldb-shell :: Minidump/Windows/arm-fp-unwind.test (928 of 2167)
PASS: lldb-shell :: Host/TestCustomShell.test (929 of 2167)
PASS: lldb-shell :: Heap/heap-cstr.test (930 of 2167)
PASS: lldb-shell :: Minidump/breakpad-symbols.test (931 of 2167)
PASS: lldb-shell :: Minidump/disassemble-no-module.yaml (932 of 2167)
PASS: lldb-api :: types/TestIntegerType.py (933 of 2167)
PASS: lldb-shell :: Minidump/dump-all.test (934 of 2167)
PASS: lldb-shell :: Minidump/memory-region-from-module.yaml (935 of 2167)
PASS: lldb-shell :: Minidump/memory-region.yaml (936 of 2167)
PASS: lldb-shell :: Minidump/no-process-id.yaml (937 of 2167)
PASS: lldb-api :: tools/lldb-server/TestGdbRemoteThreadsInStopReply.py (938 of 2167)
PASS: lldb-shell :: ObjectFile/Breakpad/discontiguous-sections.test (939 of 2167)
PASS: lldb-shell :: ObjectFile/Breakpad/sections-trailing-func.test (940 of 2167)
PASS: lldb-shell :: ObjectFile/Breakpad/sections.test (941 of 2167)
PASS: lldb-shell :: ExecControl/StopHook/stop-hook.test (942 of 2167)
PASS: lldb-shell :: ObjectFile/Breakpad/uuid-matching-mac.test (943 of 2167)
PASS: lldb-shell :: ObjectFile/Breakpad/breakpad-identification.test (944 of 2167)
PASS: lldb-shell :: Minidump/fb-dump.test (945 of 2167)
PASS: lldb-shell :: ObjectFile/ELF/PT_LOAD-empty.yaml (946 of 2167)
PASS: lldb-shell :: ObjectFile/ELF/PT_LOAD-overlap-PT_INTERP.yaml (947 of 2167)
PASS: lldb-shell :: ObjectFile/ELF/PT_LOAD-overlap-section.yaml (948 of 2167)
PASS: lldb-shell :: ObjectFile/ELF/PT_LOAD-overlap.yaml (949 of 2167)
PASS: lldb-shell :: ObjectFile/ELF/PT_LOAD.yaml (950 of 2167)
PASS: lldb-shell :: ObjectFile/ELF/aarch64-relocations.yaml (951 of 2167)
PASS: lldb-shell :: ObjectFile/ELF/avr-basic-info.yaml (952 of 2167)
UNSUPPORTED: lldb-shell :: ObjectFile/ELF/basic-info.yaml (953 of 2167)
PASS: lldb-shell :: ObjectFile/ELF/base-address.yaml (954 of 2167)
PASS: lldb-shell :: ObjectFile/ELF/compressed-sections.yaml (955 of 2167)
PASS: lldb-shell :: ObjectFile/ELF/build-id-case.yaml (956 of 2167)
PASS: lldb-shell :: ObjectFile/ELF/duplicate-section.yaml (957 of 2167)
PASS: lldb-shell :: ObjectFile/ELF/gnu-debuglink.yaml (958 of 2167)
PASS: lldb-shell :: ObjectFile/ELF/minidebuginfo-corrupt-xz.yaml (959 of 2167)
PASS: lldb-shell :: ObjectFile/ELF/minidebuginfo-find-symbols.yaml (960 of 2167)
UNSUPPORTED: lldb-shell :: ObjectFile/ELF/minidebuginfo-no-lzma.yaml (961 of 2167)
UNSUPPORTED: lldb-shell :: ObjectFile/ELF/minidebuginfo-set-and-hit-breakpoint.test (962 of 2167)
PASS: lldb-shell :: ObjectFile/ELF/netbsd-core-amd64.test (963 of 2167)
PASS: lldb-api :: types/TestCharType.py (964 of 2167)
PASS: lldb-shell :: ObjectFile/ELF/netbsd-exec-8.99.30-amd64.yaml (965 of 2167)
PASS: lldb-shell :: ObjectFile/ELF/section-overlap.yaml (966 of 2167)
PASS: lldb-shell :: ObjectFile/ELF/section-addresses.yaml (967 of 2167)
PASS: lldb-shell :: ObjectFile/ELF/section-permissions.yaml (968 of 2167)
PASS: lldb-shell :: ObjectFile/ELF/section-types-edgecases.yaml (969 of 2167)
PASS: lldb-shell :: ObjectFile/ELF/section-types.yaml (970 of 2167)
PASS: lldb-shell :: ObjectFile/ELF/short-build-id.yaml (971 of 2167)
PASS: lldb-shell :: ObjectFile/MachO/lc_build_version.yaml (972 of 2167)
PASS: lldb-shell :: ObjectFile/MachO/lc_build_version_notools.yaml (973 of 2167)
PASS: lldb-shell :: ObjectFile/MachO/lc_version_min.yaml (974 of 2167)
PASS: lldb-shell :: ObjectFile/MachO/subsections.yaml (975 of 2167)
PASS: lldb-shell :: ObjectFile/PECOFF/basic-info-arm.yaml (976 of 2167)
PASS: lldb-shell :: ObjectFile/PECOFF/basic-info-arm64.yaml (977 of 2167)
PASS: lldb-shell :: ObjectFile/PECOFF/basic-info.yaml (978 of 2167)
UNSUPPORTED: lldb-shell :: ObjectFile/PECOFF/dep-modules.yaml (979 of 2167)
UNSUPPORTED: lldb-shell :: ObjectFile/PECOFF/disassemble-thumb.yaml (980 of 2167)
UNSUPPORTED: lldb-shell :: ObjectFile/PECOFF/export-dllfunc.yaml (981 of 2167)
PASS: lldb-shell :: ObjectFile/PECOFF/invalid-export-table.yaml (982 of 2167)
PASS: lldb-shell :: ObjectFile/PECOFF/section-types.yaml (983 of 2167)
PASS: lldb-shell :: ObjectFile/PECOFF/sections-names.yaml (984 of 2167)
PASS: lldb-shell :: ObjectFile/MachO/symtab.yaml (985 of 2167)
PASS: lldb-shell :: ObjectFile/PECOFF/sections.yaml (986 of 2167)
UNSUPPORTED: lldb-shell :: ObjectFile/PECOFF/uuid.yaml (987 of 2167)
PASS: lldb-shell :: ObjectFile/PECOFF/symbol.yaml (988 of 2167)
PASS: lldb-shell :: ObjectFile/wasm/basic.yaml (989 of 2167)
PASS: lldb-shell :: ObjectFile/wasm/stripped-debug-sections.yaml (990 of 2167)
PASS: lldb-shell :: ObjectFile/wasm/embedded-debug-sections.yaml (991 of 2167)
PASS: lldb-shell :: ObjectFile/wasm/unified-debug-sections.yaml (992 of 2167)
PASS: lldb-shell :: Expr/TestIRMemoryMap.test (993 of 2167)
PASS: lldb-shell :: ObjectFile/ELF/many-sections.s (994 of 2167)
PASS: lldb-shell :: Process/TestAbortExitCode.test (995 of 2167)
UNSUPPORTED: lldb-shell :: Process/Windows/exception_access_violation.cpp (996 of 2167)
PASS: lldb-shell :: Quit/TestQuitExitCode-30.test (997 of 2167)
PASS: lldb-shell :: Process/Optimization.test (998 of 2167)
PASS: lldb-shell :: Quit/TestQuitExitCode0.test (999 of 2167)
PASS: lldb-shell :: Quit/TestQuitExitCodeHex0.test (1000 of 2167)
PASS: lldb-shell :: Quit/TestQuitExitCode30.test (1001 of 2167)
PASS: lldb-shell :: Quit/TestQuitExitCodeImplicit0.test (1002 of 2167)
PASS: lldb-shell :: Quit/TestQuitExitCodeHexA.test (1003 of 2167)
PASS: lldb-shell :: Process/UnsupportedLanguage.test (1004 of 2167)
PASS: lldb-shell :: Quit/TestQuitExitCodeNonInt.test (1005 of 2167)
UNSUPPORTED: lldb-shell :: Register/aarch64-fp-read.test (1006 of 2167)
UNSUPPORTED: lldb-shell :: Register/aarch64-gp-read.test (1007 of 2167)
UNSUPPORTED: lldb-shell :: Register/arm-fp-read.test (1008 of 2167)
PASS: lldb-shell :: Quit/TestQuitExitCodeTooManyArgs.test (1009 of 2167)
UNSUPPORTED: lldb-shell :: Register/arm-gp-read.test (1010 of 2167)
PASS: lldb-shell :: Register/x86-64-gp-read.test (1011 of 2167)
UNSUPPORTED: lldb-shell :: Register/x86-64-gp-write.test (1012 of 2167)
XFAIL: lldb-shell :: Register/x86-64-fp-write.test (1013 of 2167)
PASS: lldb-shell :: Recognizer/assert.test (1014 of 2167)
UNSUPPORTED: lldb-shell :: Register/x86-64-xmm16-read.test (1015 of 2167)
UNSUPPORTED: lldb-shell :: Register/x86-64-xmm16-write.test (1016 of 2167)
PASS: lldb-shell :: Register/x86-64-read.test (1017 of 2167)
XFAIL: lldb-shell :: Register/x86-64-write.test (1018 of 2167)
UNSUPPORTED: lldb-shell :: Register/x86-64-ymm16-read.test (1019 of 2167)
UNSUPPORTED: lldb-shell :: Register/x86-64-ymm16-write.test (1020 of 2167)
UNSUPPORTED: lldb-shell :: Register/x86-64-zmm-read.test (1021 of 2167)
UNSUPPORTED: lldb-shell :: Register/x86-64-zmm-write.test (1022 of 2167)
PASS: lldb-shell :: Minidump/Windows/Sigsegv/sigsegv.test (1023 of 2167)
UNSUPPORTED: lldb-shell :: Register/x86-fp-write.test (1024 of 2167)
UNSUPPORTED: lldb-shell :: Register/x86-gp-read.test (1025 of 2167)
UNSUPPORTED: lldb-shell :: Register/x86-gp-write.test (1026 of 2167)
PASS: lldb-shell :: Register/x86-64-ymm-read.test (1027 of 2167)
PASS: lldb-shell :: Process/TestEnvironment.test (1028 of 2167)
PASS: lldb-shell :: Minidump/Windows/broken-unwind.test (1029 of 2167)
PASS: lldb-shell :: Minidump/Windows/find-module.test (1030 of 2167)
UNSUPPORTED: lldb-shell :: Register/x86-ymm-read.test (1031 of 2167)
UNSUPPORTED: lldb-shell :: Register/x86-ymm-write.test (1032 of 2167)
UNSUPPORTED: lldb-shell :: Register/x86-zmm-read.test (1033 of 2167)
UNSUPPORTED: lldb-shell :: Register/x86-zmm-write.test (1034 of 2167)
XFAIL: lldb-shell :: Register/x86-mm-xmm-read.test (1035 of 2167)
XFAIL: lldb-shell :: Register/x86-64-ymm-write.test (1036 of 2167)
XFAIL: lldb-shell :: Register/x86-mm-xmm-write.test (1037 of 2167)
PASS: lldb-api :: types/TestCharTypeExpr.py (1038 of 2167)
PASS: lldb-shell :: Register/x86-fp-read.test (1039 of 2167)
PASS: lldb-shell :: Reproducer/TestCaptureEnvOverride.test (1040 of 2167)
PASS: lldb-shell :: Reproducer/TestCrash.test (1041 of 2167)
XFAIL: lldb-shell :: Register/x86-multithread-write.test (1042 of 2167)
PASS: lldb-shell :: Register/x86-multithread-read.test (1043 of 2167)
PASS: lldb-shell :: Reproducer/TestDebugSymbols.test (1044 of 2167)
PASS: lldb-shell :: ObjectFile/ELF/PT_LOAD-overlap-PT_TLS.yaml (1045 of 2167)
PASS: lldb-shell :: ObjectFile/ELF/PT_TLS-overlap-PT_LOAD.yaml (1046 of 2167)
PASS: lldb-shell :: Reproducer/TestDriverOptions.test (1047 of 2167)
PASS: lldb-shell :: Reproducer/TestFinalize.test (1048 of 2167)
PASS: lldb-shell :: Reproducer/TestDSYM.test (1049 of 2167)
PASS: lldb-shell :: Reproducer/TestDiscard.test (1050 of 2167)
UNSUPPORTED: lldb-shell :: Reproducer/TestLuaImport.test (1051 of 2167)
PASS: lldb-shell :: Reproducer/TestHomeDir.test (1052 of 2167)
PASS: lldb-shell :: Reproducer/TestProcessList.test (1053 of 2167)
PASS: lldb-shell :: Reproducer/TestPythonImport.test (1054 of 2167)
PASS: lldb-api :: types/TestShortType.py (1055 of 2167)
PASS: lldb-shell :: Reproducer/Functionalities/TestDataFormatter.test (1056 of 2167)
PASS: lldb-shell :: Reproducer/Functionalities/TestImageList.test (1057 of 2167)
PASS: lldb-shell :: Reproducer/TestSynchronous.test (1058 of 2167)
PASS: lldb-shell :: Reproducer/Functionalities/TestStepping.test (1059 of 2167)
PASS: lldb-shell :: Reproducer/Modules/TestModuleCXX.test (1060 of 2167)
UNSUPPORTED: lldb-shell :: ScriptInterpreter/Lua/bindings.test (1061 of 2167)
UNSUPPORTED: lldb-shell :: ScriptInterpreter/Lua/breakpoint_callback.test (1062 of 2167)
UNSUPPORTED: lldb-shell :: ScriptInterpreter/Lua/command_script_import.test (1063 of 2167)
UNSUPPORTED: lldb-shell :: ScriptInterpreter/Lua/convenience_variables.test (1064 of 2167)
UNSUPPORTED: lldb-shell :: ScriptInterpreter/Lua/independent_state.test (1065 of 2167)
UNSUPPORTED: lldb-shell :: ScriptInterpreter/Lua/io.test (1066 of 2167)
UNSUPPORTED: lldb-shell :: ScriptInterpreter/Lua/lua-python.test (1067 of 2167)
UNSUPPORTED: lldb-shell :: ScriptInterpreter/Lua/lua.test (1068 of 2167)
UNSUPPORTED: lldb-shell :: ScriptInterpreter/Lua/nested_sessions.test (1069 of 2167)
UNSUPPORTED: lldb-shell :: ScriptInterpreter/Lua/persistent_state.test (1070 of 2167)
UNSUPPORTED: lldb-shell :: ScriptInterpreter/Lua/quit.test (1071 of 2167)
UNSUPPORTED: lldb-shell :: ScriptInterpreter/Lua/watchpoint_callback.test (1072 of 2167)
PASS: lldb-shell :: ScriptInterpreter/None/import_module.test (1073 of 2167)
PASS: lldb-shell :: ScriptInterpreter/None/none.test (1074 of 2167)
PASS: lldb-shell :: Reproducer/Functionalities/TestExpressionEvaluation.test (1075 of 2167)
PASS: lldb-shell :: ScriptInterpreter/Python/crashlog.test (1076 of 2167)
PASS: lldb-shell :: ScriptInterpreter/Python/eof.test (1077 of 2167)
PASS: lldb-api :: types/TestIntegerTypeExpr.py (1078 of 2167)
PASS: lldb-shell :: ScriptInterpreter/Python/sb_address_exception.test (1079 of 2167)
PASS: lldb-shell :: Settings/TestDisableColor.test (1080 of 2167)
PASS: lldb-shell :: Settings/TestDisassemblyFormat.test (1081 of 2167)
PASS: lldb-shell :: ScriptInterpreter/Python/scripted_breakpoint.test (1082 of 2167)
PASS: lldb-shell :: Settings/TestEchoCommands.test (1083 of 2167)
PASS: lldb-shell :: Reproducer/TestFileRepro.test (1084 of 2167)
PASS: lldb-shell :: Reproducer/TestDump.test (1085 of 2167)
PASS: lldb-shell :: Settings/TestFrameFormatColor.test (1086 of 2167)
PASS: lldb-shell :: Settings/TestModuleCacheSanity.test (1087 of 2167)
PASS: lldb-shell :: ScriptInterpreter/Python/python.test (1088 of 2167)
PASS: lldb-shell :: Settings/TestSettingsSet.test (1089 of 2167)
PASS: lldb-shell :: Settings/TestFrameFormatMangling.test (1090 of 2167)
PASS: lldb-shell :: Settings/TestSettingsWrite.test (1091 of 2167)
PASS: lldb-shell :: SymbolFile/Breakpad/line-table-discontinuous-file-ids.test (1092 of 2167)
PASS: lldb-shell :: Settings/TestFrameFormatNoColor.test (1093 of 2167)
PASS: lldb-shell :: Settings/TestStopCommandSourceOnError.test (1094 of 2167)
PASS: lldb-shell :: SymbolFile/Breakpad/line-table-mixed-path-styles.test (1095 of 2167)
PASS: lldb-shell :: SymbolFile/Breakpad/line-table-edgecases.test (1096 of 2167)
PASS: lldb-shell :: SymbolFile/Breakpad/line-table-missing-file.test (1097 of 2167)
UNSUPPORTED: lldb-shell :: SymbolFile/Breakpad/stack-cfi-arm.yaml (1098 of 2167)
PASS: lldb-shell :: SymbolFile/Breakpad/line-table.test (1099 of 2167)
PASS: lldb-shell :: SymbolFile/Breakpad/symtab-macho.test (1100 of 2167)
PASS: lldb-shell :: SymbolFile/Breakpad/symtab.test (1101 of 2167)
PASS: lldb-shell :: SymbolFile/Breakpad/stack-cfi-parsing.test (1102 of 2167)
PASS: lldb-shell :: SymbolFile/Breakpad/unwind-via-stack-cfi.test (1103 of 2167)
PASS: lldb-shell :: SymbolFile/DWARF/DW_AT_const_value-bitfields.s (1104 of 2167)
PASS: lldb-shell :: SymbolFile/DWARF/DW_AT_const_value.s (1105 of 2167)
PASS: lldb-shell :: SymbolFile/DWARF/DW_AT_data_bit_offset-DW_OP_stack_value.s (1106 of 2167)
PASS: lldb-shell :: Reproducer/TestRelativePath.test (1107 of 2167)
PASS: lldb-shell :: SymbolFile/DWARF/DW_AT_location-DW_AT_const_value.s (1108 of 2167)
PASS: lldb-shell :: Settings/TestLineMarkerColor.test (1109 of 2167)
PASS: lldb-shell :: SymbolFile/DWARF/DW_AT_low_pc-addrx.s (1110 of 2167)
PASS: lldb-shell :: SymbolFile/DWARF/DW_AT_loclists_base.s (1111 of 2167)
PASS: lldb-shell :: SymbolFile/DWARF/DW_OP_piece-smaller-than-struct.s (1112 of 2167)
UNSUPPORTED: lldb-shell :: SymbolFile/DWARF/DW_TAG_GNU_call_site-DW_AT_low_pc.s (1113 of 2167)
PASS: lldb-shell :: SymbolFile/DWARF/DW_OP_piece-struct.s (1114 of 2167)
PASS: lldb-shell :: SymbolFile/DWARF/DW_TAG_basic_type_DW_ATE_UTF_nonC.ll (1115 of 2167)
PASS: lldb-shell :: SymbolFile/DWARF/DW_AT_declaration-with-children.s (1116 of 2167)
PASS: lldb-shell :: SymbolFile/DWARF/DW_TAG_variable-DW_AT_const_value.s (1117 of 2167)
PASS: lldb-shell :: SymbolFile/DWARF/DW_TAG_variable-invalid_location.s (1118 of 2167)
UNSUPPORTED: lldb-shell :: SymbolFile/DWARF/array-sizes.s (1119 of 2167)
PASS: lldb-shell :: SymbolFile/DWARF/apple-index-is-used.cpp (1120 of 2167)
PASS: lldb-shell :: SymbolFile/DWARF/childless-compile-unit.s (1121 of 2167)
PASS: lldb-shell :: SymbolFile/DWARF/clang-ast-from-dwarf-objc-property.m (1122 of 2167)
PASS: lldb-shell :: SymbolFile/DWARF/clang-ast-from-dwarf-unamed-and-anon-structs.cpp (1123 of 2167)
UNSUPPORTED: lldb-shell :: SymbolFile/DWARF/debug-line-basic.s (1124 of 2167)
UNSUPPORTED: lldb-shell :: SymbolFile/DWARF/debug-names-compressed.cpp (1125 of 2167)
UNSUPPORTED: lldb-shell :: SymbolFile/DWARF/debug-types-address-ranges.s (1126 of 2167)
UNSUPPORTED: lldb-shell :: SymbolFile/DWARF/debug-types-basic.test (1127 of 2167)
PASS: lldb-shell :: SymbolFile/DWARF/debug-types-dwarf5.s (1128 of 2167)
UNSUPPORTED: lldb-shell :: SymbolFile/DWARF/debug-types-dwo-cross-reference.cpp (1129 of 2167)
UNSUPPORTED: lldb-shell :: SymbolFile/DWARF/debug-types-expressions.test (1130 of 2167)
PASS: lldb-shell :: SymbolFile/DWARF/anon_class_w_and_wo_export_symbols.ll (1131 of 2167)
PASS: lldb-shell :: SymbolFile/DWARF/debug-types-line-tables.s (1132 of 2167)
UNSUPPORTED: lldb-shell :: SymbolFile/DWARF/debug-types-signature-loop.s (1133 of 2167)
PASS: lldb-shell :: SymbolFile/DWARF/debug_aranges-empty-section.s (1134 of 2167)
PASS: lldb-shell :: SymbolFile/DWARF/debug_line-relative_path.s (1135 of 2167)
PASS: lldb-shell :: SymbolFile/DWARF/debug_line-tombstone.s (1136 of 2167)
PASS: lldb-shell :: SymbolFile/DWARF/debug_loc-aslr.s (1137 of 2167)
PASS: lldb-api :: types/TestShortTypeExpr.py (1138 of 2167)
PASS: lldb-shell :: SymbolFile/DWARF/debug-types-missing-signature.test (1139 of 2167)
PASS: lldb-shell :: SymbolFile/DWARF/debug_loc.s (1140 of 2167)
PASS: lldb-shell :: SymbolFile/DWARF/debug_loc_and_loclists.s (1141 of 2167)
PASS: lldb-shell :: SymbolFile/DWARF/debug_ranges-missing-section.s (1142 of 2167)
PASS: lldb-shell :: SymbolFile/DWARF/debug_loclists-dwo.s (1143 of 2167)
UNSUPPORTED: lldb-shell :: SymbolFile/DWARF/debug_ranges_and_rnglists.test (1144 of 2167)
PASS: lldb-shell :: SymbolFile/DWARF/debug_ranges.s (1145 of 2167)
PASS: lldb-shell :: SymbolFile/DWARF/debug_rnglists.s (1146 of 2167)
PASS: lldb-shell :: SymbolFile/DWARF/debug_rnglists-dwo.s (1147 of 2167)
UNSUPPORTED: lldb-shell :: SymbolFile/DWARF/dir-separator-no-comp-dir-relative-name.s (1148 of 2167)
UNSUPPORTED: lldb-shell :: SymbolFile/DWARF/dir-separator-no-comp-dir.s (1149 of 2167)
UNSUPPORTED: lldb-shell :: SymbolFile/DWARF/dir-separator-posix.s (1150 of 2167)
UNSUPPORTED: lldb-shell :: SymbolFile/DWARF/dir-separator-windows.s (1151 of 2167)
PASS: lldb-shell :: SymbolFile/DWARF/dwarf5-debug_line.s (1152 of 2167)
UNSUPPORTED: lldb-shell :: SymbolFile/DWARF/dwarf5-index-is-used.cpp (1153 of 2167)
UNSUPPORTED: lldb-shell :: SymbolFile/DWARF/dwarf5-partial-index.cpp (1154 of 2167)
UNSUPPORTED: lldb-shell :: SymbolFile/DWARF/dwarf5_locations.s (1155 of 2167)
PASS: lldb-shell :: SymbolFile/DWARF/dwarf5-atomic.s (1156 of 2167)
PASS: lldb-shell :: SymbolFile/DWARF/compilercontext.ll (1157 of 2167)
UNSUPPORTED: lldb-shell :: SymbolFile/DWARF/dwp-separate-debug-file.cpp (1158 of 2167)
PASS: lldb-shell :: SymbolFile/DWARF/dwo-type-in-main-file.s (1159 of 2167)
UNSUPPORTED: lldb-shell :: SymbolFile/DWARF/find-basic-function.cpp (1160 of 2167)
UNSUPPORTED: lldb-shell :: SymbolFile/DWARF/find-basic-namespace.cpp (1161 of 2167)
UNSUPPORTED: lldb-shell :: SymbolFile/DWARF/find-basic-type.cpp (1162 of 2167)
UNSUPPORTED: lldb-shell :: SymbolFile/DWARF/find-basic-variable.cpp (1163 of 2167)
UNSUPPORTED: lldb-shell :: SymbolFile/DWARF/find-function-regex.cpp (1164 of 2167)
UNSUPPORTED: lldb-shell :: SymbolFile/DWARF/find-inline-method.s (1165 of 2167)
PASS: lldb-shell :: SymbolFile/DWARF/dwp-debug-types.s (1166 of 2167)
UNSUPPORTED: lldb-shell :: SymbolFile/DWARF/find-method.cpp (1167 of 2167)
PASS: lldb-shell :: SymbolFile/DWARF/find-method-local-struct.cpp (1168 of 2167)
UNSUPPORTED: lldb-shell :: SymbolFile/DWARF/find-type-in-function.cpp (1169 of 2167)
UNSUPPORTED: lldb-shell :: SymbolFile/DWARF/find-variable-dwo.cpp (1170 of 2167)
UNSUPPORTED: lldb-shell :: SymbolFile/DWARF/find-variable-file.cpp (1171 of 2167)
PASS: lldb-shell :: SymbolFile/DWARF/dwp.s (1172 of 2167)
UNSUPPORTED: lldb-shell :: SymbolFile/DWARF/inline-function-address-shared.test (1173 of 2167)
UNSUPPORTED: lldb-shell :: SymbolFile/DWARF/inline-function-address.ll (1174 of 2167)
UNSUPPORTED: lldb-shell :: SymbolFile/DWARF/limit-debug-info.s (1175 of 2167)
PASS: lldb-shell :: SymbolFile/DWARF/find-qualified-variable.cpp (1176 of 2167)
PASS: lldb-shell :: SymbolFile/DWARF/gnu-style-compression.cpp (1177 of 2167)
UNSUPPORTED: lldb-shell :: SymbolFile/DWARF/split-dwarf-expression-eval-bug.cpp (1178 of 2167)
PASS: lldb-shell :: SymbolFile/DWARF/parallel-indexing-stress.s (1179 of 2167)
PASS: lldb-shell :: SymbolFile/DWARF/split-dwarf-inlining.cpp (1180 of 2167)
PASS: lldb-shell :: SymbolFile/DWARF/split-dwarf-multiple-cu.ll (1181 of 2167)
UNSUPPORTED: lldb-shell :: SymbolFile/DWARF/win-i386-line-table.s (1182 of 2167)
UNSUPPORTED: lldb-shell :: SymbolFile/NativePDB/ast-functions-msvc.cpp (1183 of 2167)
UNSUPPORTED: lldb-shell :: SymbolFile/NativePDB/ast-functions.cpp (1184 of 2167)
UNSUPPORTED: lldb-shell :: SymbolFile/NativePDB/ast-methods.cpp (1185 of 2167)
UNSUPPORTED: lldb-shell :: SymbolFile/NativePDB/ast-types.cpp (1186 of 2167)
UNSUPPORTED: lldb-shell :: SymbolFile/NativePDB/bitfields.cpp (1187 of 2167)
UNSUPPORTED: lldb-shell :: SymbolFile/NativePDB/break-by-function.cpp (1188 of 2167)
UNSUPPORTED: lldb-shell :: SymbolFile/NativePDB/break-by-line.cpp (1189 of 2167)
UNSUPPORTED: lldb-shell :: SymbolFile/NativePDB/disassembly.cpp (1190 of 2167)
UNSUPPORTED: lldb-shell :: SymbolFile/NativePDB/function-types-builtins.cpp (1191 of 2167)
UNSUPPORTED: lldb-shell :: SymbolFile/NativePDB/function-types-calling-conv.cpp (1192 of 2167)
UNSUPPORTED: lldb-shell :: SymbolFile/NativePDB/function-types-classes.cpp (1193 of 2167)
UNSUPPORTED: lldb-shell :: SymbolFile/NativePDB/global-classes.cpp (1194 of 2167)
UNSUPPORTED: lldb-shell :: SymbolFile/NativePDB/globals-bss.cpp (1195 of 2167)
UNSUPPORTED: lldb-shell :: SymbolFile/NativePDB/globals-fundamental.cpp (1196 of 2167)
UNSUPPORTED: lldb-shell :: SymbolFile/NativePDB/local-variables.cpp (1197 of 2167)
UNSUPPORTED: lldb-shell :: SymbolFile/NativePDB/locate-pdb.cpp (1198 of 2167)
PASS: lldb-shell :: SymbolFile/DWARF/static_scope.s (1199 of 2167)
UNSUPPORTED: lldb-shell :: SymbolFile/NativePDB/nested-types.cpp (1200 of 2167)
UNSUPPORTED: lldb-shell :: SymbolFile/NativePDB/s_constant.cpp (1201 of 2167)
UNSUPPORTED: lldb-shell :: SymbolFile/NativePDB/source-list.cpp (1202 of 2167)
UNSUPPORTED: lldb-shell :: SymbolFile/NativePDB/stack_unwinding01.cpp (1203 of 2167)
UNSUPPORTED: lldb-shell :: SymbolFile/NativePDB/tag-types.cpp (1204 of 2167)
UNSUPPORTED: lldb-shell :: SymbolFile/NativePDB/typedefs.cpp (1205 of 2167)
UNSUPPORTED: lldb-shell :: SymbolFile/PDB/ast-restore.test (1206 of 2167)
UNSUPPORTED: lldb-shell :: SymbolFile/PDB/calling-conventions.test (1207 of 2167)
UNSUPPORTED: lldb-shell :: SymbolFile/PDB/class-layout.test (1208 of 2167)
UNSUPPORTED: lldb-shell :: SymbolFile/PDB/compilands.test (1209 of 2167)
UNSUPPORTED: lldb-shell :: SymbolFile/PDB/expressions.test (1210 of 2167)
UNSUPPORTED: lldb-shell :: SymbolFile/PDB/enums-layout.test (1211 of 2167)
UNSUPPORTED: lldb-shell :: SymbolFile/PDB/func-symbols.test (1212 of 2167)
UNSUPPORTED: lldb-shell :: SymbolFile/PDB/function-level-linking.test (1213 of 2167)
UNSUPPORTED: lldb-shell :: SymbolFile/PDB/function-nested-block.test (1214 of 2167)
UNSUPPORTED: lldb-shell :: SymbolFile/PDB/pointers.test (1215 of 2167)
UNSUPPORTED: lldb-shell :: SymbolFile/PDB/type-quals.test (1216 of 2167)
UNSUPPORTED: lldb-shell :: SymbolFile/PDB/typedefs.test (1217 of 2167)
UNSUPPORTED: lldb-shell :: SymbolFile/PDB/udt-layout.test (1218 of 2167)
UNSUPPORTED: lldb-shell :: SymbolFile/PDB/variables-locations.test (1219 of 2167)
UNSUPPORTED: lldb-shell :: SymbolFile/PDB/variables.test (1220 of 2167)
UNSUPPORTED: lldb-shell :: SymbolFile/PDB/vbases.test (1221 of 2167)
UNSUPPORTED: lldb-shell :: SymbolFile/dissassemble-entry-point.s (1222 of 2167)
UNSUPPORTED: lldb-shell :: SymbolFile/target-symbols-add-unwind.test (1223 of 2167)
UNSUPPORTED: lldb-shell :: Unwind/basic-block-sections.test (1224 of 2167)
UNSUPPORTED: lldb-shell :: Unwind/eh-frame-augment-noop.test (1225 of 2167)
PASS: lldb-shell :: SymbolFile/symbol-binding.test (1226 of 2167)
PASS: lldb-shell :: SymbolFile/DWARF/module-ownership.mm (1227 of 2167)
UNSUPPORTED: lldb-shell :: Unwind/eh-frame-small-fde.test (1228 of 2167)
PASS: lldb-shell :: SymbolFile/DWARF/deterministic-build.cpp (1229 of 2167)
PASS: lldb-shell :: Unwind/eh-frame-dwarf-unwind.test (1230 of 2167)
UNSUPPORTED: lldb-shell :: Unwind/unwind-plan-dwarf-dump.test (1231 of 2167)
PASS: lldb-shell :: VSCode/TestOptions.test (1232 of 2167)
PASS: lldb-shell :: Unwind/thread-step-out-ret-addr-check.test (1233 of 2167)
UNSUPPORTED: lldb-shell :: Watchpoint/netbsd-nouserdbregs.test (1234 of 2167)
FAIL: lldb-shell :: lldb-server/TestErrorMessages.test (1235 of 2167)
PASS: lldb-unit :: API/Release/APITests/SBCommandInterpreterTest.MultiWordCommand (1236 of 2167)
PASS: lldb-unit :: API/Release/APITests/SBCommandInterpreterTest.SingleWordCommand (1237 of 2167)
PASS: lldb-unit :: Breakpoint/Release/LLDBBreakpointTests/BreakpointIDTest.StringIsBreakpointName (1238 of 2167)
PASS: lldb-unit :: Core/Release/LLDBCoreTests/CommunicationTest.SynchronizeWhileClosing (1239 of 2167)
PASS: lldb-unit :: Core/Release/LLDBCoreTests/MangledTest.EmptyForInvalidName (1240 of 2167)
PASS: lldb-shell :: Unwind/trap_frame_sym_ctx.test (1241 of 2167)
PASS: lldb-unit :: Core/Release/LLDBCoreTests/MangledTest.NameIndexes_FindFunctionSymbols (1242 of 2167)
PASS: lldb-unit :: Core/Release/LLDBCoreTests/MangledTest.ResultForBlockInvocation (1243 of 2167)
PASS: lldb-unit :: Core/Release/LLDBCoreTests/MangledTest.ResultForValidName (1244 of 2167)
PASS: lldb-unit :: Core/Release/LLDBCoreTests/ModuleSpecTest.InvalidInMemoryBuffer (1245 of 2167)
PASS: lldb-unit :: Core/Release/LLDBCoreTests/ModuleSpecTest.InvalidInMemoryBufferValidFile (1246 of 2167)
PASS: lldb-unit :: Core/Release/LLDBCoreTests/ModuleSpecTest.TestCOFFFile (1247 of 2167)
PASS: lldb-unit :: Core/Release/LLDBCoreTests/ModuleSpecTest.TestMachOFile (1248 of 2167)
PASS: lldb-unit :: Core/Release/LLDBCoreTests/ModuleSpecTest.TestELFFile (1249 of 2167)
XFAIL: lldb-shell :: Unwind/prefer-debug-over-eh-frame.test (1250 of 2167)
PASS: lldb-unit :: Core/Release/LLDBCoreTests/RichManglingContextTest.Basic (1251 of 2167)
PASS: lldb-unit :: Core/Release/LLDBCoreTests/RichManglingContextTest.FromCxxMethodName (1252 of 2167)
PASS: lldb-unit :: Core/Release/LLDBCoreTests/RichManglingContextTest.IPDRealloc (1253 of 2167)
PASS: lldb-unit :: Core/Release/LLDBCoreTests/SourceFileCache.FindSourceFileFound (1254 of 2167)
PASS: lldb-unit :: Core/Release/LLDBCoreTests/RichManglingContextTest.SwitchProvider (1255 of 2167)
PASS: lldb-unit :: Core/Release/LLDBCoreTests/SourceFileCache.FindSourceFileNotFound (1256 of 2167)
PASS: lldb-unit :: Core/Release/LLDBCoreTests/UniqueCStringMap.NoDefaultConstructor (1257 of 2167)
PASS: lldb-unit :: Core/Release/LLDBCoreTests/StreamCallbackTest.Callback (1258 of 2167)
PASS: lldb-unit :: DataFormatter/Release/LLDBFormatterTests/FormatManagerTests.CompatibleLangs (1259 of 2167)
PASS: lldb-unit :: DataFormatter/Release/LLDBFormatterTests/StringPrinterTests.CxxASCII (1260 of 2167)
PASS: lldb-unit :: DataFormatter/Release/LLDBFormatterTests/StringPrinterTests.CxxUTF8 (1261 of 2167)
PASS: lldb-unit :: DataFormatter/Release/LLDBFormatterTests/StringPrinterTests.SwiftUTF8 (1262 of 2167)
PASS: lldb-unit :: DataFormatter/Release/LLDBFormatterTests/TypeMatcherTests.CreatedBySameMatchString (1263 of 2167)
PASS: lldb-unit :: DataFormatter/Release/LLDBFormatterTests/TypeMatcherTests.CreatedBySameMatchStringExactNamePrefixes (1264 of 2167)
PASS: lldb-unit :: DataFormatter/Release/LLDBFormatterTests/TypeMatcherTests.ExactName (1265 of 2167)
PASS: lldb-unit :: DataFormatter/Release/LLDBFormatterTests/TypeMatcherTests.GetMatchStringRegex (1266 of 2167)
PASS: lldb-unit :: DataFormatter/Release/LLDBFormatterTests/TypeMatcherTests.GetMatchStringExactName (1267 of 2167)
PASS: lldb-unit :: DataFormatter/Release/LLDBFormatterTests/TypeMatcherTests.RegexMatchPart (1268 of 2167)
PASS: lldb-unit :: DataFormatter/Release/LLDBFormatterTests/TypeMatcherTests.RegexName (1269 of 2167)
PASS: lldb-unit :: Editline/Release/EditlineTests/EditlineTestFixture.EditlineReceivesMultiLineText (1270 of 2167)
PASS: lldb-unit :: Editline/Release/EditlineTests/EditlineTestFixture.EditlineReceivesSingleLineText (1271 of 2167)
PASS: lldb-unit :: Expression/Release/ExpressionTests/ClangHostTest.ComputeClangResourceDirectory (1272 of 2167)
PASS: lldb-unit :: Expression/Release/ExpressionTests/ClangExpressionDeclMapTest.TestUnknownIdentifierLookup (1273 of 2167)
PASS: lldb-unit :: Expression/Release/ExpressionTests/ClangHostTest.MacOSX (1274 of 2167)
PASS: lldb-unit :: Expression/Release/ExpressionTests/ClangExpressionDeclMapTest.TestPersistentDeclLookup (1275 of 2167)
PASS: lldb-unit :: Expression/Release/ExpressionTests/CppModuleConfigurationTest.AmbiguousCLib (1276 of 2167)
PASS: lldb-unit :: Expression/Release/ExpressionTests/CppModuleConfigurationTest.AmbiguousLibCpp (1277 of 2167)
PASS: lldb-unit :: Expression/Release/ExpressionTests/CppModuleConfigurationTest.IgnoreLibStdCpp (1278 of 2167)
PASS: lldb-unit :: Expression/Release/ExpressionTests/CppModuleConfigurationTest.LibCppV2 (1279 of 2167)
PASS: lldb-unit :: Expression/Release/ExpressionTests/CppModuleConfigurationTest.Linux (1280 of 2167)
PASS: lldb-unit :: Expression/Release/ExpressionTests/CppModuleConfigurationTest.LinuxLocalLibCpp (1281 of 2167)
PASS: lldb-unit :: Expression/Release/ExpressionTests/CppModuleConfigurationTest.MissingLibCpp (1282 of 2167)
PASS: lldb-unit :: Expression/Release/ExpressionTests/CppModuleConfigurationTest.MissingUsrInclude (1283 of 2167)
PASS: lldb-unit :: Expression/Release/ExpressionTests/CppModuleConfigurationTest.Sysroot (1284 of 2167)
PASS: lldb-unit :: Expression/Release/ExpressionTests/CppModuleConfigurationTest.UnknownLibCppFile (1285 of 2167)
PASS: lldb-unit :: Expression/Release/ExpressionTests/CppModuleConfigurationTest.UnrelatedLibrary (1286 of 2167)
PASS: lldb-unit :: Expression/Release/ExpressionTests/CppModuleConfigurationTest.Xcode (1287 of 2167)
PASS: lldb-unit :: Expression/Release/ExpressionTests/DWARFExpression.DW_OP_pick (1288 of 2167)
PASS: lldb-unit :: Expression/Release/ExpressionTests/DWARFExpression.DW_OP_implicit_value (1289 of 2167)
PASS: lldb-unit :: Expression/Release/ExpressionTests/DWARFExpression.DW_OP_convert (1290 of 2167)
PASS: lldb-unit :: Expression/Release/ExpressionTests/DWARFExpression.DW_OP_stack_value (1291 of 2167)
PASS: lldb-unit :: Expression/Release/ExpressionTests/DWARFExpression.DW_OP_piece (1292 of 2167)
PASS: lldb-unit :: Expression/Release/ExpressionTests/DWARFExpression.DW_OP_unknown (1293 of 2167)
PASS: lldb-unit :: Expression/Release/ExpressionTests/DiagnosticManagerTest.AppendMessageAttachToLastDiag (1294 of 2167)
PASS: lldb-unit :: Expression/Release/ExpressionTests/DiagnosticManagerTest.AddDiagnostic (1295 of 2167)
PASS: lldb-unit :: Expression/Release/ExpressionTests/DiagnosticManagerTest.AppendMessageNoDiag (1296 of 2167)
PASS: lldb-unit :: Expression/Release/ExpressionTests/DiagnosticManagerTest.AppendMessageSubsequentDiags (1297 of 2167)
PASS: lldb-unit :: Expression/Release/ExpressionTests/DiagnosticManagerTest.FixedExpression (1298 of 2167)
PASS: lldb-unit :: Expression/Release/ExpressionTests/DiagnosticManagerTest.GetStringBasic (1299 of 2167)
PASS: lldb-unit :: Expression/Release/ExpressionTests/DiagnosticManagerTest.GetStringMultiline (1300 of 2167)
PASS: lldb-unit :: Expression/Release/ExpressionTests/DiagnosticManagerTest.GetStringMultipleDiags (1301 of 2167)
PASS: lldb-unit :: Expression/Release/ExpressionTests/DiagnosticManagerTest.GetStringNoDiags (1302 of 2167)
PASS: lldb-unit :: Expression/Release/ExpressionTests/DiagnosticManagerTest.GetStringPreserveOrder (1303 of 2167)
PASS: lldb-unit :: Expression/Release/ExpressionTests/DiagnosticManagerTest.GetStringSeverityLabels (1304 of 2167)
PASS: lldb-unit :: Expression/Release/ExpressionTests/DiagnosticManagerTest.HasFixits (1305 of 2167)
PASS: lldb-unit :: Expression/Release/ExpressionTests/DiagnosticManagerTest.PutStringMultiple (1306 of 2167)
PASS: lldb-unit :: Expression/Release/ExpressionTests/DiagnosticManagerTest.PutString (1307 of 2167)
PASS: lldb-unit :: Expression/Release/ExpressionTests/DiagnosticManagerTest.PutStringSeverities (1308 of 2167)
PASS: lldb-unit :: Host/Release/HostTests/File.GetStreamFromDescriptor (1309 of 2167)
PASS: lldb-unit :: Host/Release/HostTests/ConnectionFileDescriptorTest.TCPGetURIv4 (1310 of 2167)
PASS: lldb-unit :: Host/Release/HostTests/ConnectionFileDescriptorTest.TCPGetURIv6 (1311 of 2167)
PASS: lldb-unit :: Host/Release/HostTests/File.GetWaitableHandleFileno (1312 of 2167)
PASS: lldb-unit :: Host/Release/HostTests/FileSystemTest.EmptyTest (1313 of 2167)
PASS: lldb-unit :: Host/Release/HostTests/FileActionTest.Open (1314 of 2167)
PASS: lldb-unit :: Host/Release/HostTests/FileSystemTest.FileAndDirectoryComponents (1315 of 2167)
PASS: lldb-unit :: Host/Release/HostTests/FileSystemTest.Exists (1316 of 2167)
PASS: lldb-unit :: Host/Release/HostTests/FileSystemTest.EnumerateDirectory (1317 of 2167)
PASS: lldb-unit :: Host/Release/HostTests/FileSystemTest.GetByteSize (1318 of 2167)
PASS: lldb-unit :: Host/Release/HostTests/FileSystemTest.GetPermissions (1319 of 2167)
PASS: lldb-unit :: Host/Release/HostTests/FileSystemTest.MakeAbsolute (1320 of 2167)
PASS: lldb-unit :: Host/Release/HostTests/FileSystemTest.Resolve (1321 of 2167)
PASS: lldb-unit :: Host/Release/HostTests/FileSystemTest.Readable (1322 of 2167)
PASS: lldb-unit :: Host/Release/HostTests/FileSystemTest.OpenErrno (1323 of 2167)
PASS: lldb-unit :: Host/Release/HostTests/Host.WaitStatusFormat (1324 of 2167)
PASS: lldb-unit :: Host/Release/HostTests/Host.GetEnvironment (1325 of 2167)
PASS: lldb-unit :: Host/Release/HostTests/HostInfoTest.GetAugmentedArchSpec (1326 of 2167)
PASS: lldb-unit :: Host/Release/HostTests/HostInfoTest.GetHostname (1327 of 2167)
PASS: lldb-unit :: Host/Release/HostTests/MainLoopTest.DetectsEOF (1328 of 2167)
PASS: lldb-unit :: Host/Release/HostTests/MainLoopTest.ReadObject (1329 of 2167)
PASS: lldb-unit :: Host/Release/HostTests/MainLoopTest.Signal (1330 of 2167)
PASS: lldb-unit :: Host/Release/HostTests/MainLoopTest.TerminatesImmediately (1331 of 2167)
PASS: lldb-unit :: Host/Release/HostTests/HostInfoTest.GetXcodeSDK (1332 of 2167)
PASS: lldb-unit :: Host/Release/HostTests/NativeProcessProtocolTest.ReadCStringFromMemory (1333 of 2167)
PASS: lldb-unit :: Host/Release/HostTests/NativeProcessProtocolTest.ReadCStringFromMemory_CrossPageBoundary (1334 of 2167)
PASS: lldb-unit :: Host/Release/HostTests/NativeProcessProtocolTest.ReadCStringFromMemory_MaxSize (1335 of 2167)
PASS: lldb-unit :: Host/Release/HostTests/NativeProcessProtocolTest.ReadMemoryWithoutTrap (1336 of 2167)
PASS: lldb-unit :: Host/Release/HostTests/NativeProcessProtocolTest.SetBreakpoint (1337 of 2167)
PASS: lldb-unit :: Host/Release/HostTests/NativeProcessProtocolTest.SetBreakpointFailRead (1338 of 2167)
PASS: lldb-unit :: Host/Release/HostTests/NativeProcessProtocolTest.SetBreakpointFailVerify (1339 of 2167)
PASS: lldb-unit :: Host/Release/HostTests/NativeProcessProtocolTest.SetBreakpointFailWrite (1340 of 2167)
PASS: lldb-unit :: Host/Release/HostTests/ProcessLaunchInfoTest.Constructor (1341 of 2167)
PASS: lldb-unit :: Host/Release/HostTests/SocketAddressTest.GetAddressInfo (1342 of 2167)
PASS: lldb-unit :: Host/Release/HostTests/SocketAddressTest.Set (1343 of 2167)
PASS: lldb-unit :: Host/Release/HostTests/SocketTests/SocketTest.DecodeHostAndPort/ipv4 (1344 of 2167)
PASS: lldb-unit :: Host/Release/HostTests/SocketTests/SocketTest.DecodeHostAndPort/ipv6 (1345 of 2167)
PASS: lldb-unit :: Host/Release/HostTests/SocketTests/SocketTest.DomainGetConnectURI/ipv4 (1346 of 2167)
PASS: lldb-unit :: Host/Release/HostTests/SocketTests/SocketTest.DomainGetConnectURI/ipv6 (1347 of 2167)
PASS: lldb-unit :: Host/Release/HostTests/SocketTests/SocketTest.DomainListenConnectAccept/ipv4 (1348 of 2167)
PASS: lldb-unit :: Host/Release/HostTests/SocketTests/SocketTest.DomainListenConnectAccept/ipv6 (1349 of 2167)
PASS: lldb-unit :: Host/Release/HostTests/SocketTests/SocketTest.TCPGetAddress/ipv4 (1350 of 2167)
PASS: lldb-unit :: Host/Release/HostTests/SocketTests/SocketTest.TCPGetAddress/ipv6 (1351 of 2167)
PASS: lldb-unit :: Host/Release/HostTests/SocketTests/SocketTest.TCPGetConnectURI/ipv4 (1352 of 2167)
PASS: lldb-unit :: Host/Release/HostTests/SocketTests/SocketTest.TCPGetConnectURI/ipv6 (1353 of 2167)
PASS: lldb-unit :: Host/Release/HostTests/SocketTests/SocketTest.TCPListen0ConnectAccept/ipv4 (1354 of 2167)
PASS: lldb-unit :: Host/Release/HostTests/SocketTests/SocketTest.TCPListen0ConnectAccept/ipv6 (1355 of 2167)
PASS: lldb-unit :: Host/Release/HostTests/SocketTests/SocketTest.TCPListen0GetPort/ipv4 (1356 of 2167)
PASS: lldb-unit :: Host/Release/HostTests/SocketTests/SocketTest.TCPListen0GetPort/ipv6 (1357 of 2167)
PASS: lldb-unit :: Host/Release/HostTests/SocketTests/SocketTest.UDPConnect/ipv4 (1358 of 2167)
PASS: lldb-unit :: Host/Release/HostTests/SocketTests/SocketTest.UDPConnect/ipv6 (1359 of 2167)
PASS: lldb-unit :: Host/Release/HostTests/SocketTests/SocketTest.UDPGetConnectURI/ipv4 (1360 of 2167)
PASS: lldb-unit :: Host/Release/HostTests/SocketTests/SocketTest.UDPGetConnectURI/ipv6 (1361 of 2167)
PASS: lldb-unit :: Interpreter/Release/InterpreterTests/CompletionTest.DirCompletionUsername (1362 of 2167)
PASS: lldb-unit :: Interpreter/Release/InterpreterTests/CompletionTest.DirCompletionAbsolute (1363 of 2167)
PASS: lldb-unit :: Interpreter/Release/InterpreterTests/OptionArgParserTest.toBoolean (1364 of 2167)
PASS: lldb-unit :: Interpreter/Release/InterpreterTests/CompletionTest.FileCompletionAbsolute (1365 of 2167)
PASS: lldb-unit :: Interpreter/Release/InterpreterTests/OptionArgParserTest.toChar (1366 of 2167)
PASS: lldb-unit :: Interpreter/Release/InterpreterTests/OptionArgParserTest.toScriptLanguage (1367 of 2167)
PASS: lldb-unit :: Interpreter/Release/InterpreterTests/OptionValueFileColonLine.setFromString (1368 of 2167)
PASS: lldb-unit :: Language/CLanguages/Release/LanguageCLanguagesTests/CLanguages.LookupCLanguagesByLanguageType (1369 of 2167)
PASS: lldb-unit :: Language/CPlusPlus/Release/LanguageCPlusPlusTests/CPlusPlusLanguage.CPlusPlusNameParser (1370 of 2167)
PASS: lldb-unit :: Language/CPlusPlus/Release/LanguageCPlusPlusTests/CPlusPlusLanguage.ExtractContextAndIdentifier (1371 of 2167)
PASS: lldb-unit :: Language/CPlusPlus/Release/LanguageCPlusPlusTests/CPlusPlusLanguage.MethodNameParsing (1372 of 2167)
PASS: lldb-unit :: Language/CPlusPlus/Release/LanguageCPlusPlusTests/CPlusPlusLanguage.FindAlternateFunctionManglings (1373 of 2167)
PASS: lldb-unit :: Language/Highlighting/Release/HighlighterTests/HighlighterTest.ClangCommas (1374 of 2167)
PASS: lldb-unit :: Language/Highlighting/Release/HighlighterTests/HighlighterTest.ClangBraces (1375 of 2167)
PASS: lldb-shell :: Watchpoint/SetErrorCases.test (1376 of 2167)
PASS: lldb-unit :: Language/Highlighting/Release/HighlighterTests/HighlighterTest.ClangComments (1377 of 2167)
PASS: lldb-unit :: Language/Highlighting/Release/HighlighterTests/HighlighterTest.ClangCursorOutOfBounds (1378 of 2167)
PASS: lldb-unit :: Language/Highlighting/Release/HighlighterTests/HighlighterTest.ClangCursorPos (1379 of 2167)
PASS: lldb-unit :: Language/Highlighting/Release/HighlighterTests/HighlighterTest.ClangCursorPosAfterOtherToken (1380 of 2167)
PASS: lldb-unit :: Language/Highlighting/Release/HighlighterTests/HighlighterTest.ClangCursorPosBeforeOtherToken (1381 of 2167)
PASS: lldb-unit :: Language/Highlighting/Release/HighlighterTests/HighlighterTest.ClangCursorPosEndOfLine (1382 of 2167)
PASS: lldb-unit :: Language/Highlighting/Release/HighlighterTests/HighlighterTest.ClangCursorPosInOtherToken (1383 of 2167)
PASS: lldb-unit :: Language/Highlighting/Release/HighlighterTests/HighlighterTest.ClangEmptyInput (1384 of 2167)
PASS: lldb-unit :: Language/Highlighting/Release/HighlighterTests/HighlighterTest.ClangIdentifiers (1385 of 2167)
PASS: lldb-unit :: Language/Highlighting/Release/HighlighterTests/HighlighterTest.ClangOperators (1386 of 2167)
PASS: lldb-unit :: Language/Highlighting/Release/HighlighterTests/HighlighterTest.ClangPPDirectives (1387 of 2167)
PASS: lldb-unit :: Language/Highlighting/Release/HighlighterTests/HighlighterTest.ClangPreserveNewLine (1388 of 2167)
PASS: lldb-unit :: Language/Highlighting/Release/HighlighterTests/HighlighterTest.ClangScalarLiterals (1389 of 2167)
PASS: lldb-unit :: Language/Highlighting/Release/HighlighterTests/HighlighterTest.ClangSquareBrackets (1390 of 2167)
PASS: lldb-unit :: Language/Highlighting/Release/HighlighterTests/HighlighterTest.ClangStringLiterals (1391 of 2167)
PASS: lldb-unit :: Language/Highlighting/Release/HighlighterTests/HighlighterTest.ClangTrailingBackslashBeforeNewline (1392 of 2167)
PASS: lldb-unit :: Language/Highlighting/Release/HighlighterTests/HighlighterTest.ClangTrailingBackslashMissingNewLine (1393 of 2167)
PASS: lldb-unit :: Language/Highlighting/Release/HighlighterTests/HighlighterTest.ClangTrailingBackslashWithWhitespace (1394 of 2167)
PASS: lldb-unit :: Language/Highlighting/Release/HighlighterTests/HighlighterTest.ClangUnterminatedString (1395 of 2167)
PASS: lldb-unit :: Language/Highlighting/Release/HighlighterTests/HighlighterTest.Colons (1396 of 2167)
PASS: lldb-unit :: Language/Highlighting/Release/HighlighterTests/HighlighterTest.DefaultHighlighter (1397 of 2167)
PASS: lldb-unit :: Language/Highlighting/Release/HighlighterTests/HighlighterTest.DefaultHighlighterWithCursor (1398 of 2167)
PASS: lldb-unit :: Language/Highlighting/Release/HighlighterTests/HighlighterTest.DefaultHighlighterWithCursorOutOfBounds (1399 of 2167)
PASS: lldb-unit :: Language/Highlighting/Release/HighlighterTests/HighlighterTest.FallbackHighlighter (1400 of 2167)
PASS: lldb-unit :: Language/Highlighting/Release/HighlighterTests/HighlighterTest.HighlighterSelectionPath (1401 of 2167)
PASS: lldb-unit :: Language/Highlighting/Release/HighlighterTests/HighlighterTest.HighlighterSelectionType (1402 of 2167)
PASS: lldb-unit :: Language/Highlighting/Release/HighlighterTests/HighlighterTest.Keywords (1403 of 2167)
PASS: lldb-unit :: ObjectFile/Breakpad/Release/ObjectFileBreakpadTests/FileRecord.parse (1404 of 2167)
PASS: lldb-unit :: ObjectFile/Breakpad/Release/ObjectFileBreakpadTests/InfoRecord.parse (1405 of 2167)
PASS: lldb-unit :: ObjectFile/Breakpad/Release/ObjectFileBreakpadTests/FuncRecord.parse (1406 of 2167)
PASS: lldb-unit :: ObjectFile/Breakpad/Release/ObjectFileBreakpadTests/LineRecord.parse (1407 of 2167)
PASS: lldb-unit :: ObjectFile/Breakpad/Release/ObjectFileBreakpadTests/ModuleRecord.parse (1408 of 2167)
PASS: lldb-unit :: ObjectFile/Breakpad/Release/ObjectFileBreakpadTests/PublicRecord.parse (1409 of 2167)
PASS: lldb-unit :: ObjectFile/Breakpad/Release/ObjectFileBreakpadTests/Record.classify (1410 of 2167)
PASS: lldb-unit :: ObjectFile/Breakpad/Release/ObjectFileBreakpadTests/StackWinRecord.parse (1411 of 2167)
PASS: lldb-unit :: ObjectFile/Breakpad/Release/ObjectFileBreakpadTests/StackCFIRecord.parse (1412 of 2167)
PASS: lldb-unit :: ObjectFile/ELF/Release/ObjectFileELFTests/ObjectFileELFTest.GetModuleSpecifications_EarlySectionHeaders (1413 of 2167)
PASS: lldb-unit :: ObjectFile/ELF/Release/ObjectFileELFTests/ObjectFileELFTest.GetSymtab_NoSymEntryPointArmThumbAddressClass (1414 of 2167)
PASS: lldb-unit :: ObjectFile/ELF/Release/ObjectFileELFTests/ObjectFileELFTest.GetSymtab_NoSymEntryPointArmAddressClass (1415 of 2167)
PASS: lldb-unit :: ObjectFile/ELF/Release/ObjectFileELFTests/ObjectFileELFTest.SectionsResolveConsistently (1416 of 2167)
PASS: lldb-unit :: ObjectFile/PECOFF/Release/ObjectFilePECOFFTests/PECallFrameInfoTest.Basic_eh (1417 of 2167)
PASS: lldb-unit :: ObjectFile/MachO/Release/ObjectFileMachOTests/ObjectFileMachOTest.ModuleFromSharedCacheInfo (1418 of 2167)
PASS: lldb-unit :: ObjectFile/PECOFF/Release/ObjectFilePECOFFTests/PECallFrameInfoTest.Chained_eh (1419 of 2167)
PASS: lldb-unit :: ObjectFile/PECOFF/Release/ObjectFilePECOFFTests/PECallFrameInfoTest.Frame_reg_eh (1420 of 2167)
PASS: lldb-unit :: Platform/Android/Release/AdbClientTests/AdbClientTest.CreateByDeviceId (1421 of 2167)
PASS: lldb-unit :: Platform/Android/Release/AdbClientTests/AdbClientTest.CreateByDeviceId_ByEnvVar (1422 of 2167)
PASS: lldb-unit :: Platform/Release/LLDBPlatformTests/PlatformDarwinTest.FindComponentInPath (1423 of 2167)
PASS: lldb-unit :: Platform/Release/LLDBPlatformTests/PlatformDarwinTest.TestParseVersionBuildDir (1424 of 2167)
PASS: lldb-unit :: Process/Release/ProcessEventDataTests/ProcessEventDataTest.DoOnRemoval (1425 of 2167)
PASS: lldb-unit :: Process/Release/ProcessEventDataTests/ProcessEventDataTest.ShouldStop (1426 of 2167)
PASS: lldb-shell :: Reproducer/TestWorkingDir.test (1427 of 2167)
PASS: lldb-unit :: Process/gdb-remote/Release/ProcessGdbRemoteTests/GDBRemoteClientBaseTest.SendContinueAndAsyncPacket (1428 of 2167)
PASS: lldb-unit :: Process/gdb-remote/Release/ProcessGdbRemoteTests/GDBRemoteClientBaseTest.SendContinueAndAsyncSignal (1429 of 2167)
PASS: lldb-unit :: Process/gdb-remote/Release/ProcessGdbRemoteTests/GDBRemoteClientBaseTest.SendContinueAndInterrupt (1430 of 2167)
PASS: lldb-unit :: Process/gdb-remote/Release/ProcessGdbRemoteTests/GDBRemoteClientBaseTest.SendContinueAndInterrupt2PacketBug (1431 of 2167)
PASS: lldb-unit :: Process/gdb-remote/Release/ProcessGdbRemoteTests/GDBRemoteClientBaseTest.SendContinueAndLateInterrupt (1432 of 2167)
PASS: lldb-unit :: Process/gdb-remote/Release/ProcessGdbRemoteTests/GDBRemoteClientBaseTest.SendContinueAndWait (1433 of 2167)
PASS: lldb-unit :: Process/gdb-remote/Release/ProcessGdbRemoteTests/GDBRemoteClientBaseTest.SendContinueDelegateInterface (1434 of 2167)
PASS: lldb-unit :: Process/gdb-remote/Release/ProcessGdbRemoteTests/GDBRemoteClientBaseTest.SendContinueDelegateStructuredDataReceipt (1435 of 2167)
PASS: lldb-unit :: Process/gdb-remote/Release/ProcessGdbRemoteTests/GDBRemoteClientBaseTest.SendPacketAndReceiveResponseWithOutputSupport (1436 of 2167)
PASS: lldb-unit :: Process/gdb-remote/Release/ProcessGdbRemoteTests/GDBRemoteCommunicationClientTest.GetMemoryRegionInfo (1437 of 2167)
PASS: lldb-unit :: Process/gdb-remote/Release/ProcessGdbRemoteTests/GDBRemoteCommunicationClientTest.GetMemoryRegionInfoInvalidResponse (1438 of 2167)
PASS: lldb-unit :: Process/gdb-remote/Release/ProcessGdbRemoteTests/GDBRemoteCommunicationClientTest.GetModulesInfo (1439 of 2167)
PASS: lldb-unit :: Process/gdb-remote/Release/ProcessGdbRemoteTests/GDBRemoteCommunicationClientTest.GetModulesInfoInvalidResponse (1440 of 2167)
PASS: lldb-unit :: Process/gdb-remote/Release/ProcessGdbRemoteTests/GDBRemoteCommunicationClientTest.GetModulesInfo_UUID20 (1441 of 2167)
PASS: lldb-unit :: Process/gdb-remote/Release/ProcessGdbRemoteTests/GDBRemoteCommunicationClientTest.GetQOffsets (1442 of 2167)
PASS: lldb-unit :: Process/gdb-remote/Release/ProcessGdbRemoteTests/GDBRemoteCommunicationClientTest.ReadRegister (1443 of 2167)
PASS: lldb-unit :: Process/gdb-remote/Release/ProcessGdbRemoteTests/GDBRemoteCommunicationClientTest.SaveRestoreRegistersNoSuffix (1444 of 2167)
PASS: lldb-unit :: Process/gdb-remote/Release/ProcessGdbRemoteTests/GDBRemoteCommunicationClientTest.SendGetDataPacket (1445 of 2167)
PASS: lldb-unit :: Process/gdb-remote/Release/ProcessGdbRemoteTests/GDBRemoteCommunicationClientTest.SendGetMetaDataPacket (1446 of 2167)
PASS: lldb-unit :: Process/gdb-remote/Release/ProcessGdbRemoteTests/GDBRemoteCommunicationClientTest.SendGetTraceConfigPacket (1447 of 2167)
PASS: lldb-unit :: Process/gdb-remote/Release/ProcessGdbRemoteTests/GDBRemoteCommunicationClientTest.SendSignalsToIgnore (1448 of 2167)
PASS: lldb-unit :: Process/gdb-remote/Release/ProcessGdbRemoteTests/GDBRemoteCommunicationClientTest.SendStartTracePacket (1449 of 2167)
PASS: lldb-unit :: Process/gdb-remote/Release/ProcessGdbRemoteTests/GDBRemoteCommunicationClientTest.SendStopTracePacket (1450 of 2167)
PASS: lldb-unit :: Process/gdb-remote/Release/ProcessGdbRemoteTests/GDBRemoteCommunicationClientTest.SyncThreadState (1451 of 2167)
PASS: lldb-unit :: Process/gdb-remote/Release/ProcessGdbRemoteTests/GDBRemoteCommunicationClientTest.TestPacketSpeedJSON (1452 of 2167)
PASS: lldb-unit :: Process/gdb-remote/Release/ProcessGdbRemoteTests/GDBRemoteCommunicationClientTest.WriteRegister (1453 of 2167)
PASS: lldb-unit :: Process/gdb-remote/Release/ProcessGdbRemoteTests/GDBRemoteCommunicationClientTest.WriteRegisterNoSuffix (1454 of 2167)
PASS: lldb-unit :: Process/gdb-remote/Release/ProcessGdbRemoteTests/GDBRemoteCommunicationServerTest.SendErrorResponse_ErrorList (1455 of 2167)
PASS: lldb-shell :: SymbolFile/Breakpad/unwind-via-stack-win-no-memory-info.yaml (1456 of 2167)
PASS: lldb-shell :: SymbolFile/Breakpad/unwind-via-stack-win.test (1457 of 2167)
PASS: lldb-shell :: SymbolFile/Breakpad/unwind-via-raSearch.test (1458 of 2167)
PASS: lldb-unit :: Process/gdb-remote/Release/ProcessGdbRemoteTests/GDBRemoteCommunicationServerTest.SendErrorResponse_ErrorNumber (1459 of 2167)
PASS: lldb-unit :: Process/gdb-remote/Release/ProcessGdbRemoteTests/GDBRemoteCommunicationServerTest.SendErrorResponse_Status (1460 of 2167)
PASS: lldb-unit :: Process/gdb-remote/Release/ProcessGdbRemoteTests/GDBRemoteCommunicationServerTest.SendErrorResponse_StringError (1461 of 2167)
PASS: lldb-unit :: Process/gdb-remote/Release/ProcessGdbRemoteTests/GDBRemoteCommunicationServerTest.SendErrorResponse_UnimplementedError (1462 of 2167)
PASS: lldb-unit :: Process/gdb-remote/Release/ProcessGdbRemoteTests/GDBRemoteCommunicationTest.ReadPacket_checksum (1463 of 2167)
PASS: lldb-unit :: Process/minidump/Release/LLDBMinidumpTests/MinidumpParserTest.FindMemoryRangeWithFullMemoryMinidump (1464 of 2167)
PASS: lldb-unit :: Process/minidump/Release/LLDBMinidumpTests/MinidumpParserTest.FindMemoryRange (1465 of 2167)
PASS: lldb-unit :: Process/minidump/Release/LLDBMinidumpTests/MinidumpParserTest.GetArchitecture (1466 of 2167)
PASS: lldb-unit :: Process/minidump/Release/LLDBMinidumpTests/MinidumpParserTest.GetExceptionStream (1467 of 2167)
PASS: lldb-unit :: Process/minidump/Release/LLDBMinidumpTests/MinidumpParserTest.GetLinuxProcStatus (1468 of 2167)
PASS: lldb-unit :: Process/minidump/Release/LLDBMinidumpTests/MinidumpParserTest.GetArchitectureWindows (1469 of 2167)
PASS: lldb-unit :: Process/minidump/Release/LLDBMinidumpTests/MinidumpParserTest.GetFilteredModuleList (1470 of 2167)
PASS: lldb-unit :: Process/minidump/Release/LLDBMinidumpTests/MinidumpParserTest.GetLinuxProcStatus_no_stream (1471 of 2167)
PASS: lldb-unit :: Process/minidump/Release/LLDBMinidumpTests/MinidumpParserTest.GetMemoryRegionInfoFromMemory64List (1472 of 2167)
PASS: lldb-unit :: Process/minidump/Release/LLDBMinidumpTests/MinidumpParserTest.GetMemoryRegionInfo (1473 of 2167)
PASS: lldb-unit :: Process/minidump/Release/LLDBMinidumpTests/MinidumpParserTest.GetMemory (1474 of 2167)
PASS: lldb-api :: types/TestLongTypes.py (1475 of 2167)
PASS: lldb-unit :: Process/minidump/Release/LLDBMinidumpTests/MinidumpParserTest.GetMiscInfo_no_stream (1476 of 2167)
PASS: lldb-unit :: Process/minidump/Release/LLDBMinidumpTests/MinidumpParserTest.GetMemoryRegionInfoLinuxMaps (1477 of 2167)
PASS: lldb-unit :: Process/minidump/Release/LLDBMinidumpTests/MinidumpParserTest.GetMiscInfoWindows (1478 of 2167)
PASS: lldb-unit :: Process/minidump/Release/LLDBMinidumpTests/MinidumpParserTest.GetMemoryRegionInfoFromMemoryList (1479 of 2167)
PASS: lldb-unit :: Process/minidump/Release/LLDBMinidumpTests/MinidumpParserTest.GetPid (1480 of 2167)
PASS: lldb-unit :: Process/minidump/Release/LLDBMinidumpTests/MinidumpParserTest.GetThreadContext_x86_64 (1481 of 2167)
PASS: lldb-unit :: Process/minidump/Release/LLDBMinidumpTests/MinidumpParserTest.GetPidWow64 (1482 of 2167)
PASS: lldb-unit :: Process/minidump/Release/LLDBMinidumpTests/MinidumpParserTest.GetThreadContext_x86_32 (1483 of 2167)
PASS: lldb-unit :: Process/minidump/Release/LLDBMinidumpTests/MinidumpParserTest.GetPidWindows (1484 of 2167)
PASS: lldb-unit :: Process/minidump/Release/LLDBMinidumpTests/MinidumpParserTest.GetThreadContext_x86_32_wow64 (1485 of 2167)
PASS: lldb-unit :: Process/minidump/Release/LLDBMinidumpTests/MinidumpParserTest.InvalidMinidump (1486 of 2167)
PASS: lldb-unit :: Process/minidump/Release/LLDBMinidumpTests/MinidumpParserTest.GetThreadsAndGetThreadContext (1487 of 2167)
PASS: lldb-unit :: Process/minidump/Release/LLDBMinidumpTests/MinidumpParserTest.MinidumpDuplicateModuleMappedSecond (1488 of 2167)
PASS: lldb-unit :: Process/minidump/Release/LLDBMinidumpTests/MinidumpParserTest.MinidumpDuplicateModuleMinAddress (1489 of 2167)
PASS: lldb-unit :: Process/minidump/Release/LLDBMinidumpTests/MinidumpParserTest.MinidumpDuplicateModuleMappedFirst (1490 of 2167)
PASS: lldb-unit :: Process/minidump/Release/LLDBMinidumpTests/RegisterContextMinidump.CheckRegisterContextMinidump_ARM (1491 of 2167)
PASS: lldb-unit :: Process/minidump/Release/LLDBMinidumpTests/RegisterContextMinidump.ConvertMinidumpContext_x86_64 (1492 of 2167)
PASS: lldb-unit :: Process/minidump/Release/LLDBMinidumpTests/RegisterContextMinidump.ConvertMinidumpContext_x86_32 (1493 of 2167)
PASS: lldb-unit :: Process/minidump/Release/LLDBMinidumpTests/MinidumpParserTest.MinidumpDuplicateModuleSeparateCode (1494 of 2167)
PASS: lldb-unit :: Process/minidump/Release/LLDBMinidumpTests/MinidumpParserTest.MinidumpModuleOrder (1495 of 2167)
PASS: lldb-unit :: ScriptInterpreter/Python/Release/ScriptInterpreterPythonTests/PythonDataObjectsTest.TestBorrowedReferences (1496 of 2167)
PASS: lldb-unit :: ScriptInterpreter/Python/Release/ScriptInterpreterPythonTests/PythonDataObjectsTest.TestExtractingUInt64ThroughStructuredData (1497 of 2167)
PASS: lldb-unit :: ScriptInterpreter/Python/Release/ScriptInterpreterPythonTests/PythonDataObjectsTest.TestDictionaryResolutionWithDot (1498 of 2167)
PASS: lldb-unit :: ScriptInterpreter/Python/Release/ScriptInterpreterPythonTests/PythonDataObjectsTest.TestExceptions (1499 of 2167)
PASS: lldb-unit :: ScriptInterpreter/Python/Release/ScriptInterpreterPythonTests/PythonDataObjectsTest.TestCallable (1500 of 2167)
PASS: lldb-unit :: ScriptInterpreter/Python/Release/ScriptInterpreterPythonTests/PythonDataObjectsTest.TestGlobalNameResolutionNoDot (1501 of 2167)
PASS: lldb-unit :: ScriptInterpreter/Python/Release/ScriptInterpreterPythonTests/PythonDataObjectsTest.TestGlobalNameResolutionWithDot (1502 of 2167)
PASS: lldb-unit :: ScriptInterpreter/Python/Release/ScriptInterpreterPythonTests/PythonDataObjectsTest.TestInstanceNameResolutionNoDot (1503 of 2167)
PASS: lldb-unit :: ScriptInterpreter/Python/Release/ScriptInterpreterPythonTests/PythonDataObjectsTest.TestModuleNameResolutionNoDot (1504 of 2167)
PASS: lldb-unit :: ScriptInterpreter/Python/Release/ScriptInterpreterPythonTests/PythonDataObjectsTest.TestObjectAttributes (1505 of 2167)
PASS: lldb-unit :: ScriptInterpreter/Python/Release/ScriptInterpreterPythonTests/PythonDataObjectsTest.TestOwnedReferences (1506 of 2167)
PASS: lldb-unit :: ScriptInterpreter/Python/Release/ScriptInterpreterPythonTests/PythonDataObjectsTest.TestPythonBoolean (1507 of 2167)
PASS: lldb-unit :: ScriptInterpreter/Python/Release/ScriptInterpreterPythonTests/PythonDataObjectsTest.TestPythonByteArray (1508 of 2167)
PASS: lldb-unit :: Host/Release/HostTests/MainLoopTest.UnmonitoredSignal (1509 of 2167)
PASS: lldb-unit :: ScriptInterpreter/Python/Release/ScriptInterpreterPythonTests/PythonDataObjectsTest.TestPythonBytes (1510 of 2167)
PASS: lldb-unit :: ScriptInterpreter/Python/Release/ScriptInterpreterPythonTests/PythonDataObjectsTest.TestPythonCallableCheck (1511 of 2167)
PASS: lldb-unit :: ScriptInterpreter/Python/Release/ScriptInterpreterPythonTests/PythonDataObjectsTest.TestPythonDictionaryManipulation (1512 of 2167)
PASS: lldb-unit :: ScriptInterpreter/Python/Release/ScriptInterpreterPythonTests/PythonDataObjectsTest.TestPythonCallableInvoke (1513 of 2167)
PASS: lldb-unit :: ScriptInterpreter/Python/Release/ScriptInterpreterPythonTests/PythonDataObjectsTest.TestPythonDictionaryValueEquality (1514 of 2167)
PASS: lldb-unit :: ScriptInterpreter/Python/Release/ScriptInterpreterPythonTests/PythonDataObjectsTest.TestPythonDictionaryToStructuredDictionary (1515 of 2167)
PASS: lldb-unit :: ScriptInterpreter/Python/Release/ScriptInterpreterPythonTests/PythonDataObjectsTest.TestPythonFile (1516 of 2167)
PASS: lldb-unit :: ScriptInterpreter/Python/Release/ScriptInterpreterPythonTests/PythonDataObjectsTest.TestPythonInteger (1517 of 2167)
PASS: lldb-unit :: ScriptInterpreter/Python/Release/ScriptInterpreterPythonTests/PythonDataObjectsTest.TestPythonIntegerToStructuredInteger (1518 of 2167)
PASS: lldb-unit :: ScriptInterpreter/Python/Release/ScriptInterpreterPythonTests/PythonDataObjectsTest.TestPythonIntegerToStr (1519 of 2167)
PASS: lldb-unit :: ScriptInterpreter/Python/Release/ScriptInterpreterPythonTests/PythonDataObjectsTest.TestPythonListManipulation (1520 of 2167)
PASS: lldb-unit :: ScriptInterpreter/Python/Release/ScriptInterpreterPythonTests/PythonDataObjectsTest.TestPythonListToStructuredList (1521 of 2167)
PASS: lldb-unit :: ScriptInterpreter/Python/Release/ScriptInterpreterPythonTests/PythonDataObjectsTest.TestPythonListValueEquality (1522 of 2167)
PASS: lldb-unit :: ScriptInterpreter/Python/Release/ScriptInterpreterPythonTests/PythonDataObjectsTest.TestPythonString (1523 of 2167)
PASS: lldb-unit :: ScriptInterpreter/Python/Release/ScriptInterpreterPythonTests/PythonDataObjectsTest.TestPythonStringToStructuredString (1524 of 2167)
PASS: lldb-unit :: ScriptInterpreter/Python/Release/ScriptInterpreterPythonTests/PythonDataObjectsTest.TestPythonStringToStr (1525 of 2167)
PASS: lldb-unit :: ScriptInterpreter/Python/Release/ScriptInterpreterPythonTests/PythonDataObjectsTest.TestPythonTupleInitializerList (1526 of 2167)
PASS: lldb-unit :: ScriptInterpreter/Python/Release/ScriptInterpreterPythonTests/PythonDataObjectsTest.TestPythonTupleInitializerList2 (1527 of 2167)
PASS: lldb-unit :: ScriptInterpreter/Python/Release/ScriptInterpreterPythonTests/PythonDataObjectsTest.TestPythonTupleSize (1528 of 2167)
PASS: lldb-unit :: ScriptInterpreter/Python/Release/ScriptInterpreterPythonTests/PythonDataObjectsTest.TestPythonTupleToStructuredList (1529 of 2167)
PASS: lldb-unit :: ScriptInterpreter/Python/Release/ScriptInterpreterPythonTests/PythonDataObjectsTest.TestPythonTupleValues (1530 of 2167)
PASS: lldb-unit :: ScriptInterpreter/Python/Release/ScriptInterpreterPythonTests/PythonDataObjectsTest.TestResetting (1531 of 2167)
PASS: lldb-unit :: Signals/Release/SignalsTests/UnixSignalsTest.GetFilteredSignals (1532 of 2167)
PASS: lldb-unit :: Signals/Release/SignalsTests/UnixSignalsTest.GetInfo (1533 of 2167)
PASS: lldb-unit :: Signals/Release/SignalsTests/UnixSignalsTest.VersionChange (1534 of 2167)
PASS: lldb-unit :: Signals/Release/SignalsTests/UnixSignalsTest.Iteration (1535 of 2167)
PASS: lldb-unit :: ScriptInterpreter/Python/Release/ScriptInterpreterPythonTests/PythonDataObjectsTest.TestRun (1536 of 2167)
PASS: lldb-unit :: ScriptInterpreter/Python/Release/ScriptInterpreterPythonTests/PythonDataObjectsTest.TestScript (1537 of 2167)
PASS: lldb-unit :: ScriptInterpreter/Python/Release/ScriptInterpreterPythonTests/PythonDataObjectsTest.TestTypeNameResolutionNoDot (1538 of 2167)
PASS: lldb-shell :: Reproducer/TestMultipleTargets.test (1539 of 2167)
PASS: lldb-unit :: Symbol/Release/SymbolTests/PostfixExpression.ParseFPOProgram (1540 of 2167)
PASS: lldb-unit :: Symbol/Release/SymbolTests/DWARFCallFrameInfoTest.Basic_dwarf3 (1541 of 2167)
PASS: lldb-unit :: Symbol/Release/SymbolTests/DWARFCallFrameInfoTest.Basic_dwarf4 (1542 of 2167)
PASS: lldb-unit :: Symbol/Release/SymbolTests/DWARFCallFrameInfoTest.Basic_eh (1543 of 2167)
PASS: lldb-unit :: Symbol/Release/SymbolTests/LineEntryTest.GetSameLineContiguousAddressRangeNoInlines (1544 of 2167)
PASS: lldb-unit :: Symbol/Release/SymbolTests/PostfixExpression.ParseOneExpression (1545 of 2167)
PASS: lldb-unit :: Symbol/Release/SymbolTests/LineEntryTest.GetSameLineContiguousAddressRangeNestedInline (1546 of 2167)
PASS: lldb-unit :: Symbol/Release/SymbolTests/LineEntryTest.GetSameLineContiguousAddressRangeOneInline (1547 of 2167)
PASS: lldb-unit :: Symbol/Release/SymbolTests/PostfixExpression.ToDWARF (1548 of 2167)
PASS: lldb-unit :: Symbol/Release/SymbolTests/SymbolsTest.TerminateLocateExecutableSymbolFileForUnknownExecutableAndUnknownSymbolFile (1549 of 2167)
PASS: lldb-unit :: Symbol/Release/SymbolTests/SymbolsTest.LocateExecutableSymbolFileForUnknownExecutableAndMissingSymbolFile (1550 of 2167)
PASS: lldb-unit :: Symbol/Release/SymbolTests/TestClangASTImporter.CanImportInvalidType (1551 of 2167)
PASS: lldb-unit :: Symbol/Release/SymbolTests/TestClangASTImporter.ImportInvalidType (1552 of 2167)
PASS: lldb-unit :: Symbol/Release/SymbolTests/TestClangASTImporter.MetadataPropagation (1553 of 2167)
PASS: lldb-unit :: Symbol/Release/SymbolTests/TestClangASTImporter.CopyDeclTagDecl (1554 of 2167)
PASS: lldb-unit :: Symbol/Release/SymbolTests/TestClangASTImporter.CopyTypeTagDecl (1555 of 2167)
PASS: lldb-unit :: Symbol/Release/SymbolTests/TestClangASTImporter.DeportTypeTagDecl (1556 of 2167)
PASS: lldb-unit :: Symbol/Release/SymbolTests/TestClangASTImporter.DeportDeclTagDecl (1557 of 2167)
PASS: lldb-unit :: Symbol/Release/SymbolTests/TestClangASTImporter.CompleteFwdDeclWithOtherOrigin (1558 of 2167)
PASS: lldb-unit :: Symbol/Release/SymbolTests/TestClangASTImporter.MetadataPropagationAfterCopying (1559 of 2167)
PASS: lldb-unit :: Symbol/Release/SymbolTests/TestClangASTImporter.RecordLayout (1560 of 2167)
PASS: lldb-unit :: Symbol/Release/SymbolTests/TestTypeSystemClang.AddMethodToObjCObjectType (1561 of 2167)
PASS: lldb-unit :: Symbol/Release/SymbolTests/TestTypeSystemClang.TestBuiltinTypeForEncodingAndBitSize (1562 of 2167)
PASS: lldb-unit :: Symbol/Release/SymbolTests/TestClangASTImporter.MetadataPropagationIndirectImport (1563 of 2167)
PASS: lldb-unit :: Symbol/Release/SymbolTests/TestTypeSystemClang.TestConvertAccessTypeToAccessSpecifier (1564 of 2167)
PASS: lldb-unit :: Symbol/Release/SymbolTests/TestTypeSystemClang.TemplateArguments (1565 of 2167)
PASS: lldb-unit :: Symbol/Release/SymbolTests/TestTypeSystemClang.TestDeletingImplicitCopyCstrDueToMoveCStr (1566 of 2167)
PASS: lldb-unit :: Symbol/Release/SymbolTests/TestTypeSystemClang.TestDisplayName (1567 of 2167)
PASS: lldb-unit :: Symbol/Release/SymbolTests/TestTypeSystemClang.TestFunctionTemplateConstruction (1568 of 2167)
PASS: lldb-unit :: Symbol/Release/SymbolTests/TestTypeSystemClang.TestGetBasicTypeFromEnum (1569 of 2167)
PASS: lldb-unit :: Symbol/Release/SymbolTests/TestTypeSystemClang.TestFunctionTemplateInRecordConstruction (1570 of 2167)
PASS: lldb-unit :: Symbol/Release/SymbolTests/TestTypeSystemClang.TestDisplayNameEmpty (1571 of 2167)
PASS: lldb-unit :: Symbol/Release/SymbolTests/TestTypeSystemClang.TestGetBasicTypeFromName (1572 of 2167)
PASS: lldb-unit :: Symbol/Release/SymbolTests/TestTypeSystemClang.TestGetEnumIntegerTypeBasicTypes (1573 of 2167)
PASS: lldb-unit :: Symbol/Release/SymbolTests/TestTypeSystemClang.TestGetEnumIntegerTypeInvalid (1574 of 2167)
PASS: lldb-unit :: Symbol/Release/SymbolTests/TestTypeSystemClang.TestGetEnumIntegerTypeUnexpectedType (1575 of 2167)
PASS: lldb-unit :: Symbol/Release/SymbolTests/TestTypeSystemClang.TestGetTypeClassDeclType (1576 of 2167)
PASS: lldb-unit :: Symbol/Release/SymbolTests/TestTypeSystemClang.TestGetTypeClassTypeOfExpr (1577 of 2167)
PASS: lldb-unit :: Symbol/Release/SymbolTests/TestTypeSystemClang.TestGetTypeClassNested (1578 of 2167)
PASS: lldb-unit :: Symbol/Release/SymbolTests/TestTypeSystemClang.TestGetTypeClassTypeOf (1579 of 2167)
PASS: lldb-unit :: Symbol/Release/SymbolTests/TestTypeSystemClang.TestNotDeletingUserCopyCstrDueToMoveCStr (1580 of 2167)
PASS: lldb-unit :: Symbol/Release/SymbolTests/TestTypeSystemClang.TestIsClangType (1581 of 2167)
PASS: lldb-unit :: Symbol/Release/SymbolTests/Type.CompilerContextPattern (1582 of 2167)
PASS: lldb-unit :: Symbol/Release/SymbolTests/TestTypeSystemClang.TestOwningModule (1583 of 2167)
PASS: lldb-unit :: Symbol/Release/SymbolTests/TestTypeSystemClang.TestUnifyAccessSpecifiers (1584 of 2167)
PASS: lldb-unit :: Symbol/Release/SymbolTests/TestTypeSystemClang.TestRemoveFastQualifiers (1585 of 2167)
PASS: lldb-unit :: Symbol/Release/SymbolTests/TestTypeSystemClang.TestRecordHasFields (1586 of 2167)
PASS: lldb-unit :: Symbol/Release/SymbolTests/Type.GetTypeScopeAndBasename (1587 of 2167)
PASS: lldb-unit :: SymbolFile/DWARF/Release/SymbolFileDWARFTests/SymbolFileDWARFTests.ParseAranges (1588 of 2167)
PASS: lldb-unit :: SymbolFile/DWARF/Release/SymbolFileDWARFTests/SymbolFileDWARFTests.ParseArangesNonzeroSegmentSize (1589 of 2167)
PASS: lldb-unit :: SymbolFile/DWARF/Release/SymbolFileDWARFTests/SymbolFileDWARFTests.TestAbbrevInvalidNULLTag (1590 of 2167)
PASS: lldb-unit :: SymbolFile/DWARF/Release/SymbolFileDWARFTests/SymbolFileDWARFTests.TestAbbrevMissingTerminator (1591 of 2167)
PASS: lldb-unit :: SymbolFile/DWARF/Release/SymbolFileDWARFTests/SymbolFileDWARFTests.TestAbbrevNullAttrValidForm (1592 of 2167)
PASS: lldb-unit :: SymbolFile/DWARF/Release/SymbolFileDWARFTests/DWARFASTParserClangTests.EnsureAllDIEsInDeclContextHaveBeenParsedParsesOnlyMatchingEntries (1593 of 2167)
PASS: lldb-unit :: SymbolFile/DWARF/Release/SymbolFileDWARFTests/SymbolFileDWARFTests.TestAbbrevOrder1Start1 (1594 of 2167)
PASS: lldb-unit :: SymbolFile/DWARF/Release/SymbolFileDWARFTests/SymbolFileDWARFTests.TestAbbrevValidAttrNullForm (1595 of 2167)
PASS: lldb-unit :: SymbolFile/DWARF/Release/SymbolFileDWARFTests/SymbolFileDWARFTests.TestAbbrevOrder1Start5 (1596 of 2167)
PASS: lldb-unit :: SymbolFile/DWARF/Release/SymbolFileDWARFTests/SymbolFileDWARFTests.TestAbbrevOutOfOrder (1597 of 2167)
PASS: lldb-unit :: SymbolFile/DWARF/Release/SymbolFileDWARFTests/SymbolFileDWARFTests.TestAbilitiesForDWARF (1598 of 2167)
PASS: lldb-unit :: SymbolFile/NativePDB/Release/SymbolFileNativePDBTests/PDBFPOProgramToDWARFExpressionTests.InvalidAssignmentMultiple (1599 of 2167)
PASS: lldb-unit :: SymbolFile/NativePDB/Release/SymbolFileNativePDBTests/PDBFPOProgramToDWARFExpressionTests.InvalidOpUnary (1600 of 2167)
PASS: lldb-unit :: SymbolFile/NativePDB/Release/SymbolFileNativePDBTests/PDBFPOProgramToDWARFExpressionTests.InvalidOpBinary (1601 of 2167)
PASS: lldb-unit :: SymbolFile/NativePDB/Release/SymbolFileNativePDBTests/PDBFPOProgramToDWARFExpressionTests.InvalidAssignmentSingle (1602 of 2167)
PASS: lldb-unit :: SymbolFile/NativePDB/Release/SymbolFileNativePDBTests/PDBFPOProgramToDWARFExpressionTests.MissingTargetRegister (1603 of 2167)
PASS: lldb-unit :: SymbolFile/NativePDB/Release/SymbolFileNativePDBTests/PDBFPOProgramToDWARFExpressionTests.DependencyChain (1604 of 2167)
PASS: lldb-unit :: SymbolFile/NativePDB/Release/SymbolFileNativePDBTests/PDBFPOProgramToDWARFExpressionTests.MultipleDependentAssignments (1605 of 2167)
PASS: lldb-unit :: SymbolFile/NativePDB/Release/SymbolFileNativePDBTests/PDBFPOProgramToDWARFExpressionTests.SingleAssignmentRegisterRef (1606 of 2167)
PASS: lldb-unit :: SymbolFile/NativePDB/Release/SymbolFileNativePDBTests/PDBFPOProgramToDWARFExpressionTests.UnknownOp (1607 of 2167)
PASS: lldb-unit :: SymbolFile/NativePDB/Release/SymbolFileNativePDBTests/PDBFPOProgramToDWARFExpressionTests.MultipleIndependentAssignments (1608 of 2167)
PASS: lldb-unit :: SymbolFile/NativePDB/Release/SymbolFileNativePDBTests/PDBFPOProgramToDWARFExpressionTests.UnresolvedDependentCyclicRegisterAssignmentReference (1609 of 2167)
PASS: lldb-unit :: SymbolFile/NativePDB/Release/SymbolFileNativePDBTests/PDBFPOProgramToDWARFExpressionTests.UnresolvedCyclicRegisterAssignmentReference (1610 of 2167)
PASS: lldb-unit :: SymbolFile/NativePDB/Release/SymbolFileNativePDBTests/PDBFPOProgramToDWARFExpressionTests.UnresolvedRegisterReference (1611 of 2167)
PASS: lldb-unit :: SymbolFile/NativePDB/Release/SymbolFileNativePDBTests/PDBFPOProgramToDWARFExpressionTests.UnresolvedRegisterAssignmentReference (1612 of 2167)
PASS: lldb-unit :: SymbolFile/NativePDB/Release/SymbolFileNativePDBTests/PDBFPOProgramToDWARFExpressionTests.UnsupportedRASearch (1613 of 2167)
PASS: lldb-unit :: Target/Release/TargetTests/ExecutionContextTest.GetByteOrder (1614 of 2167)
PASS: lldb-unit :: Target/Release/TargetTests/MemoryRegionInfoTest.Formatv (1615 of 2167)
PASS: lldb-unit :: Target/Release/TargetTests/MCBasedABI.MapRegisterName (1616 of 2167)
PASS: lldb-unit :: Target/Release/TargetTests/ExecutionContextTest.GetByteOrderProcess (1617 of 2167)
PASS: lldb-unit :: Target/Release/TargetTests/ExecutionContextTest.GetByteOrderTarget (1618 of 2167)
PASS: lldb-unit :: Target/Release/TargetTests/ModuleCacheTest.GetAndPut (1619 of 2167)
PASS: lldb-unit :: Target/Release/TargetTests/ModuleCacheTest.GetAndPutStrangeHostname (1620 of 2167)
PASS: lldb-unit :: Target/Release/TargetTests/PathMappingListTest.AbsoluteTests (1621 of 2167)
PASS: lldb-unit :: Target/Release/TargetTests/PathMappingListTest.RelativeTests (1622 of 2167)
PASS: lldb-unit :: Target/Release/TargetTests/PathMappingListTest.RemapRoot (1623 of 2167)
PASS: lldb-unit :: Target/Release/TargetTests/ModuleCacheTest.GetAndPutUuidExists (1624 of 2167)
PASS: lldb-unit :: Target/Release/TargetTests/RemoteAwarePlatformTest.TestResolveExecutabelOnClientByPlatform (1625 of 2167)
PASS: lldb-unit :: Target/Release/TargetTests/StackFrameRecognizerTest.NullModuleRegex (1626 of 2167)
PASS: lldb-unit :: Thread/Release/ThreadTests/ThreadTest.SetStopInfo (1627 of 2167)
PASS: lldb-unit :: Thread/Release/ThreadTests/ThreadTest.GetPrivateStopInfo (1628 of 2167)
PASS: lldb-shell :: Reproducer/TestGDBRemoteRepro.test (1629 of 2167)
PASS: lldb-unit :: UnwindAssembly/x86/Release/UnwindAssemblyx86Tests/Testx86AssemblyInspectionEngine.Test32BitOnlyInstruction (1630 of 2167)
PASS: lldb-unit :: UnwindAssembly/x86/Release/UnwindAssemblyx86Tests/Testx86AssemblyInspectionEngine.TestAddESP (1631 of 2167)
PASS: lldb-unit :: UnwindAssembly/x86/Release/UnwindAssemblyx86Tests/Testx86AssemblyInspectionEngine.Test64bitFramelessBigStackFrame (1632 of 2167)
PASS: lldb-unit :: UnwindAssembly/x86/Release/UnwindAssemblyx86Tests/Testx86AssemblyInspectionEngine.Test32bitFramelessBigStackFrame (1633 of 2167)
PASS: lldb-unit :: UnwindAssembly/x86/Release/UnwindAssemblyx86Tests/Testx86AssemblyInspectionEngine.Test32bitFramelessSmallStackFrame (1634 of 2167)
PASS: lldb-unit :: UnwindAssembly/x86/Release/UnwindAssemblyx86Tests/Testx86AssemblyInspectionEngine.TestAddRSP (1635 of 2167)
PASS: lldb-unit :: UnwindAssembly/x86/Release/UnwindAssemblyx86Tests/Testx86AssemblyInspectionEngine.Test64bitFramelessSmallStackFrame (1636 of 2167)
PASS: lldb-unit :: UnwindAssembly/x86/Release/UnwindAssemblyx86Tests/Testx86AssemblyInspectionEngine.TestPopEBX (1637 of 2167)
PASS: lldb-unit :: UnwindAssembly/x86/Release/UnwindAssemblyx86Tests/Testx86AssemblyInspectionEngine.TestDisassemblyJunkBytes (1638 of 2167)
PASS: lldb-unit :: UnwindAssembly/x86/Release/UnwindAssemblyx86Tests/Testx86AssemblyInspectionEngine.TestCALLNextInsn (1639 of 2167)
PASS: lldb-unit :: UnwindAssembly/x86/Release/UnwindAssemblyx86Tests/Testx86AssemblyInspectionEngine.TestLEAVE (1640 of 2167)
PASS: lldb-unit :: UnwindAssembly/x86/Release/UnwindAssemblyx86Tests/Testx86AssemblyInspectionEngine.TestPopEBP (1641 of 2167)
PASS: lldb-unit :: UnwindAssembly/x86/Release/UnwindAssemblyx86Tests/Testx86AssemblyInspectionEngine.TestDisassemblyMidFunctionEpilogues (1642 of 2167)
PASS: lldb-unit :: UnwindAssembly/x86/Release/UnwindAssemblyx86Tests/Testx86AssemblyInspectionEngine.TestMovRSPtoRBP (1643 of 2167)
PASS: lldb-unit :: UnwindAssembly/x86/Release/UnwindAssemblyx86Tests/Testx86AssemblyInspectionEngine.TestPopESI (1644 of 2167)
PASS: lldb-unit :: UnwindAssembly/x86/Release/UnwindAssemblyx86Tests/Testx86AssemblyInspectionEngine.TestPopRBP (1645 of 2167)
PASS: lldb-unit :: UnwindAssembly/x86/Release/UnwindAssemblyx86Tests/Testx86AssemblyInspectionEngine.TestPopEDI (1646 of 2167)
PASS: lldb-unit :: UnwindAssembly/x86/Release/UnwindAssemblyx86Tests/Testx86AssemblyInspectionEngine.TestPopR13 (1647 of 2167)
PASS: lldb-unit :: UnwindAssembly/x86/Release/UnwindAssemblyx86Tests/Testx86AssemblyInspectionEngine.TestPopR14 (1648 of 2167)
PASS: lldb-unit :: UnwindAssembly/x86/Release/UnwindAssemblyx86Tests/Testx86AssemblyInspectionEngine.TestPopR15 (1649 of 2167)
PASS: lldb-unit :: UnwindAssembly/x86/Release/UnwindAssemblyx86Tests/Testx86AssemblyInspectionEngine.TestPopR12 (1650 of 2167)
PASS: lldb-unit :: UnwindAssembly/x86/Release/UnwindAssemblyx86Tests/Testx86AssemblyInspectionEngine.TestPushEAX (1651 of 2167)
PASS: lldb-unit :: UnwindAssembly/x86/Release/UnwindAssemblyx86Tests/Testx86AssemblyInspectionEngine.TestPushEBX (1652 of 2167)
PASS: lldb-unit :: UnwindAssembly/x86/Release/UnwindAssemblyx86Tests/Testx86AssemblyInspectionEngine.TestPushEBP (1653 of 2167)
PASS: lldb-unit :: UnwindAssembly/x86/Release/UnwindAssemblyx86Tests/Testx86AssemblyInspectionEngine.TestPushECX (1654 of 2167)
PASS: lldb-unit :: UnwindAssembly/x86/Release/UnwindAssemblyx86Tests/Testx86AssemblyInspectionEngine.TestPush0 (1655 of 2167)
PASS: lldb-unit :: UnwindAssembly/x86/Release/UnwindAssemblyx86Tests/Testx86AssemblyInspectionEngine.TestPopRBX (1656 of 2167)
PASS: lldb-unit :: UnwindAssembly/x86/Release/UnwindAssemblyx86Tests/Testx86AssemblyInspectionEngine.TestPopRBPWithREX (1657 of 2167)
PASS: lldb-unit :: UnwindAssembly/x86/Release/UnwindAssemblyx86Tests/Testx86AssemblyInspectionEngine.TestPushEDX (1658 of 2167)
PASS: lldb-unit :: UnwindAssembly/x86/Release/UnwindAssemblyx86Tests/Testx86AssemblyInspectionEngine.TestPushEDI (1659 of 2167)
PASS: lldb-unit :: UnwindAssembly/x86/Release/UnwindAssemblyx86Tests/Testx86AssemblyInspectionEngine.TestPushESI (1660 of 2167)
PASS: lldb-unit :: UnwindAssembly/x86/Release/UnwindAssemblyx86Tests/Testx86AssemblyInspectionEngine.TestPushR13 (1661 of 2167)
PASS: lldb-unit :: UnwindAssembly/x86/Release/UnwindAssemblyx86Tests/Testx86AssemblyInspectionEngine.TestPushR12 (1662 of 2167)
PASS: lldb-unit :: UnwindAssembly/x86/Release/UnwindAssemblyx86Tests/Testx86AssemblyInspectionEngine.TestPushExtended (1663 of 2167)
PASS: lldb-unit :: UnwindAssembly/x86/Release/UnwindAssemblyx86Tests/Testx86AssemblyInspectionEngine.TestPushImm (1664 of 2167)
PASS: lldb-unit :: UnwindAssembly/x86/Release/UnwindAssemblyx86Tests/Testx86AssemblyInspectionEngine.TestSimple32bitFrameFunction (1665 of 2167)
PASS: lldb-unit :: UnwindAssembly/x86/Release/UnwindAssemblyx86Tests/Testx86AssemblyInspectionEngine.TestPushRBPWithREX (1666 of 2167)
PASS: lldb-unit :: UnwindAssembly/x86/Release/UnwindAssemblyx86Tests/Testx86AssemblyInspectionEngine.TestPushR15 (1667 of 2167)
PASS: lldb-unit :: UnwindAssembly/x86/Release/UnwindAssemblyx86Tests/Testx86AssemblyInspectionEngine.TestPushRBP (1668 of 2167)
PASS: lldb-unit :: UnwindAssembly/x86/Release/UnwindAssemblyx86Tests/Testx86AssemblyInspectionEngine.TestPushR14 (1669 of 2167)
PASS: lldb-unit :: UnwindAssembly/x86/Release/UnwindAssemblyx86Tests/Testx86AssemblyInspectionEngine.TestReturnDetect (1670 of 2167)
PASS: lldb-unit :: UnwindAssembly/x86/Release/UnwindAssemblyx86Tests/Testx86AssemblyInspectionEngine.TestPushRBX (1671 of 2167)
PASS: lldb-unit :: UnwindAssembly/x86/Release/UnwindAssemblyx86Tests/Testx86AssemblyInspectionEngine.TestSimple64bitFrameFunction (1672 of 2167)
PASS: lldb-unit :: UnwindAssembly/x86/Release/UnwindAssemblyx86Tests/Testx86AssemblyInspectionEngine.TestSimplei386ugmented (1673 of 2167)
PASS: lldb-unit :: UnwindAssembly/x86/Release/UnwindAssemblyx86Tests/Testx86AssemblyInspectionEngine.TestSpillRegToStackViaMOVi386 (1674 of 2167)
PASS: lldb-unit :: UnwindAssembly/x86/Release/UnwindAssemblyx86Tests/Testx86AssemblyInspectionEngine.TestSpArithx86_64Augmented (1675 of 2167)
PASS: lldb-unit :: UnwindAssembly/x86/Release/UnwindAssemblyx86Tests/Testx86AssemblyInspectionEngine.TestSimplex86_64Augmented (1676 of 2167)
PASS: lldb-unit :: UnwindAssembly/x86/Release/UnwindAssemblyx86Tests/Testx86AssemblyInspectionEngine.TestSpillRegToStackViaMOVx86_64 (1677 of 2167)
PASS: lldb-unit :: UnwindAssembly/x86/Release/UnwindAssemblyx86Tests/Testx86AssemblyInspectionEngine.TestStackRealign32BitDisp_x86_64 (1678 of 2167)
PASS: lldb-unit :: Utility/Release/UtilityTests/AnsiTerminal.AtEnd (1679 of 2167)
PASS: lldb-unit :: UnwindAssembly/x86/Release/UnwindAssemblyx86Tests/Testx86AssemblyInspectionEngine.TestSubESP (1680 of 2167)
PASS: lldb-unit :: UnwindAssembly/x86/Release/UnwindAssemblyx86Tests/Testx86AssemblyInspectionEngine.TestStackRealign8BitDisp_i386 (1681 of 2167)
PASS: lldb-unit :: UnwindAssembly/x86/Release/UnwindAssemblyx86Tests/Testx86AssemblyInspectionEngine.TestStackRealignMSVC_i386 (1682 of 2167)
PASS: lldb-unit :: Utility/Release/UtilityTests/AnsiTerminal.AtStart (1683 of 2167)
PASS: lldb-unit :: UnwindAssembly/x86/Release/UnwindAssemblyx86Tests/Testx86AssemblyInspectionEngine.TestSubRSP (1684 of 2167)
PASS: lldb-unit :: UnwindAssembly/x86/Release/UnwindAssemblyx86Tests/Testx86AssemblyInspectionEngine.Testi386IgnoredRegisters (1685 of 2167)
PASS: lldb-unit :: Utility/Release/UtilityTests/AnsiTerminal.Basic (1686 of 2167)
PASS: lldb-unit :: Utility/Release/UtilityTests/AnsiTerminal.Empty (1687 of 2167)
PASS: lldb-unit :: Utility/Release/UtilityTests/AnsiTerminal.KnownPrefix (1688 of 2167)
PASS: lldb-unit :: Utility/Release/UtilityTests/AnsiTerminal.Twice (1689 of 2167)
PASS: lldb-unit :: Utility/Release/UtilityTests/AnsiTerminal.Unknown (1690 of 2167)
PASS: lldb-unit :: Utility/Release/UtilityTests/AnsiTerminal.Incomplete (1691 of 2167)
PASS: lldb-unit :: Utility/Release/UtilityTests/AnsiTerminal.WhiteSpace (1692 of 2167)
PASS: lldb-unit :: Utility/Release/UtilityTests/ArchSpecTest.Compatibility (1693 of 2167)
PASS: lldb-unit :: Utility/Release/UtilityTests/ArchSpecTest.MergeFrom (1694 of 2167)
PASS: lldb-unit :: Utility/Release/UtilityTests/ArchSpecTest.TestParseMachCPUDashSubtypeTripleSimple (1695 of 2167)
PASS: lldb-unit :: Utility/Release/UtilityTests/ArchSpecTest.MergeFromMachOUnknown (1696 of 2167)
PASS: lldb-unit :: Utility/Release/UtilityTests/ArchSpecTest.OperatorBool (1697 of 2167)
PASS: lldb-unit :: Utility/Release/UtilityTests/ArchSpecTest.TestParseMachCPUDashSubtypeTripleExtra (1698 of 2167)
PASS: lldb-unit :: Utility/Release/UtilityTests/ArchSpecTest.TestSetTriple (1699 of 2167)
PASS: lldb-unit :: Utility/Release/UtilityTests/ArchSpecTest.TripleComponentsWereSpecified (1700 of 2167)
PASS: lldb-unit :: Utility/Release/UtilityTests/ArchSpecTest.YAML (1701 of 2167)
PASS: lldb-unit :: Utility/Release/UtilityTests/ArgsTest.AppendArguments (1702 of 2167)
PASS: lldb-unit :: Utility/Release/UtilityTests/ArgsTest.DoubleQuotedItem (1703 of 2167)
PASS: lldb-unit :: Utility/Release/UtilityTests/ArgsTest.BareSingleQuote (1704 of 2167)
PASS: lldb-unit :: Utility/Release/UtilityTests/ArgsTest.EscapeLLDBCommandArgument (1705 of 2167)
PASS: lldb-unit :: Utility/Release/UtilityTests/ArgsTest.GetArgumentArrayRef (1706 of 2167)
PASS: lldb-unit :: Utility/Release/UtilityTests/ArgsTest.GetQuotedCommandString (1707 of 2167)
PASS: lldb-unit :: Utility/Release/UtilityTests/ArgsTest.ReplaceArgumentAtIndexLonger (1708 of 2167)
PASS: lldb-unit :: Utility/Release/UtilityTests/ArgsTest.ReplaceArgumentAtIndexEqual (1709 of 2167)
PASS: lldb-unit :: Utility/Release/UtilityTests/ArgsTest.ReplaceArgumentAtIndexFarOutOfRange (1710 of 2167)
PASS: lldb-unit :: Utility/Release/UtilityTests/ArgsTest.GetShellSafeArgument (1711 of 2167)
PASS: lldb-unit :: Utility/Release/UtilityTests/ArgsTest.ReplaceArgumentAtIndexOutOfRange (1712 of 2167)
PASS: lldb-unit :: Utility/Release/UtilityTests/ArgsTest.ReplaceArgumentAtIndexShort (1713 of 2167)
PASS: lldb-unit :: Utility/Release/UtilityTests/ArgsTest.StringListConstructor (1714 of 2167)
PASS: lldb-unit :: Utility/Release/UtilityTests/ArgsTest.TestAppendArg (1715 of 2167)
PASS: lldb-unit :: Utility/Release/UtilityTests/ArgsTest.TestArgv (1716 of 2167)
PASS: lldb-unit :: Utility/Release/UtilityTests/ArgsTest.TestMultipleArgs (1717 of 2167)
PASS: lldb-unit :: Utility/Release/UtilityTests/ArgsTest.TestInsertArg (1718 of 2167)
PASS: lldb-unit :: Utility/Release/UtilityTests/ArgsTest.TestOverwriteArgs (1719 of 2167)
PASS: lldb-unit :: Utility/Release/UtilityTests/ArgsTest.TestQuotedTrailingBackslash (1720 of 2167)
PASS: lldb-unit :: Utility/Release/UtilityTests/ArgsTest.TestQuotedUnknownEscape (1721 of 2167)
PASS: lldb-unit :: Utility/Release/UtilityTests/ArgsTest.TestSingleArg (1722 of 2167)
PASS: lldb-unit :: Utility/Release/UtilityTests/ArgsTest.TestSingleArgWithQuotedSpace (1723 of 2167)
PASS: lldb-unit :: Utility/Release/UtilityTests/ArgsTest.TestSingleQuotedArgWithSpace (1724 of 2167)
PASS: lldb-unit :: Utility/Release/UtilityTests/ArgsTest.TestUnknownEscape (1725 of 2167)
PASS: lldb-unit :: Utility/Release/UtilityTests/ArgsTest.TestTrailingBackslash (1726 of 2167)
PASS: lldb-unit :: Utility/Release/UtilityTests/ArgsTest.Yaml (1727 of 2167)
PASS: lldb-unit :: Utility/Release/UtilityTests/BinaryStreamTest.PutSLEB128EightBytes (1728 of 2167)
PASS: lldb-unit :: Utility/Release/UtilityTests/BinaryStreamTest.PutSLEB128FourBytes (1729 of 2167)
PASS: lldb-unit :: Utility/Release/UtilityTests/BinaryStreamTest.PutSLEB128FiveBytes (1730 of 2167)
PASS: lldb-unit :: Utility/Release/UtilityTests/BinaryStreamTest.PutSLEB128NineBytes (1731 of 2167)
PASS: lldb-unit :: Utility/Release/UtilityTests/BinaryStreamTest.PutSLEB128MaxValue (1732 of 2167)
PASS: lldb-unit :: Utility/Release/UtilityTests/BinaryStreamTest.PutSLEB128OneByte (1733 of 2167)
PASS: lldb-unit :: Utility/Release/UtilityTests/BinaryStreamTest.PutSLEB128One (1734 of 2167)
PASS: lldb-unit :: Utility/Release/UtilityTests/BinaryStreamTest.PutSLEB128SevenBytes (1735 of 2167)
PASS: lldb-unit :: Utility/Release/UtilityTests/BinaryStreamTest.PutSLEB128ThreeBytes (1736 of 2167)
PASS: lldb-unit :: Utility/Release/UtilityTests/BinaryStreamTest.PutSLEB128SixBytes (1737 of 2167)
PASS: lldb-unit :: Utility/Release/UtilityTests/BinaryStreamTest.PutSLEB128TwoBytes (1738 of 2167)
PASS: lldb-unit :: Utility/Release/UtilityTests/BinaryStreamTest.PutSLEB128Zero (1739 of 2167)
PASS: lldb-unit :: Utility/Release/UtilityTests/BinaryStreamTest.PutULEB128FiveBytes (1740 of 2167)
PASS: lldb-unit :: Utility/Release/UtilityTests/BinaryStreamTest.PutULEB128EightBytes (1741 of 2167)
PASS: lldb-unit :: Utility/Release/UtilityTests/BinaryStreamTest.PutULEB128FourBytes (1742 of 2167)
PASS: lldb-unit :: Utility/Release/UtilityTests/BinaryStreamTest.PutULEB128MaxValue (1743 of 2167)
PASS: lldb-unit :: Utility/Release/UtilityTests/BinaryStreamTest.PutULEB128NineBytes (1744 of 2167)
PASS: lldb-unit :: Utility/Release/UtilityTests/BinaryStreamTest.PutULEB128One (1745 of 2167)
PASS: lldb-unit :: Utility/Release/UtilityTests/BinaryStreamTest.PutULEB128OneByte (1746 of 2167)
PASS: lldb-unit :: Utility/Release/UtilityTests/BinaryStreamTest.PutULEB128SevenBytes (1747 of 2167)
PASS: lldb-unit :: Utility/Release/UtilityTests/BinaryStreamTest.PutULEB128SixBytes (1748 of 2167)
PASS: lldb-unit :: Utility/Release/UtilityTests/BinaryStreamTest.PutULEB128ThreeBytes (1749 of 2167)
PASS: lldb-unit :: Utility/Release/UtilityTests/BroadcasterTest.BroadcastEvent (1750 of 2167)
PASS: lldb-unit :: Utility/Release/UtilityTests/BinaryStreamTest.PutULEB128TwoBytes (1751 of 2167)
PASS: lldb-unit :: Utility/Release/UtilityTests/BinaryStreamTest.PutULEB128Zero (1752 of 2167)
PASS: lldb-unit :: Utility/Release/UtilityTests/BroadcasterTest.EventTypeHasListeners (1753 of 2167)
PASS: lldb-unit :: Utility/Release/UtilityTests/CompletionRequest.Constructor (1754 of 2167)
PASS: lldb-unit :: Utility/Release/UtilityTests/CompletionRequest.DuplicateFiltering (1755 of 2167)
PASS: lldb-unit :: Utility/Release/UtilityTests/CompletionRequest.DuplicateFilteringWithComments (1756 of 2167)
PASS: lldb-unit :: Utility/Release/UtilityTests/CompletionRequest.TestCompletionOwnership (1757 of 2167)
PASS: lldb-unit :: Utility/Release/UtilityTests/CompletionRequest.ShiftArguments (1758 of 2167)
PASS: lldb-unit :: Utility/Release/UtilityTests/CompletionRequest.FakeLastArg (1759 of 2167)
PASS: lldb-unit :: Utility/Release/UtilityTests/CompletionRequest.TryCompleteCurrentArgBad (1760 of 2167)
PASS: lldb-unit :: Utility/Release/UtilityTests/CompletionRequest.TryCompleteCurrentArgGood (1761 of 2167)
PASS: lldb-unit :: Utility/Release/UtilityTests/CompletionRequest.TryCompleteCurrentArgMode (1762 of 2167)
PASS: lldb-unit :: Utility/Release/UtilityTests/ConstStringTest.CompareConstString (1763 of 2167)
PASS: lldb-unit :: Utility/Release/UtilityTests/ConstStringTest.FromMidOfBufferStringRef (1764 of 2167)
PASS: lldb-unit :: Utility/Release/UtilityTests/ConstStringTest.MangledCounterpart (1765 of 2167)
PASS: lldb-unit :: Utility/Release/UtilityTests/ConstStringTest.CompareStringRef (1766 of 2167)
PASS: lldb-unit :: Utility/Release/UtilityTests/ConstStringTest.NullAndEmptyStates (1767 of 2167)
PASS: lldb-unit :: Utility/Release/UtilityTests/ConstStringTest.UpdateMangledCounterpart (1768 of 2167)
PASS: lldb-unit :: Utility/Release/UtilityTests/ConstStringTest.YAML (1769 of 2167)
PASS: lldb-unit :: Utility/Release/UtilityTests/ConstStringTest.format_provider (1770 of 2167)
PASS: lldb-unit :: Utility/Release/UtilityTests/DataExtractorTest.GetCStr (1771 of 2167)
PASS: lldb-unit :: Utility/Release/UtilityTests/DataExtractorTest.GetCStrAtNullOffset (1772 of 2167)
PASS: lldb-unit :: Utility/Release/UtilityTests/DataExtractorTest.GetBitfield (1773 of 2167)
PASS: lldb-unit :: Utility/Release/UtilityTests/DataExtractorTest.GetCStrAtEnd (1774 of 2167)
PASS: lldb-unit :: Utility/Release/UtilityTests/DataExtractorTest.GetCStrEmpty (1775 of 2167)
PASS: lldb-unit :: Utility/Release/UtilityTests/DataExtractorTest.GetCStrUnterminated (1776 of 2167)
PASS: lldb-unit :: Utility/Release/UtilityTests/DataExtractorTest.GetDouble (1777 of 2167)
PASS: lldb-unit :: Utility/Release/UtilityTests/DataExtractorTest.GetDoubleUnaligned (1778 of 2167)
PASS: lldb-unit :: Utility/Release/UtilityTests/DataExtractorTest.GetFloat (1779 of 2167)
PASS: lldb-unit :: Utility/Release/UtilityTests/DataExtractorTest.GetFloatUnaligned (1780 of 2167)
PASS: lldb-unit :: Utility/Release/UtilityTests/DataExtractorTest.GetMaxS64 (1781 of 2167)
PASS: lldb-unit :: Utility/Release/UtilityTests/DataExtractorTest.GetMaxU64 (1782 of 2167)
PASS: lldb-unit :: Utility/Release/UtilityTests/DataExtractorTest.GetMaxU64_unchecked (1783 of 2167)
PASS: lldb-unit :: Utility/Release/UtilityTests/DataExtractorTest.GetULEB128_bit63 (1784 of 2167)
PASS: lldb-unit :: Utility/Release/UtilityTests/EnvironmentTest.EnvpConstruction (1785 of 2167)
PASS: lldb-unit :: Utility/Release/UtilityTests/DataExtractorTest.GetSLEB128_bit63 (1786 of 2167)
PASS: lldb-unit :: Utility/Release/UtilityTests/DataExtractorTest.PeekData (1787 of 2167)
PASS: lldb-unit :: Utility/Release/UtilityTests/EnvironmentTest.EnvpConversion (1788 of 2167)
PASS: lldb-unit :: Utility/Release/UtilityTests/DataExtractorTest.UncommonAddressSize (1789 of 2167)
PASS: lldb-unit :: Utility/Release/UtilityTests/DeserializerTest.HasData (1790 of 2167)
PASS: lldb-unit :: Utility/Release/UtilityTests/FileSpecTest.AppendPathComponent (1791 of 2167)
PASS: lldb-unit :: Utility/Release/UtilityTests/EventTest.DumpEventDataBytes (1792 of 2167)
PASS: lldb-unit :: Utility/Release/UtilityTests/FileSpecTest.EqualDotsPosix (1793 of 2167)
PASS: lldb-unit :: Utility/Release/UtilityTests/FileSpecTest.CopyByAppendingPathComponent (1794 of 2167)
PASS: lldb-unit :: Utility/Release/UtilityTests/FileSpecTest.Equal (1795 of 2167)
PASS: lldb-unit :: Utility/Release/UtilityTests/FileSpecTest.EqualDotsPosixRoot (1796 of 2167)
PASS: lldb-unit :: Utility/Release/UtilityTests/FileSpecTest.EqualDotsWindows (1797 of 2167)
PASS: lldb-unit :: Utility/Release/UtilityTests/FileSpecTest.FileAndDirectoryComponents (1798 of 2167)
PASS: lldb-unit :: Utility/Release/UtilityTests/FileSpecTest.GuessPathStyle (1799 of 2167)
PASS: lldb-unit :: Utility/Release/UtilityTests/FileSpecTest.EqualSeparator (1800 of 2167)
PASS: lldb-unit :: Utility/Release/UtilityTests/FileSpecTest.GetPath (1801 of 2167)
PASS: lldb-unit :: Utility/Release/UtilityTests/FileSpecTest.FormatFileSpec (1802 of 2167)
PASS: lldb-unit :: Utility/Release/UtilityTests/FileSpecTest.Match (1803 of 2167)
PASS: lldb-unit :: Utility/Release/UtilityTests/FileSpecTest.IsRelative (1804 of 2167)
PASS: lldb-unit :: Utility/Release/UtilityTests/Flags.AnyClear (1805 of 2167)
PASS: lldb-unit :: Utility/Release/UtilityTests/FileSpecTest.PrependPathComponent (1806 of 2167)
PASS: lldb-unit :: Utility/Release/UtilityTests/Flags.AllClear (1807 of 2167)
PASS: lldb-unit :: Utility/Release/UtilityTests/FileSpecTest.Yaml (1808 of 2167)
PASS: lldb-unit :: Utility/Release/UtilityTests/FileSpecTest.RemoveLastPathComponent (1809 of 2167)
PASS: lldb-unit :: Utility/Release/UtilityTests/FileSpecTest.OperatorBool (1810 of 2167)
PASS: lldb-unit :: Utility/Release/UtilityTests/Flags.AllSet (1811 of 2167)
PASS: lldb-unit :: Utility/Release/UtilityTests/Flags.GetBitSize (1812 of 2167)
PASS: lldb-unit :: Utility/Release/UtilityTests/Flags.Clear (1813 of 2167)
PASS: lldb-unit :: Utility/Release/UtilityTests/Flags.AnySet (1814 of 2167)
PASS: lldb-unit :: Utility/Release/UtilityTests/Flags.IsClear (1815 of 2167)
PASS: lldb-unit :: Utility/Release/UtilityTests/Flags.Reset (1816 of 2167)
PASS: lldb-unit :: Utility/Release/UtilityTests/Flags.Test (1817 of 2167)
PASS: lldb-unit :: Utility/Release/UtilityTests/GeneratorTest.Create (1818 of 2167)
PASS: lldb-unit :: Utility/Release/UtilityTests/GeneratorTest.Get (1819 of 2167)
PASS: lldb-unit :: Utility/Release/UtilityTests/GeneratorTest.GetOrCreate (1820 of 2167)
PASS: lldb-unit :: Utility/Release/UtilityTests/IndexToObjectTest.ObjectForIndex (1821 of 2167)
PASS: lldb-unit :: Utility/Release/UtilityTests/ListenerTest.GetEventImmediate (1822 of 2167)
PASS: lldb-unit :: Utility/Release/UtilityTests/LogChannelEnabledTest.LLDB_LOG_ERROR (1823 of 2167)
PASS: lldb-unit :: Utility/Release/UtilityTests/GeneratorTest.YamlMultiProvider (1824 of 2167)
PASS: lldb-unit :: Utility/Release/UtilityTests/LogChannelEnabledTest.LogGetLogThread (1825 of 2167)
PASS: lldb-unit :: Utility/Release/UtilityTests/LogChannelEnabledTest.LogThread (1826 of 2167)
PASS: lldb-unit :: Utility/Release/UtilityTests/LogChannelEnabledTest.log_options (1827 of 2167)
PASS: lldb-unit :: Utility/Release/UtilityTests/LogChannelEnabledTest.LogVerboseThread (1828 of 2167)
PASS: lldb-unit :: Utility/Release/UtilityTests/LogChannelTest.Disable (1829 of 2167)
PASS: lldb-unit :: Utility/Release/UtilityTests/LogChannelTest.Enable (1830 of 2167)
PASS: lldb-unit :: Utility/Release/UtilityTests/LogChannelTest.EnableOptions (1831 of 2167)
PASS: lldb-unit :: Utility/Release/UtilityTests/LogChannelTest.List (1832 of 2167)
PASS: lldb-unit :: Utility/Release/UtilityTests/LogTest.Register (1833 of 2167)
PASS: lldb-unit :: Utility/Release/UtilityTests/LogTest.LLDB_LOG_nullptr (1834 of 2167)
PASS: lldb-unit :: Utility/Release/UtilityTests/LogTest.Unregister (1835 of 2167)
PASS: lldb-unit :: Utility/Release/UtilityTests/NameMatchesTest.Contains (1836 of 2167)
PASS: lldb-unit :: Utility/Release/UtilityTests/ListenerTest.GetEventWait (1837 of 2167)
PASS: lldb-unit :: Utility/Release/UtilityTests/NameMatchesTest.EndsWith (1838 of 2167)
PASS: lldb-unit :: Utility/Release/UtilityTests/NameMatchesTest.Ignore (1839 of 2167)
PASS: lldb-unit :: Utility/Release/UtilityTests/NameMatchesTest.Equals (1840 of 2167)
PASS: lldb-unit :: Utility/Release/UtilityTests/NameMatchesTest.RegularExpression (1841 of 2167)
PASS: lldb-unit :: Utility/Release/UtilityTests/NameMatchesTest.StartsWith (1842 of 2167)
PASS: lldb-unit :: Utility/Release/UtilityTests/OptionsWithRawTest.ArgsButNoLeadingDash (1843 of 2167)
PASS: lldb-unit :: Utility/Release/UtilityTests/OptionsWithRawTest.ArgsButNoDelimiter (1844 of 2167)
PASS: lldb-unit :: Utility/Release/UtilityTests/OptionsWithRawTest.EmptyArgsOnlySuffix (1845 of 2167)
PASS: lldb-unit :: Utility/Release/UtilityTests/OptionsWithRawTest.EmptyInput (1846 of 2167)
PASS: lldb-unit :: Utility/Release/UtilityTests/OptionsWithRawTest.MultiWordSuffix (1847 of 2167)
PASS: lldb-unit :: Utility/Release/UtilityTests/OptionsWithRawTest.EmptySuffix (1848 of 2167)
PASS: lldb-unit :: Utility/Release/UtilityTests/OptionsWithRawTest.LeadingSpaceArgs (1849 of 2167)
PASS: lldb-unit :: Utility/Release/UtilityTests/OptionsWithRawTest.EmptySuffixSingleWhitespace (1850 of 2167)
PASS: lldb-unit :: Utility/Release/UtilityTests/OptionsWithRawTest.QuotedSuffix (1851 of 2167)
PASS: lldb-unit :: Utility/Release/UtilityTests/OptionsWithRawTest.WhitespaceInput (1852 of 2167)
PASS: lldb-unit :: Utility/Release/UtilityTests/OptionsWithRawTest.SingleWordSuffix (1853 of 2167)
PASS: lldb-unit :: Utility/Release/UtilityTests/OptionsWithRawTest.SingleWhitespaceInput (1854 of 2167)
PASS: lldb-unit :: Utility/Release/UtilityTests/OptionsWithRawTest.UnterminatedQuote (1855 of 2167)
PASS: lldb-unit :: Utility/Release/UtilityTests/OptionsWithRawTest.TerminatedQuote (1856 of 2167)
PASS: lldb-unit :: Utility/Release/UtilityTests/OptionsWithRawTest.WhitespaceSuffix (1857 of 2167)
PASS: lldb-unit :: Utility/Release/UtilityTests/PassiveReplayTest.InstrumentedBar (1858 of 2167)
PASS: lldb-unit :: Utility/Release/UtilityTests/ProcessInfoTest.Constructor (1859 of 2167)
PASS: lldb-unit :: Utility/Release/UtilityTests/PassiveReplayTest.InstrumentedBarRef (1860 of 2167)
PASS: lldb-unit :: Utility/Release/UtilityTests/PassiveReplayTest.InstrumentedBarPtr (1861 of 2167)
PASS: lldb-unit :: Utility/Release/UtilityTests/PassiveReplayTest.InstrumentedFoo (1862 of 2167)
PASS: lldb-unit :: Utility/Release/UtilityTests/Predicate.WaitForValueNotEqualTo (1863 of 2167)
PASS: lldb-unit :: Utility/Release/UtilityTests/ProcessInstanceInfo.Dump (1864 of 2167)
PASS: lldb-unit :: Utility/Release/UtilityTests/ProcessInstanceInfo.DumpTable_invalidUID (1865 of 2167)
PASS: lldb-unit :: Utility/Release/UtilityTests/ProcessInstanceInfo.Yaml (1866 of 2167)
PASS: lldb-unit :: Utility/Release/UtilityTests/ProcessInstanceInfo.DumpTable (1867 of 2167)
PASS: lldb-unit :: Utility/Release/UtilityTests/PassiveReplayTest.InstrumentedFooInvalid (1868 of 2167)
PASS: lldb-unit :: Utility/Release/UtilityTests/ProcessInstanceInfoList.Yaml (1869 of 2167)
PASS: lldb-unit :: Utility/Release/UtilityTests/RangeDataVector.CustomSort (1870 of 2167)
PASS: lldb-unit :: Utility/Release/UtilityTests/ProcessInstanceInfoMatch.Name (1871 of 2167)
PASS: lldb-unit :: Utility/Release/UtilityTests/RangeDataVector.FindEntryIndexesThatContain (1872 of 2167)
PASS: lldb-unit :: Utility/Release/UtilityTests/RangeDataVector.FindEntryIndexesThatContain_Overlap (1873 of 2167)
PASS: lldb-unit :: Utility/Release/UtilityTests/RangeDataVector.FindEntryThatContains (1874 of 2167)
PASS: lldb-unit :: Utility/Release/UtilityTests/RangeDataVector.FindEntryThatContains_Overlap (1875 of 2167)
PASS: lldb-unit :: Utility/Release/UtilityTests/RangeTest.Clear (1876 of 2167)
PASS: lldb-unit :: Utility/Release/UtilityTests/RangeTest.Constructor (1877 of 2167)
PASS: lldb-unit :: Utility/Release/UtilityTests/RangeTest.ClearWithStarAddress (1878 of 2167)
PASS: lldb-unit :: Utility/Release/UtilityTests/RangeTest.ContainsAddrInvalid (1879 of 2167)
PASS: lldb-unit :: Utility/Release/UtilityTests/RangeTest.ContainsAddr (1880 of 2167)
PASS: lldb-unit :: Utility/Release/UtilityTests/RangeTest.ContainsEndInclusive (1881 of 2167)
PASS: lldb-unit :: Utility/Release/UtilityTests/RangeTest.ContainsEndInclusiveInvalid (1882 of 2167)
PASS: lldb-unit :: Utility/Release/UtilityTests/RangeTest.ContainsRange (1883 of 2167)
PASS: lldb-unit :: Utility/Release/UtilityTests/RangeTest.ContainsRangeStartingFromZero (1884 of 2167)
PASS: lldb-unit :: Utility/Release/UtilityTests/RangeTest.Copy (1885 of 2167)
PASS: lldb-unit :: Utility/Release/UtilityTests/RangeTest.DefaultConstructor (1886 of 2167)
PASS: lldb-unit :: Utility/Release/UtilityTests/RangeTest.DoesAdjoinOrIntersect (1887 of 2167)
PASS: lldb-unit :: Utility/Release/UtilityTests/RangeTest.DoesIntersect (1888 of 2167)
PASS: lldb-unit :: Utility/Release/UtilityTests/RangeTest.EqualInvalid (1889 of 2167)
PASS: lldb-unit :: Utility/Release/UtilityTests/RangeTest.LessThan (1890 of 2167)
PASS: lldb-unit :: Utility/Release/UtilityTests/RangeTest.Equal (1891 of 2167)
PASS: lldb-unit :: Utility/Release/UtilityTests/RangeTest.LessThanInvalid (1892 of 2167)
PASS: lldb-unit :: Utility/Release/UtilityTests/RangeTest.NotEqualInvalid (1893 of 2167)
PASS: lldb-unit :: Utility/Release/UtilityTests/RangeTest.Slide (1894 of 2167)
PASS: lldb-unit :: Utility/Release/UtilityTests/RangeTest.SizeTypes (1895 of 2167)
PASS: lldb-unit :: Utility/Release/UtilityTests/RangeTest.NotEqual (1896 of 2167)
PASS: lldb-unit :: Utility/Release/UtilityTests/RangeTest.SetRangeBase (1897 of 2167)
PASS: lldb-unit :: Utility/Release/UtilityTests/RangeTest.SlideZero (1898 of 2167)
PASS: lldb-unit :: Utility/Release/UtilityTests/RangeTest.Union (1899 of 2167)
PASS: lldb-unit :: Utility/Release/UtilityTests/RangeVector.CombineConsecutiveRanges (1900 of 2167)
PASS: lldb-unit :: Utility/Release/UtilityTests/Predicate.WaitForValueEqualTo (1901 of 2167)
PASS: lldb-unit :: Utility/Release/UtilityTests/RegisterValueTest.GetSet8 (1902 of 2167)
PASS: lldb-unit :: Utility/Release/UtilityTests/RegularExpression.CopyAssignment (1903 of 2167)
PASS: lldb-unit :: Utility/Release/UtilityTests/RegularExpression.Empty (1904 of 2167)
PASS: lldb-unit :: Utility/Release/UtilityTests/RegularExpression.Invalid (1905 of 2167)
PASS: lldb-unit :: Utility/Release/UtilityTests/RegularExpression.Match (1906 of 2167)
PASS: lldb-unit :: Utility/Release/UtilityTests/RegularExpression.Valid (1907 of 2167)
PASS: lldb-unit :: Utility/Release/UtilityTests/ReproducerTest.SetCapture (1908 of 2167)
PASS: lldb-unit :: Utility/Release/UtilityTests/ReproducerTest.SetReplay (1909 of 2167)
PASS: lldb-unit :: Utility/Release/UtilityTests/ScalarTest.APIntConstructor (1910 of 2167)
PASS: lldb-unit :: Utility/Release/UtilityTests/ScalarTest.CastOperations (1911 of 2167)
PASS: lldb-unit :: Utility/Release/UtilityTests/ScalarTest.Comparison (1912 of 2167)
PASS: lldb-unit :: Utility/Release/UtilityTests/ScalarTest.ComparisonFloat (1913 of 2167)
PASS: lldb-unit :: Utility/Release/UtilityTests/ScalarTest.Division (1914 of 2167)
PASS: lldb-unit :: Utility/Release/UtilityTests/ScalarTest.Equality (1915 of 2167)
PASS: lldb-unit :: Utility/Release/UtilityTests/ScalarTest.ExtractBitfield (1916 of 2167)
PASS: lldb-unit :: Utility/Release/UtilityTests/ScalarTest.GetValue (1917 of 2167)
PASS: lldb-unit :: Utility/Release/UtilityTests/ScalarTest.GetBytes (1918 of 2167)
PASS: lldb-unit :: Utility/Release/UtilityTests/RecordReplayTest.InstrumentedFoo (1919 of 2167)
PASS: lldb-unit :: Utility/Release/UtilityTests/RecordReplayTest.InstrumentedBar (1920 of 2167)
PASS: lldb-unit :: Utility/Release/UtilityTests/RecordReplayTest.InstrumentedBarPtr (1921 of 2167)
PASS: lldb-unit :: Utility/Release/UtilityTests/RecordReplayTest.InstrumentedBarRef (1922 of 2167)
PASS: lldb-unit :: Utility/Release/UtilityTests/RecordReplayTest.InstrumentedFooSameThis (1923 of 2167)
PASS: lldb-unit :: Utility/Release/UtilityTests/ScalarTest.LongLongAssigmentOperator (1924 of 2167)
PASS: lldb-unit :: Utility/Release/UtilityTests/ScalarTest.Getters (1925 of 2167)
PASS: lldb-unit :: Utility/Release/UtilityTests/ScalarTest.SetValueFromCString (1926 of 2167)
PASS: lldb-unit :: Utility/Release/UtilityTests/ScalarTest.Promotion (1927 of 2167)
PASS: lldb-unit :: Utility/Release/UtilityTests/ScalarTest.Scalar_512 (1928 of 2167)
PASS: lldb-unit :: Utility/Release/UtilityTests/ScalarTest.RightShiftOperator (1929 of 2167)
PASS: lldb-unit :: Utility/Release/UtilityTests/ScalarTest.SetValueFromData (1930 of 2167)
PASS: lldb-unit :: Utility/Release/UtilityTests/ScalarTest.TruncOrExtendTo (1931 of 2167)
PASS: lldb-unit :: Utility/Release/UtilityTests/SerializationRountripTest.SerializeDeserializeCString (1932 of 2167)
PASS: lldb-unit :: Utility/Release/UtilityTests/SerializationRountripTest.SerializeDeserializeCStringArrayNullptr (1933 of 2167)
PASS: lldb-unit :: Utility/Release/UtilityTests/SerializationRountripTest.SerializeDeserializeCStringArray (1934 of 2167)
PASS: lldb-unit :: Utility/Release/UtilityTests/SerializationRountripTest.SerializeDeserializeCStringArrayNullptrElem (1935 of 2167)
PASS: lldb-unit :: Utility/Release/UtilityTests/SerializationRountripTest.SerializeDeserializeCStringNull (1936 of 2167)
PASS: lldb-unit :: Utility/Release/UtilityTests/SerializationRountripTest.SerializeDeserializeObjectPointer (1937 of 2167)
PASS: lldb-unit :: Utility/Release/UtilityTests/SerializationRountripTest.SerializeDeserializeObjectReference (1938 of 2167)
PASS: lldb-unit :: Utility/Release/UtilityTests/SerializationRountripTest.SerializeDeserializePod (1939 of 2167)
PASS: lldb-unit :: Utility/Release/UtilityTests/SerializationRountripTest.SerializeDeserializePodPointers (1940 of 2167)
PASS: lldb-unit :: Utility/Release/UtilityTests/SerializationRountripTest.SerializeDeserializePodReferences (1941 of 2167)
PASS: lldb-unit :: Utility/Release/UtilityTests/SharedCluster.ClusterManager (1942 of 2167)
PASS: lldb-unit :: Utility/Release/UtilityTests/StateTest.Formatv (1943 of 2167)
PASS: lldb-unit :: Utility/Release/UtilityTests/StatusTest.ErrorCodeConstructor (1944 of 2167)
PASS: lldb-unit :: Utility/Release/UtilityTests/StatusTest.ErrorConversion (1945 of 2167)
PASS: lldb-unit :: Utility/Release/UtilityTests/StatusTest.ErrorConstructor (1946 of 2167)
PASS: lldb-unit :: Utility/Release/UtilityTests/StreamTeeTest.Assignment (1947 of 2167)
PASS: lldb-unit :: Utility/Release/UtilityTests/StatusTest.Formatv (1948 of 2167)
PASS: lldb-unit :: Utility/Release/UtilityTests/StreamTeeTest.AppendStream (1949 of 2167)
PASS: lldb-unit :: Utility/Release/UtilityTests/StreamTeeTest.Constructor1Stream (1950 of 2167)
PASS: lldb-unit :: Utility/Release/UtilityTests/StreamTeeTest.Constructor2Streams (1951 of 2167)
PASS: lldb-unit :: Utility/Release/UtilityTests/StreamTeeTest.CopyConstructor (1952 of 2167)
PASS: lldb-unit :: Utility/Release/UtilityTests/StreamTeeTest.DefaultConstructor (1953 of 2167)
PASS: lldb-unit :: Utility/Release/UtilityTests/StreamTeeTest.Flush (1954 of 2167)
PASS: lldb-unit :: Utility/Release/UtilityTests/StreamTeeTest.GetStreamAtIndexOutOfBoundsEmpty (1955 of 2167)
PASS: lldb-unit :: Utility/Release/UtilityTests/StreamTeeTest.SetStreamAtIndexOutOfBounds (1956 of 2167)
PASS: lldb-unit :: Utility/Release/UtilityTests/StreamTeeTest.GetStreamAtIndexOutOfBounds (1957 of 2167)
PASS: lldb-unit :: Utility/Release/UtilityTests/StreamTeeTest.SetStreamAtIndexOverwrite (1958 of 2167)
PASS: lldb-unit :: Utility/Release/UtilityTests/StreamTeeTest.Write (1959 of 2167)
PASS: lldb-unit :: Utility/Release/UtilityTests/StreamTest.AddressEmptyPrefix (1960 of 2167)
PASS: lldb-unit :: Utility/Release/UtilityTests/StreamTest.AddressNoSuffix (1961 of 2167)
PASS: lldb-unit :: Utility/Release/UtilityTests/StreamTest.AddressPrefix (1962 of 2167)
PASS: lldb-unit :: Utility/Release/UtilityTests/StreamTest.AddressRange (1963 of 2167)
PASS: lldb-unit :: Utility/Release/UtilityTests/StreamTest.AddressRangeEmptyRange (1964 of 2167)
PASS: lldb-unit :: Utility/Release/UtilityTests/StreamTest.AddressPrefixAndSuffix (1965 of 2167)
PASS: lldb-unit :: Utility/Release/UtilityTests/StreamTest.AddressRangeInvalidRange (1966 of 2167)
PASS: lldb-unit :: Utility/Release/UtilityTests/StreamTest.AddressRangeSize (1967 of 2167)
PASS: lldb-unit :: Utility/Release/UtilityTests/StreamTest.AddressSize (1968 of 2167)
PASS: lldb-unit :: Utility/Release/UtilityTests/StreamTest.AddressSuffix (1969 of 2167)
PASS: lldb-unit :: Utility/Release/UtilityTests/StreamTest.PutBytesAsRawHex8ToBigEndian (1970 of 2167)
PASS: lldb-unit :: Utility/Release/UtilityTests/StreamTest.Indent (1971 of 2167)
PASS: lldb-unit :: Utility/Release/UtilityTests/StreamTest.ChangingByteOrder (1972 of 2167)
PASS: lldb-unit :: Utility/Release/UtilityTests/StreamTest.PutBytesAsRawHex8ToLittleEndian (1973 of 2167)
PASS: lldb-unit :: Utility/Release/UtilityTests/StreamTest.PutCString (1974 of 2167)
PASS: lldb-unit :: Utility/Release/UtilityTests/StreamTest.PutBytesAsRawHex8ToMixedEndian (1975 of 2167)
PASS: lldb-unit :: Utility/Release/UtilityTests/StreamTest.PutCStringWithStringRef (1976 of 2167)
PASS: lldb-unit :: Utility/Release/UtilityTests/StreamTest.PutCharNull (1977 of 2167)
PASS: lldb-unit :: Utility/Release/UtilityTests/StreamTest.PutChar (1978 of 2167)
PASS: lldb-unit :: Utility/Release/UtilityTests/StreamTest.PutCharWhitespace (1979 of 2167)
PASS: lldb-unit :: Utility/Release/UtilityTests/StreamTest.PutHex16ByteOrderLittle (1980 of 2167)
PASS: lldb-unit :: Utility/Release/UtilityTests/StreamTest.PutHex32ByteOrderLittle (1981 of 2167)
PASS: lldb-unit :: Utility/Release/UtilityTests/StreamTest.PutHex16ByteOrderBig (1982 of 2167)
PASS: lldb-unit :: Utility/Release/UtilityTests/StreamTest.PutHex32ByteOrderBig (1983 of 2167)
PASS: lldb-unit :: Utility/Release/UtilityTests/StreamTest.PutHex64ByteOrderBig (1984 of 2167)
PASS: lldb-unit :: Utility/Release/UtilityTests/StreamTest.PutHex64ByteOrderLittle (1985 of 2167)
PASS: lldb-unit :: Utility/Release/UtilityTests/StreamTest.PutHex8 (1986 of 2167)
PASS: lldb-unit :: Utility/Release/UtilityTests/StreamTest.PutMaxHex64ByteOrderBig (1987 of 2167)
PASS: lldb-unit :: Utility/Release/UtilityTests/StreamTest.PutMaxHex64ByteOrderLittle (1988 of 2167)
PASS: lldb-unit :: Utility/Release/UtilityTests/StreamTest.PutNHex8 (1989 of 2167)
PASS: lldb-unit :: Utility/Release/UtilityTests/StreamTest.PutPtr (1990 of 2167)
PASS: lldb-unit :: Utility/Release/UtilityTests/StreamTest.PutRawBytesToMixedEndian (1991 of 2167)
PASS: lldb-unit :: Utility/Release/UtilityTests/StreamTest.PutRawBytesToLittleEndian (1992 of 2167)
PASS: lldb-unit :: Utility/Release/UtilityTests/StreamTest.PutRawBytesToBigEndian (1993 of 2167)
PASS: lldb-unit :: Utility/Release/UtilityTests/StreamTest.PutStringAsRawHex8 (1994 of 2167)
PASS: lldb-unit :: Utility/Release/UtilityTests/StreamTest.PutSLEB128 (1995 of 2167)
PASS: lldb-unit :: Utility/Release/UtilityTests/StreamTest.QuotedCString (1996 of 2167)
PASS: lldb-unit :: Utility/Release/UtilityTests/StreamTest.PutULEB128 (1997 of 2167)
PASS: lldb-unit :: Utility/Release/UtilityTests/StreamTest.ShiftOperatorPtr (1998 of 2167)
PASS: lldb-unit :: Utility/Release/UtilityTests/StreamTest.SetIndentLevel (1999 of 2167)
PASS: lldb-unit :: Utility/Release/UtilityTests/StreamTest.ShiftOperatorChars (2000 of 2167)
PASS: lldb-unit :: Utility/Release/UtilityTests/StreamTest.ShiftOperatorStrings (2001 of 2167)
PASS: lldb-unit :: Utility/Release/UtilityTests/StringExtractorTest.DecodeHexU8_Extra (2002 of 2167)
PASS: lldb-unit :: Utility/Release/UtilityTests/StringExtractorTest.DecodeHexU8_Exact (2003 of 2167)
PASS: lldb-unit :: Utility/Release/UtilityTests/StringExtractorTest.DecodeHexU8_InvalidHex (2004 of 2167)
PASS: lldb-unit :: Utility/Release/UtilityTests/StringExtractorTest.DecodeHexU8_InvalidHex2 (2005 of 2167)
PASS: lldb-unit :: Utility/Release/UtilityTests/StringExtractorTest.DecodeHexU8_Underflow (2006 of 2167)
PASS: lldb-unit :: Utility/Release/UtilityTests/StringExtractorTest.DecodeHexU8_Underflow2 (2007 of 2167)
PASS: lldb-unit :: Utility/Release/UtilityTests/StringExtractorTest.GetHexBytesAvail (2008 of 2167)
PASS: lldb-unit :: Utility/Release/UtilityTests/StringExtractorTest.GetHexBytesAvail_OddPair2 (2009 of 2167)
PASS: lldb-unit :: Utility/Release/UtilityTests/StringExtractorTest.GetHexBytesAvail_FullString (2010 of 2167)
PASS: lldb-unit :: Utility/Release/UtilityTests/StringExtractorTest.GetHexBytes (2011 of 2167)
PASS: lldb-unit :: Utility/Release/UtilityTests/StringExtractorTest.GetHexBytesAvail_OddPair (2012 of 2167)
PASS: lldb-unit :: Utility/Release/UtilityTests/StringExtractorTest.GetHexBytesAvail_Underflow (2013 of 2167)
PASS: lldb-unit :: Utility/Release/UtilityTests/StringExtractorTest.GetHexBytesAvail_Partial (2014 of 2167)
PASS: lldb-unit :: Utility/Release/UtilityTests/StringExtractorTest.GetHexBytes_FullString (2015 of 2167)
PASS: lldb-unit :: Utility/Release/UtilityTests/StringExtractorTest.GetHexBytes_OddPair (2016 of 2167)
PASS: lldb-unit :: Utility/Release/UtilityTests/StringExtractorTest.GetHexBytes_Underflow (2017 of 2167)
PASS: lldb-unit :: Utility/Release/UtilityTests/StringExtractorTest.GetHexBytes_OddPair2 (2018 of 2167)
PASS: lldb-unit :: Utility/Release/UtilityTests/StringExtractorTest.GetHexBytes_Partial (2019 of 2167)
PASS: lldb-unit :: Utility/Release/UtilityTests/StringExtractorTest.GetHexU8_Exact (2020 of 2167)
PASS: lldb-unit :: Utility/Release/UtilityTests/StringExtractorTest.GetHexU8_Exact_NoEof (2021 of 2167)
PASS: lldb-unit :: Utility/Release/UtilityTests/StringExtractorTest.GetHexU8_InvalidHex (2022 of 2167)
PASS: lldb-unit :: Utility/Release/UtilityTests/StringExtractorTest.GetHexU8_Extra_NoEof (2023 of 2167)
PASS: lldb-unit :: Utility/Release/UtilityTests/StringExtractorTest.GetHexU8_Extra (2024 of 2167)
PASS: lldb-unit :: Utility/Release/UtilityTests/StringExtractorTest.GetHexU8_Underflow (2025 of 2167)
PASS: lldb-unit :: Utility/Release/UtilityTests/StringExtractorTest.GetHexU8_InvalidHex_NoEof (2026 of 2167)
PASS: lldb-unit :: Utility/Release/UtilityTests/StringExtractorTest.GetHexU8_Underflow2 (2027 of 2167)
PASS: lldb-unit :: Utility/Release/UtilityTests/StringExtractorTest.GetHexU8_Underflow2_NoEof (2028 of 2167)
PASS: lldb-unit :: Utility/Release/UtilityTests/StringExtractorTest.GetNameColonValueNoSemicolon (2029 of 2167)
PASS: lldb-unit :: Utility/Release/UtilityTests/StringExtractorTest.GetHexU8_Underflow_NoEof (2030 of 2167)
PASS: lldb-unit :: Utility/Release/UtilityTests/StringExtractorTest.GetU32BigEndian (2031 of 2167)
PASS: lldb-unit :: Utility/Release/UtilityTests/StringExtractorTest.GetNameColonValueNoColon (2032 of 2167)
PASS: lldb-unit :: Utility/Release/UtilityTests/StringExtractorTest.GetNameColonValueContainsColon (2033 of 2167)
PASS: lldb-unit :: Utility/Release/UtilityTests/StringExtractorTest.GetNameColonValueSuccess (2034 of 2167)
PASS: lldb-unit :: Utility/Release/UtilityTests/StringExtractorTest.GetU32LittleEndian (2035 of 2167)
PASS: lldb-unit :: Utility/Release/UtilityTests/StringExtractorTest.GetU64BigEndian (2036 of 2167)
PASS: lldb-unit :: Utility/Release/UtilityTests/StringExtractorTest.InitMisc (2037 of 2167)
PASS: lldb-unit :: Utility/Release/UtilityTests/StringExtractorTest.GetU64LittleEndian (2038 of 2167)
PASS: lldb-unit :: Utility/Release/UtilityTests/StringLexerTest.GetUnlexed (2039 of 2167)
PASS: lldb-unit :: Utility/Release/UtilityTests/StringLexerTest.AdvanceIf (2040 of 2167)
PASS: lldb-unit :: Utility/Release/UtilityTests/StringExtractorTest.InitEmpty (2041 of 2167)
PASS: lldb-unit :: Utility/Release/UtilityTests/StringLexerTest.HasAtLeast (2042 of 2167)
PASS: lldb-unit :: Utility/Release/UtilityTests/StringLexerTest.NextIf (2043 of 2167)
PASS: lldb-unit :: Utility/Release/UtilityTests/StringLexerTest.Next (2044 of 2167)
PASS: lldb-unit :: Utility/Release/UtilityTests/StringLexerTest.PutBack (2045 of 2167)
PASS: lldb-unit :: Utility/Release/UtilityTests/StringLexerTest.NextIfList (2046 of 2167)
PASS: lldb-unit :: Utility/Release/UtilityTests/StringLexerTest.Peek (2047 of 2167)
PASS: lldb-unit :: Utility/Release/UtilityTests/StringListTest.AppendList (2048 of 2167)
PASS: lldb-unit :: Utility/Release/UtilityTests/StringListTest.AppendListCStringArray (2049 of 2167)
PASS: lldb-unit :: Utility/Release/UtilityTests/StringListTest.AppendStringMove (2050 of 2167)
PASS: lldb-unit :: Utility/Release/UtilityTests/StringListTest.AppendStringCString (2051 of 2167)
PASS: lldb-unit :: Utility/Release/UtilityTests/StringListTest.Clear (2052 of 2167)
PASS: lldb-unit :: Utility/Release/UtilityTests/StringListTest.AppendStringStdString (2053 of 2167)
PASS: lldb-unit :: Utility/Release/UtilityTests/StringListTest.AppendListCStringArrayEmpty (2054 of 2167)
PASS: lldb-unit :: Utility/Release/UtilityTests/StringListTest.Assignment (2055 of 2167)
PASS: lldb-unit :: Utility/Release/UtilityTests/StringListTest.CopyList (2056 of 2167)
PASS: lldb-unit :: Utility/Release/UtilityTests/StringListTest.ForRangeEmpty (2057 of 2167)
PASS: lldb-unit :: Utility/Release/UtilityTests/StringListTest.CopyListSingle (2058 of 2167)
PASS: lldb-unit :: Utility/Release/UtilityTests/StringListTest.CopyListEmpty (2059 of 2167)
PASS: lldb-unit :: Utility/Release/UtilityTests/StringListTest.DefaultConstructor (2060 of 2167)
PASS: lldb-unit :: Utility/Release/UtilityTests/StringListTest.ForRange (2061 of 2167)
PASS: lldb-unit :: Utility/Release/UtilityTests/StringListTest.GetMaxStringLengthDecreasingSize (2062 of 2167)
PASS: lldb-unit :: Utility/Release/UtilityTests/StringListTest.GetMaxStringLengthEmpty (2063 of 2167)
PASS: lldb-unit :: Utility/Release/UtilityTests/StringListTest.GetMaxStringLengthEqualSize (2064 of 2167)
PASS: lldb-unit :: Utility/Release/UtilityTests/StringListTest.GetMaxStringLengthMixed (2065 of 2167)
PASS: lldb-unit :: Utility/Release/UtilityTests/StringListTest.GetMaxStringLengthIncreasingSize (2066 of 2167)
PASS: lldb-unit :: Utility/Release/UtilityTests/StringListTest.InsertStringAtIndexMove (2067 of 2167)
PASS: lldb-unit :: Utility/Release/UtilityTests/StringListTest.GetSize (2068 of 2167)
PASS: lldb-unit :: Utility/Release/UtilityTests/StringListTest.InsertStringAtIndexEnd (2069 of 2167)
PASS: lldb-unit :: Utility/Release/UtilityTests/StringListTest.InsertStringAtIndexOutOfBounds (2070 of 2167)
PASS: lldb-shell :: Reproducer/TestReuseDirectory.test (2071 of 2167)
PASS: lldb-unit :: Utility/Release/UtilityTests/StringListTest.InsertStringAtIndexStart (2072 of 2167)
PASS: lldb-unit :: Utility/Release/UtilityTests/StringListTest.InsertStringAtIndexStdString (2073 of 2167)
PASS: lldb-unit :: Utility/Release/UtilityTests/StringListTest.Join (2074 of 2167)
PASS: lldb-unit :: Utility/Release/UtilityTests/StringListTest.JoinEmpty (2075 of 2167)
PASS: lldb-unit :: Utility/Release/UtilityTests/StringListTest.JoinMultiCharSeparator (2076 of 2167)
PASS: lldb-unit :: Utility/Release/UtilityTests/StringListTest.JoinSingle (2077 of 2167)
PASS: lldb-unit :: Utility/Release/UtilityTests/StringListTest.JoinNonSpace (2078 of 2167)
PASS: lldb-unit :: Utility/Release/UtilityTests/StringListTest.JoinThree (2079 of 2167)
PASS: lldb-unit :: Utility/Release/UtilityTests/StringListTest.LongestCommonPrefixDuplicateElement (2080 of 2167)
PASS: lldb-unit :: Utility/Release/UtilityTests/StringListTest.LongestCommonPrefixEmpty (2081 of 2167)
PASS: lldb-unit :: Utility/Release/UtilityTests/StringListTest.LongestCommonPrefix (2082 of 2167)
PASS: lldb-unit :: Utility/Release/UtilityTests/StringListTest.LongestCommonPrefixSingleElement (2083 of 2167)
PASS: lldb-unit :: Utility/Release/UtilityTests/StringListTest.SetSize (2084 of 2167)
PASS: lldb-unit :: Utility/Release/UtilityTests/StringListTest.LongestCommonPrefixNoPrefix (2085 of 2167)
PASS: lldb-unit :: Utility/Release/UtilityTests/StringListTest.PopBack (2086 of 2167)
PASS: lldb-unit :: Utility/Release/UtilityTests/StringListTest.RemoveBlankLines (2087 of 2167)
PASS: lldb-unit :: Utility/Release/UtilityTests/StringListTest.SplitIntoLines (2088 of 2167)
PASS: lldb-unit :: Utility/Release/UtilityTests/StringListTest.ShiftStdString (2089 of 2167)
PASS: lldb-unit :: Utility/Release/UtilityTests/StringListTest.ShiftCString (2090 of 2167)
PASS: lldb-unit :: Utility/Release/UtilityTests/StringListTest.ShiftMove (2091 of 2167)
PASS: lldb-unit :: Utility/Release/UtilityTests/StringListTest.SplitIntoLinesSingleTrailingCR (2092 of 2167)
PASS: lldb-unit :: Utility/Release/UtilityTests/StringListTest.SplitIntoLinesEmpty (2093 of 2167)
PASS: lldb-unit :: Utility/Release/UtilityTests/StructuredDataTest.StringDump (2094 of 2167)
PASS: lldb-unit :: Utility/Release/UtilityTests/StructuredDataTest.ParseJSONFromFile (2095 of 2167)
PASS: lldb-unit :: Utility/Release/UtilityTests/SubsystemRAIITest.NormalSubsystem (2096 of 2167)
PASS: lldb-unit :: Utility/Release/UtilityTests/SubsystemRAIITest.SubsystemWithErrorFailure (2097 of 2167)
PASS: lldb-unit :: Utility/Release/UtilityTests/TildeExpressionResolver.ResolveFullPath (2098 of 2167)
PASS: lldb-unit :: Utility/Release/UtilityTests/SubsystemRAIITest.SubsystemWithErrorSuccess (2099 of 2167)
PASS: lldb-unit :: Utility/Release/UtilityTests/TimeoutTest.Construction (2100 of 2167)
PASS: lldb-unit :: Utility/Release/UtilityTests/TimeoutTest.Format (2101 of 2167)
PASS: lldb-unit :: Utility/Release/UtilityTests/TimerTest.CategoryTimes (2102 of 2167)
PASS: lldb-unit :: Utility/Release/UtilityTests/UUIDTest.RelationalOperators (2103 of 2167)
PASS: lldb-unit :: Utility/Release/UtilityTests/UUIDTest.SetFromStringRef (2104 of 2167)
PASS: lldb-unit :: Utility/Release/UtilityTests/UUIDTest.StringConverion (2105 of 2167)
PASS: lldb-unit :: Utility/Release/UtilityTests/UUIDTest.Validity (2106 of 2167)
PASS: lldb-unit :: Utility/Release/UtilityTests/UriParserTest.BadPort (2107 of 2167)
PASS: lldb-unit :: Utility/Release/UtilityTests/UriParserTest.BadPort2 (2108 of 2167)
PASS: lldb-unit :: Utility/Release/UtilityTests/UriParserTest.BracketedHostnamePort (2109 of 2167)
PASS: lldb-unit :: Utility/Release/UtilityTests/UriParserTest.BracketedHostname (2110 of 2167)
PASS: lldb-unit :: Utility/Release/UtilityTests/UriParserTest.BracketedHostnameWithColon (2111 of 2167)
PASS: lldb-unit :: Utility/Release/UtilityTests/TimerTest.CategoryTimesNested (2112 of 2167)
PASS: lldb-unit :: Utility/Release/UtilityTests/UriParserTest.BracketedHostnameWithPortIPv4 (2113 of 2167)
PASS: lldb-unit :: Utility/Release/UtilityTests/UriParserTest.LongPath (2114 of 2167)
PASS: lldb-unit :: Utility/Release/UtilityTests/UriParserTest.Empty (2115 of 2167)
PASS: lldb-unit :: Utility/Release/UtilityTests/UriParserTest.BracketedHostnameWithPortIPv6 (2116 of 2167)
PASS: lldb-unit :: Utility/Release/UtilityTests/UriParserTest.Minimal (2117 of 2167)
PASS: lldb-unit :: Utility/Release/UtilityTests/UriParserTest.MinimalPort (2118 of 2167)
PASS: lldb-unit :: Utility/Release/UtilityTests/UriParserTest.MinimalPath (2119 of 2167)
PASS: lldb-unit :: Utility/Release/UtilityTests/UriParserTest.PortOverflow (2120 of 2167)
PASS: lldb-unit :: Utility/Release/UtilityTests/UriParserTest.MinimalPortPath (2121 of 2167)
PASS: lldb-unit :: Utility/Release/UtilityTests/UriParserTest.SchemeHostSeparator (2122 of 2167)
PASS: lldb-unit :: Utility/Release/UtilityTests/UriParserTest.SchemeHostSeparator2 (2123 of 2167)
PASS: lldb-unit :: Utility/Release/UtilityTests/UriParserTest.SchemeHostSeparator3 (2124 of 2167)
PASS: lldb-unit :: Utility/Release/UtilityTests/UriParserTest.SchemeHostSeparator4 (2125 of 2167)
PASS: lldb-unit :: Utility/Release/UtilityTests/UriParserTest.TypicalPortPathIPv4 (2126 of 2167)
PASS: lldb-unit :: Utility/Release/UtilityTests/UriParserTest.TypicalPortPathIPv6 (2127 of 2167)
PASS: lldb-unit :: Utility/Release/UtilityTests/UserIDResolver.GetUserName (2128 of 2167)
PASS: lldb-unit :: Utility/Release/UtilityTests/UserIDResolver.GetGroupName (2129 of 2167)
PASS: lldb-unit :: Utility/Release/UtilityTests/VASprintfTest.EncodingError (2130 of 2167)
PASS: lldb-unit :: Utility/Release/UtilityTests/VASprintfTest.BufferResize (2131 of 2167)
PASS: lldb-unit :: Utility/Release/UtilityTests/VASprintfTest.NoBufferResize (2132 of 2167)
PASS: lldb-unit :: Utility/Release/UtilityTests/VMRange.Clear (2133 of 2167)
PASS: lldb-unit :: Utility/Release/UtilityTests/VMRange.Comparison (2134 of 2167)
PASS: lldb-unit :: Utility/Release/UtilityTests/VMRange.CollectionContains (2135 of 2167)
PASS: lldb-unit :: Utility/Release/UtilityTests/VMRange.ContainsAddr (2136 of 2167)
PASS: lldb-unit :: Utility/Release/UtilityTests/VMRange.IsValid (2137 of 2167)
PASS: lldb-unit :: Utility/Release/UtilityTests/VMRange.ContainsRange (2138 of 2167)
PASS: lldb-unit :: Utility/Release/UtilityTests/VMRange.SetEndAddress (2139 of 2167)
PASS: lldb-unit :: Utility/Release/UtilityTests/VMRange.Reset (2140 of 2167)
PASS: lldb-unit :: Utility/Release/UtilityTests/VMRange.Ordering (2141 of 2167)
PASS: lldb-unit :: Utility/Release/UtilityTests/XcodeSDKTest.FindXcodeContentsDirectoryInPath (2142 of 2167)
PASS: lldb-unit :: Utility/Release/UtilityTests/XcodeSDKTest.GetSDKTypeForTriple (2143 of 2167)
PASS: lldb-unit :: Utility/Release/UtilityTests/XcodeSDKTest.GetCanonicalNameAndConstruct (2144 of 2167)
PASS: lldb-unit :: Utility/Release/UtilityTests/XcodeSDKTest.MergeTest (2145 of 2167)
PASS: lldb-unit :: Utility/Release/UtilityTests/XcodeSDKTest.ParseTest (2146 of 2167)
PASS: lldb-unit :: Utility/Release/UtilityTests/XcodeSDKTest.SDKSupportsModules (2147 of 2167)
PASS: lldb-unit :: Utility/Release/UtilityTests/TimerTest.CategoryTimes2 (2148 of 2167)
PASS: lldb-unit :: debugserver/Release/debugserverTests/JSON.Parse (2149 of 2167)
PASS: lldb-unit :: Utility/Release/UtilityTests/XcodeSDKTest.SDKSupportsSwift (2150 of 2167)
PASS: lldb-unit :: debugserver/Release/debugserverTests/RNBSocket.LoopBackConnectIPv6 (2151 of 2167)
PASS: lldb-unit :: debugserver/Release/debugserverTests/RNBSocket.LoopBackConnectIPv4 (2152 of 2167)
PASS: lldb-unit :: debugserver/Release/debugserverTests/RNBSocket.AnyListen (2153 of 2167)
PASS: lldb-unit :: debugserver/Release/debugserverTests/RNBSocket.LoopBackListenIPv4 (2154 of 2167)
PASS: lldb-unit :: debugserver/Release/debugserverTests/RNBSocket.LoopBackListenIPv6 (2155 of 2167)
PASS: lldb-unit :: Utility/Release/UtilityTests/TimerTest.CategoryTimesStats (2156 of 2167)
PASS: lldb-unit :: tools/lldb-server/tests/Release/LLDBServerTests/TestBase.DebugserverEnv (2157 of 2167)
PASS: lldb-unit :: tools/lldb-server/tests/Release/LLDBServerTests/TestBase.LaunchModePreservesEnvironment (2158 of 2167)
PASS: lldb-unit :: tools/lldb-server/tests/Release/LLDBServerTests/StandardStartupTest.TestStopReplyContainsThreadPcs (2159 of 2167)
PASS: lldb-unit :: SymbolFile/DWARF/Release/SymbolFileDWARFTests/XcodeSDKModuleTests.TestModuleGetXcodeSDK (2160 of 2167)
PASS: lldb-unit :: Platform/Release/LLDBPlatformTests/PlatformAppleSimulatorTest.TestHostPlatformToSim (2161 of 2167)
PASS: lldb-unit :: Platform/Release/LLDBPlatformTests/PlatformAppleSimulatorTest.TestSimHasSimEnvionament (2162 of 2167)
PASS: lldb-unit :: Process/gdb-remote/Release/ProcessGdbRemoteTests/GDBRemoteClientBaseTest.InterruptNoResponse (2163 of 2167)
PASS: lldb-shell :: Reproducer/TestVersionCheck.test (2164 of 2167)
PASS: lldb-shell :: Reproducer/TestVerify.test (2165 of 2167)
PASS: lldb-api :: types/TestLongTypesExpr.py (2166 of 2167)
PASS: lldb-api :: tools/lldb-server/TestLldbGdbServer.py (2167 of 2167)
********************
Failed Tests (16):
  lldb-api :: commands/expression/expr-in-syscall/TestExpressionInSyscall.py
  lldb-api :: commands/expression/import-std-module/basic/TestImportStdModule.py
  lldb-api :: commands/expression/import-std-module/conflicts/TestStdModuleWithConflicts.py
  lldb-api :: commands/expression/import-std-module/deque-basic/TestDequeFromStdModule.py
  lldb-api :: commands/expression/import-std-module/deque-dbg-info-content/TestDbgInfoContentDequeFromStdModule.py
  lldb-api :: commands/expression/import-std-module/forward_list-dbg-info-content/TestDbgInfoContentForwardListFromStdModule.py
  lldb-api :: commands/expression/import-std-module/forward_list/TestForwardListFromStdModule.py
  lldb-api :: commands/expression/import-std-module/list-dbg-info-content/TestDbgInfoContentListFromStdModule.py
  lldb-api :: commands/expression/import-std-module/list/TestListFromStdModule.py
  lldb-api :: commands/expression/import-std-module/no-std-module/TestMissingStdModule.py
  lldb-api :: commands/expression/import-std-module/pair/TestPairFromStdModule.py
  lldb-api :: commands/expression/import-std-module/queue/TestQueueFromStdModule.py
  lldb-api :: commands/expression/import-std-module/shared_ptr-dbg-info-content/TestSharedPtrDbgInfoContentFromStdModule.py
  lldb-api :: commands/expression/import-std-module/shared_ptr/TestSharedPtrFromStdModule.py
  lldb-api :: commands/expression/import-std-module/stack/TestStackFromStdModule.py
  lldb-shell :: lldb-server/TestErrorMessages.test

Hide Details

Hide Details

Testing Time: 485.28s Unsupported : 226 Passed : 1917 Expectedly Failed: 8 Failed : 16 make: *** [/Users/buildslave/jenkins/workspace/lldb-cmake-standalone/lldb-xcode-build/test/CMakeFiles/check-lldb-lit] Error 1

Hide Details

** BUILD FAILED **

Hide Details

Hide Details

The following build commands failed: PhaseScriptExecution CMake\ Rules /Users/buildslave/jenkins/workspace/lldb-cmake-standalone/lldb-xcode-build/test/lldb.build/Release/check-lldb-lit.build/Script-262961D2EE4947E4B0C2DA88.sh (1 failure) Command failed: Command '['/usr/bin/env', 'TERM=vt100', '/usr/local/bin/cmake', '--build', '.', '--config', 'Release', '--target', 'check-lldb']' returned non-zero exit status 65. Command: ['/usr/bin/env', 'TERM=vt100', '/usr/local/bin/cmake', '--build', '.', '--config', 'Release', '--target', 'check-lldb'] [Pipeline] } [Pipeline] // timeout [Pipeline] } [Pipeline] // stage [Pipeline] stage [Pipeline] { (Declarative: Post Actions) [Pipeline] emailext Warning: paulsson@linux.vnet.ibm.com is not a recognized user, but sending mail anyway Warning: dblaikie@gmail.com is not a recognized user, but sending mail anyway Warning: evandro.menezes@sifive.com is not a recognized user, but sending mail anyway Warning: tu.da.wei@gmail.com is not a recognized user, but sending mail anyway Warning: ravishankarm@google.com is not a recognized user, but sending mail anyway Warning: mkazantsev@azul.com is not a recognized user, but sending mail anyway Warning: sepavloff@gmail.com is not a recognized user, but sending mail anyway Warning: hubert.reinterpretcast@gmail.com is not a recognized user, but sending mail anyway Warning: tmsriram@google.com is not a recognized user, but sending mail anyway Warning: flx@google.com is not a recognized user, but sending mail anyway Warning: vyng@google.com is not a recognized user, but sending mail anyway Warning: martin@martin.st is not a recognized user, but sending mail anyway Warning: paul@windfall.com is not a recognized user, but sending mail anyway Warning: julian.gross@dfki.de is not a recognized user, but sending mail anyway Warning: mgorny@gentoo.org is not a recognized user, but sending mail anyway Warning: zequanwu@google.com is not a recognized user, but sending mail anyway Warning: llvm-project@meinersbur.de is not a recognized user, but sending mail anyway Warning: pengfei.wang@intel.com is not a recognized user, but sending mail anyway Warning: jeremy.morse@sony.com is not a recognized user, but sending mail anyway Warning: wmi@google.com is not a recognized user, but sending mail anyway Warning: stellaraccident@gmail.com is not a recognized user, but sending mail anyway Warning: rdzhabarov@google.com is not a recognized user, but sending mail anyway Warning: luismarques@lowrisc.org is not a recognized user, but sending mail anyway Warning: alexfh@google.com is not a recognized user, but sending mail anyway Warning: saghir@ca.ibm.com is not a recognized user, but sending mail anyway Warning: Saiyedul.Islam@amd.com is not a recognized user, but sending mail anyway Warning: csigg@google.com is not a recognized user, but sending mail anyway Warning: enye.shi@gmail.com is not a recognized user, but sending mail anyway Warning: gjn@google.com is not a recognized user, but sending mail anyway Warning: eleviant@accesssoftek.com is not a recognized user, but sending mail anyway Warning: tstellar@redhat.com is not a recognized user, but sending mail anyway Warning: zinenko@google.com is not a recognized user, but sending mail anyway Warning: xiang1.zhang@intel.com is not a recognized user, but sending mail anyway Warning: Tony.Tye@amd.com is not a recognized user, but sending mail anyway Warning: antiagainst@gmail.com is not a recognized user, but sending mail anyway Warning: Joseph.Nash@amd.com is not a recognized user, but sending mail anyway Warning: craig.topper@intel.com is not a recognized user, but sending mail anyway Warning: Xiangling.Liao@ibm.com is not a recognized user, but sending mail anyway Warning: aaron.smith@microsoft.com is not a recognized user, but sending mail anyway Warning: richard@metafoo.co.uk is not a recognized user, but sending mail anyway Warning: Stanislav.Mekhanoshin@amd.com is not a recognized user, but sending mail anyway Warning: alexshap@fb.com is not a recognized user, but sending mail anyway Warning: abidh@codesourcery.com is not a recognized user, but sending mail anyway Warning: sbc@chromium.org is not a recognized user, but sending mail anyway Warning: aeubanks@google.com is not a recognized user, but sending mail anyway Warning: dpolukhin@fb.com is not a recognized user, but sending mail anyway Warning: nicolai.haehnle@amd.com is not a recognized user, but sending mail anyway Warning: ctetreau@quicinc.com is not a recognized user, but sending mail anyway Warning: zeratul976@hotmail.com is not a recognized user, but sending mail anyway Warning: tyker1@outlook.com is not a recognized user, but sending mail anyway Warning: thakis@chromium.org is not a recognized user, but sending mail anyway Warning: mmoroz@chromium.org is not a recognized user, but sending mail anyway Warning: david.green@arm.com is not a recognized user, but sending mail anyway Warning: joker.eph@gmail.com is not a recognized user, but sending mail anyway Warning: sam.mccall@gmail.com is not a recognized user, but sending mail anyway Warning: tejohnson@google.com is not a recognized user, but sending mail anyway Warning: mcgrathr@google.com is not a recognized user, but sending mail anyway Warning: czhengsz@cn.ibm.com is not a recognized user, but sending mail anyway Warning: peter@pcc.me.uk is not a recognized user, but sending mail anyway Warning: aorlov@accesssoftek.com is not a recognized user, but sending mail anyway Warning: Abhina.Sreeskantharajan@ibm.com is not a recognized user, but sending mail anyway Warning: pifon@google.com is not a recognized user, but sending mail anyway Warning: kparzysz@codeaurora.org is not a recognized user, but sending mail anyway Warning: a20012251@gmail.com is not a recognized user, but sending mail anyway Warning: llvm-dev@redking.me.uk is not a recognized user, but sending mail anyway Warning: valery.pykhtin@gmail.com is not a recognized user, but sending mail anyway Warning: frgossen@google.com is not a recognized user, but sending mail anyway Warning: clementval@gmail.com is not a recognized user, but sending mail anyway Warning: orlando.hyams@sony.com is not a recognized user, but sending mail anyway Warning: wei.huang@ibm.com is not a recognized user, but sending mail anyway Warning: hoy@fb.com is not a recognized user, but sending mail anyway Warning: psteinfeld@nvidia.com is not a recognized user, but sending mail anyway Warning: sjoerd.meijer@arm.com is not a recognized user, but sending mail anyway Warning: thomasraoux@google.com is not a recognized user, but sending mail anyway Warning: kadircet@google.com is not a recognized user, but sending mail anyway Warning: kostyak@google.com is not a recognized user, but sending mail anyway Warning: zhanghb97@126.com is not a recognized user, but sending mail anyway Warning: benny.kra@googlemail.com is not a recognized user, but sending mail anyway Warning: yitzhakm@google.com is not a recognized user, but sending mail anyway Warning: Ben.Dunbobbin@sony.com is not a recognized user, but sending mail anyway Warning: kbobyrev@google.com is not a recognized user, but sending mail anyway Warning: nikita.ppv@gmail.com is not a recognized user, but sending mail anyway Warning: jhuber6@vols.utk.edu is not a recognized user, but sending mail anyway Warning: qcolombet@apple.com is not a recognized user, but sending mail anyway Warning: llvmgnsyncbot@gmail.com is not a recognized user, but sending mail anyway Warning: marco.antognini@arm.com is not a recognized user, but sending mail anyway Warning: ndesaulniers@google.com is not a recognized user, but sending mail anyway Warning: huihuiz@quicinc.com is not a recognized user, but sending mail anyway Warning: andrzej.warzynski@arm.com is not a recognized user, but sending mail anyway Warning: ezhulenev@google.com is not a recognized user, but sending mail anyway Warning: jay.foad@gmail.com is not a recognized user, but sending mail anyway Warning: i@maskray.me is not a recognized user, but sending mail anyway Warning: james.henderson@sony.com is not a recognized user, but sending mail anyway Warning: daniil.fukalov@amd.com is not a recognized user, but sending mail anyway Warning: douglas.yung@sony.com is not a recognized user, but sending mail anyway Warning: medismail.bennani@gmail.com is not a recognized user, but sending mail anyway Warning: pavel@labath.sk is not a recognized user, but sending mail anyway Warning: serguei.katkov@azul.com is not a recognized user, but sending mail anyway Warning: koraq@xs4all.nl is not a recognized user, but sending mail anyway Warning: jan.kratochvil@redhat.com is not a recognized user, but sending mail anyway Warning: spatel@rotateright.com is not a recognized user, but sending mail anyway Warning: apilipenko@azulsystems.com is not a recognized user, but sending mail anyway Warning: akhuang@google.com is not a recognized user, but sending mail anyway Warning: shenhan@google.com is not a recognized user, but sending mail anyway Warning: michael.hliao@gmail.com is not a recognized user, but sending mail anyway Warning: jonathanchesterfield@gmail.com is not a recognized user, but sending mail anyway Warning: dantrushin@gmail.com is not a recognized user, but sending mail anyway Warning: Matthew.Arsenault@amd.com is not a recognized user, but sending mail anyway Warning: silvasean@google.com is not a recognized user, but sending mail anyway Warning: goncharov.mikhail@gmail.com is not a recognized user, but sending mail anyway Warning: caroline.concatto@arm.com is not a recognized user, but sending mail anyway Warning: flo@fhahn.com is not a recognized user, but sending mail anyway Warning: etiotto@ca.ibm.com is not a recognized user, but sending mail anyway Warning: jonathanchesterfield@gmail.com is not a recognized user, but sending mail anyway Warning: sylvestre@debian.org is not a recognized user, but sending mail anyway Warning: tcorring@amd.com is not a recognized user, but sending mail anyway Warning: arsenm2@gmail.com is not a recognized user, but sending mail anyway Warning: mtrofin@google.com is not a recognized user, but sending mail anyway Warning: stefanp@kuat.aus.stglabs.ibm.com is not a recognized user, but sending mail anyway Warning: john.brawn@arm.com is not a recognized user, but sending mail anyway Warning: tianshilei1992@gmail.com is not a recognized user, but sending mail anyway Warning: david.stenberg@ericsson.com is not a recognized user, but sending mail anyway Warning: tra@google.com is not a recognized user, but sending mail anyway Warning: SourabhSingh.Tomar@amd.com is not a recognized user, but sending mail anyway Warning: martin@martin.st is not a recognized user, but sending mail anyway Warning: tejohnson@google.com is not a recognized user, but sending mail anyway Warning: craig.topper@intel.com is not a recognized user, but sending mail anyway Warning: richard@metafoo.co.uk is not a recognized user, but sending mail anyway

Hide Details

Begin Pre-Send Script... Sending email to: Akira Hatanaka <ahatanaka@apple.com> Akira Hatanaka <ahatanaka@apple.com> Azhar Mohammed <azhar@apple.com>
[Pipeline] } [Pipeline] // stage [Pipeline] } [Pipeline] // withEnv [Pipeline] } [Pipeline] // node [Pipeline] End of Pipeline [Checks API] No suitable checks publisher found. ERROR: script returned exit code 1 Finished: FAILURE