Started 2 mo 5 days ago
Took 1 hr 14 min

Failed Build clang-d346782-ge1fb9d53727-t8141-b8141.tar.gz (Mar 31, 2020 2:41:27 PM)

Issues

Found 348 issues:
Fatal Error: error in backend: Found 1 machine code errors.
- function:    func
- basic block: %bb.8 entry (0x7f8e5f0c4988)
- instruction: early-clobber %40:gpr64, early-clobber %41:gpr64sp = JumpTableDest32 %11:gpr64, %7:gpr64sp, %jump-table.0
- operand 3:   %7:gpr64sp
Expected a GPR64 register, but got a GPR64sp register
fatal error: error in backend: Found 1 machine code errors.
PLEASE submit a bug report to https://bugs.llvm.org/ and include the crash backtrace, preprocessed source, and associated run script.
Stack dump:
Error: clang frontend command failed with exit code 70 (use -v to see invocation)
25 clang         0x0000000111f6b1bb clang::driver::Compilation::ExecuteJobs(clang::driver::JobList const&, llvm::SmallVectorImpl<std::__1::pair<int, clang::driver::Command const*> >&) const + 107
26 clang         0x0000000111f7efbb clang::driver::Driver::ExecuteCompilation(clang::driver::Compilation&, llvm::SmallVectorImpl<std::__1::pair<int, clang::driver::Command const*> >&) + 203
27 clang         0x000000010faa0495 main + 10917
28 libdyld.dylib 0x00007fff5feb2085 start + 1
29 libdyld.dylib 0x0000000000000018 start + 18446603338906918804
clang-11: error: clang frontend command failed with exit code 70 (use -v to see invocation)
clang version 11.0.0 (https://github.com/llvm/llvm-project.git e1fb9d53727f379be7930e8d8bb24c3c7da2f12a)
Target: aarch64-apple-darwin18.0.0
Fatal Error: error in backend: Found 1 machine code errors.
- function:    _Z22defineLoopSuiteRunInfoRKNSt3__16vectorI13LoopVariantIDNS_9allocatorIS1_EEEEPbdd
- basic block: %bb.260 if.then88 (0x7fb07cd77e88)
- instruction: early-clobber %2752:gpr64, early-clobber %2753:gpr64sp = JumpTableDest32 %267:gpr64, %263:gpr64sp, %jump-table.0
- operand 3:   %263:gpr64sp
Expected a GPR64 register, but got a GPR64sp register
fatal error: error in backend: Found 1 machine code errors.
PLEASE submit a bug report to https://bugs.llvm.org/ and include the crash backtrace, preprocessed source, and associated run script.
Stack dump:
Error: clang frontend command failed with exit code 70 (use -v to see invocation)
25 clang++       0x00000001063c91bb clang::driver::Compilation::ExecuteJobs(clang::driver::JobList const&, llvm::SmallVectorImpl<std::__1::pair<int, clang::driver::Command const*> >&) const + 107
26 clang++       0x00000001063dcfbb clang::driver::Driver::ExecuteCompilation(clang::driver::Compilation&, llvm::SmallVectorImpl<std::__1::pair<int, clang::driver::Command const*> >&) + 203
27 clang++       0x0000000103efe495 main + 10917
28 libdyld.dylib 0x00007fff5feb2085 start + 1
29 libdyld.dylib 0x000000000000001f start + 18446603338906918811
clang-11: error: clang frontend command failed with exit code 70 (use -v to see invocation)
clang version 11.0.0 (https://github.com/llvm/llvm-project.git e1fb9d53727f379be7930e8d8bb24c3c7da2f12a)
Target: aarch64-apple-darwin18.0.0
Fatal Error: error in backend: Found 1 machine code errors.
- function:    _Z22defineLoopSuiteRunInfoRKNSt3__16vectorI13LoopVariantIDNS_9allocatorIS1_EEEEPbdd
- basic block: %bb.260 if.then88 (0x7fc52feb2688)
- instruction: early-clobber %2752:gpr64, early-clobber %2753:gpr64sp = JumpTableDest32 %267:gpr64, %263:gpr64sp, %jump-table.0
- operand 3:   %263:gpr64sp
Expected a GPR64 register, but got a GPR64sp register
fatal error: error in backend: Found 1 machine code errors.
PLEASE submit a bug report to https://bugs.llvm.org/ and include the crash backtrace, preprocessed source, and associated run script.
Stack dump:
Error: clang frontend command failed with exit code 70 (use -v to see invocation)
25 clang++       0x000000010c0da1bb clang::driver::Compilation::ExecuteJobs(clang::driver::JobList const&, llvm::SmallVectorImpl<std::__1::pair<int, clang::driver::Command const*> >&) const + 107
26 clang++       0x000000010c0edfbb clang::driver::Driver::ExecuteCompilation(clang::driver::Compilation&, llvm::SmallVectorImpl<std::__1::pair<int, clang::driver::Command const*> >&) + 203
27 clang++       0x0000000109c0f495 main + 10917
28 libdyld.dylib 0x00007fff5feb2085 start + 1
29 libdyld.dylib 0x000000000000001f start + 18446603338906918811
clang-11: error: clang frontend command failed with exit code 70 (use -v to see invocation)
clang version 11.0.0 (https://github.com/llvm/llvm-project.git e1fb9d53727f379be7930e8d8bb24c3c7da2f12a)
Target: aarch64-apple-darwin18.0.0
Fatal Error: error in backend: Found 1 machine code errors.
- function:    _Z22defineLoopSuiteRunInfoRKNSt3__16vectorI13LoopVariantIDNS_9allocatorIS1_EEEEPbdd
- basic block: %bb.260 if.then88 (0x7ff0f7f16a88)
- instruction: early-clobber %2752:gpr64, early-clobber %2753:gpr64sp = JumpTableDest32 %267:gpr64, %263:gpr64sp, %jump-table.0
- operand 3:   %263:gpr64sp
Expected a GPR64 register, but got a GPR64sp register
fatal error: error in backend: Found 1 machine code errors.
PLEASE submit a bug report to https://bugs.llvm.org/ and include the crash backtrace, preprocessed source, and associated run script.
Stack dump:
Error: clang frontend command failed with exit code 70 (use -v to see invocation)
25 clang++       0x00000001077e41bb clang::driver::Compilation::ExecuteJobs(clang::driver::JobList const&, llvm::SmallVectorImpl<std::__1::pair<int, clang::driver::Command const*> >&) const + 107
26 clang++       0x00000001077f7fbb clang::driver::Driver::ExecuteCompilation(clang::driver::Compilation&, llvm::SmallVectorImpl<std::__1::pair<int, clang::driver::Command const*> >&) + 203
27 clang++       0x0000000105319495 main + 10917
28 libdyld.dylib 0x00007fff5feb2085 start + 1
29 libdyld.dylib 0x000000000000001f start + 18446603338906918811
clang-11: error: clang frontend command failed with exit code 70 (use -v to see invocation)
clang version 11.0.0 (https://github.com/llvm/llvm-project.git e1fb9d53727f379be7930e8d8bb24c3c7da2f12a)
Target: aarch64-apple-darwin18.0.0
Fatal Error: error in backend: Found 1 machine code errors.
- function:    _Z22defineLoopSuiteRunInfoRKNSt3__16vectorI13LoopVariantIDNS_9allocatorIS1_EEEEPbdd
- basic block: %bb.260 if.then88 (0x7f9b736eea88)
- instruction: early-clobber %2752:gpr64, early-clobber %2753:gpr64sp = JumpTableDest32 %267:gpr64, %263:gpr64sp, %jump-table.0
- operand 3:   %263:gpr64sp
Expected a GPR64 register, but got a GPR64sp register
fatal error: error in backend: Found 1 machine code errors.
PLEASE submit a bug report to https://bugs.llvm.org/ and include the crash backtrace, preprocessed source, and associated run script.
Stack dump:
Error: clang frontend command failed with exit code 70 (use -v to see invocation)
25 clang++       0x00000001084c21bb clang::driver::Compilation::ExecuteJobs(clang::driver::JobList const&, llvm::SmallVectorImpl<std::__1::pair<int, clang::driver::Command const*> >&) const + 107
26 clang++       0x00000001084d5fbb clang::driver::Driver::ExecuteCompilation(clang::driver::Compilation&, llvm::SmallVectorImpl<std::__1::pair<int, clang::driver::Command const*> >&) + 203
27 clang++       0x0000000105ff7495 main + 10917
28 libdyld.dylib 0x00007fff5feb2085 start + 1
29 libdyld.dylib 0x000000000000001f start + 18446603338906918811
clang-11: error: clang frontend command failed with exit code 70 (use -v to see invocation)
clang version 11.0.0 (https://github.com/llvm/llvm-project.git e1fb9d53727f379be7930e8d8bb24c3c7da2f12a)
Target: aarch64-apple-darwin18.0.0
Fatal Error: error in backend: Found 1 machine code errors.
- function:    _Z22defineLoopSuiteRunInfoRKNSt3__16vectorI13LoopVariantIDNS_9allocatorIS1_EEEEPbdd
- basic block: %bb.260 if.then88 (0x7fa7a8111888)
- instruction: early-clobber %2752:gpr64, early-clobber %2753:gpr64sp = JumpTableDest32 %267:gpr64, %263:gpr64sp, %jump-table.0
- operand 3:   %263:gpr64sp
Expected a GPR64 register, but got a GPR64sp register
fatal error: error in backend: Found 1 machine code errors.
PLEASE submit a bug report to https://bugs.llvm.org/ and include the crash backtrace, preprocessed source, and associated run script.
Stack dump:
Error: clang frontend command failed with exit code 70 (use -v to see invocation)
25 clang++       0x000000010b7c41bb clang::driver::Compilation::ExecuteJobs(clang::driver::JobList const&, llvm::SmallVectorImpl<std::__1::pair<int, clang::driver::Command const*> >&) const + 107
26 clang++       0x000000010b7d7fbb clang::driver::Driver::ExecuteCompilation(clang::driver::Compilation&, llvm::SmallVectorImpl<std::__1::pair<int, clang::driver::Command const*> >&) + 203
27 clang++       0x00000001092f9495 main + 10917
28 libdyld.dylib 0x00007fff5feb2085 start + 1
29 libdyld.dylib 0x000000000000001f start + 18446603338906918811
clang-11: error: clang frontend command failed with exit code 70 (use -v to see invocation)
clang version 11.0.0 (https://github.com/llvm/llvm-project.git e1fb9d53727f379be7930e8d8bb24c3c7da2f12a)
Target: aarch64-apple-darwin18.0.0
... (limited to first 12 issues)

Build Log

Changes
  1. [AMDGPU] Define 16 bit VGPR subregs (details)
  2. [CodeGenPrepare] Delete intrinsic call to llvm.assume to enable more tailcall (details)
  3. [lld] Initial commit for new Mach-O backend (details)
  4. Replace std::string::find == 0 with StringRef::startswith (details)
  5. [AArch64][SVE] Add support for fcmp. (details)
  6. Add a new -fglobal-isel option and make -fexperimental-isel an alias for it. (details)
  7. [gn build] Port 03f43b3aca36 (details)
  8. [mlir][spirv] Change op doc description autogen separator (details)
  9. [docs] Make llvm-addr2line documentation more explicit about which (details)
  10. Re-land "[lldb/Reproducers] Always collect the whole dSYM in the reproducer" (details)
  11. [libc++] Allow running .sh.cpp tests with SSHExecutors (details)
  12. [InstCombine] Report change in non zero phi transform (details)
  13. [InstCombine] Use replaceOperand() in non zero phi transform (details)
  14. [InstCombine] Erase old alloca in cast of alloca transform (details)
  15. [InstCombine] Use replaceOperand() in descaling (details)
  16. Remove "mask" operand from shufflevector. (details)
  17. [InstCombine] Use replaceOperand() in some select transforms (details)
  18. Revert "[InlineFunction] Handle return attributes on call within inlined body" (details)
  19. [cmake] Link libc++ tests against static libc++/libc++abi in CrossWinToARMLinux.cmake (details)
  20. Switch this function to the LLVM variable naming convention, to match the rest of the file. (details)
  21. [pch] Honour -fallow-pch-with-compiler-errors for overall compilation status (details)
  22. [MLIR][NFC] modernize affine.for unroll test pass (details)

Started by upstream project relay-test-suite-verify-machineinstrs build number 7360
originally caused by:

This run spent:

  • 1 hr 0 min waiting;
  • 1 hr 14 min build duration;
  • 1 hr 15 min total from scheduled to completion.
Revision: 4abf27c36f15a0828fd4794e4a63fc663589c69c
  • refs/remotes/origin/master
Revision: e1fb9d53727f379be7930e8d8bb24c3c7da2f12a
  • detached
Revision: 9c9f6f8aaca07b783b4a2db2b68f7878a61bd97a
  • refs/remotes/origin/master
Revision: 44dad74558616adcdf54a289db4466c7ab7d2563
  • refs/remotes/origin/master

Identified problems

Compile Error

This build failed because of a compile error. Below is a list of all errors in the build log:
Indication 1

Ninja target failed

Below is a link to the first failed ninja target.
Indication 2