Started 1 mo 27 days ago
Took 38 min

Failed Build clang-d346796-g0f44a09757f-t8144-b8144.tar.gz (Mar 31, 2020 4:27:32 PM)

Issues

Found 348 issues:
Fatal Error: error in backend: Found 1 machine code errors.
- function:    _Z22defineLoopSuiteRunInfoRKNSt3__16vectorI13LoopVariantIDNS_9allocatorIS1_EEEEPbdd
- basic block: %bb.260 if.then88 (0x7f864199f888)
- instruction: early-clobber %2752:gpr64, early-clobber %2753:gpr64sp = JumpTableDest32 %267:gpr64, %263:gpr64sp, %jump-table.0
- operand 3:   %263:gpr64sp
Expected a GPR64 register, but got a GPR64sp register
fatal error: error in backend: Found 1 machine code errors.
PLEASE submit a bug report to https://bugs.llvm.org/ and include the crash backtrace, preprocessed source, and associated run script.
Stack dump:
Error: clang frontend command failed with exit code 70 (use -v to see invocation)
25 clang++       0x00000001097720eb clang::driver::Compilation::ExecuteJobs(clang::driver::JobList const&, llvm::SmallVectorImpl<std::__1::pair<int, clang::driver::Command const*> >&) const + 107
26 clang++       0x0000000109785eeb clang::driver::Driver::ExecuteCompilation(clang::driver::Compilation&, llvm::SmallVectorImpl<std::__1::pair<int, clang::driver::Command const*> >&) + 203
27 clang++       0x00000001072a7115 main + 10917
28 libdyld.dylib 0x00007fff5feb2085 start + 1
29 libdyld.dylib 0x000000000000001f start + 18446603338906918811
clang-11: error: clang frontend command failed with exit code 70 (use -v to see invocation)
clang version 11.0.0 (https://github.com/llvm/llvm-project.git 0f44a09757f4f45e527e2bb79f15eb16967457a1)
Target: aarch64-apple-darwin18.0.0
Fatal Error: error in backend: Found 1 machine code errors.
- function:    _Z22defineLoopSuiteRunInfoRKNSt3__16vectorI13LoopVariantIDNS_9allocatorIS1_EEEEPbdd
- basic block: %bb.260 if.then88 (0x7fba805be288)
- instruction: early-clobber %2752:gpr64, early-clobber %2753:gpr64sp = JumpTableDest32 %267:gpr64, %263:gpr64sp, %jump-table.0
- operand 3:   %263:gpr64sp
Expected a GPR64 register, but got a GPR64sp register
fatal error: error in backend: Found 1 machine code errors.
PLEASE submit a bug report to https://bugs.llvm.org/ and include the crash backtrace, preprocessed source, and associated run script.
Stack dump:
Error: clang frontend command failed with exit code 70 (use -v to see invocation)
25 clang++       0x00000001100f00eb clang::driver::Compilation::ExecuteJobs(clang::driver::JobList const&, llvm::SmallVectorImpl<std::__1::pair<int, clang::driver::Command const*> >&) const + 107
26 clang++       0x0000000110103eeb clang::driver::Driver::ExecuteCompilation(clang::driver::Compilation&, llvm::SmallVectorImpl<std::__1::pair<int, clang::driver::Command const*> >&) + 203
27 clang++       0x000000010dc25115 main + 10917
28 libdyld.dylib 0x00007fff5feb2085 start + 1
29 libdyld.dylib 0x000000000000001f start + 18446603338906918811
clang-11: error: clang frontend command failed with exit code 70 (use -v to see invocation)
clang version 11.0.0 (https://github.com/llvm/llvm-project.git 0f44a09757f4f45e527e2bb79f15eb16967457a1)
Target: aarch64-apple-darwin18.0.0
Fatal Error: error in backend: Found 1 machine code errors.
- function:    _Z22defineLoopSuiteRunInfoRKNSt3__16vectorI13LoopVariantIDNS_9allocatorIS1_EEEEPbdd
- basic block: %bb.260 if.then88 (0x7fb63ce24288)
- instruction: early-clobber %2752:gpr64, early-clobber %2753:gpr64sp = JumpTableDest32 %267:gpr64, %263:gpr64sp, %jump-table.0
- operand 3:   %263:gpr64sp
Expected a GPR64 register, but got a GPR64sp register
fatal error: error in backend: Found 1 machine code errors.
PLEASE submit a bug report to https://bugs.llvm.org/ and include the crash backtrace, preprocessed source, and associated run script.
Stack dump:
Error: clang frontend command failed with exit code 70 (use -v to see invocation)
25 clang++       0x0000000111a8d0eb clang::driver::Compilation::ExecuteJobs(clang::driver::JobList const&, llvm::SmallVectorImpl<std::__1::pair<int, clang::driver::Command const*> >&) const + 107
26 clang++       0x0000000111aa0eeb clang::driver::Driver::ExecuteCompilation(clang::driver::Compilation&, llvm::SmallVectorImpl<std::__1::pair<int, clang::driver::Command const*> >&) + 203
27 clang++       0x000000010f5c2115 main + 10917
28 libdyld.dylib 0x00007fff5feb2085 start + 1
29 libdyld.dylib 0x000000000000001f start + 18446603338906918811
clang-11: error: clang frontend command failed with exit code 70 (use -v to see invocation)
clang version 11.0.0 (https://github.com/llvm/llvm-project.git 0f44a09757f4f45e527e2bb79f15eb16967457a1)
Target: aarch64-apple-darwin18.0.0
Fatal Error: error in backend: Found 1 machine code errors.
- function:    _Z22defineLoopSuiteRunInfoRKNSt3__16vectorI13LoopVariantIDNS_9allocatorIS1_EEEEPbdd
- basic block: %bb.260 if.then88 (0x7f9962fbb688)
- instruction: early-clobber %2752:gpr64, early-clobber %2753:gpr64sp = JumpTableDest32 %267:gpr64, %263:gpr64sp, %jump-table.0
- operand 3:   %263:gpr64sp
Expected a GPR64 register, but got a GPR64sp register
fatal error: error in backend: Found 1 machine code errors.
PLEASE submit a bug report to https://bugs.llvm.org/ and include the crash backtrace, preprocessed source, and associated run script.
Stack dump:
Error: clang frontend command failed with exit code 70 (use -v to see invocation)
25 clang++       0x0000000110e160eb clang::driver::Compilation::ExecuteJobs(clang::driver::JobList const&, llvm::SmallVectorImpl<std::__1::pair<int, clang::driver::Command const*> >&) const + 107
26 clang++       0x0000000110e29eeb clang::driver::Driver::ExecuteCompilation(clang::driver::Compilation&, llvm::SmallVectorImpl<std::__1::pair<int, clang::driver::Command const*> >&) + 203
27 clang++       0x000000010e94b115 main + 10917
28 libdyld.dylib 0x00007fff5feb2085 start + 1
29 libdyld.dylib 0x000000000000001f start + 18446603338906918811
clang-11: error: clang frontend command failed with exit code 70 (use -v to see invocation)
clang version 11.0.0 (https://github.com/llvm/llvm-project.git 0f44a09757f4f45e527e2bb79f15eb16967457a1)
Target: aarch64-apple-darwin18.0.0
Fatal Error: error in backend: Found 1 machine code errors.
- function:    _Z22defineLoopSuiteRunInfoRKNSt3__16vectorI13LoopVariantIDNS_9allocatorIS1_EEEEPbdd
- basic block: %bb.260 if.then88 (0x7fc48c02a888)
- instruction: early-clobber %2752:gpr64, early-clobber %2753:gpr64sp = JumpTableDest32 %267:gpr64, %263:gpr64sp, %jump-table.0
- operand 3:   %263:gpr64sp
Expected a GPR64 register, but got a GPR64sp register
fatal error: error in backend: Found 1 machine code errors.
PLEASE submit a bug report to https://bugs.llvm.org/ and include the crash backtrace, preprocessed source, and associated run script.
Stack dump:
Error: clang frontend command failed with exit code 70 (use -v to see invocation)
25 clang++       0x000000010ad2f0eb clang::driver::Compilation::ExecuteJobs(clang::driver::JobList const&, llvm::SmallVectorImpl<std::__1::pair<int, clang::driver::Command const*> >&) const + 107
26 clang++       0x000000010ad42eeb clang::driver::Driver::ExecuteCompilation(clang::driver::Compilation&, llvm::SmallVectorImpl<std::__1::pair<int, clang::driver::Command const*> >&) + 203
27 clang++       0x0000000108864115 main + 10917
28 libdyld.dylib 0x00007fff5feb2085 start + 1
29 libdyld.dylib 0x000000000000001f start + 18446603338906918811
clang-11: error: clang frontend command failed with exit code 70 (use -v to see invocation)
clang version 11.0.0 (https://github.com/llvm/llvm-project.git 0f44a09757f4f45e527e2bb79f15eb16967457a1)
Target: aarch64-apple-darwin18.0.0
Fatal Error: error in backend: Found 1 machine code errors.
- function:    _Z22defineLoopSuiteRunInfoRKNSt3__16vectorI13LoopVariantIDNS_9allocatorIS1_EEEEPbdd
- basic block: %bb.260 if.then88 (0x7f863cee8888)
- instruction: early-clobber %2752:gpr64, early-clobber %2753:gpr64sp = JumpTableDest32 %267:gpr64, %263:gpr64sp, %jump-table.0
- operand 3:   %263:gpr64sp
Expected a GPR64 register, but got a GPR64sp register
fatal error: error in backend: Found 1 machine code errors.
PLEASE submit a bug report to https://bugs.llvm.org/ and include the crash backtrace, preprocessed source, and associated run script.
Stack dump:
Error: clang frontend command failed with exit code 70 (use -v to see invocation)
25 clang++       0x0000000104d5f0eb clang::driver::Compilation::ExecuteJobs(clang::driver::JobList const&, llvm::SmallVectorImpl<std::__1::pair<int, clang::driver::Command const*> >&) const + 107
26 clang++       0x0000000104d72eeb clang::driver::Driver::ExecuteCompilation(clang::driver::Compilation&, llvm::SmallVectorImpl<std::__1::pair<int, clang::driver::Command const*> >&) + 203
27 clang++       0x0000000102894115 main + 10917
28 libdyld.dylib 0x00007fff5feb2085 start + 1
29 libdyld.dylib 0x000000000000001f start + 18446603338906918811
clang-11: error: clang frontend command failed with exit code 70 (use -v to see invocation)
clang version 11.0.0 (https://github.com/llvm/llvm-project.git 0f44a09757f4f45e527e2bb79f15eb16967457a1)
Target: aarch64-apple-darwin18.0.0
... (limited to first 12 issues)

Build Log

Changes
  1. Fixed windows failure after D74873 (details)
  2. [clangd] Don't build clangdserver for (most) completion tests. NFC (details)
  3. [libc++] Use 'export' instead of 'env' to run remote commands (details)
  4. [OPENMP50]Allow use of array shaping expression in a list. (details)
  5. [AArch64] Fix mismatch in prologue and epilogue for funclets on Windows (details)
  6. [AArch64] Change AArch64 Windows EH UnwindHelp object to be a fixed object (details)
  7. [Object] Update ObjectFile::makeTriple for XCOFF (details)
  8. [FileCheck] Add missing %ProtectFileCheckOutput to FileCheck tests (details)
  9. Add a Type::Payload typedef. (NFC) (details)
  10. Replace uint32_t with typedef (NFC) (details)
  11. HIP: Ensure new denormal mode attributes are set (details)
  12. [PPCInstPrinter] Print conditional branches as `bt 2, $target` instead of `bt 2, .+$imm` (details)
  13. AMDGPU: Make HIPToolChain a subclass of AMDGPUToolChain (details)
  14. [ELF][test] Add 'REQUIRES: x86' to threads.s (details)

Started by upstream project relay-test-suite-verify-machineinstrs build number 7361
originally caused by:

This run spent:

  • 23 min waiting;
  • 38 min build duration;
  • 38 min total from scheduled to completion.
Revision: 4abf27c36f15a0828fd4794e4a63fc663589c69c
  • refs/remotes/origin/master
Revision: 0f44a09757f4f45e527e2bb79f15eb16967457a1
  • detached
Revision: 9c9f6f8aaca07b783b4a2db2b68f7878a61bd97a
  • refs/remotes/origin/master
Revision: 44dad74558616adcdf54a289db4466c7ab7d2563
  • refs/remotes/origin/master

Identified problems

Compile Error

This build failed because of a compile error. Below is a list of all errors in the build log:
Indication 1

Ninja target failed

Below is a link to the first failed ninja target.
Indication 2