Started 1 mo 1 day ago
Took 27 min

Failed Build clang-d359602-g5b14f5051f1-t12366-b12366.tar.gz (Jul 8, 2020 1:56:51 AM)

Issues

Found 3 issues:
Ninja target: pr84524.c.o
[8681/11529] : && /Users/buildslave/jenkins/workspace/test-suite-verify-machineinstrs-aarch64-O0-g/test-suite-build/tools/timeit --summary SingleSource/Regression/C/gcc-c-torture/execute/GCC-C-execute-pr79354.link.time /Users/buildslave/jenkins/workspace/test-suite-verify-machineinstrs-aarch64-O0-g/compiler/bin/clang -B /Applications/Xcode.app/Contents/Developer/Toolchains/XcodeDefault.xctoolchain/usr/bin    -Wno-unused-command-line-argument -mllvm -verify-machineinstrs -O0 -g -arch arm64 -isysroot /Applications/Xcode.app/Contents/Developer/Platforms/iPhoneOS.platform/Developer/SDKs/iPhoneOS13.5.sdk -Wl,-search_paths_first -Wl,-headerpad_max_install_names -B /Applications/Xcode.app/Contents/Developer/Toolchains/XcodeDefault.xctoolchain/usr/bin SingleSource/Regression/C/gcc-c-torture/execute/CMakeFiles/GCC-C-execute-pr79354.dir/pr79354.c.o  -o SingleSource/Regression/C/gcc-c-torture/execute/GCC-C-execute-pr79354   && :
[8682/11529] /Users/buildslave/jenkins/workspace/test-suite-verify-machineinstrs-aarch64-O0-g/test-suite-build/tools/timeit --summary SingleSource/Regression/C/gcc-c-torture/execute/CMakeFiles/GCC-C-execute-pr79286.dir/pr79286.c.o.time /Users/buildslave/jenkins/workspace/test-suite-verify-machineinstrs-aarch64-O0-g/compiler/bin/clang -DNDEBUG  -B /Applications/Xcode.app/Contents/Developer/Toolchains/XcodeDefault.xctoolchain/usr/bin    -Wno-unused-command-line-argument -mllvm -verify-machineinstrs -O0 -g -arch arm64 -isysroot /Applications/Xcode.app/Contents/Developer/Platforms/iPhoneOS.platform/Developer/SDKs/iPhoneOS13.5.sdk   -w -Werror=date-time -w -MD -MT SingleSource/Regression/C/gcc-c-torture/execute/CMakeFiles/GCC-C-execute-pr79286.dir/pr79286.c.o -MF SingleSource/Regression/C/gcc-c-torture/execute/CMakeFiles/GCC-C-execute-pr79286.dir/pr79286.c.o.d -o SingleSource/Regression/C/gcc-c-torture/execute/CMakeFiles/GCC-C-execute-pr79286.dir/pr79286.c.o   -c /Users/buildslave/jenkins/workspace/test-suite-verify-machineinstrs-aarch64-O0-g/test-suite/SingleSource/Regression/C/gcc-c-torture/execute/pr79286.c
[8683/11529] /Users/buildslave/jenkins/workspace/test-suite-verify-machineinstrs-aarch64-O0-g/test-suite-build/tools/timeit --summary SingleSource/Regression/C/gcc-c-torture/execute/CMakeFiles/GCC-C-execute-pr78791.dir/pr78791.c.o.time /Users/buildslave/jenkins/workspace/test-suite-verify-machineinstrs-aarch64-O0-g/compiler/bin/clang -DNDEBUG  -B /Applications/Xcode.app/Contents/Developer/Toolchains/XcodeDefault.xctoolchain/usr/bin    -Wno-unused-command-line-argument -mllvm -verify-machineinstrs -O0 -g -arch arm64 -isysroot /Applications/Xcode.app/Contents/Developer/Platforms/iPhoneOS.platform/Developer/SDKs/iPhoneOS13.5.sdk   -w -Werror=date-time -w -MD -MT SingleSource/Regression/C/gcc-c-torture/execute/CMakeFiles/GCC-C-execute-pr78791.dir/pr78791.c.o -MF SingleSource/Regression/C/gcc-c-torture/execute/CMakeFiles/GCC-C-execute-pr78791.dir/pr78791.c.o.d -o SingleSource/Regression/C/gcc-c-torture/execute/CMakeFiles/GCC-C-execute-pr78791.dir/pr78791.c.o   -c /Users/buildslave/jenkins/workspace/test-suite-verify-machineinstrs-aarch64-O0-g/test-suite/SingleSource/Regression/C/gcc-c-torture/execute/pr78791.c
[8684/11529] /Users/buildslave/jenkins/workspace/test-suite-verify-machineinstrs-aarch64-O0-g/test-suite-build/tools/timeit --summary SingleSource/Regression/C/gcc-c-torture/execute/CMakeFiles/GCC-C-execute-pr78726.dir/pr78726.c.o.time /Users/buildslave/jenkins/workspace/test-suite-verify-machineinstrs-aarch64-O0-g/compiler/bin/clang -DNDEBUG  -B /Applications/Xcode.app/Contents/Developer/Toolchains/XcodeDefault.xctoolchain/usr/bin    -Wno-unused-command-line-argument -mllvm -verify-machineinstrs -O0 -g -arch arm64 -isysroot /Applications/Xcode.app/Contents/Developer/Platforms/iPhoneOS.platform/Developer/SDKs/iPhoneOS13.5.sdk   -w -Werror=date-time -w -MD -MT SingleSource/Regression/C/gcc-c-torture/execute/CMakeFiles/GCC-C-execute-pr78726.dir/pr78726.c.o -MF SingleSource/Regression/C/gcc-c-torture/execute/CMakeFiles/GCC-C-execute-pr78726.dir/pr78726.c.o.d -o SingleSource/Regression/C/gcc-c-torture/execute/CMakeFiles/GCC-C-execute-pr78726.dir/pr78726.c.o   -c /Users/buildslave/jenkins/workspace/test-suite-verify-machineinstrs-aarch64-O0-g/test-suite/SingleSource/Regression/C/gcc-c-torture/execute/pr78726.c
[8685/11529] /Users/buildslave/jenkins/workspace/test-suite-verify-machineinstrs-aarch64-O0-g/test-suite-build/tools/timeit --summary SingleSource/Regression/C/gcc-c-torture/execute/CMakeFiles/GCC-C-execute-pr84524.dir/pr84524.c.o.time /Users/buildslave/jenkins/workspace/test-suite-verify-machineinstrs-aarch64-O0-g/compiler/bin/clang -DNDEBUG  -B /Applications/Xcode.app/Contents/Developer/Toolchains/XcodeDefault.xctoolchain/usr/bin    -Wno-unused-command-line-argument -mllvm -verify-machineinstrs -O0 -g -arch arm64 -isysroot /Applications/Xcode.app/Contents/Developer/Platforms/iPhoneOS.platform/Developer/SDKs/iPhoneOS13.5.sdk   -w -Werror=date-time -w -MD -MT SingleSource/Regression/C/gcc-c-torture/execute/CMakeFiles/GCC-C-execute-pr84524.dir/pr84524.c.o -MF SingleSource/Regression/C/gcc-c-torture/execute/CMakeFiles/GCC-C-execute-pr84524.dir/pr84524.c.o.d -o SingleSource/Regression/C/gcc-c-torture/execute/CMakeFiles/GCC-C-execute-pr84524.dir/pr84524.c.o   -c /Users/buildslave/jenkins/workspace/test-suite-verify-machineinstrs-aarch64-O0-g/test-suite/SingleSource/Regression/C/gcc-c-torture/execute/pr84524.c
FAILED: SingleSource/Regression/C/gcc-c-torture/execute/CMakeFiles/GCC-C-execute-pr84524.dir/pr84524.c.o 
/Users/buildslave/jenkins/workspace/test-suite-verify-machineinstrs-aarch64-O0-g/test-suite-build/tools/timeit --summary SingleSource/Regression/C/gcc-c-torture/execute/CMakeFiles/GCC-C-execute-pr84524.dir/pr84524.c.o.time /Users/buildslave/jenkins/workspace/test-suite-verify-machineinstrs-aarch64-O0-g/compiler/bin/clang -DNDEBUG  -B /Applications/Xcode.app/Contents/Developer/Toolchains/XcodeDefault.xctoolchain/usr/bin    -Wno-unused-command-line-argument -mllvm -verify-machineinstrs -O0 -g -arch arm64 -isysroot /Applications/Xcode.app/Contents/Developer/Platforms/iPhoneOS.platform/Developer/SDKs/iPhoneOS13.5.sdk   -w -Werror=date-time -w -MD -MT SingleSource/Regression/C/gcc-c-torture/execute/CMakeFiles/GCC-C-execute-pr84524.dir/pr84524.c.o -MF SingleSource/Regression/C/gcc-c-torture/execute/CMakeFiles/GCC-C-execute-pr84524.dir/pr84524.c.o.d -o SingleSource/Regression/C/gcc-c-torture/execute/CMakeFiles/GCC-C-execute-pr84524.dir/pr84524.c.o   -c /Users/buildslave/jenkins/workspace/test-suite-verify-machineinstrs-aarch64-O0-g/test-suite/SingleSource/Regression/C/gcc-c-torture/execute/pr84524.c
Fatal Error: error in backend: Found 1 machine code errors.
*** Bad machine code: Copy Instruction is illegal with mismatching sizes ***
- function:    main
- basic block: %bb.5 for.body4 (0x7fd3708592a0)
- instruction: %38:gpr32common = COPY %36:_(s16), debug-location !102; test-suite/SingleSource/Regression/C/gcc-c-torture/execute/pr84524.c:31:4
Def Size = 32, Src Size = 16
fatal error: error in backend: Found 1 machine code errors.
PLEASE submit a bug report to https://bugs.llvm.org/ and include the crash backtrace, preprocessed source, and associated run script.
Stack dump:
Error: clang frontend command failed with exit code 70 (use -v to see invocation)
25 clang         0x000000010e5a295d clang::driver::Compilation::ExecuteJobs(clang::driver::JobList const&, llvm::SmallVectorImpl<std::__1::pair<int, clang::driver::Command const*> >&) const + 125
26 clang         0x000000010e5b6c0c clang::driver::Driver::ExecuteCompilation(clang::driver::Compilation&, llvm::SmallVectorImpl<std::__1::pair<int, clang::driver::Command const*> >&) + 204
27 clang         0x000000010c151985 main + 10389
28 libdyld.dylib 0x00007fff696f7cc9 start + 1
29 libdyld.dylib 0x0000000000000019 start + 18446603338747249489
clang-11: error: clang frontend command failed with exit code 70 (use -v to see invocation)
clang version 11.0.0 (https://github.com/llvm/llvm-project.git 5b14f5051f134d29f51b523e5c9b602c08a4a7af)
Target: aarch64-apple-darwin19.5.0

Build Log

Changes
  1. Upgrade TypePromotionTransaction to be able to report changes in CodeGenPrepare (details)
  2. [analyzer] Warning for default constructed unique_ptr dereference (details)
  3. [gn build] Port 20e271a98de (details)
  4. [DSE,MSSA] Eliminate stores by terminators (free,lifetime.end). (details)
  5. [WebAssembly] Generate unreachable after __stack_chk_fail (details)
  6. [MLIR][SPIRVToLLVM] Miscellaneous ops conversion: select, fmul and undef (details)
  7. [CodeGen] Fix warnings in sve-ld1-addressing-mode-reg-imm.ll (details)
  8. [analyzer] Silence gcc -Wparentheses warning [NFC] (details)
  9. [CodeGen] Fix wrong use of getVectorNumElements in PromoteIntRes_EXTRACT_SUBVECTOR (details)

Started by upstream project relay-test-suite-verify-machineinstrs build number 8326
originally caused by:

This run spent:

  • 12 min waiting;
  • 27 min build duration;
  • 27 min total from scheduled to completion.
Revision: 6e68cd8d5047703f01a15e0b9978219584c57887
  • refs/remotes/origin/master
Revision: 5b14f5051f134d29f51b523e5c9b602c08a4a7af
  • detached
Revision: 53229320df0e57a7b779a3dcded72fc9e6d44e01
  • refs/remotes/origin/master
Revision: 879f4962e83f98863c83e385e956d579e131791f
  • refs/remotes/origin/master

Identified problems

Compile Error

This build failed because of a compile error. Below is a list of all errors in the build log:
Indication 1

Ninja target failed

Below is a link to the first failed ninja target.
Indication 2