Started 1 mo 0 days ago
Took 2 hr 1 min

Failed Build clang-d359724-g67091509446-t12393-b12393.tar.gz (Jul 8, 2020 10:12:25 PM)

Issues

Found 3 issues:
Ninja target: pr84524.c.o
[9287/11529] : && /Users/buildslave/jenkins/workspace/test-suite-verify-machineinstrs-aarch64-O0-g/test-suite-build/tools/timeit --summary SingleSource/Regression/C/gcc-c-torture/execute/GCC-C-execute-pr79354.link.time /Users/buildslave/jenkins/workspace/test-suite-verify-machineinstrs-aarch64-O0-g/compiler/bin/clang -B /Applications/Xcode.app/Contents/Developer/Toolchains/XcodeDefault.xctoolchain/usr/bin    -Wno-unused-command-line-argument -mllvm -verify-machineinstrs -O0 -g -arch arm64 -isysroot /Applications/Xcode.app/Contents/Developer/Platforms/iPhoneOS.platform/Developer/SDKs/iPhoneOS13.5.sdk -Wl,-search_paths_first -Wl,-headerpad_max_install_names -B /Applications/Xcode.app/Contents/Developer/Toolchains/XcodeDefault.xctoolchain/usr/bin SingleSource/Regression/C/gcc-c-torture/execute/CMakeFiles/GCC-C-execute-pr79354.dir/pr79354.c.o  -o SingleSource/Regression/C/gcc-c-torture/execute/GCC-C-execute-pr79354   && :
[9288/11529] : && /Users/buildslave/jenkins/workspace/test-suite-verify-machineinstrs-aarch64-O0-g/test-suite-build/tools/timeit --summary SingleSource/Regression/C/gcc-c-torture/execute/GCC-C-execute-pr79286.link.time /Users/buildslave/jenkins/workspace/test-suite-verify-machineinstrs-aarch64-O0-g/compiler/bin/clang -B /Applications/Xcode.app/Contents/Developer/Toolchains/XcodeDefault.xctoolchain/usr/bin    -Wno-unused-command-line-argument -mllvm -verify-machineinstrs -O0 -g -arch arm64 -isysroot /Applications/Xcode.app/Contents/Developer/Platforms/iPhoneOS.platform/Developer/SDKs/iPhoneOS13.5.sdk -Wl,-search_paths_first -Wl,-headerpad_max_install_names -B /Applications/Xcode.app/Contents/Developer/Toolchains/XcodeDefault.xctoolchain/usr/bin SingleSource/Regression/C/gcc-c-torture/execute/CMakeFiles/GCC-C-execute-pr79286.dir/pr79286.c.o  -o SingleSource/Regression/C/gcc-c-torture/execute/GCC-C-execute-pr79286   && :
[9289/11529] /Users/buildslave/jenkins/workspace/test-suite-verify-machineinstrs-aarch64-O0-g/test-suite-build/tools/timeit --summary SingleSource/Regression/C/gcc-c-torture/execute/CMakeFiles/GCC-C-execute-pr78726.dir/pr78726.c.o.time /Users/buildslave/jenkins/workspace/test-suite-verify-machineinstrs-aarch64-O0-g/compiler/bin/clang -DNDEBUG  -B /Applications/Xcode.app/Contents/Developer/Toolchains/XcodeDefault.xctoolchain/usr/bin    -Wno-unused-command-line-argument -mllvm -verify-machineinstrs -O0 -g -arch arm64 -isysroot /Applications/Xcode.app/Contents/Developer/Platforms/iPhoneOS.platform/Developer/SDKs/iPhoneOS13.5.sdk   -w -Werror=date-time -w -MD -MT SingleSource/Regression/C/gcc-c-torture/execute/CMakeFiles/GCC-C-execute-pr78726.dir/pr78726.c.o -MF SingleSource/Regression/C/gcc-c-torture/execute/CMakeFiles/GCC-C-execute-pr78726.dir/pr78726.c.o.d -o SingleSource/Regression/C/gcc-c-torture/execute/CMakeFiles/GCC-C-execute-pr78726.dir/pr78726.c.o   -c /Users/buildslave/jenkins/workspace/test-suite-verify-machineinstrs-aarch64-O0-g/test-suite/SingleSource/Regression/C/gcc-c-torture/execute/pr78726.c
[9290/11529] /Users/buildslave/jenkins/workspace/test-suite-verify-machineinstrs-aarch64-O0-g/test-suite-build/tools/timeit --summary SingleSource/Regression/C/gcc-c-torture/execute/CMakeFiles/GCC-C-execute-pr78791.dir/pr78791.c.o.time /Users/buildslave/jenkins/workspace/test-suite-verify-machineinstrs-aarch64-O0-g/compiler/bin/clang -DNDEBUG  -B /Applications/Xcode.app/Contents/Developer/Toolchains/XcodeDefault.xctoolchain/usr/bin    -Wno-unused-command-line-argument -mllvm -verify-machineinstrs -O0 -g -arch arm64 -isysroot /Applications/Xcode.app/Contents/Developer/Platforms/iPhoneOS.platform/Developer/SDKs/iPhoneOS13.5.sdk   -w -Werror=date-time -w -MD -MT SingleSource/Regression/C/gcc-c-torture/execute/CMakeFiles/GCC-C-execute-pr78791.dir/pr78791.c.o -MF SingleSource/Regression/C/gcc-c-torture/execute/CMakeFiles/GCC-C-execute-pr78791.dir/pr78791.c.o.d -o SingleSource/Regression/C/gcc-c-torture/execute/CMakeFiles/GCC-C-execute-pr78791.dir/pr78791.c.o   -c /Users/buildslave/jenkins/workspace/test-suite-verify-machineinstrs-aarch64-O0-g/test-suite/SingleSource/Regression/C/gcc-c-torture/execute/pr78791.c
[9291/11529] /Users/buildslave/jenkins/workspace/test-suite-verify-machineinstrs-aarch64-O0-g/test-suite-build/tools/timeit --summary SingleSource/Regression/C/gcc-c-torture/execute/CMakeFiles/GCC-C-execute-pr84524.dir/pr84524.c.o.time /Users/buildslave/jenkins/workspace/test-suite-verify-machineinstrs-aarch64-O0-g/compiler/bin/clang -DNDEBUG  -B /Applications/Xcode.app/Contents/Developer/Toolchains/XcodeDefault.xctoolchain/usr/bin    -Wno-unused-command-line-argument -mllvm -verify-machineinstrs -O0 -g -arch arm64 -isysroot /Applications/Xcode.app/Contents/Developer/Platforms/iPhoneOS.platform/Developer/SDKs/iPhoneOS13.5.sdk   -w -Werror=date-time -w -MD -MT SingleSource/Regression/C/gcc-c-torture/execute/CMakeFiles/GCC-C-execute-pr84524.dir/pr84524.c.o -MF SingleSource/Regression/C/gcc-c-torture/execute/CMakeFiles/GCC-C-execute-pr84524.dir/pr84524.c.o.d -o SingleSource/Regression/C/gcc-c-torture/execute/CMakeFiles/GCC-C-execute-pr84524.dir/pr84524.c.o   -c /Users/buildslave/jenkins/workspace/test-suite-verify-machineinstrs-aarch64-O0-g/test-suite/SingleSource/Regression/C/gcc-c-torture/execute/pr84524.c
FAILED: SingleSource/Regression/C/gcc-c-torture/execute/CMakeFiles/GCC-C-execute-pr84524.dir/pr84524.c.o 
/Users/buildslave/jenkins/workspace/test-suite-verify-machineinstrs-aarch64-O0-g/test-suite-build/tools/timeit --summary SingleSource/Regression/C/gcc-c-torture/execute/CMakeFiles/GCC-C-execute-pr84524.dir/pr84524.c.o.time /Users/buildslave/jenkins/workspace/test-suite-verify-machineinstrs-aarch64-O0-g/compiler/bin/clang -DNDEBUG  -B /Applications/Xcode.app/Contents/Developer/Toolchains/XcodeDefault.xctoolchain/usr/bin    -Wno-unused-command-line-argument -mllvm -verify-machineinstrs -O0 -g -arch arm64 -isysroot /Applications/Xcode.app/Contents/Developer/Platforms/iPhoneOS.platform/Developer/SDKs/iPhoneOS13.5.sdk   -w -Werror=date-time -w -MD -MT SingleSource/Regression/C/gcc-c-torture/execute/CMakeFiles/GCC-C-execute-pr84524.dir/pr84524.c.o -MF SingleSource/Regression/C/gcc-c-torture/execute/CMakeFiles/GCC-C-execute-pr84524.dir/pr84524.c.o.d -o SingleSource/Regression/C/gcc-c-torture/execute/CMakeFiles/GCC-C-execute-pr84524.dir/pr84524.c.o   -c /Users/buildslave/jenkins/workspace/test-suite-verify-machineinstrs-aarch64-O0-g/test-suite/SingleSource/Regression/C/gcc-c-torture/execute/pr84524.c
Fatal Error: error in backend: Found 1 machine code errors.
*** Bad machine code: Copy Instruction is illegal with mismatching sizes ***
- function:    main
- basic block: %bb.5 for.body4 (0x7fbd34859ca0)
- instruction: %38:gpr32common = COPY %36:_(s16), debug-location !102; test-suite/SingleSource/Regression/C/gcc-c-torture/execute/pr84524.c:31:4
Def Size = 32, Src Size = 16
fatal error: error in backend: Found 1 machine code errors.
PLEASE submit a bug report to https://bugs.llvm.org/ and include the crash backtrace, preprocessed source, and associated run script.
Stack dump:
Error: clang frontend command failed with exit code 70 (use -v to see invocation)
25 clang         0x000000010aedce6d clang::driver::Compilation::ExecuteJobs(clang::driver::JobList const&, llvm::SmallVectorImpl<std::__1::pair<int, clang::driver::Command const*> >&) const + 125
26 clang         0x000000010aef111c clang::driver::Driver::ExecuteCompilation(clang::driver::Compilation&, llvm::SmallVectorImpl<std::__1::pair<int, clang::driver::Command const*> >&) + 204
27 clang         0x0000000108a8d185 main + 10389
28 libdyld.dylib 0x00007fff696f7cc9 start + 1
29 libdyld.dylib 0x0000000000000019 start + 18446603338747249489
clang-11: error: clang frontend command failed with exit code 70 (use -v to see invocation)
clang version 11.0.0 (https://github.com/llvm/llvm-project.git 670915094462d831e3733e5b01a76471b8cf6dd8)
Target: aarch64-apple-darwin19.5.0

Build Log

Changes
  1. Add missing CMake bool canonicalizations. (details)
  2. Fix a typo in an error message. (details)
  3. [DWARFYAML][unittest] Refactor parseDWARFYAML(). (details)
  4. [ORC] Modify LazyCallThroughManager to support asynchronous resolution. (details)

Started by upstream project relay-test-suite-verify-machineinstrs build number 8336
originally caused by:

This run spent:

  • 1 hr 46 min waiting;
  • 2 hr 1 min build duration;
  • 2 hr 1 min total from scheduled to completion.
Revision: 26fab8ff789d7386ca0944bbb367f04715386d71
  • refs/remotes/origin/master
Revision: 670915094462d831e3733e5b01a76471b8cf6dd8
  • detached
Revision: 53229320df0e57a7b779a3dcded72fc9e6d44e01
  • refs/remotes/origin/master
Revision: 879f4962e83f98863c83e385e956d579e131791f
  • refs/remotes/origin/master

Identified problems

Compile Error

This build failed because of a compile error. Below is a list of all errors in the build log:
Indication 1

Ninja target failed

Below is a link to the first failed ninja target.
Indication 2