Started 4 mo 26 days ago
Took 2 hr 14 min

Failed Build clang-d359750-g47c4ce41a16-t12401-b12401.tar.gz (Jul 9, 2020 4:24:59 AM)

Issues

Found 3 issues:
Ninja target: pr84524.c.o
[1892/11529] : && /Users/buildslave/jenkins/workspace/test-suite-verify-machineinstrs-aarch64-O0-g/test-suite-build/tools/timeit --summary SingleSource/Regression/C/gcc-c-torture/execute/GCC-C-execute-pr68376-2.link.time /Users/buildslave/jenkins/workspace/test-suite-verify-machineinstrs-aarch64-O0-g/compiler/bin/clang -B /Applications/Xcode.app/Contents/Developer/Toolchains/XcodeDefault.xctoolchain/usr/bin    -Wno-unused-command-line-argument -mllvm -verify-machineinstrs -O0 -g -arch arm64 -isysroot /Applications/Xcode.app/Contents/Developer/Platforms/iPhoneOS.platform/Developer/SDKs/iPhoneOS13.5.sdk -Wl,-search_paths_first -Wl,-headerpad_max_install_names -B /Applications/Xcode.app/Contents/Developer/Toolchains/XcodeDefault.xctoolchain/usr/bin SingleSource/Regression/C/gcc-c-torture/execute/CMakeFiles/GCC-C-execute-pr68376-2.dir/pr68376-2.c.o  -o SingleSource/Regression/C/gcc-c-torture/execute/GCC-C-execute-pr68376-2   && :
[1893/11529] : && /Users/buildslave/jenkins/workspace/test-suite-verify-machineinstrs-aarch64-O0-g/test-suite-build/tools/timeit --summary SingleSource/Regression/C/gcc-c-torture/execute/GCC-C-execute-pr67714.link.time /Users/buildslave/jenkins/workspace/test-suite-verify-machineinstrs-aarch64-O0-g/compiler/bin/clang -B /Applications/Xcode.app/Contents/Developer/Toolchains/XcodeDefault.xctoolchain/usr/bin    -Wno-unused-command-line-argument -mllvm -verify-machineinstrs -O0 -g -arch arm64 -isysroot /Applications/Xcode.app/Contents/Developer/Platforms/iPhoneOS.platform/Developer/SDKs/iPhoneOS13.5.sdk -Wl,-search_paths_first -Wl,-headerpad_max_install_names -B /Applications/Xcode.app/Contents/Developer/Toolchains/XcodeDefault.xctoolchain/usr/bin SingleSource/Regression/C/gcc-c-torture/execute/CMakeFiles/GCC-C-execute-pr67714.dir/pr67714.c.o  -o SingleSource/Regression/C/gcc-c-torture/execute/GCC-C-execute-pr67714   && :
[1894/11529] : && /Users/buildslave/jenkins/workspace/test-suite-verify-machineinstrs-aarch64-O0-g/test-suite-build/tools/timeit --summary SingleSource/Regression/C/gcc-c-torture/execute/GCC-C-execute-pr67226.link.time /Users/buildslave/jenkins/workspace/test-suite-verify-machineinstrs-aarch64-O0-g/compiler/bin/clang -B /Applications/Xcode.app/Contents/Developer/Toolchains/XcodeDefault.xctoolchain/usr/bin    -Wno-unused-command-line-argument -mllvm -verify-machineinstrs -O0 -g -arch arm64 -isysroot /Applications/Xcode.app/Contents/Developer/Platforms/iPhoneOS.platform/Developer/SDKs/iPhoneOS13.5.sdk -Wl,-search_paths_first -Wl,-headerpad_max_install_names -B /Applications/Xcode.app/Contents/Developer/Toolchains/XcodeDefault.xctoolchain/usr/bin SingleSource/Regression/C/gcc-c-torture/execute/CMakeFiles/GCC-C-execute-pr67226.dir/pr67226.c.o  -o SingleSource/Regression/C/gcc-c-torture/execute/GCC-C-execute-pr67226   && :
[1895/11529] /Users/buildslave/jenkins/workspace/test-suite-verify-machineinstrs-aarch64-O0-g/test-suite-build/tools/timeit --summary SingleSource/Regression/C/gcc-c-torture/execute/CMakeFiles/GCC-C-execute-pr67037.dir/pr67037.c.o.time /Users/buildslave/jenkins/workspace/test-suite-verify-machineinstrs-aarch64-O0-g/compiler/bin/clang -DNDEBUG  -B /Applications/Xcode.app/Contents/Developer/Toolchains/XcodeDefault.xctoolchain/usr/bin    -Wno-unused-command-line-argument -mllvm -verify-machineinstrs -O0 -g -arch arm64 -isysroot /Applications/Xcode.app/Contents/Developer/Platforms/iPhoneOS.platform/Developer/SDKs/iPhoneOS13.5.sdk   -w -Werror=date-time -w -MD -MT SingleSource/Regression/C/gcc-c-torture/execute/CMakeFiles/GCC-C-execute-pr67037.dir/pr67037.c.o -MF SingleSource/Regression/C/gcc-c-torture/execute/CMakeFiles/GCC-C-execute-pr67037.dir/pr67037.c.o.d -o SingleSource/Regression/C/gcc-c-torture/execute/CMakeFiles/GCC-C-execute-pr67037.dir/pr67037.c.o   -c /Users/buildslave/jenkins/workspace/test-suite-verify-machineinstrs-aarch64-O0-g/test-suite/SingleSource/Regression/C/gcc-c-torture/execute/pr67037.c
[1896/11529] /Users/buildslave/jenkins/workspace/test-suite-verify-machineinstrs-aarch64-O0-g/test-suite-build/tools/timeit --summary SingleSource/Regression/C/gcc-c-torture/execute/CMakeFiles/GCC-C-execute-pr84524.dir/pr84524.c.o.time /Users/buildslave/jenkins/workspace/test-suite-verify-machineinstrs-aarch64-O0-g/compiler/bin/clang -DNDEBUG  -B /Applications/Xcode.app/Contents/Developer/Toolchains/XcodeDefault.xctoolchain/usr/bin    -Wno-unused-command-line-argument -mllvm -verify-machineinstrs -O0 -g -arch arm64 -isysroot /Applications/Xcode.app/Contents/Developer/Platforms/iPhoneOS.platform/Developer/SDKs/iPhoneOS13.5.sdk   -w -Werror=date-time -w -MD -MT SingleSource/Regression/C/gcc-c-torture/execute/CMakeFiles/GCC-C-execute-pr84524.dir/pr84524.c.o -MF SingleSource/Regression/C/gcc-c-torture/execute/CMakeFiles/GCC-C-execute-pr84524.dir/pr84524.c.o.d -o SingleSource/Regression/C/gcc-c-torture/execute/CMakeFiles/GCC-C-execute-pr84524.dir/pr84524.c.o   -c /Users/buildslave/jenkins/workspace/test-suite-verify-machineinstrs-aarch64-O0-g/test-suite/SingleSource/Regression/C/gcc-c-torture/execute/pr84524.c
FAILED: SingleSource/Regression/C/gcc-c-torture/execute/CMakeFiles/GCC-C-execute-pr84524.dir/pr84524.c.o 
/Users/buildslave/jenkins/workspace/test-suite-verify-machineinstrs-aarch64-O0-g/test-suite-build/tools/timeit --summary SingleSource/Regression/C/gcc-c-torture/execute/CMakeFiles/GCC-C-execute-pr84524.dir/pr84524.c.o.time /Users/buildslave/jenkins/workspace/test-suite-verify-machineinstrs-aarch64-O0-g/compiler/bin/clang -DNDEBUG  -B /Applications/Xcode.app/Contents/Developer/Toolchains/XcodeDefault.xctoolchain/usr/bin    -Wno-unused-command-line-argument -mllvm -verify-machineinstrs -O0 -g -arch arm64 -isysroot /Applications/Xcode.app/Contents/Developer/Platforms/iPhoneOS.platform/Developer/SDKs/iPhoneOS13.5.sdk   -w -Werror=date-time -w -MD -MT SingleSource/Regression/C/gcc-c-torture/execute/CMakeFiles/GCC-C-execute-pr84524.dir/pr84524.c.o -MF SingleSource/Regression/C/gcc-c-torture/execute/CMakeFiles/GCC-C-execute-pr84524.dir/pr84524.c.o.d -o SingleSource/Regression/C/gcc-c-torture/execute/CMakeFiles/GCC-C-execute-pr84524.dir/pr84524.c.o   -c /Users/buildslave/jenkins/workspace/test-suite-verify-machineinstrs-aarch64-O0-g/test-suite/SingleSource/Regression/C/gcc-c-torture/execute/pr84524.c
Fatal Error: error in backend: Found 1 machine code errors.
*** Bad machine code: Copy Instruction is illegal with mismatching sizes ***
- function:    main
- basic block: %bb.5 for.body4 (0x7fa43382c4a0)
- instruction: %38:gpr32common = COPY %36:_(s16), debug-location !102; test-suite/SingleSource/Regression/C/gcc-c-torture/execute/pr84524.c:31:4
Def Size = 32, Src Size = 16
fatal error: error in backend: Found 1 machine code errors.
PLEASE submit a bug report to https://bugs.llvm.org/ and include the crash backtrace, preprocessed source, and associated run script.
Stack dump:
Error: clang frontend command failed with exit code 70 (use -v to see invocation)
25 clang         0x00000001088ae7dd clang::driver::Compilation::ExecuteJobs(clang::driver::JobList const&, llvm::SmallVectorImpl<std::__1::pair<int, clang::driver::Command const*> >&) const + 125
26 clang         0x00000001088c2a8c clang::driver::Driver::ExecuteCompilation(clang::driver::Compilation&, llvm::SmallVectorImpl<std::__1::pair<int, clang::driver::Command const*> >&) + 204
27 clang         0x000000010645ebf5 main + 10389
28 libdyld.dylib 0x00007fff696f7cc9 start + 1
29 libdyld.dylib 0x0000000000000019 start + 18446603338747249489
clang-11: error: clang frontend command failed with exit code 70 (use -v to see invocation)
clang version 11.0.0 (https://github.com/llvm/llvm-project.git 47c4ce41a16412efe49da1715be3144861cbf50a)
Target: aarch64-apple-darwin19.5.0

Build Log

Changes
  1. [MC] Simplify the logic of applying fixup for fragments, NFCI (details)
  2. [CodeGen] Matching promoted type for 16-bit integer bitcasts from fp16 operand (details)
  3. [PredicateInfo] Add additional RenamedOp field to PB. (details)
  4. [clangd] Enable async preambles by default (details)
  5. [llvm-objdump] Display locations of variables alongside disassembly (details)
  6. Correctly update return status for MVEGatherScatterLowering (details)
  7. [mlir] Add additional Canonicalization of shape.cstr_broadcastable. (details)
  8. [yaml][clang-tidy] Fix multiline YAML serialization (details)
  9. VersionPrinter - use const auto& iterator in for-range-loop. (details)
  10. Fix MSVC "not all control paths return a value" warning. NFC. (details)
  11. ConstantFoldScalarCall3 - use const APInt& returned by getValue() (details)
  12. [Coroutines] Refactor sinkLifetimeStartMarkers (details)
  13. [change-namespace][NFC] Clean up joinNamespaces (details)
  14. DebugCounterList::printOptionInfo - use const auto& iterator in for-range-loop. (details)
  15. [llvm-readelf] - Stop using 'unwrapOrError()' in 'ELFDumper<ELFT>::getSymbolVersion'. (details)
  16. [SVE] Disable some BUILD_VECTOR related code generator features. (details)
  17. [SVE] Scalarize fixed length masked loads and stores. (details)
  18. [DWARFYAML] Use override instead of virtual for better safety. (details)

Started by upstream project relay-test-suite-verify-machineinstrs build number 8339
originally caused by:

This run spent:

  • 1 hr 56 min waiting;
  • 2 hr 14 min build duration;
  • 2 hr 14 min total from scheduled to completion.
Revision: 26fab8ff789d7386ca0944bbb367f04715386d71
  • refs/remotes/origin/master
Revision: 47c4ce41a16412efe49da1715be3144861cbf50a
  • detached
Revision: 53229320df0e57a7b779a3dcded72fc9e6d44e01
  • refs/remotes/origin/master
Revision: 879f4962e83f98863c83e385e956d579e131791f
  • refs/remotes/origin/master

Identified problems

Compile Error

This build failed because of a compile error. Below is a list of all errors in the build log:
Indication 1

Ninja target failed

Below is a link to the first failed ninja target.
Indication 2