Started 2 mo 4 days ago
Took 1 hr 9 min

Failed Build clang-d332381-g9f3fdb0d7fa-t3945-b3945.tar.gz (Nov 21, 2019 3:18:22 AM)

Issues

Found 10 issues:
Ninja target: aarch64_neon_intrinsics.c.o
[8574/8583] /Users/buildslave/jenkins/workspace/test-suite-verify-machineinstrs-aarch64-O3/test-suite-build/tools/timeit --summary SingleSource/UnitTests/ObjC/CMakeFiles/for-in.dir/for-in.m.o.time /Users/buildslave/jenkins/workspace/test-suite-verify-machineinstrs-aarch64-O3/compiler/bin/clang -DNDEBUG  -B /Applications/Xcode.app/Contents/Developer/Toolchains/XcodeDefault.xctoolchain/usr/bin    -Wno-unused-command-line-argument -mllvm -verify-machineinstrs -O3 -arch arm64 -isysroot /Applications/Xcode.app/Contents/Developer/Platforms/iPhoneOS.platform/Developer/SDKs/iPhoneOS12.1.sdk   -w -Werror=date-time -MD -MT SingleSource/UnitTests/ObjC/CMakeFiles/for-in.dir/for-in.m.o -MF SingleSource/UnitTests/ObjC/CMakeFiles/for-in.dir/for-in.m.o.d -o SingleSource/UnitTests/ObjC/CMakeFiles/for-in.dir/for-in.m.o   -c /Users/buildslave/jenkins/workspace/test-suite-verify-machineinstrs-aarch64-O3/test-suite/SingleSource/UnitTests/ObjC/for-in.m
[8575/8583] : && /Users/buildslave/jenkins/workspace/test-suite-verify-machineinstrs-aarch64-O3/test-suite-build/tools/timeit --summary SingleSource/UnitTests/ObjC/for-in.link.time /Users/buildslave/jenkins/workspace/test-suite-verify-machineinstrs-aarch64-O3/compiler/bin/clang -B /Applications/Xcode.app/Contents/Developer/Toolchains/XcodeDefault.xctoolchain/usr/bin    -Wno-unused-command-line-argument -mllvm -verify-machineinstrs -O3 -arch arm64 -isysroot /Applications/Xcode.app/Contents/Developer/Platforms/iPhoneOS.platform/Developer/SDKs/iPhoneOS12.1.sdk -Wl,-search_paths_first -Wl,-headerpad_max_install_names -B /Applications/Xcode.app/Contents/Developer/Toolchains/XcodeDefault.xctoolchain/usr/bin SingleSource/UnitTests/ObjC/CMakeFiles/for-in.dir/for-in.m.o  -o SingleSource/UnitTests/ObjC/for-in  -lobjc -framework Foundation && cd /Users/buildslave/jenkins/workspace/test-suite-verify-machineinstrs-aarch64-O3/test-suite-build/SingleSource/UnitTests/ObjC && /usr/local/Cellar/cmake/3.13.1/bin/cmake -E create_symlink /Users/buildslave/jenkins/workspace/test-suite-verify-machineinstrs-aarch64-O3/test-suite/SingleSource/UnitTests/ObjC/for-in.reference_output /Users/buildslave/jenkins/workspace/test-suite-verify-machineinstrs-aarch64-O3/test-suite-build/SingleSource/UnitTests/ObjC/for-in.reference_output
[8576/8583] /Users/buildslave/jenkins/workspace/test-suite-verify-machineinstrs-aarch64-O3/test-suite-build/tools/timeit --summary SingleSource/UnitTests/Vectorizer/CMakeFiles/gcc-loops.dir/gcc-loops.cpp.o.time /Users/buildslave/jenkins/workspace/test-suite-verify-machineinstrs-aarch64-O3/compiler/bin/clang++  -DNDEBUG  -B /Applications/Xcode.app/Contents/Developer/Toolchains/XcodeDefault.xctoolchain/usr/bin    -Wno-unused-command-line-argument -mllvm -verify-machineinstrs -O3 -arch arm64 -isysroot /Applications/Xcode.app/Contents/Developer/Platforms/iPhoneOS.platform/Developer/SDKs/iPhoneOS12.1.sdk   -w -Werror=date-time -MD -MT SingleSource/UnitTests/Vectorizer/CMakeFiles/gcc-loops.dir/gcc-loops.cpp.o -MF SingleSource/UnitTests/Vectorizer/CMakeFiles/gcc-loops.dir/gcc-loops.cpp.o.d -o SingleSource/UnitTests/Vectorizer/CMakeFiles/gcc-loops.dir/gcc-loops.cpp.o -c /Users/buildslave/jenkins/workspace/test-suite-verify-machineinstrs-aarch64-O3/test-suite/SingleSource/UnitTests/Vectorizer/gcc-loops.cpp
[8577/8583] : && /Users/buildslave/jenkins/workspace/test-suite-verify-machineinstrs-aarch64-O3/test-suite-build/tools/timeit --summary SingleSource/UnitTests/Vectorizer/gcc-loops.link.time /Users/buildslave/jenkins/workspace/test-suite-verify-machineinstrs-aarch64-O3/compiler/bin/clang++  -B /Applications/Xcode.app/Contents/Developer/Toolchains/XcodeDefault.xctoolchain/usr/bin    -Wno-unused-command-line-argument -mllvm -verify-machineinstrs -O3 -arch arm64 -isysroot /Applications/Xcode.app/Contents/Developer/Platforms/iPhoneOS.platform/Developer/SDKs/iPhoneOS12.1.sdk -Wl,-search_paths_first -Wl,-headerpad_max_install_names -B /Applications/Xcode.app/Contents/Developer/Toolchains/XcodeDefault.xctoolchain/usr/bin SingleSource/UnitTests/Vectorizer/CMakeFiles/gcc-loops.dir/gcc-loops.cpp.o  -o SingleSource/UnitTests/Vectorizer/gcc-loops  -lstdc++ && cd /Users/buildslave/jenkins/workspace/test-suite-verify-machineinstrs-aarch64-O3/test-suite-build/SingleSource/UnitTests/Vectorizer && /usr/local/Cellar/cmake/3.13.1/bin/cmake -E create_symlink /Users/buildslave/jenkins/workspace/test-suite-verify-machineinstrs-aarch64-O3/test-suite/SingleSource/UnitTests/Vectorizer/gcc-loops.reference_output.little-endian /Users/buildslave/jenkins/workspace/test-suite-verify-machineinstrs-aarch64-O3/test-suite-build/SingleSource/UnitTests/Vectorizer/gcc-loops.reference_output.little-endian
[8578/8583] /Users/buildslave/jenkins/workspace/test-suite-verify-machineinstrs-aarch64-O3/test-suite-build/tools/timeit --summary SingleSource/UnitTests/Vector/AArch64/CMakeFiles/aarch64_neon_intrinsics.dir/aarch64_neon_intrinsics.c.o.time /Users/buildslave/jenkins/workspace/test-suite-verify-machineinstrs-aarch64-O3/compiler/bin/clang -DNDEBUG  -B /Applications/Xcode.app/Contents/Developer/Toolchains/XcodeDefault.xctoolchain/usr/bin    -Wno-unused-command-line-argument -mllvm -verify-machineinstrs -O3 -arch arm64 -isysroot /Applications/Xcode.app/Contents/Developer/Platforms/iPhoneOS.platform/Developer/SDKs/iPhoneOS12.1.sdk   -w -Werror=date-time -std=c99 -MD -MT SingleSource/UnitTests/Vector/AArch64/CMakeFiles/aarch64_neon_intrinsics.dir/aarch64_neon_intrinsics.c.o -MF SingleSource/UnitTests/Vector/AArch64/CMakeFiles/aarch64_neon_intrinsics.dir/aarch64_neon_intrinsics.c.o.d -o SingleSource/UnitTests/Vector/AArch64/CMakeFiles/aarch64_neon_intrinsics.dir/aarch64_neon_intrinsics.c.o   -c /Users/buildslave/jenkins/workspace/test-suite-verify-machineinstrs-aarch64-O3/test-suite/SingleSource/UnitTests/Vector/AArch64/aarch64_neon_intrinsics.c
FAILED: SingleSource/UnitTests/Vector/AArch64/CMakeFiles/aarch64_neon_intrinsics.dir/aarch64_neon_intrinsics.c.o 
/Users/buildslave/jenkins/workspace/test-suite-verify-machineinstrs-aarch64-O3/test-suite-build/tools/timeit --summary SingleSource/UnitTests/Vector/AArch64/CMakeFiles/aarch64_neon_intrinsics.dir/aarch64_neon_intrinsics.c.o.time /Users/buildslave/jenkins/workspace/test-suite-verify-machineinstrs-aarch64-O3/compiler/bin/clang -DNDEBUG  -B /Applications/Xcode.app/Contents/Developer/Toolchains/XcodeDefault.xctoolchain/usr/bin    -Wno-unused-command-line-argument -mllvm -verify-machineinstrs -O3 -arch arm64 -isysroot /Applications/Xcode.app/Contents/Developer/Platforms/iPhoneOS.platform/Developer/SDKs/iPhoneOS12.1.sdk   -w -Werror=date-time -std=c99 -MD -MT SingleSource/UnitTests/Vector/AArch64/CMakeFiles/aarch64_neon_intrinsics.dir/aarch64_neon_intrinsics.c.o -MF SingleSource/UnitTests/Vector/AArch64/CMakeFiles/aarch64_neon_intrinsics.dir/aarch64_neon_intrinsics.c.o.d -o SingleSource/UnitTests/Vector/AArch64/CMakeFiles/aarch64_neon_intrinsics.dir/aarch64_neon_intrinsics.c.o   -c /Users/buildslave/jenkins/workspace/test-suite-verify-machineinstrs-aarch64-O3/test-suite/SingleSource/UnitTests/Vector/AArch64/aarch64_neon_intrinsics.c
/Users/buildslave/jenkins/workspace/test-suite-verify-machineinstrs-aarch64-O3/test-suite/SingleSource/UnitTests/Vector/AArch64/aarch64_neon_intrinsics.c:37433:27: error: invalid conversion between vector type 'int32x2_t' (vector of 2 'int32_t' values) and integer type 'int' of different size
aarch64_neon_intrinsics.c error: invalid conversion between vector type 'int32x2_t' (vector of 2 'int32_t' values) and integer type 'int' of different size
[8576/8583] /Users/buildslave/jenkins/workspace/test-suite-verify-machineinstrs-aarch64-O3/test-suite-build/tools/timeit --summary SingleSource/UnitTests/Vectorizer/CMakeFiles/gcc-loops.dir/gcc-loops.cpp.o.time /Users/buildslave/jenkins/workspace/test-suite-verify-machineinstrs-aarch64-O3/compiler/bin/clang++  -DNDEBUG  -B /Applications/Xcode.app/Contents/Developer/Toolchains/XcodeDefault.xctoolchain/usr/bin    -Wno-unused-command-line-argument -mllvm -verify-machineinstrs -O3 -arch arm64 -isysroot /Applications/Xcode.app/Contents/Developer/Platforms/iPhoneOS.platform/Developer/SDKs/iPhoneOS12.1.sdk   -w -Werror=date-time -MD -MT SingleSource/UnitTests/Vectorizer/CMakeFiles/gcc-loops.dir/gcc-loops.cpp.o -MF SingleSource/UnitTests/Vectorizer/CMakeFiles/gcc-loops.dir/gcc-loops.cpp.o.d -o SingleSource/UnitTests/Vectorizer/CMakeFiles/gcc-loops.dir/gcc-loops.cpp.o -c /Users/buildslave/jenkins/workspace/test-suite-verify-machineinstrs-aarch64-O3/test-suite/SingleSource/UnitTests/Vectorizer/gcc-loops.cpp
[8577/8583] : && /Users/buildslave/jenkins/workspace/test-suite-verify-machineinstrs-aarch64-O3/test-suite-build/tools/timeit --summary SingleSource/UnitTests/Vectorizer/gcc-loops.link.time /Users/buildslave/jenkins/workspace/test-suite-verify-machineinstrs-aarch64-O3/compiler/bin/clang++  -B /Applications/Xcode.app/Contents/Developer/Toolchains/XcodeDefault.xctoolchain/usr/bin    -Wno-unused-command-line-argument -mllvm -verify-machineinstrs -O3 -arch arm64 -isysroot /Applications/Xcode.app/Contents/Developer/Platforms/iPhoneOS.platform/Developer/SDKs/iPhoneOS12.1.sdk -Wl,-search_paths_first -Wl,-headerpad_max_install_names -B /Applications/Xcode.app/Contents/Developer/Toolchains/XcodeDefault.xctoolchain/usr/bin SingleSource/UnitTests/Vectorizer/CMakeFiles/gcc-loops.dir/gcc-loops.cpp.o  -o SingleSource/UnitTests/Vectorizer/gcc-loops  -lstdc++ && cd /Users/buildslave/jenkins/workspace/test-suite-verify-machineinstrs-aarch64-O3/test-suite-build/SingleSource/UnitTests/Vectorizer && /usr/local/Cellar/cmake/3.13.1/bin/cmake -E create_symlink /Users/buildslave/jenkins/workspace/test-suite-verify-machineinstrs-aarch64-O3/test-suite/SingleSource/UnitTests/Vectorizer/gcc-loops.reference_output.little-endian /Users/buildslave/jenkins/workspace/test-suite-verify-machineinstrs-aarch64-O3/test-suite-build/SingleSource/UnitTests/Vectorizer/gcc-loops.reference_output.little-endian
[8578/8583] /Users/buildslave/jenkins/workspace/test-suite-verify-machineinstrs-aarch64-O3/test-suite-build/tools/timeit --summary SingleSource/UnitTests/Vector/AArch64/CMakeFiles/aarch64_neon_intrinsics.dir/aarch64_neon_intrinsics.c.o.time /Users/buildslave/jenkins/workspace/test-suite-verify-machineinstrs-aarch64-O3/compiler/bin/clang -DNDEBUG  -B /Applications/Xcode.app/Contents/Developer/Toolchains/XcodeDefault.xctoolchain/usr/bin    -Wno-unused-command-line-argument -mllvm -verify-machineinstrs -O3 -arch arm64 -isysroot /Applications/Xcode.app/Contents/Developer/Platforms/iPhoneOS.platform/Developer/SDKs/iPhoneOS12.1.sdk   -w -Werror=date-time -std=c99 -MD -MT SingleSource/UnitTests/Vector/AArch64/CMakeFiles/aarch64_neon_intrinsics.dir/aarch64_neon_intrinsics.c.o -MF SingleSource/UnitTests/Vector/AArch64/CMakeFiles/aarch64_neon_intrinsics.dir/aarch64_neon_intrinsics.c.o.d -o SingleSource/UnitTests/Vector/AArch64/CMakeFiles/aarch64_neon_intrinsics.dir/aarch64_neon_intrinsics.c.o   -c /Users/buildslave/jenkins/workspace/test-suite-verify-machineinstrs-aarch64-O3/test-suite/SingleSource/UnitTests/Vector/AArch64/aarch64_neon_intrinsics.c
FAILED: SingleSource/UnitTests/Vector/AArch64/CMakeFiles/aarch64_neon_intrinsics.dir/aarch64_neon_intrinsics.c.o 
/Users/buildslave/jenkins/workspace/test-suite-verify-machineinstrs-aarch64-O3/test-suite-build/tools/timeit --summary SingleSource/UnitTests/Vector/AArch64/CMakeFiles/aarch64_neon_intrinsics.dir/aarch64_neon_intrinsics.c.o.time /Users/buildslave/jenkins/workspace/test-suite-verify-machineinstrs-aarch64-O3/compiler/bin/clang -DNDEBUG  -B /Applications/Xcode.app/Contents/Developer/Toolchains/XcodeDefault.xctoolchain/usr/bin    -Wno-unused-command-line-argument -mllvm -verify-machineinstrs -O3 -arch arm64 -isysroot /Applications/Xcode.app/Contents/Developer/Platforms/iPhoneOS.platform/Developer/SDKs/iPhoneOS12.1.sdk   -w -Werror=date-time -std=c99 -MD -MT SingleSource/UnitTests/Vector/AArch64/CMakeFiles/aarch64_neon_intrinsics.dir/aarch64_neon_intrinsics.c.o -MF SingleSource/UnitTests/Vector/AArch64/CMakeFiles/aarch64_neon_intrinsics.dir/aarch64_neon_intrinsics.c.o.d -o SingleSource/UnitTests/Vector/AArch64/CMakeFiles/aarch64_neon_intrinsics.dir/aarch64_neon_intrinsics.c.o   -c /Users/buildslave/jenkins/workspace/test-suite-verify-machineinstrs-aarch64-O3/test-suite/SingleSource/UnitTests/Vector/AArch64/aarch64_neon_intrinsics.c
/Users/buildslave/jenkins/workspace/test-suite-verify-machineinstrs-aarch64-O3/test-suite/SingleSource/UnitTests/Vector/AArch64/aarch64_neon_intrinsics.c:37433:27: error: invalid conversion between vector type 'int32x2_t' (vector of 2 'int32_t' values) and integer type 'int' of different size
      arg2 = vcombine_s32(vcreate_s32(0),
                          ^~~~~~~~~~~~~~
aarch64_neon_intrinsics.c error: invalid conversion between vector type 'int32x2_t' (vector of 2 'int32_t' values) and integer type 'int' of different size
      arg2 = vcombine_s32(vcreate_s32(0),
                          ^~~~~~~~~~~~~~
/Users/buildslave/jenkins/workspace/test-suite-verify-machineinstrs-aarch64-O3/compiler/lib/clang/10.0.0/include/arm_neon.h:4169:11: note: expanded from macro 'vcreate_s32'
  __ret = (int32x2_t)(__p0); \
          ^~~~~~~~~~~~~~~~~
/Users/buildslave/jenkins/workspace/test-suite-verify-machineinstrs-aarch64-O3/test-suite/SingleSource/UnitTests/Vector/AArch64/aarch64_neon_intrinsics.c:43129:27: error: invalid conversion between vector type 'int32x2_t' (vector of 2 'int32_t' values) and integer type 'int' of different size
                          vcreate_s32(0));
                          ^~~~~~~~~~~~~~
aarch64_neon_intrinsics.c error: invalid conversion between vector type 'uint16x4_t' (vector of 4 'uint16_t' values) and integer type 'int' of different size
                          vcreate_s32(0));
                          ^~~~~~~~~~~~~~
/Users/buildslave/jenkins/workspace/test-suite-verify-machineinstrs-aarch64-O3/compiler/lib/clang/10.0.0/include/arm_neon.h:4169:11: note: expanded from macro 'vcreate_s32'
  __ret = (int32x2_t)(__p0); \
          ^~~~~~~~~~~~~~~~~
/Users/buildslave/jenkins/workspace/test-suite-verify-machineinstrs-aarch64-O3/test-suite/SingleSource/UnitTests/Vector/AArch64/aarch64_neon_intrinsics.c:44230:14: error: invalid conversion between vector type 'uint16x4_t' (vector of 4 'uint16_t' values) and integer type 'int' of different size
      arg2 = vcreate_u16(0);
             ^~~~~~~~~~~~~~
aarch64_neon_intrinsics.c error: invalid conversion between vector type 'int16x4_t' (vector of 4 'int16_t' values) and integer type 'int' of different size
      arg2 = vcreate_u16(0);
             ^~~~~~~~~~~~~~
/Users/buildslave/jenkins/workspace/test-suite-verify-machineinstrs-aarch64-O3/compiler/lib/clang/10.0.0/include/arm_neon.h:4149:11: note: expanded from macro 'vcreate_u16'
  __ret = (uint16x4_t)(__p0); \
          ^~~~~~~~~~~~~~~~~~
/Users/buildslave/jenkins/workspace/test-suite-verify-machineinstrs-aarch64-O3/test-suite/SingleSource/UnitTests/Vector/AArch64/aarch64_neon_intrinsics.c:62891:27: error: invalid conversion between vector type 'int16x4_t' (vector of 4 'int16_t' values) and integer type 'int' of different size
                          vcreate_s16(0));
                          ^~~~~~~~~~~~~~
aarch64_neon_intrinsics.c error: invalid conversion between vector type 'int32x2_t' (vector of 2 'int32_t' values) and integer type 'int' of different size
                          vcreate_s16(0));
                          ^~~~~~~~~~~~~~
/Users/buildslave/jenkins/workspace/test-suite-verify-machineinstrs-aarch64-O3/compiler/lib/clang/10.0.0/include/arm_neon.h:4179:11: note: expanded from macro 'vcreate_s16'
  __ret = (int16x4_t)(__p0); \
          ^~~~~~~~~~~~~~~~~
/Users/buildslave/jenkins/workspace/test-suite-verify-machineinstrs-aarch64-O3/test-suite/SingleSource/UnitTests/Vector/AArch64/aarch64_neon_intrinsics.c:107308:34: error: invalid conversion between vector type 'int32x2_t' (vector of 2 'int32_t' values) and integer type 'int' of different size
      arg2.val[0] = vcombine_s32(vcreate_s32(0),
                                 ^~~~~~~~~~~~~~
aarch64_neon_intrinsics.c error: invalid conversion between vector type 'uint32x2_t' (vector of 2 'uint32_t' values) and integer type 'int' of different size
      arg2.val[0] = vcombine_s32(vcreate_s32(0),
                                 ^~~~~~~~~~~~~~
/Users/buildslave/jenkins/workspace/test-suite-verify-machineinstrs-aarch64-O3/compiler/lib/clang/10.0.0/include/arm_neon.h:4169:11: note: expanded from macro 'vcreate_s32'
  __ret = (int32x2_t)(__p0); \
          ^~~~~~~~~~~~~~~~~
/Users/buildslave/jenkins/workspace/test-suite-verify-machineinstrs-aarch64-O3/test-suite/SingleSource/UnitTests/Vector/AArch64/aarch64_neon_intrinsics.c:174263:27: error: invalid conversion between vector type 'uint32x2_t' (vector of 2 'uint32_t' values) and integer type 'int' of different size
                          vcreate_u32(0));
                          ^~~~~~~~~~~~~~
aarch64_neon_intrinsics.c error: invalid conversion between vector type 'int32x2_t' (vector of 2 'int32_t' values) and integer type 'int' of different size
                          vcreate_u32(0));
                          ^~~~~~~~~~~~~~
/Users/buildslave/jenkins/workspace/test-suite-verify-machineinstrs-aarch64-O3/compiler/lib/clang/10.0.0/include/arm_neon.h:4139:11: note: expanded from macro 'vcreate_u32'
  __ret = (uint32x2_t)(__p0); \
          ^~~~~~~~~~~~~~~~~~
/Users/buildslave/jenkins/workspace/test-suite-verify-machineinstrs-aarch64-O3/test-suite/SingleSource/UnitTests/Vector/AArch64/aarch64_neon_intrinsics.c:175191:27: error: invalid conversion between vector type 'int32x2_t' (vector of 2 'int32_t' values) and integer type 'int' of different size
      arg1 = vcombine_s32(vcreate_s32(0),
                          ^~~~~~~~~~~~~~
aarch64_neon_intrinsics.c error: invalid conversion between vector type 'int32x2_t' (vector of 2 'int32_t' values) and integer type 'int' of different size
      arg1 = vcombine_s32(vcreate_s32(0),
                          ^~~~~~~~~~~~~~
/Users/buildslave/jenkins/workspace/test-suite-verify-machineinstrs-aarch64-O3/compiler/lib/clang/10.0.0/include/arm_neon.h:4169:11: note: expanded from macro 'vcreate_s32'
  __ret = (int32x2_t)(__p0); \
          ^~~~~~~~~~~~~~~~~
/Users/buildslave/jenkins/workspace/test-suite-verify-machineinstrs-aarch64-O3/test-suite/SingleSource/UnitTests/Vector/AArch64/aarch64_neon_intrinsics.c:176993:27: error: invalid conversion between vector type 'int32x2_t' (vector of 2 'int32_t' values) and integer type 'int' of different size
                          vcreate_s32(0));
                          ^~~~~~~~~~~~~~
aarch64_neon_intrinsics.c error: invalid conversion between vector type 'uint16x4_t' (vector of 4 'uint16_t' values) and integer type 'int' of different size
                          vcreate_s32(0));
                          ^~~~~~~~~~~~~~
/Users/buildslave/jenkins/workspace/test-suite-verify-machineinstrs-aarch64-O3/compiler/lib/clang/10.0.0/include/arm_neon.h:4169:11: note: expanded from macro 'vcreate_s32'
  __ret = (int32x2_t)(__p0); \
          ^~~~~~~~~~~~~~~~~
/Users/buildslave/jenkins/workspace/test-suite-verify-machineinstrs-aarch64-O3/test-suite/SingleSource/UnitTests/Vector/AArch64/aarch64_neon_intrinsics.c:210780:27: error: invalid conversion between vector type 'uint16x4_t' (vector of 4 'uint16_t' values) and integer type 'int' of different size
      arg1 = vcombine_u16(vcreate_u16(0),
                          ^~~~~~~~~~~~~~

Build Log

Changes
  1. [clangd] Reland b5135a86e0476: Fix a crash in expected types (detail)
  2. [libcxx] Add Sergej Jaskiewicz to CREDITS.txt (detail)
  3. [RISCV] Support mutilib in baremetal environment (detail)
  4. [Support] Don't check XCR0 when detecting avx512 on Darwin. (detail)
  5. [compiler-rt] Don't check XCR0 when detecting avx512 on Darwin. (detail)
  6. [lldb][NFC] Early exit in (detail)
  7. [DebugInfo] Refactor DIExpression [SZ]Ext creation into function [NFC] (detail)
  8. [AMDGPU] Add attribute for target loop unroll threshold default (detail)
  9. [Driver] Use VFS to check if sanitizer blacklists exist (detail)
  10. [lldb][NFC] Move searching for the local variable namespace into own (detail)
  11. [COFF] Widen PE32Header fields to fit 64 bit versions (detail)
  12. Revert "[Driver] Use VFS to check if sanitizer blacklists exist" (detail)

Started by upstream project relay-test-suite-verify-machineinstrs build number 6738
originally caused by:

This run spent:

  • 5.2 sec waiting;
  • 1 hr 9 min build duration;
  • 1 hr 10 min total from scheduled to completion.
Revision: 9f3fdb0d7fab73083e354768eb5808597474e1b8
  • detached

Identified problems

Ninja target failed

Below is a link to the first failed ninja target.
Indication 1

Compile Error

This build failed because of a compile error. Below is a list of all errors in the build log:
Indication 2