Started 1 mo 27 days ago
Took 1 hr 32 min

Failed Build clang-d346782-ge1fb9d53727-t8141-b8141.tar.gz (Mar 31, 2020 2:41:27 PM)

Issues

Found 348 issues:
Fatal Error: error in backend: Found 1 machine code errors.
- function:    _Z22defineLoopSuiteRunInfoRKNSt3__16vectorI13LoopVariantIDNS_9allocatorIS1_EEEEPbdd
- basic block: %bb.260 if.then88 (0x7f84a42d0288)
- instruction: early-clobber %2752:gpr64, early-clobber %2753:gpr64sp = JumpTableDest32 %267:gpr64, %263:gpr64sp, %jump-table.0
- operand 3:   %263:gpr64sp
Expected a GPR64 register, but got a GPR64sp register
fatal error: error in backend: Found 1 machine code errors.
PLEASE submit a bug report to https://bugs.llvm.org/ and include the crash backtrace, preprocessed source, and associated run script.
Stack dump:
Error: clang frontend command failed with exit code 70 (use -v to see invocation)
25 clang++       0x0000000107edc1bb clang::driver::Compilation::ExecuteJobs(clang::driver::JobList const&, llvm::SmallVectorImpl<std::__1::pair<int, clang::driver::Command const*> >&) const + 107
26 clang++       0x0000000107eeffbb clang::driver::Driver::ExecuteCompilation(clang::driver::Compilation&, llvm::SmallVectorImpl<std::__1::pair<int, clang::driver::Command const*> >&) + 203
27 clang++       0x0000000105a11495 main + 10917
28 libdyld.dylib 0x00007fff4ffd9015 start + 1
29 libdyld.dylib 0x000000000000001f start + 18446603339174146059
clang-11: error: clang frontend command failed with exit code 70 (use -v to see invocation)
clang version 11.0.0 (https://github.com/llvm/llvm-project.git e1fb9d53727f379be7930e8d8bb24c3c7da2f12a)
Target: aarch64-apple-darwin17.6.0
Fatal Error: error in backend: Found 1 machine code errors.
- function:    _Z22defineLoopSuiteRunInfoRKNSt3__16vectorI13LoopVariantIDNS_9allocatorIS1_EEEEPbdd
- basic block: %bb.260 if.then88 (0x7fa726ad5888)
- instruction: early-clobber %2752:gpr64, early-clobber %2753:gpr64sp = JumpTableDest32 %267:gpr64, %263:gpr64sp, %jump-table.0
- operand 3:   %263:gpr64sp
Expected a GPR64 register, but got a GPR64sp register
fatal error: error in backend: Found 1 machine code errors.
PLEASE submit a bug report to https://bugs.llvm.org/ and include the crash backtrace, preprocessed source, and associated run script.
Stack dump:
Error: clang frontend command failed with exit code 70 (use -v to see invocation)
25 clang++       0x0000000102d601bb clang::driver::Compilation::ExecuteJobs(clang::driver::JobList const&, llvm::SmallVectorImpl<std::__1::pair<int, clang::driver::Command const*> >&) const + 107
26 clang++       0x0000000102d73fbb clang::driver::Driver::ExecuteCompilation(clang::driver::Compilation&, llvm::SmallVectorImpl<std::__1::pair<int, clang::driver::Command const*> >&) + 203
27 clang++       0x0000000100895495 main + 10917
28 libdyld.dylib 0x00007fff4ffd9015 start + 1
29 libdyld.dylib 0x000000000000001f start + 18446603339174146059
clang-11: error: clang frontend command failed with exit code 70 (use -v to see invocation)
clang version 11.0.0 (https://github.com/llvm/llvm-project.git e1fb9d53727f379be7930e8d8bb24c3c7da2f12a)
Target: aarch64-apple-darwin17.6.0
Fatal Error: error in backend: Found 1 machine code errors.
- function:    _Z22defineLoopSuiteRunInfoRKNSt3__16vectorI13LoopVariantIDNS_9allocatorIS1_EEEEPbdd
- basic block: %bb.260 if.then88 (0x7fd68a2ea288)
- instruction: early-clobber %2752:gpr64, early-clobber %2753:gpr64sp = JumpTableDest32 %267:gpr64, %263:gpr64sp, %jump-table.0
- operand 3:   %263:gpr64sp
Expected a GPR64 register, but got a GPR64sp register
fatal error: error in backend: Found 1 machine code errors.
PLEASE submit a bug report to https://bugs.llvm.org/ and include the crash backtrace, preprocessed source, and associated run script.
Stack dump:
Error: clang frontend command failed with exit code 70 (use -v to see invocation)
25 clang++       0x000000010e50c1bb clang::driver::Compilation::ExecuteJobs(clang::driver::JobList const&, llvm::SmallVectorImpl<std::__1::pair<int, clang::driver::Command const*> >&) const + 107
26 clang++       0x000000010e51ffbb clang::driver::Driver::ExecuteCompilation(clang::driver::Compilation&, llvm::SmallVectorImpl<std::__1::pair<int, clang::driver::Command const*> >&) + 203
27 clang++       0x000000010c041495 main + 10917
28 libdyld.dylib 0x00007fff4ffd9015 start + 1
29 libdyld.dylib 0x000000000000001f start + 18446603339174146059
clang-11: error: clang frontend command failed with exit code 70 (use -v to see invocation)
clang version 11.0.0 (https://github.com/llvm/llvm-project.git e1fb9d53727f379be7930e8d8bb24c3c7da2f12a)
Target: aarch64-apple-darwin17.6.0
Fatal Error: error in backend: Found 1 machine code errors.
- function:    _Z22defineLoopSuiteRunInfoRKNSt3__16vectorI13LoopVariantIDNS_9allocatorIS1_EEEEPbdd
- basic block: %bb.260 if.then88 (0x7ffce4af4688)
- instruction: early-clobber %2752:gpr64, early-clobber %2753:gpr64sp = JumpTableDest32 %267:gpr64, %263:gpr64sp, %jump-table.0
- operand 3:   %263:gpr64sp
Expected a GPR64 register, but got a GPR64sp register
fatal error: error in backend: Found 1 machine code errors.
PLEASE submit a bug report to https://bugs.llvm.org/ and include the crash backtrace, preprocessed source, and associated run script.
Stack dump:
Error: clang frontend command failed with exit code 70 (use -v to see invocation)
25 clang++       0x0000000110c9b1bb clang::driver::Compilation::ExecuteJobs(clang::driver::JobList const&, llvm::SmallVectorImpl<std::__1::pair<int, clang::driver::Command const*> >&) const + 107
26 clang++       0x0000000110caefbb clang::driver::Driver::ExecuteCompilation(clang::driver::Compilation&, llvm::SmallVectorImpl<std::__1::pair<int, clang::driver::Command const*> >&) + 203
27 clang++       0x000000010e7d0495 main + 10917
28 libdyld.dylib 0x00007fff4ffd9015 start + 1
29 libdyld.dylib 0x000000000000001f start + 18446603339174146059
clang-11: error: clang frontend command failed with exit code 70 (use -v to see invocation)
clang version 11.0.0 (https://github.com/llvm/llvm-project.git e1fb9d53727f379be7930e8d8bb24c3c7da2f12a)
Target: aarch64-apple-darwin17.6.0
Fatal Error: error in backend: Found 1 machine code errors.
- function:    _Z22defineLoopSuiteRunInfoRKNSt3__16vectorI13LoopVariantIDNS_9allocatorIS1_EEEEPbdd
- basic block: %bb.260 if.then88 (0x7fc8fbc23c88)
- instruction: early-clobber %2752:gpr64, early-clobber %2753:gpr64sp = JumpTableDest32 %267:gpr64, %263:gpr64sp, %jump-table.0
- operand 3:   %263:gpr64sp
Expected a GPR64 register, but got a GPR64sp register
fatal error: error in backend: Found 1 machine code errors.
PLEASE submit a bug report to https://bugs.llvm.org/ and include the crash backtrace, preprocessed source, and associated run script.
Stack dump:
Error: clang frontend command failed with exit code 70 (use -v to see invocation)
25 clang++       0x0000000102d2d1bb clang::driver::Compilation::ExecuteJobs(clang::driver::JobList const&, llvm::SmallVectorImpl<std::__1::pair<int, clang::driver::Command const*> >&) const + 107
26 clang++       0x0000000102d40fbb clang::driver::Driver::ExecuteCompilation(clang::driver::Compilation&, llvm::SmallVectorImpl<std::__1::pair<int, clang::driver::Command const*> >&) + 203
27 clang++       0x0000000100862495 main + 10917
28 libdyld.dylib 0x00007fff4ffd9015 start + 1
29 libdyld.dylib 0x000000000000001f start + 18446603339174146059
clang-11: error: clang frontend command failed with exit code 70 (use -v to see invocation)
clang version 11.0.0 (https://github.com/llvm/llvm-project.git e1fb9d53727f379be7930e8d8bb24c3c7da2f12a)
Target: aarch64-apple-darwin17.6.0
Fatal Error: error in backend: Found 1 machine code errors.
- function:    _Z22defineLoopSuiteRunInfoRKNSt3__16vectorI13LoopVariantIDNS_9allocatorIS1_EEEEPbdd
- basic block: %bb.260 if.then88 (0x7fb8c7c4c688)
- instruction: early-clobber %2752:gpr64, early-clobber %2753:gpr64sp = JumpTableDest32 %267:gpr64, %263:gpr64sp, %jump-table.0
- operand 3:   %263:gpr64sp
Expected a GPR64 register, but got a GPR64sp register
fatal error: error in backend: Found 1 machine code errors.
PLEASE submit a bug report to https://bugs.llvm.org/ and include the crash backtrace, preprocessed source, and associated run script.
Stack dump:
Error: clang frontend command failed with exit code 70 (use -v to see invocation)
25 clang++       0x000000010da851bb clang::driver::Compilation::ExecuteJobs(clang::driver::JobList const&, llvm::SmallVectorImpl<std::__1::pair<int, clang::driver::Command const*> >&) const + 107
26 clang++       0x000000010da98fbb clang::driver::Driver::ExecuteCompilation(clang::driver::Compilation&, llvm::SmallVectorImpl<std::__1::pair<int, clang::driver::Command const*> >&) + 203
27 clang++       0x000000010b5ba495 main + 10917
28 libdyld.dylib 0x00007fff4ffd9015 start + 1
29 libdyld.dylib 0x000000000000001f start + 18446603339174146059
clang-11: error: clang frontend command failed with exit code 70 (use -v to see invocation)
clang version 11.0.0 (https://github.com/llvm/llvm-project.git e1fb9d53727f379be7930e8d8bb24c3c7da2f12a)
Target: aarch64-apple-darwin17.6.0
... (limited to first 12 issues)

Build Log

Changes
  1. [AMDGPU] Define 16 bit VGPR subregs (details)
  2. [CodeGenPrepare] Delete intrinsic call to llvm.assume to enable more tailcall (details)
  3. [lld] Initial commit for new Mach-O backend (details)
  4. Replace std::string::find == 0 with StringRef::startswith (details)
  5. [AArch64][SVE] Add support for fcmp. (details)
  6. Add a new -fglobal-isel option and make -fexperimental-isel an alias for it. (details)
  7. [gn build] Port 03f43b3aca36 (details)
  8. [mlir][spirv] Change op doc description autogen separator (details)
  9. [docs] Make llvm-addr2line documentation more explicit about which (details)
  10. Re-land "[lldb/Reproducers] Always collect the whole dSYM in the reproducer" (details)
  11. [libc++] Allow running .sh.cpp tests with SSHExecutors (details)
  12. [InstCombine] Report change in non zero phi transform (details)
  13. [InstCombine] Use replaceOperand() in non zero phi transform (details)
  14. [InstCombine] Erase old alloca in cast of alloca transform (details)
  15. [InstCombine] Use replaceOperand() in descaling (details)
  16. Remove "mask" operand from shufflevector. (details)
  17. [InstCombine] Use replaceOperand() in some select transforms (details)
  18. Revert "[InlineFunction] Handle return attributes on call within inlined body" (details)
  19. [cmake] Link libc++ tests against static libc++/libc++abi in CrossWinToARMLinux.cmake (details)
  20. Switch this function to the LLVM variable naming convention, to match the rest of the file. (details)
  21. [pch] Honour -fallow-pch-with-compiler-errors for overall compilation status (details)
  22. [MLIR][NFC] modernize affine.for unroll test pass (details)

Started by upstream project relay-test-suite-verify-machineinstrs build number 7360
originally caused by:

This run spent:

  • 1 hr 14 min waiting;
  • 1 hr 32 min build duration;
  • 1 hr 33 min total from scheduled to completion.
Revision: 4abf27c36f15a0828fd4794e4a63fc663589c69c
  • refs/remotes/origin/master
Revision: e1fb9d53727f379be7930e8d8bb24c3c7da2f12a
  • detached
Revision: 9c9f6f8aaca07b783b4a2db2b68f7878a61bd97a
  • refs/remotes/origin/master
Revision: 44dad74558616adcdf54a289db4466c7ab7d2563
  • refs/remotes/origin/master

Identified problems

Compile Error

This build failed because of a compile error. Below is a list of all errors in the build log:
Indication 1

Ninja target failed

Below is a link to the first failed ninja target.
Indication 2