Started 3 mo 1 day ago
Took 39 min

Failed Build clang-d358890-g98202edacba-t12024-b12024.tar.gz (Jun 30, 2020 11:04:58 AM)

Issues

Found 5 issues:
Ninja target: pr84524.c.o
[1939/11527] /Users/buildslave/jenkins/workspace/test-suite-verify-machineinstrs-aarch64-globalisel-O0-g/test-suite-build/tools/timeit --summary SingleSource/Regression/C/gcc-c-torture/execute/CMakeFiles/GCC-C-execute-pr78170.dir/pr78170.c.o.time /Users/buildslave/jenkins/workspace/test-suite-verify-machineinstrs-aarch64-globalisel-O0-g/compiler/bin/clang -DNDEBUG  -B /Applications/Xcode.app/Contents/Developer/Toolchains/XcodeDefault.xctoolchain/usr/bin    -Wno-unused-command-line-argument -mllvm -verify-machineinstrs -O0 -g -arch arm64 -isysroot /Applications/Xcode.app/Contents/Developer/Platforms/iPhoneOS.platform/Developer/SDKs/iPhoneOS13.5.sdk   -w -Werror=date-time -w -MD -MT SingleSource/Regression/C/gcc-c-torture/execute/CMakeFiles/GCC-C-execute-pr78170.dir/pr78170.c.o -MF SingleSource/Regression/C/gcc-c-torture/execute/CMakeFiles/GCC-C-execute-pr78170.dir/pr78170.c.o.d -o SingleSource/Regression/C/gcc-c-torture/execute/CMakeFiles/GCC-C-execute-pr78170.dir/pr78170.c.o   -c /Users/buildslave/jenkins/workspace/test-suite-verify-machineinstrs-aarch64-globalisel-O0-g/test-suite/SingleSource/Regression/C/gcc-c-torture/execute/pr78170.c
[1940/11527] /Users/buildslave/jenkins/workspace/test-suite-verify-machineinstrs-aarch64-globalisel-O0-g/test-suite-build/tools/timeit --summary SingleSource/Regression/C/gcc-c-torture/execute/CMakeFiles/GCC-C-execute-pr65418-1.dir/pr65418-1.c.o.time /Users/buildslave/jenkins/workspace/test-suite-verify-machineinstrs-aarch64-globalisel-O0-g/compiler/bin/clang -DNDEBUG  -B /Applications/Xcode.app/Contents/Developer/Toolchains/XcodeDefault.xctoolchain/usr/bin    -Wno-unused-command-line-argument -mllvm -verify-machineinstrs -O0 -g -arch arm64 -isysroot /Applications/Xcode.app/Contents/Developer/Platforms/iPhoneOS.platform/Developer/SDKs/iPhoneOS13.5.sdk   -w -Werror=date-time -w -MD -MT SingleSource/Regression/C/gcc-c-torture/execute/CMakeFiles/GCC-C-execute-pr65418-1.dir/pr65418-1.c.o -MF SingleSource/Regression/C/gcc-c-torture/execute/CMakeFiles/GCC-C-execute-pr65418-1.dir/pr65418-1.c.o.d -o SingleSource/Regression/C/gcc-c-torture/execute/CMakeFiles/GCC-C-execute-pr65418-1.dir/pr65418-1.c.o   -c /Users/buildslave/jenkins/workspace/test-suite-verify-machineinstrs-aarch64-globalisel-O0-g/test-suite/SingleSource/Regression/C/gcc-c-torture/execute/pr65418-1.c
[1941/11527] /Users/buildslave/jenkins/workspace/test-suite-verify-machineinstrs-aarch64-globalisel-O0-g/test-suite-build/tools/timeit --summary SingleSource/Regression/C/gcc-c-torture/execute/CMakeFiles/GCC-C-execute-pr65401.dir/pr65401.c.o.time /Users/buildslave/jenkins/workspace/test-suite-verify-machineinstrs-aarch64-globalisel-O0-g/compiler/bin/clang -DNDEBUG  -B /Applications/Xcode.app/Contents/Developer/Toolchains/XcodeDefault.xctoolchain/usr/bin    -Wno-unused-command-line-argument -mllvm -verify-machineinstrs -O0 -g -arch arm64 -isysroot /Applications/Xcode.app/Contents/Developer/Platforms/iPhoneOS.platform/Developer/SDKs/iPhoneOS13.5.sdk   -w -Werror=date-time -w -MD -MT SingleSource/Regression/C/gcc-c-torture/execute/CMakeFiles/GCC-C-execute-pr65401.dir/pr65401.c.o -MF SingleSource/Regression/C/gcc-c-torture/execute/CMakeFiles/GCC-C-execute-pr65401.dir/pr65401.c.o.d -o SingleSource/Regression/C/gcc-c-torture/execute/CMakeFiles/GCC-C-execute-pr65401.dir/pr65401.c.o   -c /Users/buildslave/jenkins/workspace/test-suite-verify-machineinstrs-aarch64-globalisel-O0-g/test-suite/SingleSource/Regression/C/gcc-c-torture/execute/pr65401.c
[1942/11527] : && /Users/buildslave/jenkins/workspace/test-suite-verify-machineinstrs-aarch64-globalisel-O0-g/test-suite-build/tools/timeit --summary SingleSource/Regression/C/gcc-c-torture/execute/GCC-C-execute-pr65648.link.time /Users/buildslave/jenkins/workspace/test-suite-verify-machineinstrs-aarch64-globalisel-O0-g/compiler/bin/clang -B /Applications/Xcode.app/Contents/Developer/Toolchains/XcodeDefault.xctoolchain/usr/bin    -Wno-unused-command-line-argument -mllvm -verify-machineinstrs -O0 -g -arch arm64 -isysroot /Applications/Xcode.app/Contents/Developer/Platforms/iPhoneOS.platform/Developer/SDKs/iPhoneOS13.5.sdk -Wl,-search_paths_first -Wl,-headerpad_max_install_names -B /Applications/Xcode.app/Contents/Developer/Toolchains/XcodeDefault.xctoolchain/usr/bin SingleSource/Regression/C/gcc-c-torture/execute/CMakeFiles/GCC-C-execute-pr65648.dir/pr65648.c.o  -o SingleSource/Regression/C/gcc-c-torture/execute/GCC-C-execute-pr65648   && :
[1943/11527] /Users/buildslave/jenkins/workspace/test-suite-verify-machineinstrs-aarch64-globalisel-O0-g/test-suite-build/tools/timeit --summary SingleSource/Regression/C/gcc-c-torture/execute/CMakeFiles/GCC-C-execute-pr84524.dir/pr84524.c.o.time /Users/buildslave/jenkins/workspace/test-suite-verify-machineinstrs-aarch64-globalisel-O0-g/compiler/bin/clang -DNDEBUG  -B /Applications/Xcode.app/Contents/Developer/Toolchains/XcodeDefault.xctoolchain/usr/bin    -Wno-unused-command-line-argument -mllvm -verify-machineinstrs -O0 -g -arch arm64 -isysroot /Applications/Xcode.app/Contents/Developer/Platforms/iPhoneOS.platform/Developer/SDKs/iPhoneOS13.5.sdk   -w -Werror=date-time -w -MD -MT SingleSource/Regression/C/gcc-c-torture/execute/CMakeFiles/GCC-C-execute-pr84524.dir/pr84524.c.o -MF SingleSource/Regression/C/gcc-c-torture/execute/CMakeFiles/GCC-C-execute-pr84524.dir/pr84524.c.o.d -o SingleSource/Regression/C/gcc-c-torture/execute/CMakeFiles/GCC-C-execute-pr84524.dir/pr84524.c.o   -c /Users/buildslave/jenkins/workspace/test-suite-verify-machineinstrs-aarch64-globalisel-O0-g/test-suite/SingleSource/Regression/C/gcc-c-torture/execute/pr84524.c
FAILED: SingleSource/Regression/C/gcc-c-torture/execute/CMakeFiles/GCC-C-execute-pr84524.dir/pr84524.c.o 
/Users/buildslave/jenkins/workspace/test-suite-verify-machineinstrs-aarch64-globalisel-O0-g/test-suite-build/tools/timeit --summary SingleSource/Regression/C/gcc-c-torture/execute/CMakeFiles/GCC-C-execute-pr84524.dir/pr84524.c.o.time /Users/buildslave/jenkins/workspace/test-suite-verify-machineinstrs-aarch64-globalisel-O0-g/compiler/bin/clang -DNDEBUG  -B /Applications/Xcode.app/Contents/Developer/Toolchains/XcodeDefault.xctoolchain/usr/bin    -Wno-unused-command-line-argument -mllvm -verify-machineinstrs -O0 -g -arch arm64 -isysroot /Applications/Xcode.app/Contents/Developer/Platforms/iPhoneOS.platform/Developer/SDKs/iPhoneOS13.5.sdk   -w -Werror=date-time -w -MD -MT SingleSource/Regression/C/gcc-c-torture/execute/CMakeFiles/GCC-C-execute-pr84524.dir/pr84524.c.o -MF SingleSource/Regression/C/gcc-c-torture/execute/CMakeFiles/GCC-C-execute-pr84524.dir/pr84524.c.o.d -o SingleSource/Regression/C/gcc-c-torture/execute/CMakeFiles/GCC-C-execute-pr84524.dir/pr84524.c.o   -c /Users/buildslave/jenkins/workspace/test-suite-verify-machineinstrs-aarch64-globalisel-O0-g/test-suite/SingleSource/Regression/C/gcc-c-torture/execute/pr84524.c
Fatal Error: error in backend: Found 1 machine code errors.
*** Bad machine code: Copy Instruction is illegal with mismatching sizes ***
- function:    main
- basic block: %bb.5 for.body4 (0x7f8b6c843e08)
- instruction: %38:gpr32common = COPY %36:_(s16), debug-location !102; test-suite/SingleSource/Regression/C/gcc-c-torture/execute/pr84524.c:31:4
Def Size = 32, Src Size = 16
fatal error: error in backend: Found 1 machine code errors.
PLEASE submit a bug report to https://bugs.llvm.org/ and include the crash backtrace, preprocessed source, and associated run script.
Stack dump:
Error: clang frontend command failed with exit code 70 (use -v to see invocation)
24 clang         0x000000010ce9a62d clang::driver::Compilation::ExecuteCommand(clang::driver::Command const&, clang::driver::Command const*&) const + 221
25 clang         0x000000010ce9aa4d clang::driver::Compilation::ExecuteJobs(clang::driver::JobList const&, llvm::SmallVectorImpl<std::__1::pair<int, clang::driver::Command const*> >&) const + 125
26 clang         0x000000010ceaecfc clang::driver::Driver::ExecuteCompilation(clang::driver::Compilation&, llvm::SmallVectorImpl<std::__1::pair<int, clang::driver::Command const*> >&) + 204
27 clang         0x000000010aa5688d main + 10509
28 libdyld.dylib 0x00007fff696f7cc9 start + 1
clang-11: error: clang frontend command failed with exit code 70 (use -v to see invocation)
clang version 11.0.0 (https://github.com/llvm/llvm-project.git 98202edacbad2370105b8a5b837ad35569d7a387)
Target: aarch64-apple-darwin19.5.0
Ninja target: mytimer.cpp.o
[7442/11527] /Users/buildslave/jenkins/workspace/test-suite-verify-machineinstrs-aarch64-globalisel-O0-g/test-suite-build/tools/timeit --summary MultiSource/Benchmarks/DOE-ProxyApps-C++/PENNANT/CMakeFiles/PENNANT.dir/Mesh.cc.o.time /Users/buildslave/jenkins/workspace/test-suite-verify-machineinstrs-aarch64-globalisel-O0-g/compiler/bin/clang++  -DNDEBUG  -B /Applications/Xcode.app/Contents/Developer/Toolchains/XcodeDefault.xctoolchain/usr/bin    -Wno-unused-command-line-argument -mllvm -verify-machineinstrs -O0 -g -arch arm64 -isysroot /Applications/Xcode.app/Contents/Developer/Platforms/iPhoneOS.platform/Developer/SDKs/iPhoneOS13.5.sdk   -w -Werror=date-time -MD -MT MultiSource/Benchmarks/DOE-ProxyApps-C++/PENNANT/CMakeFiles/PENNANT.dir/Mesh.cc.o -MF MultiSource/Benchmarks/DOE-ProxyApps-C++/PENNANT/CMakeFiles/PENNANT.dir/Mesh.cc.o.d -o MultiSource/Benchmarks/DOE-ProxyApps-C++/PENNANT/CMakeFiles/PENNANT.dir/Mesh.cc.o -c /Users/buildslave/jenkins/workspace/test-suite-verify-machineinstrs-aarch64-globalisel-O0-g/test-suite/MultiSource/Benchmarks/DOE-ProxyApps-C++/PENNANT/Mesh.cc
[7443/11527] /Users/buildslave/jenkins/workspace/test-suite-verify-machineinstrs-aarch64-globalisel-O0-g/test-suite-build/tools/timeit --summary MultiSource/Benchmarks/DOE-ProxyApps-C++/PENNANT/CMakeFiles/PENNANT.dir/QCS.cc.o.time /Users/buildslave/jenkins/workspace/test-suite-verify-machineinstrs-aarch64-globalisel-O0-g/compiler/bin/clang++  -DNDEBUG  -B /Applications/Xcode.app/Contents/Developer/Toolchains/XcodeDefault.xctoolchain/usr/bin    -Wno-unused-command-line-argument -mllvm -verify-machineinstrs -O0 -g -arch arm64 -isysroot /Applications/Xcode.app/Contents/Developer/Platforms/iPhoneOS.platform/Developer/SDKs/iPhoneOS13.5.sdk   -w -Werror=date-time -MD -MT MultiSource/Benchmarks/DOE-ProxyApps-C++/PENNANT/CMakeFiles/PENNANT.dir/QCS.cc.o -MF MultiSource/Benchmarks/DOE-ProxyApps-C++/PENNANT/CMakeFiles/PENNANT.dir/QCS.cc.o.d -o MultiSource/Benchmarks/DOE-ProxyApps-C++/PENNANT/CMakeFiles/PENNANT.dir/QCS.cc.o -c /Users/buildslave/jenkins/workspace/test-suite-verify-machineinstrs-aarch64-globalisel-O0-g/test-suite/MultiSource/Benchmarks/DOE-ProxyApps-C++/PENNANT/QCS.cc
[7444/11527] /Users/buildslave/jenkins/workspace/test-suite-verify-machineinstrs-aarch64-globalisel-O0-g/test-suite-build/tools/timeit --summary MultiSource/Benchmarks/DOE-ProxyApps-C++/miniFE/CMakeFiles/miniFE.dir/BoxPartition.cpp.o.time /Users/buildslave/jenkins/workspace/test-suite-verify-machineinstrs-aarch64-globalisel-O0-g/compiler/bin/clang++  -DNDEBUG -I/Users/buildslave/jenkins/workspace/test-suite-verify-machineinstrs-aarch64-globalisel-O0-g/test-suite/MultiSource/Benchmarks/DOE-ProxyApps-C++/miniFE -B /Applications/Xcode.app/Contents/Developer/Toolchains/XcodeDefault.xctoolchain/usr/bin    -Wno-unused-command-line-argument -mllvm -verify-machineinstrs -O0 -g -arch arm64 -isysroot /Applications/Xcode.app/Contents/Developer/Platforms/iPhoneOS.platform/Developer/SDKs/iPhoneOS13.5.sdk   -w -Werror=date-time -I. -DMINIFE_SCALAR=double -DMINIFE_LOCAL_ORDINAL=int -DMINIFE_GLOBAL_ORDINAL=int -DMINIFE_CSR_MATRIX -DREDSTORM -D_XOPEN_SOURCE=700 -MD -MT MultiSource/Benchmarks/DOE-ProxyApps-C++/miniFE/CMakeFiles/miniFE.dir/BoxPartition.cpp.o -MF MultiSource/Benchmarks/DOE-ProxyApps-C++/miniFE/CMakeFiles/miniFE.dir/BoxPartition.cpp.o.d -o MultiSource/Benchmarks/DOE-ProxyApps-C++/miniFE/CMakeFiles/miniFE.dir/BoxPartition.cpp.o -c /Users/buildslave/jenkins/workspace/test-suite-verify-machineinstrs-aarch64-globalisel-O0-g/test-suite/MultiSource/Benchmarks/DOE-ProxyApps-C++/miniFE/BoxPartition.cpp
[7445/11527] /Users/buildslave/jenkins/workspace/test-suite-verify-machineinstrs-aarch64-globalisel-O0-g/test-suite-build/tools/timeit --summary MultiSource/Benchmarks/DOE-ProxyApps-C++/PENNANT/CMakeFiles/PENNANT.dir/main.cc.o.time /Users/buildslave/jenkins/workspace/test-suite-verify-machineinstrs-aarch64-globalisel-O0-g/compiler/bin/clang++  -DNDEBUG  -B /Applications/Xcode.app/Contents/Developer/Toolchains/XcodeDefault.xctoolchain/usr/bin    -Wno-unused-command-line-argument -mllvm -verify-machineinstrs -O0 -g -arch arm64 -isysroot /Applications/Xcode.app/Contents/Developer/Platforms/iPhoneOS.platform/Developer/SDKs/iPhoneOS13.5.sdk   -w -Werror=date-time -MD -MT MultiSource/Benchmarks/DOE-ProxyApps-C++/PENNANT/CMakeFiles/PENNANT.dir/main.cc.o -MF MultiSource/Benchmarks/DOE-ProxyApps-C++/PENNANT/CMakeFiles/PENNANT.dir/main.cc.o.d -o MultiSource/Benchmarks/DOE-ProxyApps-C++/PENNANT/CMakeFiles/PENNANT.dir/main.cc.o -c /Users/buildslave/jenkins/workspace/test-suite-verify-machineinstrs-aarch64-globalisel-O0-g/test-suite/MultiSource/Benchmarks/DOE-ProxyApps-C++/PENNANT/main.cc
[7446/11527] /Users/buildslave/jenkins/workspace/test-suite-verify-machineinstrs-aarch64-globalisel-O0-g/test-suite-build/tools/timeit --summary MultiSource/Benchmarks/DOE-ProxyApps-C++/miniFE/CMakeFiles/miniFE.dir/mytimer.cpp.o.time /Users/buildslave/jenkins/workspace/test-suite-verify-machineinstrs-aarch64-globalisel-O0-g/compiler/bin/clang++  -DNDEBUG -I/Users/buildslave/jenkins/workspace/test-suite-verify-machineinstrs-aarch64-globalisel-O0-g/test-suite/MultiSource/Benchmarks/DOE-ProxyApps-C++/miniFE -B /Applications/Xcode.app/Contents/Developer/Toolchains/XcodeDefault.xctoolchain/usr/bin    -Wno-unused-command-line-argument -mllvm -verify-machineinstrs -O0 -g -arch arm64 -isysroot /Applications/Xcode.app/Contents/Developer/Platforms/iPhoneOS.platform/Developer/SDKs/iPhoneOS13.5.sdk   -w -Werror=date-time -I. -DMINIFE_SCALAR=double -DMINIFE_LOCAL_ORDINAL=int -DMINIFE_GLOBAL_ORDINAL=int -DMINIFE_CSR_MATRIX -DREDSTORM -D_XOPEN_SOURCE=700 -MD -MT MultiSource/Benchmarks/DOE-ProxyApps-C++/miniFE/CMakeFiles/miniFE.dir/mytimer.cpp.o -MF MultiSource/Benchmarks/DOE-ProxyApps-C++/miniFE/CMakeFiles/miniFE.dir/mytimer.cpp.o.d -o MultiSource/Benchmarks/DOE-ProxyApps-C++/miniFE/CMakeFiles/miniFE.dir/mytimer.cpp.o -c /Users/buildslave/jenkins/workspace/test-suite-verify-machineinstrs-aarch64-globalisel-O0-g/test-suite/MultiSource/Benchmarks/DOE-ProxyApps-C++/miniFE/mytimer.cpp
FAILED: MultiSource/Benchmarks/DOE-ProxyApps-C++/miniFE/CMakeFiles/miniFE.dir/mytimer.cpp.o 
/Users/buildslave/jenkins/workspace/test-suite-verify-machineinstrs-aarch64-globalisel-O0-g/test-suite-build/tools/timeit --summary MultiSource/Benchmarks/DOE-ProxyApps-C++/miniFE/CMakeFiles/miniFE.dir/mytimer.cpp.o.time /Users/buildslave/jenkins/workspace/test-suite-verify-machineinstrs-aarch64-globalisel-O0-g/compiler/bin/clang++  -DNDEBUG -I/Users/buildslave/jenkins/workspace/test-suite-verify-machineinstrs-aarch64-globalisel-O0-g/test-suite/MultiSource/Benchmarks/DOE-ProxyApps-C++/miniFE -B /Applications/Xcode.app/Contents/Developer/Toolchains/XcodeDefault.xctoolchain/usr/bin    -Wno-unused-command-line-argument -mllvm -verify-machineinstrs -O0 -g -arch arm64 -isysroot /Applications/Xcode.app/Contents/Developer/Platforms/iPhoneOS.platform/Developer/SDKs/iPhoneOS13.5.sdk   -w -Werror=date-time -I. -DMINIFE_SCALAR=double -DMINIFE_LOCAL_ORDINAL=int -DMINIFE_GLOBAL_ORDINAL=int -DMINIFE_CSR_MATRIX -DREDSTORM -D_XOPEN_SOURCE=700 -MD -MT MultiSource/Benchmarks/DOE-ProxyApps-C++/miniFE/CMakeFiles/miniFE.dir/mytimer.cpp.o -MF MultiSource/Benchmarks/DOE-ProxyApps-C++/miniFE/CMakeFiles/miniFE.dir/mytimer.cpp.o.d -o MultiSource/Benchmarks/DOE-ProxyApps-C++/miniFE/CMakeFiles/miniFE.dir/mytimer.cpp.o -c /Users/buildslave/jenkins/workspace/test-suite-verify-machineinstrs-aarch64-globalisel-O0-g/test-suite/MultiSource/Benchmarks/DOE-ProxyApps-C++/miniFE/mytimer.cpp
/Users/buildslave/jenkins/workspace/test-suite-verify-machineinstrs-aarch64-globalisel-O0-g/test-suite/MultiSource/Benchmarks/DOE-ProxyApps-C++/miniFE/mytimer.cpp:116:19: error: variable has incomplete type 'struct timezone'
mytimer.cpp error: variable has incomplete type 'struct timezone'
[7444/11527] /Users/buildslave/jenkins/workspace/test-suite-verify-machineinstrs-aarch64-globalisel-O0-g/test-suite-build/tools/timeit --summary MultiSource/Benchmarks/DOE-ProxyApps-C++/miniFE/CMakeFiles/miniFE.dir/BoxPartition.cpp.o.time /Users/buildslave/jenkins/workspace/test-suite-verify-machineinstrs-aarch64-globalisel-O0-g/compiler/bin/clang++  -DNDEBUG -I/Users/buildslave/jenkins/workspace/test-suite-verify-machineinstrs-aarch64-globalisel-O0-g/test-suite/MultiSource/Benchmarks/DOE-ProxyApps-C++/miniFE -B /Applications/Xcode.app/Contents/Developer/Toolchains/XcodeDefault.xctoolchain/usr/bin    -Wno-unused-command-line-argument -mllvm -verify-machineinstrs -O0 -g -arch arm64 -isysroot /Applications/Xcode.app/Contents/Developer/Platforms/iPhoneOS.platform/Developer/SDKs/iPhoneOS13.5.sdk   -w -Werror=date-time -I. -DMINIFE_SCALAR=double -DMINIFE_LOCAL_ORDINAL=int -DMINIFE_GLOBAL_ORDINAL=int -DMINIFE_CSR_MATRIX -DREDSTORM -D_XOPEN_SOURCE=700 -MD -MT MultiSource/Benchmarks/DOE-ProxyApps-C++/miniFE/CMakeFiles/miniFE.dir/BoxPartition.cpp.o -MF MultiSource/Benchmarks/DOE-ProxyApps-C++/miniFE/CMakeFiles/miniFE.dir/BoxPartition.cpp.o.d -o MultiSource/Benchmarks/DOE-ProxyApps-C++/miniFE/CMakeFiles/miniFE.dir/BoxPartition.cpp.o -c /Users/buildslave/jenkins/workspace/test-suite-verify-machineinstrs-aarch64-globalisel-O0-g/test-suite/MultiSource/Benchmarks/DOE-ProxyApps-C++/miniFE/BoxPartition.cpp
[7445/11527] /Users/buildslave/jenkins/workspace/test-suite-verify-machineinstrs-aarch64-globalisel-O0-g/test-suite-build/tools/timeit --summary MultiSource/Benchmarks/DOE-ProxyApps-C++/PENNANT/CMakeFiles/PENNANT.dir/main.cc.o.time /Users/buildslave/jenkins/workspace/test-suite-verify-machineinstrs-aarch64-globalisel-O0-g/compiler/bin/clang++  -DNDEBUG  -B /Applications/Xcode.app/Contents/Developer/Toolchains/XcodeDefault.xctoolchain/usr/bin    -Wno-unused-command-line-argument -mllvm -verify-machineinstrs -O0 -g -arch arm64 -isysroot /Applications/Xcode.app/Contents/Developer/Platforms/iPhoneOS.platform/Developer/SDKs/iPhoneOS13.5.sdk   -w -Werror=date-time -MD -MT MultiSource/Benchmarks/DOE-ProxyApps-C++/PENNANT/CMakeFiles/PENNANT.dir/main.cc.o -MF MultiSource/Benchmarks/DOE-ProxyApps-C++/PENNANT/CMakeFiles/PENNANT.dir/main.cc.o.d -o MultiSource/Benchmarks/DOE-ProxyApps-C++/PENNANT/CMakeFiles/PENNANT.dir/main.cc.o -c /Users/buildslave/jenkins/workspace/test-suite-verify-machineinstrs-aarch64-globalisel-O0-g/test-suite/MultiSource/Benchmarks/DOE-ProxyApps-C++/PENNANT/main.cc
[7446/11527] /Users/buildslave/jenkins/workspace/test-suite-verify-machineinstrs-aarch64-globalisel-O0-g/test-suite-build/tools/timeit --summary MultiSource/Benchmarks/DOE-ProxyApps-C++/miniFE/CMakeFiles/miniFE.dir/mytimer.cpp.o.time /Users/buildslave/jenkins/workspace/test-suite-verify-machineinstrs-aarch64-globalisel-O0-g/compiler/bin/clang++  -DNDEBUG -I/Users/buildslave/jenkins/workspace/test-suite-verify-machineinstrs-aarch64-globalisel-O0-g/test-suite/MultiSource/Benchmarks/DOE-ProxyApps-C++/miniFE -B /Applications/Xcode.app/Contents/Developer/Toolchains/XcodeDefault.xctoolchain/usr/bin    -Wno-unused-command-line-argument -mllvm -verify-machineinstrs -O0 -g -arch arm64 -isysroot /Applications/Xcode.app/Contents/Developer/Platforms/iPhoneOS.platform/Developer/SDKs/iPhoneOS13.5.sdk   -w -Werror=date-time -I. -DMINIFE_SCALAR=double -DMINIFE_LOCAL_ORDINAL=int -DMINIFE_GLOBAL_ORDINAL=int -DMINIFE_CSR_MATRIX -DREDSTORM -D_XOPEN_SOURCE=700 -MD -MT MultiSource/Benchmarks/DOE-ProxyApps-C++/miniFE/CMakeFiles/miniFE.dir/mytimer.cpp.o -MF MultiSource/Benchmarks/DOE-ProxyApps-C++/miniFE/CMakeFiles/miniFE.dir/mytimer.cpp.o.d -o MultiSource/Benchmarks/DOE-ProxyApps-C++/miniFE/CMakeFiles/miniFE.dir/mytimer.cpp.o -c /Users/buildslave/jenkins/workspace/test-suite-verify-machineinstrs-aarch64-globalisel-O0-g/test-suite/MultiSource/Benchmarks/DOE-ProxyApps-C++/miniFE/mytimer.cpp
FAILED: MultiSource/Benchmarks/DOE-ProxyApps-C++/miniFE/CMakeFiles/miniFE.dir/mytimer.cpp.o 
/Users/buildslave/jenkins/workspace/test-suite-verify-machineinstrs-aarch64-globalisel-O0-g/test-suite-build/tools/timeit --summary MultiSource/Benchmarks/DOE-ProxyApps-C++/miniFE/CMakeFiles/miniFE.dir/mytimer.cpp.o.time /Users/buildslave/jenkins/workspace/test-suite-verify-machineinstrs-aarch64-globalisel-O0-g/compiler/bin/clang++  -DNDEBUG -I/Users/buildslave/jenkins/workspace/test-suite-verify-machineinstrs-aarch64-globalisel-O0-g/test-suite/MultiSource/Benchmarks/DOE-ProxyApps-C++/miniFE -B /Applications/Xcode.app/Contents/Developer/Toolchains/XcodeDefault.xctoolchain/usr/bin    -Wno-unused-command-line-argument -mllvm -verify-machineinstrs -O0 -g -arch arm64 -isysroot /Applications/Xcode.app/Contents/Developer/Platforms/iPhoneOS.platform/Developer/SDKs/iPhoneOS13.5.sdk   -w -Werror=date-time -I. -DMINIFE_SCALAR=double -DMINIFE_LOCAL_ORDINAL=int -DMINIFE_GLOBAL_ORDINAL=int -DMINIFE_CSR_MATRIX -DREDSTORM -D_XOPEN_SOURCE=700 -MD -MT MultiSource/Benchmarks/DOE-ProxyApps-C++/miniFE/CMakeFiles/miniFE.dir/mytimer.cpp.o -MF MultiSource/Benchmarks/DOE-ProxyApps-C++/miniFE/CMakeFiles/miniFE.dir/mytimer.cpp.o.d -o MultiSource/Benchmarks/DOE-ProxyApps-C++/miniFE/CMakeFiles/miniFE.dir/mytimer.cpp.o -c /Users/buildslave/jenkins/workspace/test-suite-verify-machineinstrs-aarch64-globalisel-O0-g/test-suite/MultiSource/Benchmarks/DOE-ProxyApps-C++/miniFE/mytimer.cpp
/Users/buildslave/jenkins/workspace/test-suite-verify-machineinstrs-aarch64-globalisel-O0-g/test-suite/MultiSource/Benchmarks/DOE-ProxyApps-C++/miniFE/mytimer.cpp:116:19: error: variable has incomplete type 'struct timezone'
  struct timezone tz;
                  ^

Build Log

Changes
  1. Add Metadata to Transformer tooling (details)
  2. [lldb/Scripts] (details)
  3. [libc++abi] Remove empty source file cxa_unexpected.cpp (details)
  4. [clang-tidy] Sanity checks in ClangTidyTest header. (details)
  5. [Alignment][NFC] TargetLowering::allowsMemoryAccessForAlignment (details)
  6. [clang-tidy] performance-faster-string-find string-view (details)
  7. [CodeComplete] Tweak completion for else. (details)
  8. [ARM] Allow rounding intrinsics to be tail predicated (details)
  9. [lldb/Test] Skip recognizer tests when Python is disabled (details)
  10. [mlir] [VectorOps] Replace zero fma with mult for vector.contract (details)
  11. [ARM][MVE] Tail-predication: clean-up of unused code (details)
  12. X86: Use Register (details)
  13. AMDGPU: Use Register (details)
  14. TailDuplicator: Use Register (details)
  15. BranchFolding: Use Register (details)
  16. RegAlloc: Start using Register (details)
  17. [libc++abi] Remove unused include of <sys/types.h> (details)
  18. [ARM] Allow the usub_sat and ssub_sat intrinsics to be tail predicated (details)
  19. Pass MDFieldPrinter::printAPInt APInt arg by reference not value. (details)
  20. [ARM] Allow the fabs intrinsic to be tail predicated (details)
  21. [clang][docs] Add note about using `-flto` with `-g` on macOS (details)
  22. [PowerPC][NFC] Rename/organize encoding test files for ISA3.1 (details)
  23. [InstCombine] New FMA tests and regenerate tests. NFC (details)
  24. [MVT] Add new MVT types for RISC-V vector. (details)
  25. [flang] Silence some warnings from clang-tidy (details)

Started by upstream project relay-test-suite-verify-machineinstrs build number 8281
originally caused by:

This run spent:

  • 23 min waiting;
  • 39 min build duration;
  • 39 min total from scheduled to completion.
Revision: 40dd3891d6e81726fb450af140659f52c12bcf43
  • refs/remotes/origin/master
Revision: 98202edacbad2370105b8a5b837ad35569d7a387
  • detached
Revision: f34ad041dce4f3b55a013ab6e7d712349a2844a0
  • refs/remotes/origin/master
Revision: 0bfeb655e49fc6feeeb63d534019019bf4bb4d7c
  • refs/remotes/origin/master

Identified problems

Compile Error

This build failed because of a compile error. Below is a list of all errors in the build log:
Indication 1

Ninja target failed

Below is a link to the first failed ninja target.
Indication 2