Started 4 mo 19 days ago
Took 48 min

Failed Build clang-d360327-gc86c1e972da-t12689-b12689.tar.gz (Jul 15, 2020 12:25:46 AM)

Issues

Found 3 issues:
Ninja target: matrix-types-spec.cpp.o
[8608/11531] /Users/buildslave/jenkins/workspace/test-suite-verify-machineinstrs-aarch64-globalisel-O0-g/test-suite-build/tools/timeit --summary SingleSource/UnitTests/Vector/NEON/CMakeFiles/Vector-NEON-simple.dir/simple.c.o.time /Users/buildslave/jenkins/workspace/test-suite-verify-machineinstrs-aarch64-globalisel-O0-g/compiler/bin/clang -DNDEBUG  -B /Applications/Xcode.app/Contents/Developer/Toolchains/XcodeDefault.xctoolchain/usr/bin    -Wno-unused-command-line-argument -mllvm -verify-machineinstrs -O0 -g -arch arm64 -isysroot /Applications/Xcode.app/Contents/Developer/Platforms/iPhoneOS.platform/Developer/SDKs/iPhoneOS13.5.sdk   -w -Werror=date-time -std=c99 -MD -MT SingleSource/UnitTests/Vector/NEON/CMakeFiles/Vector-NEON-simple.dir/simple.c.o -MF SingleSource/UnitTests/Vector/NEON/CMakeFiles/Vector-NEON-simple.dir/simple.c.o.d -o SingleSource/UnitTests/Vector/NEON/CMakeFiles/Vector-NEON-simple.dir/simple.c.o   -c /Users/buildslave/jenkins/workspace/test-suite-verify-machineinstrs-aarch64-globalisel-O0-g/test-suite/SingleSource/UnitTests/Vector/NEON/simple.c
[8609/11531] : && /Users/buildslave/jenkins/workspace/test-suite-verify-machineinstrs-aarch64-globalisel-O0-g/test-suite-build/tools/timeit --summary SingleSource/UnitTests/Vector/NEON/Vector-NEON-simple.link.time /Users/buildslave/jenkins/workspace/test-suite-verify-machineinstrs-aarch64-globalisel-O0-g/compiler/bin/clang -B /Applications/Xcode.app/Contents/Developer/Toolchains/XcodeDefault.xctoolchain/usr/bin    -Wno-unused-command-line-argument -mllvm -verify-machineinstrs -O0 -g -arch arm64 -isysroot /Applications/Xcode.app/Contents/Developer/Platforms/iPhoneOS.platform/Developer/SDKs/iPhoneOS13.5.sdk -Wl,-search_paths_first -Wl,-headerpad_max_install_names -B /Applications/Xcode.app/Contents/Developer/Toolchains/XcodeDefault.xctoolchain/usr/bin SingleSource/UnitTests/Vector/NEON/CMakeFiles/Vector-NEON-simple.dir/simple.c.o  -o SingleSource/UnitTests/Vector/NEON/Vector-NEON-simple   && cd /Users/buildslave/jenkins/workspace/test-suite-verify-machineinstrs-aarch64-globalisel-O0-g/test-suite-build/SingleSource/UnitTests/Vector/NEON && /usr/local/Cellar/cmake/3.17.2/bin/cmake -E create_symlink /Users/buildslave/jenkins/workspace/test-suite-verify-machineinstrs-aarch64-globalisel-O0-g/test-suite/SingleSource/UnitTests/Vector/NEON/simple.reference_output /Users/buildslave/jenkins/workspace/test-suite-verify-machineinstrs-aarch64-globalisel-O0-g/test-suite-build/SingleSource/UnitTests/Vector/NEON/simple.reference_output
[8610/11531] /Users/buildslave/jenkins/workspace/test-suite-verify-machineinstrs-aarch64-globalisel-O0-g/test-suite-build/tools/timeit --summary SingleSource/UnitTests/C++11/CMakeFiles/stdthreadbug.dir/stdthreadbug.cpp.o.time /Users/buildslave/jenkins/workspace/test-suite-verify-machineinstrs-aarch64-globalisel-O0-g/compiler/bin/clang++  -DNDEBUG  -B /Applications/Xcode.app/Contents/Developer/Toolchains/XcodeDefault.xctoolchain/usr/bin    -Wno-unused-command-line-argument -mllvm -verify-machineinstrs -O0 -g -arch arm64 -isysroot /Applications/Xcode.app/Contents/Developer/Platforms/iPhoneOS.platform/Developer/SDKs/iPhoneOS13.5.sdk   -w -Werror=date-time -std=c++11 -pthread -MD -MT SingleSource/UnitTests/C++11/CMakeFiles/stdthreadbug.dir/stdthreadbug.cpp.o -MF SingleSource/UnitTests/C++11/CMakeFiles/stdthreadbug.dir/stdthreadbug.cpp.o.d -o SingleSource/UnitTests/C++11/CMakeFiles/stdthreadbug.dir/stdthreadbug.cpp.o -c /Users/buildslave/jenkins/workspace/test-suite-verify-machineinstrs-aarch64-globalisel-O0-g/test-suite/SingleSource/UnitTests/C++11/stdthreadbug.cpp
[8611/11531] : && /Users/buildslave/jenkins/workspace/test-suite-verify-machineinstrs-aarch64-globalisel-O0-g/test-suite-build/tools/timeit --summary SingleSource/UnitTests/C++11/stdthreadbug.link.time /Users/buildslave/jenkins/workspace/test-suite-verify-machineinstrs-aarch64-globalisel-O0-g/compiler/bin/clang++  -B /Applications/Xcode.app/Contents/Developer/Toolchains/XcodeDefault.xctoolchain/usr/bin    -Wno-unused-command-line-argument -mllvm -verify-machineinstrs -O0 -g -arch arm64 -isysroot /Applications/Xcode.app/Contents/Developer/Platforms/iPhoneOS.platform/Developer/SDKs/iPhoneOS13.5.sdk -Wl,-search_paths_first -Wl,-headerpad_max_install_names -B /Applications/Xcode.app/Contents/Developer/Toolchains/XcodeDefault.xctoolchain/usr/bin SingleSource/UnitTests/C++11/CMakeFiles/stdthreadbug.dir/stdthreadbug.cpp.o  -o SingleSource/UnitTests/C++11/stdthreadbug  -lstdc++ -pthread && cd /Users/buildslave/jenkins/workspace/test-suite-verify-machineinstrs-aarch64-globalisel-O0-g/test-suite-build/SingleSource/UnitTests/C++11 && /usr/local/Cellar/cmake/3.17.2/bin/cmake -E create_symlink /Users/buildslave/jenkins/workspace/test-suite-verify-machineinstrs-aarch64-globalisel-O0-g/test-suite/SingleSource/UnitTests/C++11/stdthreadbug.reference_output /Users/buildslave/jenkins/workspace/test-suite-verify-machineinstrs-aarch64-globalisel-O0-g/test-suite-build/SingleSource/UnitTests/C++11/stdthreadbug.reference_output
[8612/11531] /Users/buildslave/jenkins/workspace/test-suite-verify-machineinstrs-aarch64-globalisel-O0-g/test-suite-build/tools/timeit --summary SingleSource/UnitTests/CMakeFiles/matrix-types-spec.dir/matrix-types-spec.cpp.o.time /Users/buildslave/jenkins/workspace/test-suite-verify-machineinstrs-aarch64-globalisel-O0-g/compiler/bin/clang++  -DNDEBUG  -B /Applications/Xcode.app/Contents/Developer/Toolchains/XcodeDefault.xctoolchain/usr/bin    -Wno-unused-command-line-argument -mllvm -verify-machineinstrs -O0 -g -arch arm64 -isysroot /Applications/Xcode.app/Contents/Developer/Platforms/iPhoneOS.platform/Developer/SDKs/iPhoneOS13.5.sdk   -w -Werror=date-time -fenable-matrix -MD -MT SingleSource/UnitTests/CMakeFiles/matrix-types-spec.dir/matrix-types-spec.cpp.o -MF SingleSource/UnitTests/CMakeFiles/matrix-types-spec.dir/matrix-types-spec.cpp.o.d -o SingleSource/UnitTests/CMakeFiles/matrix-types-spec.dir/matrix-types-spec.cpp.o -c /Users/buildslave/jenkins/workspace/test-suite-verify-machineinstrs-aarch64-globalisel-O0-g/test-suite/SingleSource/UnitTests/matrix-types-spec.cpp
FAILED: SingleSource/UnitTests/CMakeFiles/matrix-types-spec.dir/matrix-types-spec.cpp.o 
/Users/buildslave/jenkins/workspace/test-suite-verify-machineinstrs-aarch64-globalisel-O0-g/test-suite-build/tools/timeit --summary SingleSource/UnitTests/CMakeFiles/matrix-types-spec.dir/matrix-types-spec.cpp.o.time /Users/buildslave/jenkins/workspace/test-suite-verify-machineinstrs-aarch64-globalisel-O0-g/compiler/bin/clang++  -DNDEBUG  -B /Applications/Xcode.app/Contents/Developer/Toolchains/XcodeDefault.xctoolchain/usr/bin    -Wno-unused-command-line-argument -mllvm -verify-machineinstrs -O0 -g -arch arm64 -isysroot /Applications/Xcode.app/Contents/Developer/Platforms/iPhoneOS.platform/Developer/SDKs/iPhoneOS13.5.sdk   -w -Werror=date-time -fenable-matrix -MD -MT SingleSource/UnitTests/CMakeFiles/matrix-types-spec.dir/matrix-types-spec.cpp.o -MF SingleSource/UnitTests/CMakeFiles/matrix-types-spec.dir/matrix-types-spec.cpp.o.d -o SingleSource/UnitTests/CMakeFiles/matrix-types-spec.dir/matrix-types-spec.cpp.o -c /Users/buildslave/jenkins/workspace/test-suite-verify-machineinstrs-aarch64-globalisel-O0-g/test-suite/SingleSource/UnitTests/matrix-types-spec.cpp
Intrinsic name not mangled correctly for type arguments! Should be: llvm.matrix.column.major.load.v9f64
Fatal Error: error in backend: Broken function found, compilation aborted!
Intrinsic name not mangled correctly for type arguments! Should be: llvm.matrix.column.major.load.v9f64
<9 x double> (double*, i64, i1, i32, i32)* @llvm.matrix.column.major.load.v9f64.p0f64
Intrinsic name not mangled correctly for type arguments! Should be: llvm.matrix.column.major.store.v9f64
void (<9 x double>, double*, i64, i1, i32, i32)* @llvm.matrix.column.major.store.v9f64.p0f64
in function _Z13transposeSpecIdLj3ELj3EEvPT_S1_
fatal error: error in backend: Broken function found, compilation aborted!
PLEASE submit a bug report to https://bugs.llvm.org/ and include the crash backtrace, preprocessed source, and associated run script.
Stack dump:
Error: clang frontend command failed with exit code 70 (use -v to see invocation)
25 clang++       0x00000001078b375d clang::driver::Compilation::ExecuteJobs(clang::driver::JobList const&, llvm::SmallVectorImpl<std::__1::pair<int, clang::driver::Command const*> >&) const + 125
26 clang++       0x00000001078c7c1c clang::driver::Driver::ExecuteCompilation(clang::driver::Compilation&, llvm::SmallVectorImpl<std::__1::pair<int, clang::driver::Command const*> >&) + 204
27 clang++       0x00000001054584d5 main + 10389
28 libdyld.dylib 0x00007fff696f7cc9 start + 1
29 libdyld.dylib 0x0000000000000019 start + 18446603338747249489
clang-11: error: clang frontend command failed with exit code 70 (use -v to see invocation)
clang version 11.0.0 (https://github.com/llvm/llvm-project.git c86c1e972da07ac3417c98e04382a295d4284755)
Target: aarch64-apple-darwin19.5.0

Build Log

Changes
  1. [LLD] [MinGW] Implement the --file-alignment and --section-alignment options (details)
  2. [OpenMPOpt] Fix preserved analyses return (details)
  3. [mlir][Vector] Degrade masking information when forwarding linalg.copy to vector.transfer (details)
  4. [OpenMPOpt][NFC] Update checks for parallel_deletion test (details)
  5. [IndVarSimplify] Uniformly use emplace_back for DeadInsts, nfc (details)

Started by upstream project relay-test-suite-verify-machineinstrs build number 8348
originally caused by:

This run spent:

  • 7.9 sec waiting;
  • 48 min build duration;
  • 49 min total from scheduled to completion.
Revision: a5b58cdd800d0d45b1bdd1f7fe058db6acbfd918
  • refs/remotes/origin/master
Revision: c86c1e972da07ac3417c98e04382a295d4284755
  • detached
Revision: 4c57b004f148dffc6db199890d91fc3e6e578972
  • refs/remotes/origin/master
Revision: 60cfbf7833b8039b938ce679bed89c738b519e1d
  • refs/remotes/origin/master

Identified problems

Ninja target failed

Below is a link to the first failed ninja target.
Indication 1

Compile Error

This build failed because of a compile error. Below is a list of all errors in the build log:
Indication 2