Started 7 mo 14 days ago
Took 4 hr 33 min

Failed Build clang-d338279-gff429c5eaf7-t4948-b4948.tar.gz (Dec 31, 2019 8:38:55 AM)

Issues

Found 8 issues:
Ninja target: z19.c.o
[7666/7672] /Users/buildslave/jenkins/workspace/test-suite-verify-machineinstrs-x86_64h-O3/test-suite-build/tools/timeit --summary SingleSource/Regression/C++/EH/CMakeFiles/Regression-C++-class_hierarchy.dir/class_hierarchy.cpp.o.time /Users/buildslave/jenkins/workspace/test-suite-verify-machineinstrs-x86_64h-O3/compiler/bin/clang++  -DNDEBUG  -B /Applications/Xcode.app/Contents/Developer/Toolchains/XcodeDefault.xctoolchain/usr/bin    -Wno-unused-command-line-argument -mllvm -verify-machineinstrs -O3 -arch x86_64h -isysroot /Applications/Xcode.app/Contents/Developer/Platforms/MacOSX.platform/Developer/SDKs/MacOSX10.14.sdk   -w -Werror=date-time -MD -MT SingleSource/Regression/C++/EH/CMakeFiles/Regression-C++-class_hierarchy.dir/class_hierarchy.cpp.o -MF SingleSource/Regression/C++/EH/CMakeFiles/Regression-C++-class_hierarchy.dir/class_hierarchy.cpp.o.d -o SingleSource/Regression/C++/EH/CMakeFiles/Regression-C++-class_hierarchy.dir/class_hierarchy.cpp.o -c /Users/buildslave/jenkins/workspace/test-suite-verify-machineinstrs-x86_64h-O3/test-suite/SingleSource/Regression/C++/EH/class_hierarchy.cpp
[7667/7672] : && /Users/buildslave/jenkins/workspace/test-suite-verify-machineinstrs-x86_64h-O3/test-suite-build/tools/timeit --summary SingleSource/Regression/C++/EH/Regression-C++-class_hierarchy.link.time /Users/buildslave/jenkins/workspace/test-suite-verify-machineinstrs-x86_64h-O3/compiler/bin/clang++  -B /Applications/Xcode.app/Contents/Developer/Toolchains/XcodeDefault.xctoolchain/usr/bin    -Wno-unused-command-line-argument -mllvm -verify-machineinstrs -O3 -arch x86_64h -isysroot /Applications/Xcode.app/Contents/Developer/Platforms/MacOSX.platform/Developer/SDKs/MacOSX10.14.sdk -Wl,-search_paths_first -Wl,-headerpad_max_install_names -B /Applications/Xcode.app/Contents/Developer/Toolchains/XcodeDefault.xctoolchain/usr/bin SingleSource/Regression/C++/EH/CMakeFiles/Regression-C++-class_hierarchy.dir/class_hierarchy.cpp.o  -o SingleSource/Regression/C++/EH/Regression-C++-class_hierarchy  -Wl,-no_pie -lstdc++ && cd /Users/buildslave/jenkins/workspace/test-suite-verify-machineinstrs-x86_64h-O3/test-suite-build/SingleSource/Regression/C++/EH && /usr/local/Cellar/cmake/3.13.1/bin/cmake -E create_symlink /Users/buildslave/jenkins/workspace/test-suite-verify-machineinstrs-x86_64h-O3/test-suite/SingleSource/Regression/C++/EH/class_hierarchy.reference_output /Users/buildslave/jenkins/workspace/test-suite-verify-machineinstrs-x86_64h-O3/test-suite-build/SingleSource/Regression/C++/EH/class_hierarchy.reference_output
[7668/7672] /Users/buildslave/jenkins/workspace/test-suite-verify-machineinstrs-x86_64h-O3/test-suite-build/tools/timeit --summary SingleSource/Regression/C++/CMakeFiles/Regression-C++-ofstream_ctor.dir/ofstream_ctor.cpp.o.time /Users/buildslave/jenkins/workspace/test-suite-verify-machineinstrs-x86_64h-O3/compiler/bin/clang++  -DNDEBUG  -B /Applications/Xcode.app/Contents/Developer/Toolchains/XcodeDefault.xctoolchain/usr/bin    -Wno-unused-command-line-argument -mllvm -verify-machineinstrs -O3 -arch x86_64h -isysroot /Applications/Xcode.app/Contents/Developer/Platforms/MacOSX.platform/Developer/SDKs/MacOSX10.14.sdk   -w -Werror=date-time -MD -MT SingleSource/Regression/C++/CMakeFiles/Regression-C++-ofstream_ctor.dir/ofstream_ctor.cpp.o -MF SingleSource/Regression/C++/CMakeFiles/Regression-C++-ofstream_ctor.dir/ofstream_ctor.cpp.o.d -o SingleSource/Regression/C++/CMakeFiles/Regression-C++-ofstream_ctor.dir/ofstream_ctor.cpp.o -c /Users/buildslave/jenkins/workspace/test-suite-verify-machineinstrs-x86_64h-O3/test-suite/SingleSource/Regression/C++/ofstream_ctor.cpp
[7669/7672] : && /Users/buildslave/jenkins/workspace/test-suite-verify-machineinstrs-x86_64h-O3/test-suite-build/tools/timeit --summary SingleSource/Regression/C++/Regression-C++-ofstream_ctor.link.time /Users/buildslave/jenkins/workspace/test-suite-verify-machineinstrs-x86_64h-O3/compiler/bin/clang++  -B /Applications/Xcode.app/Contents/Developer/Toolchains/XcodeDefault.xctoolchain/usr/bin    -Wno-unused-command-line-argument -mllvm -verify-machineinstrs -O3 -arch x86_64h -isysroot /Applications/Xcode.app/Contents/Developer/Platforms/MacOSX.platform/Developer/SDKs/MacOSX10.14.sdk -Wl,-search_paths_first -Wl,-headerpad_max_install_names -B /Applications/Xcode.app/Contents/Developer/Toolchains/XcodeDefault.xctoolchain/usr/bin SingleSource/Regression/C++/CMakeFiles/Regression-C++-ofstream_ctor.dir/ofstream_ctor.cpp.o  -o SingleSource/Regression/C++/Regression-C++-ofstream_ctor  -Wl,-no_pie -lstdc++ && cd /Users/buildslave/jenkins/workspace/test-suite-verify-machineinstrs-x86_64h-O3/test-suite-build/SingleSource/Regression/C++ && /usr/local/Cellar/cmake/3.13.1/bin/cmake -E create_symlink /Users/buildslave/jenkins/workspace/test-suite-verify-machineinstrs-x86_64h-O3/test-suite/SingleSource/Regression/C++/ofstream_ctor.reference_output /Users/buildslave/jenkins/workspace/test-suite-verify-machineinstrs-x86_64h-O3/test-suite-build/SingleSource/Regression/C++/ofstream_ctor.reference_output
[7670/7672] /Users/buildslave/jenkins/workspace/test-suite-verify-machineinstrs-x86_64h-O3/test-suite-build/tools/timeit --summary MultiSource/Benchmarks/MiBench/consumer-typeset/CMakeFiles/consumer-typeset.dir/z19.c.o.time /Users/buildslave/jenkins/workspace/test-suite-verify-machineinstrs-x86_64h-O3/compiler/bin/clang -DNDEBUG  -B /Applications/Xcode.app/Contents/Developer/Toolchains/XcodeDefault.xctoolchain/usr/bin    -Wno-unused-command-line-argument -mllvm -verify-machineinstrs -O3 -arch x86_64h -isysroot /Applications/Xcode.app/Contents/Developer/Platforms/MacOSX.platform/Developer/SDKs/MacOSX10.14.sdk   -w -Werror=date-time -DOS_UNIX=1 -DOS_DOS=0 -DOS_MAC=0 -DDB_FIX=0 -DUSE_STAT=1 -DSAFE_DFT=0 -DCOLLATE=1 -DLIB_DIR=\"lout.lib\" -DFONT_DIR=\"font\" -DMAPS_DIR=\"maps\" -DINCL_DIR=\"include\" -DDATA_DIR=\"data\" -DHYPH_DIR=\"hyph\" -DLOCALE_DIR=\"locale\" -DCHAR_IN=1 -DCHAR_OUT=0 -DLOCALE_ON=1 -DASSERT_ON=1 -DDEBUG_ON=0 -DPDF_COMPRESSION=0 -D_FORTIFY_SOURCE=0 -MD -MT MultiSource/Benchmarks/MiBench/consumer-typeset/CMakeFiles/consumer-typeset.dir/z19.c.o -MF MultiSource/Benchmarks/MiBench/consumer-typeset/CMakeFiles/consumer-typeset.dir/z19.c.o.d -o MultiSource/Benchmarks/MiBench/consumer-typeset/CMakeFiles/consumer-typeset.dir/z19.c.o   -c /Users/buildslave/jenkins/workspace/test-suite-verify-machineinstrs-x86_64h-O3/test-suite/MultiSource/Benchmarks/MiBench/consumer-typeset/z19.c
FAILED: MultiSource/Benchmarks/MiBench/consumer-typeset/CMakeFiles/consumer-typeset.dir/z19.c.o 
/Users/buildslave/jenkins/workspace/test-suite-verify-machineinstrs-x86_64h-O3/test-suite-build/tools/timeit --summary MultiSource/Benchmarks/MiBench/consumer-typeset/CMakeFiles/consumer-typeset.dir/z19.c.o.time /Users/buildslave/jenkins/workspace/test-suite-verify-machineinstrs-x86_64h-O3/compiler/bin/clang -DNDEBUG  -B /Applications/Xcode.app/Contents/Developer/Toolchains/XcodeDefault.xctoolchain/usr/bin    -Wno-unused-command-line-argument -mllvm -verify-machineinstrs -O3 -arch x86_64h -isysroot /Applications/Xcode.app/Contents/Developer/Platforms/MacOSX.platform/Developer/SDKs/MacOSX10.14.sdk   -w -Werror=date-time -DOS_UNIX=1 -DOS_DOS=0 -DOS_MAC=0 -DDB_FIX=0 -DUSE_STAT=1 -DSAFE_DFT=0 -DCOLLATE=1 -DLIB_DIR=\"lout.lib\" -DFONT_DIR=\"font\" -DMAPS_DIR=\"maps\" -DINCL_DIR=\"include\" -DDATA_DIR=\"data\" -DHYPH_DIR=\"hyph\" -DLOCALE_DIR=\"locale\" -DCHAR_IN=1 -DCHAR_OUT=0 -DLOCALE_ON=1 -DASSERT_ON=1 -DDEBUG_ON=0 -DPDF_COMPRESSION=0 -D_FORTIFY_SOURCE=0 -MD -MT MultiSource/Benchmarks/MiBench/consumer-typeset/CMakeFiles/consumer-typeset.dir/z19.c.o -MF MultiSource/Benchmarks/MiBench/consumer-typeset/CMakeFiles/consumer-typeset.dir/z19.c.o.d -o MultiSource/Benchmarks/MiBench/consumer-typeset/CMakeFiles/consumer-typeset.dir/z19.c.o   -c /Users/buildslave/jenkins/workspace/test-suite-verify-machineinstrs-x86_64h-O3/test-suite/MultiSource/Benchmarks/MiBench/consumer-typeset/z19.c
Assertion failed: (N <= capacity()), function set_size, file /Users/buildslave/jenkins/workspace/clang-stage1-RA/llvm-project/llvm/include/llvm/ADT/SmallVector.h, line 67.
assertion: N <= capacity()
[7668/7672] /Users/buildslave/jenkins/workspace/test-suite-verify-machineinstrs-x86_64h-O3/test-suite-build/tools/timeit --summary SingleSource/Regression/C++/CMakeFiles/Regression-C++-ofstream_ctor.dir/ofstream_ctor.cpp.o.time /Users/buildslave/jenkins/workspace/test-suite-verify-machineinstrs-x86_64h-O3/compiler/bin/clang++  -DNDEBUG  -B /Applications/Xcode.app/Contents/Developer/Toolchains/XcodeDefault.xctoolchain/usr/bin    -Wno-unused-command-line-argument -mllvm -verify-machineinstrs -O3 -arch x86_64h -isysroot /Applications/Xcode.app/Contents/Developer/Platforms/MacOSX.platform/Developer/SDKs/MacOSX10.14.sdk   -w -Werror=date-time -MD -MT SingleSource/Regression/C++/CMakeFiles/Regression-C++-ofstream_ctor.dir/ofstream_ctor.cpp.o -MF SingleSource/Regression/C++/CMakeFiles/Regression-C++-ofstream_ctor.dir/ofstream_ctor.cpp.o.d -o SingleSource/Regression/C++/CMakeFiles/Regression-C++-ofstream_ctor.dir/ofstream_ctor.cpp.o -c /Users/buildslave/jenkins/workspace/test-suite-verify-machineinstrs-x86_64h-O3/test-suite/SingleSource/Regression/C++/ofstream_ctor.cpp
[7669/7672] : && /Users/buildslave/jenkins/workspace/test-suite-verify-machineinstrs-x86_64h-O3/test-suite-build/tools/timeit --summary SingleSource/Regression/C++/Regression-C++-ofstream_ctor.link.time /Users/buildslave/jenkins/workspace/test-suite-verify-machineinstrs-x86_64h-O3/compiler/bin/clang++  -B /Applications/Xcode.app/Contents/Developer/Toolchains/XcodeDefault.xctoolchain/usr/bin    -Wno-unused-command-line-argument -mllvm -verify-machineinstrs -O3 -arch x86_64h -isysroot /Applications/Xcode.app/Contents/Developer/Platforms/MacOSX.platform/Developer/SDKs/MacOSX10.14.sdk -Wl,-search_paths_first -Wl,-headerpad_max_install_names -B /Applications/Xcode.app/Contents/Developer/Toolchains/XcodeDefault.xctoolchain/usr/bin SingleSource/Regression/C++/CMakeFiles/Regression-C++-ofstream_ctor.dir/ofstream_ctor.cpp.o  -o SingleSource/Regression/C++/Regression-C++-ofstream_ctor  -Wl,-no_pie -lstdc++ && cd /Users/buildslave/jenkins/workspace/test-suite-verify-machineinstrs-x86_64h-O3/test-suite-build/SingleSource/Regression/C++ && /usr/local/Cellar/cmake/3.13.1/bin/cmake -E create_symlink /Users/buildslave/jenkins/workspace/test-suite-verify-machineinstrs-x86_64h-O3/test-suite/SingleSource/Regression/C++/ofstream_ctor.reference_output /Users/buildslave/jenkins/workspace/test-suite-verify-machineinstrs-x86_64h-O3/test-suite-build/SingleSource/Regression/C++/ofstream_ctor.reference_output
[7670/7672] /Users/buildslave/jenkins/workspace/test-suite-verify-machineinstrs-x86_64h-O3/test-suite-build/tools/timeit --summary MultiSource/Benchmarks/MiBench/consumer-typeset/CMakeFiles/consumer-typeset.dir/z19.c.o.time /Users/buildslave/jenkins/workspace/test-suite-verify-machineinstrs-x86_64h-O3/compiler/bin/clang -DNDEBUG  -B /Applications/Xcode.app/Contents/Developer/Toolchains/XcodeDefault.xctoolchain/usr/bin    -Wno-unused-command-line-argument -mllvm -verify-machineinstrs -O3 -arch x86_64h -isysroot /Applications/Xcode.app/Contents/Developer/Platforms/MacOSX.platform/Developer/SDKs/MacOSX10.14.sdk   -w -Werror=date-time -DOS_UNIX=1 -DOS_DOS=0 -DOS_MAC=0 -DDB_FIX=0 -DUSE_STAT=1 -DSAFE_DFT=0 -DCOLLATE=1 -DLIB_DIR=\"lout.lib\" -DFONT_DIR=\"font\" -DMAPS_DIR=\"maps\" -DINCL_DIR=\"include\" -DDATA_DIR=\"data\" -DHYPH_DIR=\"hyph\" -DLOCALE_DIR=\"locale\" -DCHAR_IN=1 -DCHAR_OUT=0 -DLOCALE_ON=1 -DASSERT_ON=1 -DDEBUG_ON=0 -DPDF_COMPRESSION=0 -D_FORTIFY_SOURCE=0 -MD -MT MultiSource/Benchmarks/MiBench/consumer-typeset/CMakeFiles/consumer-typeset.dir/z19.c.o -MF MultiSource/Benchmarks/MiBench/consumer-typeset/CMakeFiles/consumer-typeset.dir/z19.c.o.d -o MultiSource/Benchmarks/MiBench/consumer-typeset/CMakeFiles/consumer-typeset.dir/z19.c.o   -c /Users/buildslave/jenkins/workspace/test-suite-verify-machineinstrs-x86_64h-O3/test-suite/MultiSource/Benchmarks/MiBench/consumer-typeset/z19.c
FAILED: MultiSource/Benchmarks/MiBench/consumer-typeset/CMakeFiles/consumer-typeset.dir/z19.c.o 
/Users/buildslave/jenkins/workspace/test-suite-verify-machineinstrs-x86_64h-O3/test-suite-build/tools/timeit --summary MultiSource/Benchmarks/MiBench/consumer-typeset/CMakeFiles/consumer-typeset.dir/z19.c.o.time /Users/buildslave/jenkins/workspace/test-suite-verify-machineinstrs-x86_64h-O3/compiler/bin/clang -DNDEBUG  -B /Applications/Xcode.app/Contents/Developer/Toolchains/XcodeDefault.xctoolchain/usr/bin    -Wno-unused-command-line-argument -mllvm -verify-machineinstrs -O3 -arch x86_64h -isysroot /Applications/Xcode.app/Contents/Developer/Platforms/MacOSX.platform/Developer/SDKs/MacOSX10.14.sdk   -w -Werror=date-time -DOS_UNIX=1 -DOS_DOS=0 -DOS_MAC=0 -DDB_FIX=0 -DUSE_STAT=1 -DSAFE_DFT=0 -DCOLLATE=1 -DLIB_DIR=\"lout.lib\" -DFONT_DIR=\"font\" -DMAPS_DIR=\"maps\" -DINCL_DIR=\"include\" -DDATA_DIR=\"data\" -DHYPH_DIR=\"hyph\" -DLOCALE_DIR=\"locale\" -DCHAR_IN=1 -DCHAR_OUT=0 -DLOCALE_ON=1 -DASSERT_ON=1 -DDEBUG_ON=0 -DPDF_COMPRESSION=0 -D_FORTIFY_SOURCE=0 -MD -MT MultiSource/Benchmarks/MiBench/consumer-typeset/CMakeFiles/consumer-typeset.dir/z19.c.o -MF MultiSource/Benchmarks/MiBench/consumer-typeset/CMakeFiles/consumer-typeset.dir/z19.c.o.d -o MultiSource/Benchmarks/MiBench/consumer-typeset/CMakeFiles/consumer-typeset.dir/z19.c.o   -c /Users/buildslave/jenkins/workspace/test-suite-verify-machineinstrs-x86_64h-O3/test-suite/MultiSource/Benchmarks/MiBench/consumer-typeset/z19.c
Assertion failed: (N <= capacity()), function set_size, file /Users/buildslave/jenkins/workspace/clang-stage1-RA/llvm-project/llvm/include/llvm/ADT/SmallVector.h, line 67.
Stack dump:
0.	Program arguments: /Users/buildslave/jenkins/workspace/test-suite-verify-machineinstrs-x86_64h-O3/compiler/bin/clang-10 -cc1 -triple x86_64h-apple-macosx10.14.0 -Wdeprecated-objc-isa-usage -Werror=deprecated-objc-isa-usage -emit-obj -disable-free -main-file-name z19.c -mrelocation-model pic -pic-level 2 -mthread-model posix -mframe-pointer=all -fno-rounding-math -masm-verbose -munwind-tables -target-sdk-version=10.14 -target-cpu core-avx2 -target-feature -rdrnd -target-feature -aes -target-feature -pclmul -target-feature -rtm -target-feature -fsgsbase -dwarf-column-info -debugger-tuning=lldb -target-linker-version 409.12 -resource-dir /Users/buildslave/jenkins/workspace/test-suite-verify-machineinstrs-x86_64h-O3/compiler/lib/clang/10.0.0 -dependency-file MultiSource/Benchmarks/MiBench/consumer-typeset/CMakeFiles/consumer-typeset.dir/z19.c.o.d -MT MultiSource/Benchmarks/MiBench/consumer-typeset/CMakeFiles/consumer-typeset.dir/z19.c.o -sys-header-deps -isysroot /Applications/Xcode.app/Contents/Developer/Platforms/MacOSX.platform/Developer/SDKs/MacOSX10.14.sdk -D NDEBUG -D OS_UNIX=1 -D OS_DOS=0 -D OS_MAC=0 -D DB_FIX=0 -D USE_STAT=1 -D SAFE_DFT=0 -D COLLATE=1 -D LIB_DIR="lout.lib" -D FONT_DIR="font" -D MAPS_DIR="maps" -D INCL_DIR="include" -D DATA_DIR="data" -D HYPH_DIR="hyph" -D LOCALE_DIR="locale" -D CHAR_IN=1 -D CHAR_OUT=0 -D LOCALE_ON=1 -D ASSERT_ON=1 -D DEBUG_ON=0 -D PDF_COMPRESSION=0 -D _FORTIFY_SOURCE=0 -internal-isystem /Applications/Xcode.app/Contents/Developer/Platforms/MacOSX.platform/Developer/SDKs/MacOSX10.14.sdk/usr/local/include -internal-isystem /Users/buildslave/jenkins/workspace/test-suite-verify-machineinstrs-x86_64h-O3/compiler/lib/clang/10.0.0/include -internal-externc-isystem /Applications/Xcode.app/Contents/Developer/Platforms/MacOSX.platform/Developer/SDKs/MacOSX10.14.sdk/usr/include -O3 -Wno-unused-command-line-argument -Werror=date-time -w -fdebug-compilation-dir /Users/buildslave/jenkins/workspace/test-suite-verify-machineinstrs-x86_64h-O3/test-suite-build -ferror-limit 19 -fmessage-length 0 -stack-protector 1 -fblocks -fencode-extended-block-signature -fregister-global-dtors-with-atexit -fgnuc-version=4.2.1 -fobjc-runtime=macosx-10.14.0 -fmax-type-align=16 -fdiagnostics-show-option -vectorize-loops -vectorize-slp -mllvm -verify-machineinstrs -o MultiSource/Benchmarks/MiBench/consumer-typeset/CMakeFiles/consumer-typeset.dir/z19.c.o -x c /Users/buildslave/jenkins/workspace/test-suite-verify-machineinstrs-x86_64h-O3/test-suite/MultiSource/Benchmarks/MiBench/consumer-typeset/z19.c 
Error: unable to execute command: Abort trap: 6
23 clang-10                 0x000000010a07c7bf clang::ExecuteCompilerInvocation(clang::CompilerInstance*) + 1759
24 clang-10                 0x0000000107b16e26 cc1_main(llvm::ArrayRef<char const*>, char const*, void*) + 2438
25 clang-10                 0x0000000107b14543 main + 10931
26 libdyld.dylib            0x00007fff5feb2085 start + 1
27 libdyld.dylib            0x000000000000007c start + 18446603338906918904
clang-10: error: unable to execute command: Abort trap: 6
clang-10: error: clang frontend command failed due to signal (use -v to see invocation)
clang version 10.0.0 (https://github.com/llvm/llvm-project.git ff429c5eaf79529aacdc15582c90c0915080e082)
Error: clang frontend command failed due to signal (use -v to see invocation)
24 clang-10                 0x0000000107b16e26 cc1_main(llvm::ArrayRef<char const*>, char const*, void*) + 2438
25 clang-10                 0x0000000107b14543 main + 10931
26 libdyld.dylib            0x00007fff5feb2085 start + 1
27 libdyld.dylib            0x000000000000007c start + 18446603338906918904
clang-10: error: unable to execute command: Abort trap: 6
clang-10: error: clang frontend command failed due to signal (use -v to see invocation)
clang version 10.0.0 (https://github.com/llvm/llvm-project.git ff429c5eaf79529aacdc15582c90c0915080e082)
Target: x86_64h-apple-darwin18.0.0
Ninja target: z03.c.o
clang-10: note: diagnostic msg: (choose the .crash file that corresponds to your crash)
clang-10: note: diagnostic msg: 

********************
[7671/7672] /Users/buildslave/jenkins/workspace/test-suite-verify-machineinstrs-x86_64h-O3/test-suite-build/tools/timeit --summary MultiSource/Benchmarks/MiBench/consumer-typeset/CMakeFiles/consumer-typeset.dir/z03.c.o.time /Users/buildslave/jenkins/workspace/test-suite-verify-machineinstrs-x86_64h-O3/compiler/bin/clang -DNDEBUG  -B /Applications/Xcode.app/Contents/Developer/Toolchains/XcodeDefault.xctoolchain/usr/bin    -Wno-unused-command-line-argument -mllvm -verify-machineinstrs -O3 -arch x86_64h -isysroot /Applications/Xcode.app/Contents/Developer/Platforms/MacOSX.platform/Developer/SDKs/MacOSX10.14.sdk   -w -Werror=date-time -DOS_UNIX=1 -DOS_DOS=0 -DOS_MAC=0 -DDB_FIX=0 -DUSE_STAT=1 -DSAFE_DFT=0 -DCOLLATE=1 -DLIB_DIR=\"lout.lib\" -DFONT_DIR=\"font\" -DMAPS_DIR=\"maps\" -DINCL_DIR=\"include\" -DDATA_DIR=\"data\" -DHYPH_DIR=\"hyph\" -DLOCALE_DIR=\"locale\" -DCHAR_IN=1 -DCHAR_OUT=0 -DLOCALE_ON=1 -DASSERT_ON=1 -DDEBUG_ON=0 -DPDF_COMPRESSION=0 -D_FORTIFY_SOURCE=0 -MD -MT MultiSource/Benchmarks/MiBench/consumer-typeset/CMakeFiles/consumer-typeset.dir/z03.c.o -MF MultiSource/Benchmarks/MiBench/consumer-typeset/CMakeFiles/consumer-typeset.dir/z03.c.o.d -o MultiSource/Benchmarks/MiBench/consumer-typeset/CMakeFiles/consumer-typeset.dir/z03.c.o   -c /Users/buildslave/jenkins/workspace/test-suite-verify-machineinstrs-x86_64h-O3/test-suite/MultiSource/Benchmarks/MiBench/consumer-typeset/z03.c
FAILED: MultiSource/Benchmarks/MiBench/consumer-typeset/CMakeFiles/consumer-typeset.dir/z03.c.o 
/Users/buildslave/jenkins/workspace/test-suite-verify-machineinstrs-x86_64h-O3/test-suite-build/tools/timeit --summary MultiSource/Benchmarks/MiBench/consumer-typeset/CMakeFiles/consumer-typeset.dir/z03.c.o.time /Users/buildslave/jenkins/workspace/test-suite-verify-machineinstrs-x86_64h-O3/compiler/bin/clang -DNDEBUG  -B /Applications/Xcode.app/Contents/Developer/Toolchains/XcodeDefault.xctoolchain/usr/bin    -Wno-unused-command-line-argument -mllvm -verify-machineinstrs -O3 -arch x86_64h -isysroot /Applications/Xcode.app/Contents/Developer/Platforms/MacOSX.platform/Developer/SDKs/MacOSX10.14.sdk   -w -Werror=date-time -DOS_UNIX=1 -DOS_DOS=0 -DOS_MAC=0 -DDB_FIX=0 -DUSE_STAT=1 -DSAFE_DFT=0 -DCOLLATE=1 -DLIB_DIR=\"lout.lib\" -DFONT_DIR=\"font\" -DMAPS_DIR=\"maps\" -DINCL_DIR=\"include\" -DDATA_DIR=\"data\" -DHYPH_DIR=\"hyph\" -DLOCALE_DIR=\"locale\" -DCHAR_IN=1 -DCHAR_OUT=0 -DLOCALE_ON=1 -DASSERT_ON=1 -DDEBUG_ON=0 -DPDF_COMPRESSION=0 -D_FORTIFY_SOURCE=0 -MD -MT MultiSource/Benchmarks/MiBench/consumer-typeset/CMakeFiles/consumer-typeset.dir/z03.c.o -MF MultiSource/Benchmarks/MiBench/consumer-typeset/CMakeFiles/consumer-typeset.dir/z03.c.o.d -o MultiSource/Benchmarks/MiBench/consumer-typeset/CMakeFiles/consumer-typeset.dir/z03.c.o   -c /Users/buildslave/jenkins/workspace/test-suite-verify-machineinstrs-x86_64h-O3/test-suite/MultiSource/Benchmarks/MiBench/consumer-typeset/z03.c
Assertion failed: (N <= capacity()), function set_size, file /Users/buildslave/jenkins/workspace/clang-stage1-RA/llvm-project/llvm/include/llvm/ADT/SmallVector.h, line 67.
assertion: N <= capacity()

********************
[7671/7672] /Users/buildslave/jenkins/workspace/test-suite-verify-machineinstrs-x86_64h-O3/test-suite-build/tools/timeit --summary MultiSource/Benchmarks/MiBench/consumer-typeset/CMakeFiles/consumer-typeset.dir/z03.c.o.time /Users/buildslave/jenkins/workspace/test-suite-verify-machineinstrs-x86_64h-O3/compiler/bin/clang -DNDEBUG  -B /Applications/Xcode.app/Contents/Developer/Toolchains/XcodeDefault.xctoolchain/usr/bin    -Wno-unused-command-line-argument -mllvm -verify-machineinstrs -O3 -arch x86_64h -isysroot /Applications/Xcode.app/Contents/Developer/Platforms/MacOSX.platform/Developer/SDKs/MacOSX10.14.sdk   -w -Werror=date-time -DOS_UNIX=1 -DOS_DOS=0 -DOS_MAC=0 -DDB_FIX=0 -DUSE_STAT=1 -DSAFE_DFT=0 -DCOLLATE=1 -DLIB_DIR=\"lout.lib\" -DFONT_DIR=\"font\" -DMAPS_DIR=\"maps\" -DINCL_DIR=\"include\" -DDATA_DIR=\"data\" -DHYPH_DIR=\"hyph\" -DLOCALE_DIR=\"locale\" -DCHAR_IN=1 -DCHAR_OUT=0 -DLOCALE_ON=1 -DASSERT_ON=1 -DDEBUG_ON=0 -DPDF_COMPRESSION=0 -D_FORTIFY_SOURCE=0 -MD -MT MultiSource/Benchmarks/MiBench/consumer-typeset/CMakeFiles/consumer-typeset.dir/z03.c.o -MF MultiSource/Benchmarks/MiBench/consumer-typeset/CMakeFiles/consumer-typeset.dir/z03.c.o.d -o MultiSource/Benchmarks/MiBench/consumer-typeset/CMakeFiles/consumer-typeset.dir/z03.c.o   -c /Users/buildslave/jenkins/workspace/test-suite-verify-machineinstrs-x86_64h-O3/test-suite/MultiSource/Benchmarks/MiBench/consumer-typeset/z03.c
FAILED: MultiSource/Benchmarks/MiBench/consumer-typeset/CMakeFiles/consumer-typeset.dir/z03.c.o 
/Users/buildslave/jenkins/workspace/test-suite-verify-machineinstrs-x86_64h-O3/test-suite-build/tools/timeit --summary MultiSource/Benchmarks/MiBench/consumer-typeset/CMakeFiles/consumer-typeset.dir/z03.c.o.time /Users/buildslave/jenkins/workspace/test-suite-verify-machineinstrs-x86_64h-O3/compiler/bin/clang -DNDEBUG  -B /Applications/Xcode.app/Contents/Developer/Toolchains/XcodeDefault.xctoolchain/usr/bin    -Wno-unused-command-line-argument -mllvm -verify-machineinstrs -O3 -arch x86_64h -isysroot /Applications/Xcode.app/Contents/Developer/Platforms/MacOSX.platform/Developer/SDKs/MacOSX10.14.sdk   -w -Werror=date-time -DOS_UNIX=1 -DOS_DOS=0 -DOS_MAC=0 -DDB_FIX=0 -DUSE_STAT=1 -DSAFE_DFT=0 -DCOLLATE=1 -DLIB_DIR=\"lout.lib\" -DFONT_DIR=\"font\" -DMAPS_DIR=\"maps\" -DINCL_DIR=\"include\" -DDATA_DIR=\"data\" -DHYPH_DIR=\"hyph\" -DLOCALE_DIR=\"locale\" -DCHAR_IN=1 -DCHAR_OUT=0 -DLOCALE_ON=1 -DASSERT_ON=1 -DDEBUG_ON=0 -DPDF_COMPRESSION=0 -D_FORTIFY_SOURCE=0 -MD -MT MultiSource/Benchmarks/MiBench/consumer-typeset/CMakeFiles/consumer-typeset.dir/z03.c.o -MF MultiSource/Benchmarks/MiBench/consumer-typeset/CMakeFiles/consumer-typeset.dir/z03.c.o.d -o MultiSource/Benchmarks/MiBench/consumer-typeset/CMakeFiles/consumer-typeset.dir/z03.c.o   -c /Users/buildslave/jenkins/workspace/test-suite-verify-machineinstrs-x86_64h-O3/test-suite/MultiSource/Benchmarks/MiBench/consumer-typeset/z03.c
Assertion failed: (N <= capacity()), function set_size, file /Users/buildslave/jenkins/workspace/clang-stage1-RA/llvm-project/llvm/include/llvm/ADT/SmallVector.h, line 67.
Stack dump:
0.	Program arguments: /Users/buildslave/jenkins/workspace/test-suite-verify-machineinstrs-x86_64h-O3/compiler/bin/clang-10 -cc1 -triple x86_64h-apple-macosx10.14.0 -Wdeprecated-objc-isa-usage -Werror=deprecated-objc-isa-usage -emit-obj -disable-free -main-file-name z03.c -mrelocation-model pic -pic-level 2 -mthread-model posix -mframe-pointer=all -fno-rounding-math -masm-verbose -munwind-tables -target-sdk-version=10.14 -target-cpu core-avx2 -target-feature -rdrnd -target-feature -aes -target-feature -pclmul -target-feature -rtm -target-feature -fsgsbase -dwarf-column-info -debugger-tuning=lldb -target-linker-version 409.12 -resource-dir /Users/buildslave/jenkins/workspace/test-suite-verify-machineinstrs-x86_64h-O3/compiler/lib/clang/10.0.0 -dependency-file MultiSource/Benchmarks/MiBench/consumer-typeset/CMakeFiles/consumer-typeset.dir/z03.c.o.d -MT MultiSource/Benchmarks/MiBench/consumer-typeset/CMakeFiles/consumer-typeset.dir/z03.c.o -sys-header-deps -isysroot /Applications/Xcode.app/Contents/Developer/Platforms/MacOSX.platform/Developer/SDKs/MacOSX10.14.sdk -D NDEBUG -D OS_UNIX=1 -D OS_DOS=0 -D OS_MAC=0 -D DB_FIX=0 -D USE_STAT=1 -D SAFE_DFT=0 -D COLLATE=1 -D LIB_DIR="lout.lib" -D FONT_DIR="font" -D MAPS_DIR="maps" -D INCL_DIR="include" -D DATA_DIR="data" -D HYPH_DIR="hyph" -D LOCALE_DIR="locale" -D CHAR_IN=1 -D CHAR_OUT=0 -D LOCALE_ON=1 -D ASSERT_ON=1 -D DEBUG_ON=0 -D PDF_COMPRESSION=0 -D _FORTIFY_SOURCE=0 -internal-isystem /Applications/Xcode.app/Contents/Developer/Platforms/MacOSX.platform/Developer/SDKs/MacOSX10.14.sdk/usr/local/include -internal-isystem /Users/buildslave/jenkins/workspace/test-suite-verify-machineinstrs-x86_64h-O3/compiler/lib/clang/10.0.0/include -internal-externc-isystem /Applications/Xcode.app/Contents/Developer/Platforms/MacOSX.platform/Developer/SDKs/MacOSX10.14.sdk/usr/include -O3 -Wno-unused-command-line-argument -Werror=date-time -w -fdebug-compilation-dir /Users/buildslave/jenkins/workspace/test-suite-verify-machineinstrs-x86_64h-O3/test-suite-build -ferror-limit 19 -fmessage-length 0 -stack-protector 1 -fblocks -fencode-extended-block-signature -fregister-global-dtors-with-atexit -fgnuc-version=4.2.1 -fobjc-runtime=macosx-10.14.0 -fmax-type-align=16 -fdiagnostics-show-option -vectorize-loops -vectorize-slp -mllvm -verify-machineinstrs -o MultiSource/Benchmarks/MiBench/consumer-typeset/CMakeFiles/consumer-typeset.dir/z03.c.o -x c /Users/buildslave/jenkins/workspace/test-suite-verify-machineinstrs-x86_64h-O3/test-suite/MultiSource/Benchmarks/MiBench/consumer-typeset/z03.c 
Error: unable to execute command: Abort trap: 6
23 clang-10                 0x000000010968b7bf clang::ExecuteCompilerInvocation(clang::CompilerInstance*) + 1759
24 clang-10                 0x0000000107125e26 cc1_main(llvm::ArrayRef<char const*>, char const*, void*) + 2438
25 clang-10                 0x0000000107123543 main + 10931
26 libdyld.dylib            0x00007fff5feb2085 start + 1
27 libdyld.dylib            0x000000000000007c start + 18446603338906918904
clang-10: error: unable to execute command: Abort trap: 6
clang-10: error: clang frontend command failed due to signal (use -v to see invocation)
clang version 10.0.0 (https://github.com/llvm/llvm-project.git ff429c5eaf79529aacdc15582c90c0915080e082)
Error: clang frontend command failed due to signal (use -v to see invocation)
24 clang-10                 0x0000000107125e26 cc1_main(llvm::ArrayRef<char const*>, char const*, void*) + 2438
25 clang-10                 0x0000000107123543 main + 10931
26 libdyld.dylib            0x00007fff5feb2085 start + 1
27 libdyld.dylib            0x000000000000007c start + 18446603338906918904
clang-10: error: unable to execute command: Abort trap: 6
clang-10: error: clang frontend command failed due to signal (use -v to see invocation)
clang version 10.0.0 (https://github.com/llvm/llvm-project.git ff429c5eaf79529aacdc15582c90c0915080e082)
Target: x86_64h-apple-darwin18.0.0

Build Log

Changes
  1. [mlir][Linalg] Delete unused LinalgLibraryOps.td (details)
  2. [InstCombine] Fix infinite loop due to bitcast <-> phi transforms (details)
  3. [InstCombine] add tests for masked bit set/clear; NFC (details)
  4. [AArch64] add test for fsub+fneg; NFC (details)
  5. [OpenCL] Remove redundant foreach in OpenCLBuiltins.td; NFC (details)

Started by upstream project relay-test-suite-verify-machineinstrs build number 7015
originally caused by:

This run spent:

  • 6.7 sec waiting;
  • 4 hr 33 min build duration;
  • 4 hr 33 min total from scheduled to completion.
Revision: 3cdabe9ad312fedaf0feb85046f9a8ef6e3189f9
  • refs/remotes/origin/master
Revision: ff429c5eaf79529aacdc15582c90c0915080e082
  • detached
Revision: 72b33744a9ae268bd37940880eca8f35d66c10cc
  • refs/remotes/origin/master
Revision: a8c64f2bdd2b4295e5d52a63fb18409365d62bd3
  • refs/remotes/origin/master

Identified problems

Ninja target failed

Below is a link to the first failed ninja target.
Indication 1

Compile Error

This build failed because of a compile error. Below is a list of all errors in the build log:
Indication 2

Assertion failure

This build failed because of an assertion failure. Below is a list of all errors in the build log:
Indication 3