Started 4 days 12 hr ago
Took 1 hr 4 min

Failed Build clang-d343160-gc3478eff7a6-t6938-b6938.tar.gz (Feb 19, 2020 3:36:19 PM)

Issues

Found 18 issues:
tramp3d-v4.cpp error: non-const lvalue reference to type 'std::ostream' (aka 'basic_ostream<char>') cannot bind to a value of unrelated type 'std::ostringstream' (aka 'basic_ostringstream<char>')
[3722/7672] /Users/buildslave/jenkins/workspace/test-suite-verify-machineinstrs-x86_64h-O3/test-suite-build/tools/timeit --summary MultiSource/Benchmarks/DOE-ProxyApps-C++/HPCCG/CMakeFiles/HPCCG.dir/read_HPC_row.cpp.o.time /Users/buildslave/jenkins/workspace/test-suite-verify-machineinstrs-x86_64h-O3/compiler/bin/clang++  -DNDEBUG  -B /Applications/Xcode.app/Contents/Developer/Toolchains/XcodeDefault.xctoolchain/usr/bin    -Wno-unused-command-line-argument -mllvm -verify-machineinstrs -O3 -arch x86_64h -isysroot /Applications/Xcode.app/Contents/Developer/Platforms/MacOSX.platform/Developer/SDKs/MacOSX10.14.sdk   -w -Werror=date-time -DREDSTORM -MD -MT MultiSource/Benchmarks/DOE-ProxyApps-C++/HPCCG/CMakeFiles/HPCCG.dir/read_HPC_row.cpp.o -MF MultiSource/Benchmarks/DOE-ProxyApps-C++/HPCCG/CMakeFiles/HPCCG.dir/read_HPC_row.cpp.o.d -o MultiSource/Benchmarks/DOE-ProxyApps-C++/HPCCG/CMakeFiles/HPCCG.dir/read_HPC_row.cpp.o -c /Users/buildslave/jenkins/workspace/test-suite-verify-machineinstrs-x86_64h-O3/test-suite/MultiSource/Benchmarks/DOE-ProxyApps-C++/HPCCG/read_HPC_row.cpp
[3723/7672] : && /Users/buildslave/jenkins/workspace/test-suite-verify-machineinstrs-x86_64h-O3/test-suite-build/tools/timeit --summary MultiSource/Benchmarks/DOE-ProxyApps-C++/HPCCG/HPCCG.link.time /Users/buildslave/jenkins/workspace/test-suite-verify-machineinstrs-x86_64h-O3/compiler/bin/clang++  -B /Applications/Xcode.app/Contents/Developer/Toolchains/XcodeDefault.xctoolchain/usr/bin    -Wno-unused-command-line-argument -mllvm -verify-machineinstrs -O3 -arch x86_64h -isysroot /Applications/Xcode.app/Contents/Developer/Platforms/MacOSX.platform/Developer/SDKs/MacOSX10.14.sdk -Wl,-search_paths_first -Wl,-headerpad_max_install_names -B /Applications/Xcode.app/Contents/Developer/Toolchains/XcodeDefault.xctoolchain/usr/bin MultiSource/Benchmarks/DOE-ProxyApps-C++/HPCCG/CMakeFiles/HPCCG.dir/HPCCG.cpp.o MultiSource/Benchmarks/DOE-ProxyApps-C++/HPCCG/CMakeFiles/HPCCG.dir/HPC_Sparse_Matrix.cpp.o MultiSource/Benchmarks/DOE-ProxyApps-C++/HPCCG/CMakeFiles/HPCCG.dir/HPC_sparsemv.cpp.o MultiSource/Benchmarks/DOE-ProxyApps-C++/HPCCG/CMakeFiles/HPCCG.dir/YAML_Doc.cpp.o MultiSource/Benchmarks/DOE-ProxyApps-C++/HPCCG/CMakeFiles/HPCCG.dir/YAML_Element.cpp.o MultiSource/Benchmarks/DOE-ProxyApps-C++/HPCCG/CMakeFiles/HPCCG.dir/compute_residual.cpp.o MultiSource/Benchmarks/DOE-ProxyApps-C++/HPCCG/CMakeFiles/HPCCG.dir/ddot.cpp.o MultiSource/Benchmarks/DOE-ProxyApps-C++/HPCCG/CMakeFiles/HPCCG.dir/dump_matlab_matrix.cpp.o MultiSource/Benchmarks/DOE-ProxyApps-C++/HPCCG/CMakeFiles/HPCCG.dir/exchange_externals.cpp.o MultiSource/Benchmarks/DOE-ProxyApps-C++/HPCCG/CMakeFiles/HPCCG.dir/generate_matrix.cpp.o MultiSource/Benchmarks/DOE-ProxyApps-C++/HPCCG/CMakeFiles/HPCCG.dir/main.cpp.o MultiSource/Benchmarks/DOE-ProxyApps-C++/HPCCG/CMakeFiles/HPCCG.dir/make_local_matrix.cpp.o MultiSource/Benchmarks/DOE-ProxyApps-C++/HPCCG/CMakeFiles/HPCCG.dir/mytimer.cpp.o MultiSource/Benchmarks/DOE-ProxyApps-C++/HPCCG/CMakeFiles/HPCCG.dir/read_HPC_row.cpp.o MultiSource/Benchmarks/DOE-ProxyApps-C++/HPCCG/CMakeFiles/HPCCG.dir/waxpby.cpp.o  -o MultiSource/Benchmarks/DOE-ProxyApps-C++/HPCCG/HPCCG  -Wl,-no_pie -lm && cd /Users/buildslave/jenkins/workspace/test-suite-verify-machineinstrs-x86_64h-O3/test-suite-build/MultiSource/Benchmarks/DOE-ProxyApps-C++/HPCCG && /usr/local/Cellar/cmake/3.13.1/bin/cmake -E create_symlink /Users/buildslave/jenkins/workspace/test-suite-verify-machineinstrs-x86_64h-O3/test-suite/MultiSource/Benchmarks/DOE-ProxyApps-C++/HPCCG/HPCCG.reference_output /Users/buildslave/jenkins/workspace/test-suite-verify-machineinstrs-x86_64h-O3/test-suite-build/MultiSource/Benchmarks/DOE-ProxyApps-C++/HPCCG/HPCCG.reference_output
[3724/7672] /Users/buildslave/jenkins/workspace/test-suite-verify-machineinstrs-x86_64h-O3/test-suite-build/tools/timeit --summary MultiSource/Benchmarks/tramp3d-v4/CMakeFiles/tramp3d-v4.dir/tramp3d-v4.cpp.o.time /Users/buildslave/jenkins/workspace/test-suite-verify-machineinstrs-x86_64h-O3/compiler/bin/clang++  -DNDEBUG  -B /Applications/Xcode.app/Contents/Developer/Toolchains/XcodeDefault.xctoolchain/usr/bin    -Wno-unused-command-line-argument -mllvm -verify-machineinstrs -O3 -arch x86_64h -isysroot /Applications/Xcode.app/Contents/Developer/Platforms/MacOSX.platform/Developer/SDKs/MacOSX10.14.sdk   -w -Werror=date-time -fno-exceptions -MD -MT MultiSource/Benchmarks/tramp3d-v4/CMakeFiles/tramp3d-v4.dir/tramp3d-v4.cpp.o -MF MultiSource/Benchmarks/tramp3d-v4/CMakeFiles/tramp3d-v4.dir/tramp3d-v4.cpp.o.d -o MultiSource/Benchmarks/tramp3d-v4/CMakeFiles/tramp3d-v4.dir/tramp3d-v4.cpp.o -c /Users/buildslave/jenkins/workspace/test-suite-verify-machineinstrs-x86_64h-O3/test-suite/MultiSource/Benchmarks/tramp3d-v4/tramp3d-v4.cpp
FAILED: MultiSource/Benchmarks/tramp3d-v4/CMakeFiles/tramp3d-v4.dir/tramp3d-v4.cpp.o 
/Users/buildslave/jenkins/workspace/test-suite-verify-machineinstrs-x86_64h-O3/test-suite-build/tools/timeit --summary MultiSource/Benchmarks/tramp3d-v4/CMakeFiles/tramp3d-v4.dir/tramp3d-v4.cpp.o.time /Users/buildslave/jenkins/workspace/test-suite-verify-machineinstrs-x86_64h-O3/compiler/bin/clang++  -DNDEBUG  -B /Applications/Xcode.app/Contents/Developer/Toolchains/XcodeDefault.xctoolchain/usr/bin    -Wno-unused-command-line-argument -mllvm -verify-machineinstrs -O3 -arch x86_64h -isysroot /Applications/Xcode.app/Contents/Developer/Platforms/MacOSX.platform/Developer/SDKs/MacOSX10.14.sdk   -w -Werror=date-time -fno-exceptions -MD -MT MultiSource/Benchmarks/tramp3d-v4/CMakeFiles/tramp3d-v4.dir/tramp3d-v4.cpp.o -MF MultiSource/Benchmarks/tramp3d-v4/CMakeFiles/tramp3d-v4.dir/tramp3d-v4.cpp.o.d -o MultiSource/Benchmarks/tramp3d-v4/CMakeFiles/tramp3d-v4.dir/tramp3d-v4.cpp.o -c /Users/buildslave/jenkins/workspace/test-suite-verify-machineinstrs-x86_64h-O3/test-suite/MultiSource/Benchmarks/tramp3d-v4/tramp3d-v4.cpp
/Users/buildslave/jenkins/workspace/test-suite-verify-machineinstrs-x86_64h-O3/test-suite/MultiSource/Benchmarks/tramp3d-v4/tramp3d-v4.cpp:241:35: error: non-const lvalue reference to type 'std::ostream' (aka 'basic_ostream<char>') cannot bind to a value of unrelated type 'std::ostringstream' (aka 'basic_ostringstream<char>')
  std::ostream& stream() { return *message_m; }
                                  ^~~~~~~~~~
tramp3d-v4.cpp error: implicit instantiation of undefined template 'std::__1::basic_ostringstream<char, std::__1::char_traits<char>, std::__1::allocator<char> >'
FAILED: MultiSource/Benchmarks/tramp3d-v4/CMakeFiles/tramp3d-v4.dir/tramp3d-v4.cpp.o 
/Users/buildslave/jenkins/workspace/test-suite-verify-machineinstrs-x86_64h-O3/test-suite-build/tools/timeit --summary MultiSource/Benchmarks/tramp3d-v4/CMakeFiles/tramp3d-v4.dir/tramp3d-v4.cpp.o.time /Users/buildslave/jenkins/workspace/test-suite-verify-machineinstrs-x86_64h-O3/compiler/bin/clang++  -DNDEBUG  -B /Applications/Xcode.app/Contents/Developer/Toolchains/XcodeDefault.xctoolchain/usr/bin    -Wno-unused-command-line-argument -mllvm -verify-machineinstrs -O3 -arch x86_64h -isysroot /Applications/Xcode.app/Contents/Developer/Platforms/MacOSX.platform/Developer/SDKs/MacOSX10.14.sdk   -w -Werror=date-time -fno-exceptions -MD -MT MultiSource/Benchmarks/tramp3d-v4/CMakeFiles/tramp3d-v4.dir/tramp3d-v4.cpp.o -MF MultiSource/Benchmarks/tramp3d-v4/CMakeFiles/tramp3d-v4.dir/tramp3d-v4.cpp.o.d -o MultiSource/Benchmarks/tramp3d-v4/CMakeFiles/tramp3d-v4.dir/tramp3d-v4.cpp.o -c /Users/buildslave/jenkins/workspace/test-suite-verify-machineinstrs-x86_64h-O3/test-suite/MultiSource/Benchmarks/tramp3d-v4/tramp3d-v4.cpp
/Users/buildslave/jenkins/workspace/test-suite-verify-machineinstrs-x86_64h-O3/test-suite/MultiSource/Benchmarks/tramp3d-v4/tramp3d-v4.cpp:241:35: error: non-const lvalue reference to type 'std::ostream' (aka 'basic_ostream<char>') cannot bind to a value of unrelated type 'std::ostringstream' (aka 'basic_ostringstream<char>')
  std::ostream& stream() { return *message_m; }
                                  ^~~~~~~~~~
/Users/buildslave/jenkins/workspace/test-suite-verify-machineinstrs-x86_64h-O3/test-suite/MultiSource/Benchmarks/tramp3d-v4/tramp3d-v4.cpp:244:23: error: implicit instantiation of undefined template 'std::__1::basic_ostringstream<char, std::__1::char_traits<char>, std::__1::allocator<char> >'
    { return message_m->setf(setbits,field);}
                      ^
tramp3d-v4.cpp error: implicit instantiation of undefined template 'std::__1::basic_ostringstream<char, std::__1::char_traits<char>, std::__1::allocator<char> >'
    { return message_m->setf(setbits,field);}
                      ^
/Users/buildslave/jenkins/workspace/test-suite-verify-machineinstrs-x86_64h-O3/compiler/bin/../include/c++/v1/iosfwd:136:32: note: template is declared here
    class _LIBCPP_TEMPLATE_VIS basic_ostringstream;
                               ^
/Users/buildslave/jenkins/workspace/test-suite-verify-machineinstrs-x86_64h-O3/test-suite/MultiSource/Benchmarks/tramp3d-v4/tramp3d-v4.cpp:246:42: error: implicit instantiation of undefined template 'std::__1::basic_ostringstream<char, std::__1::char_traits<char>, std::__1::allocator<char> >'
    setf(FmtFlags_t f) { return message_m->setf(f); }
                                         ^
tramp3d-v4.cpp error: implicit instantiation of undefined template 'std::__1::basic_ostringstream<char, std::__1::char_traits<char>, std::__1::allocator<char> >'
    setf(FmtFlags_t f) { return message_m->setf(f); }
                                         ^
/Users/buildslave/jenkins/workspace/test-suite-verify-machineinstrs-x86_64h-O3/compiler/bin/../include/c++/v1/iosfwd:136:32: note: template is declared here
    class _LIBCPP_TEMPLATE_VIS basic_ostringstream;
                               ^
/Users/buildslave/jenkins/workspace/test-suite-verify-machineinstrs-x86_64h-O3/test-suite/MultiSource/Benchmarks/tramp3d-v4/tramp3d-v4.cpp:247:40: error: implicit instantiation of undefined template 'std::__1::basic_ostringstream<char, std::__1::char_traits<char>, std::__1::allocator<char> >'
  void unsetf(FmtFlags_t f) { message_m->unsetf(f); }
                                       ^
tramp3d-v4.cpp error: implicit instantiation of undefined template 'std::__1::basic_ostringstream<char, std::__1::char_traits<char>, std::__1::allocator<char> >'
  void unsetf(FmtFlags_t f) { message_m->unsetf(f); }
                                       ^
/Users/buildslave/jenkins/workspace/test-suite-verify-machineinstrs-x86_64h-O3/compiler/bin/../include/c++/v1/iosfwd:136:32: note: template is declared here
    class _LIBCPP_TEMPLATE_VIS basic_ostringstream;
                               ^
/Users/buildslave/jenkins/workspace/test-suite-verify-machineinstrs-x86_64h-O3/test-suite/MultiSource/Benchmarks/tramp3d-v4/tramp3d-v4.cpp:248:40: error: implicit instantiation of undefined template 'std::__1::basic_ostringstream<char, std::__1::char_traits<char>, std::__1::allocator<char> >'
  long flags() const { return message_m->flags(); }
                                       ^
tramp3d-v4.cpp error: implicit instantiation of undefined template 'std::__1::basic_ostringstream<char, std::__1::char_traits<char>, std::__1::allocator<char> >'
  long flags() const { return message_m->flags(); }
                                       ^
/Users/buildslave/jenkins/workspace/test-suite-verify-machineinstrs-x86_64h-O3/compiler/bin/../include/c++/v1/iosfwd:136:32: note: template is declared here
    class _LIBCPP_TEMPLATE_VIS basic_ostringstream;
                               ^
/Users/buildslave/jenkins/workspace/test-suite-verify-machineinstrs-x86_64h-O3/test-suite/MultiSource/Benchmarks/tramp3d-v4/tramp3d-v4.cpp:249:46: error: implicit instantiation of undefined template 'std::__1::basic_ostringstream<char, std::__1::char_traits<char>, std::__1::allocator<char> >'
  long flags(FmtFlags_t f) { return message_m->flags(f); }
                                             ^
tramp3d-v4.cpp error: implicit instantiation of undefined template 'std::__1::basic_ostringstream<char, std::__1::char_traits<char>, std::__1::allocator<char> >'
  long flags(FmtFlags_t f) { return message_m->flags(f); }
                                             ^
/Users/buildslave/jenkins/workspace/test-suite-verify-machineinstrs-x86_64h-O3/compiler/bin/../include/c++/v1/iosfwd:136:32: note: template is declared here
    class _LIBCPP_TEMPLATE_VIS basic_ostringstream;
                               ^
/Users/buildslave/jenkins/workspace/test-suite-verify-machineinstrs-x86_64h-O3/test-suite/MultiSource/Benchmarks/tramp3d-v4/tramp3d-v4.cpp:250:39: error: implicit instantiation of undefined template 'std::__1::basic_ostringstream<char, std::__1::char_traits<char>, std::__1::allocator<char> >'
  int width() const { return message_m->width(); }
                                      ^
tramp3d-v4.cpp error: implicit instantiation of undefined template 'std::__1::basic_ostringstream<char, std::__1::char_traits<char>, std::__1::allocator<char> >'
  int width() const { return message_m->width(); }
                                      ^
/Users/buildslave/jenkins/workspace/test-suite-verify-machineinstrs-x86_64h-O3/compiler/bin/../include/c++/v1/iosfwd:136:32: note: template is declared here
    class _LIBCPP_TEMPLATE_VIS basic_ostringstream;
                               ^
/Users/buildslave/jenkins/workspace/test-suite-verify-machineinstrs-x86_64h-O3/test-suite/MultiSource/Benchmarks/tramp3d-v4/tramp3d-v4.cpp:251:38: error: implicit instantiation of undefined template 'std::__1::basic_ostringstream<char, std::__1::char_traits<char>, std::__1::allocator<char> >'
  int width(int w) { return message_m->width(w); }
                                     ^
tramp3d-v4.cpp error: implicit instantiation of undefined template 'std::__1::basic_ostringstream<char, std::__1::char_traits<char>, std::__1::allocator<char> >'
  int width(int w) { return message_m->width(w); }
                                     ^
/Users/buildslave/jenkins/workspace/test-suite-verify-machineinstrs-x86_64h-O3/compiler/bin/../include/c++/v1/iosfwd:136:32: note: template is declared here
    class _LIBCPP_TEMPLATE_VIS basic_ostringstream;
                               ^
/Users/buildslave/jenkins/workspace/test-suite-verify-machineinstrs-x86_64h-O3/test-suite/MultiSource/Benchmarks/tramp3d-v4/tramp3d-v4.cpp:252:39: error: implicit instantiation of undefined template 'std::__1::basic_ostringstream<char, std::__1::char_traits<char>, std::__1::allocator<char> >'
  char fill() const { return message_m->fill(); }
                                      ^
tramp3d-v4.cpp error: implicit instantiation of undefined template 'std::__1::basic_ostringstream<char, std::__1::char_traits<char>, std::__1::allocator<char> >'
  char fill() const { return message_m->fill(); }
                                      ^
/Users/buildslave/jenkins/workspace/test-suite-verify-machineinstrs-x86_64h-O3/compiler/bin/../include/c++/v1/iosfwd:136:32: note: template is declared here
    class _LIBCPP_TEMPLATE_VIS basic_ostringstream;
                               ^
/Users/buildslave/jenkins/workspace/test-suite-verify-machineinstrs-x86_64h-O3/test-suite/MultiSource/Benchmarks/tramp3d-v4/tramp3d-v4.cpp:253:39: error: implicit instantiation of undefined template 'std::__1::basic_ostringstream<char, std::__1::char_traits<char>, std::__1::allocator<char> >'
  char fill(char c) { return message_m->fill(c); }
                                      ^
tramp3d-v4.cpp error: implicit instantiation of undefined template 'std::__1::basic_ostringstream<char, std::__1::char_traits<char>, std::__1::allocator<char> >'
  char fill(char c) { return message_m->fill(c); }
                                      ^
/Users/buildslave/jenkins/workspace/test-suite-verify-machineinstrs-x86_64h-O3/compiler/bin/../include/c++/v1/iosfwd:136:32: note: template is declared here
    class _LIBCPP_TEMPLATE_VIS basic_ostringstream;
                               ^
/Users/buildslave/jenkins/workspace/test-suite-verify-machineinstrs-x86_64h-O3/test-suite/MultiSource/Benchmarks/tramp3d-v4/tramp3d-v4.cpp:254:43: error: implicit instantiation of undefined template 'std::__1::basic_ostringstream<char, std::__1::char_traits<char>, std::__1::allocator<char> >'
  int precision() const { return message_m->precision(); }
                                          ^
tramp3d-v4.cpp error: implicit instantiation of undefined template 'std::__1::basic_ostringstream<char, std::__1::char_traits<char>, std::__1::allocator<char> >'
  int precision() const { return message_m->precision(); }
                                          ^
/Users/buildslave/jenkins/workspace/test-suite-verify-machineinstrs-x86_64h-O3/compiler/bin/../include/c++/v1/iosfwd:136:32: note: template is declared here
    class _LIBCPP_TEMPLATE_VIS basic_ostringstream;
                               ^
/Users/buildslave/jenkins/workspace/test-suite-verify-machineinstrs-x86_64h-O3/test-suite/MultiSource/Benchmarks/tramp3d-v4/tramp3d-v4.cpp:255:42: error: implicit instantiation of undefined template 'std::__1::basic_ostringstream<char, std::__1::char_traits<char>, std::__1::allocator<char> >'
  int precision(int p) { return message_m->precision(p); }
                                         ^
... (limited to first 12 issues)

Build Log

Changes
  1. [OpenMP][OMPIRBuilder] Introducing the `OMPBuilderCBHelpers` helper class (details)
  2. [Hexagon] Change HVX vector predicate types from v512/1024i1 to v64/128i1 (details)
  3. [x86] add test for uint->fp with unsafe-fp-math (PR43609); NFC (details)
  4. [AMDGPU] Update AMDGPUUsage with DWARF proposal (details)
  5. [IndVarSimply] Fix assert/release build difference. (details)
  6. [AMDGPU] AMDGPUUsage define call convention ABI (details)
  7. [libc++] Fixes backreferences for extended grammar. (details)
  8. [libc++] reduce <complex> parsing time (details)

Started by upstream project relay-test-suite-verify-machineinstrs build number 7124
originally caused by:

This run spent:

  • 36 min waiting;
  • 1 hr 4 min build duration;
  • 1 hr 4 min total from scheduled to completion.
Revision: 3a4296e9c1cdb53e0bf939b244790d257a6d5f26
  • refs/remotes/origin/master
Revision: c3478eff7a65d6a77b34e756eabc7176a2b422e8
  • detached
Revision: e630ecf2f321b7a37e915a51088983bb109f0d6a
  • refs/remotes/origin/master
Revision: 90595f186d00a0e6ad63e95e4226e34f139627f7
  • refs/remotes/origin/master

Identified problems

Ninja target failed

Below is a link to the first failed ninja target.
Indication 1

Compile Error

This build failed because of a compile error. Below is a list of all errors in the build log:
Indication 2