Started 25 days ago
Took 2 hr 12 min

Aborted Build clang-d382975-g991df7333d4a-t19455-b19455.tar.gz (Mar 17, 2021 4:11:42 PM)

Issues

Found 3 issues:
Error: received signal 15. killing monitored process(es): /Users/buildslave/jenkins/workspace/lnt-ctmark-aarch64-O3-flto/compiler/bin/clang++
[ 53%] Linking CXX executable tramp3d-v4
cd /Users/buildslave/jenkins/workspace/lnt-ctmark-aarch64-O3-flto/lnt-sandbox/build/CTMark/tramp3d-v4 && /usr/local/Cellar/cmake/3.17.2/bin/cmake -E cmake_link_script CMakeFiles/tramp3d-v4.dir/link.txt --verbose=1
/Users/buildslave/jenkins/workspace/lnt-ctmark-aarch64-O3-flto/lnt-sandbox/build/tools/timeit --summary tramp3d-v4.link.time /Users/buildslave/jenkins/workspace/lnt-ctmark-aarch64-O3-flto/compiler/bin/clang++    -B /Applications/Xcode.app/Contents/Developer/Toolchains/XcodeDefault.xctoolchain/usr/bin    -O3 -flto -arch arm64 -isysroot /Applications/Xcode.app/Contents/Developer/Platforms/iPhoneOS.platform/Developer/SDKs/iPhoneOS13.5.sdk -Wl,-search_paths_first -Wl,-headerpad_max_install_names   -B /Applications/Xcode.app/Contents/Developer/Toolchains/XcodeDefault.xctoolchain/usr/bin   CMakeFiles/tramp3d-v4.dir/tramp3d-v4.cpp.o  -o tramp3d-v4 
Cancelling nested steps due to timeout
Sending interrupt signal to process
/Users/buildslave/jenkins/workspace/lnt-ctmark-aarch64-O3-flto/lnt-sandbox/build/tools/timeit: error: received signal 15. killing monitored process(es): /Users/buildslave/jenkins/workspace/lnt-ctmark-aarch64-O3-flto/compiler/bin/clang++
make[2]: *** [CTMark/tramp3d-v4/tramp3d-v4] Terminated: 15
make[1]: *** [CTMark/tramp3d-v4/CMakeFiles/tramp3d-v4.dir/all] Terminated: 15
Error: received signal 15. killing monitored process(es): /Users/buildslave/jenkins/workspace/lnt-ctmark-aarch64-O3-flto/compiler/bin/clang++
Sending interrupt signal to process
/Users/buildslave/jenkins/workspace/lnt-ctmark-aarch64-O3-flto/lnt-sandbox/build/tools/timeit: error: received signal 15. killing monitored process(es): /Users/buildslave/jenkins/workspace/lnt-ctmark-aarch64-O3-flto/compiler/bin/clang++
make[2]: *** [CTMark/tramp3d-v4/tramp3d-v4] Terminated: 15
make[1]: *** [CTMark/tramp3d-v4/CMakeFiles/tramp3d-v4.dir/all] Terminated: 15
make: *** [all] Terminated: 15
/Users/buildslave/jenkins/workspace/lnt-ctmark-aarch64-O3-flto/lnt-sandbox/build/tools/timeit: error: received signal 15. killing monitored process(es): /Users/buildslave/jenkins/workspace/lnt-ctmark-aarch64-O3-flto/compiler/bin/clang++
/Users/buildslave/jenkins/workspace/lnt-ctmark-aarch64-O3-flto/lnt-sandbox/build/tools/timeit: error: child terminated by signal 15
*Build failed!* (return code -15)
Error: child terminated by signal 15
/Users/buildslave/jenkins/workspace/lnt-ctmark-aarch64-O3-flto/lnt-sandbox/build/tools/timeit: error: received signal 15. killing monitored process(es): /Users/buildslave/jenkins/workspace/lnt-ctmark-aarch64-O3-flto/compiler/bin/clang++
make[2]: *** [CTMark/tramp3d-v4/tramp3d-v4] Terminated: 15
make[1]: *** [CTMark/tramp3d-v4/CMakeFiles/tramp3d-v4.dir/all] Terminated: 15
make: *** [all] Terminated: 15
/Users/buildslave/jenkins/workspace/lnt-ctmark-aarch64-O3-flto/lnt-sandbox/build/tools/timeit: error: received signal 15. killing monitored process(es): /Users/buildslave/jenkins/workspace/lnt-ctmark-aarch64-O3-flto/compiler/bin/clang++
/Users/buildslave/jenkins/workspace/lnt-ctmark-aarch64-O3-flto/lnt-sandbox/build/tools/timeit: error: child terminated by signal 15
*Build failed!* (return code -15)
script returned exit code 143

Build Log

Changes
  1. [M68k] Use fixed asm string for MxPseudo instructions (details)
  2. [M68k] Forward declare getMCInstrBeads in one place (details)
  3. [NewPM] Verify LoopAnalysisResults after a loop pass (details)
  4. [mlir][IR] Support parsing hex float values in the DialectSymbolParser (details)
  5. [ARM] Add VREV MVE shuffle costs (details)
  6. [ASTMatchers][NFC] Use move semantics when passing matchers around. (details)
  7. [Object][MachO] Handle end iterator in getSymbolType() (details)

Started by upstream project relay-lnt-ctmark build number 11829
originally caused by:

This run spent:

  • 6.6 sec waiting;
  • 2 hr 12 min build duration;
  • 2 hr 12 min total from scheduled to completion.
Revision: 70a8255a6f8d3afb11d6223f0c44aa5efe61743a
  • refs/remotes/origin/main
Revision: 991df7333d4a6c9904dec17f53b4c531cfb40d49
  • detached
Revision: f48d431f44610e339d00a33d57564c6029c4ff43
  • refs/remotes/origin/main
Revision: e4defee7cbb23a72d99e2a1e0990030c43f54796
  • refs/remotes/origin/main

Timeout has been exceeded

Identified problems

Compile Error

This build failed because of a compile error. Below is a list of all errors in the build log:
Indication 1