Started 1 mo 5 days ago
Took 1 hr 20 min

Failed Build clang-d359318-g11a3f040c71-t12167-b12167.tar.gz (Jul 4, 2020 11:59:32 AM)

Issues

Found 2 issues:
Ninja target: mytimer.cpp.o
[7316/11527] /Users/buildslave/jenkins/workspace/test-suite-verify-machineinstrs-aarch64-O3/test-suite-build/tools/timeit --summary MultiSource/Benchmarks/DOE-ProxyApps-C++/PENNANT/CMakeFiles/PENNANT.dir/Mesh.cc.o.time /Users/buildslave/jenkins/workspace/test-suite-verify-machineinstrs-aarch64-O3/compiler/bin/clang++  -DNDEBUG  -B /Applications/Xcode.app/Contents/Developer/Toolchains/XcodeDefault.xctoolchain/usr/bin    -Wno-unused-command-line-argument -mllvm -verify-machineinstrs -O3 -arch arm64 -isysroot /Applications/Xcode.app/Contents/Developer/Platforms/iPhoneOS.platform/Developer/SDKs/iPhoneOS13.5.sdk   -w -Werror=date-time -MD -MT MultiSource/Benchmarks/DOE-ProxyApps-C++/PENNANT/CMakeFiles/PENNANT.dir/Mesh.cc.o -MF MultiSource/Benchmarks/DOE-ProxyApps-C++/PENNANT/CMakeFiles/PENNANT.dir/Mesh.cc.o.d -o MultiSource/Benchmarks/DOE-ProxyApps-C++/PENNANT/CMakeFiles/PENNANT.dir/Mesh.cc.o -c /Users/buildslave/jenkins/workspace/test-suite-verify-machineinstrs-aarch64-O3/test-suite/MultiSource/Benchmarks/DOE-ProxyApps-C++/PENNANT/Mesh.cc
[7317/11527] /Users/buildslave/jenkins/workspace/test-suite-verify-machineinstrs-aarch64-O3/test-suite-build/tools/timeit --summary MultiSource/Benchmarks/DOE-ProxyApps-C++/miniFE/CMakeFiles/miniFE.dir/BoxPartition.cpp.o.time /Users/buildslave/jenkins/workspace/test-suite-verify-machineinstrs-aarch64-O3/compiler/bin/clang++  -DNDEBUG -I/Users/buildslave/jenkins/workspace/test-suite-verify-machineinstrs-aarch64-O3/test-suite/MultiSource/Benchmarks/DOE-ProxyApps-C++/miniFE -B /Applications/Xcode.app/Contents/Developer/Toolchains/XcodeDefault.xctoolchain/usr/bin    -Wno-unused-command-line-argument -mllvm -verify-machineinstrs -O3 -arch arm64 -isysroot /Applications/Xcode.app/Contents/Developer/Platforms/iPhoneOS.platform/Developer/SDKs/iPhoneOS13.5.sdk   -w -Werror=date-time -I. -DMINIFE_SCALAR=double -DMINIFE_LOCAL_ORDINAL=int -DMINIFE_GLOBAL_ORDINAL=int -DMINIFE_CSR_MATRIX -DREDSTORM -D_XOPEN_SOURCE=700 -MD -MT MultiSource/Benchmarks/DOE-ProxyApps-C++/miniFE/CMakeFiles/miniFE.dir/BoxPartition.cpp.o -MF MultiSource/Benchmarks/DOE-ProxyApps-C++/miniFE/CMakeFiles/miniFE.dir/BoxPartition.cpp.o.d -o MultiSource/Benchmarks/DOE-ProxyApps-C++/miniFE/CMakeFiles/miniFE.dir/BoxPartition.cpp.o -c /Users/buildslave/jenkins/workspace/test-suite-verify-machineinstrs-aarch64-O3/test-suite/MultiSource/Benchmarks/DOE-ProxyApps-C++/miniFE/BoxPartition.cpp
[7318/11527] /Users/buildslave/jenkins/workspace/test-suite-verify-machineinstrs-aarch64-O3/test-suite-build/tools/timeit --summary MultiSource/Benchmarks/DOE-ProxyApps-C++/PENNANT/CMakeFiles/PENNANT.dir/TTS.cc.o.time /Users/buildslave/jenkins/workspace/test-suite-verify-machineinstrs-aarch64-O3/compiler/bin/clang++  -DNDEBUG  -B /Applications/Xcode.app/Contents/Developer/Toolchains/XcodeDefault.xctoolchain/usr/bin    -Wno-unused-command-line-argument -mllvm -verify-machineinstrs -O3 -arch arm64 -isysroot /Applications/Xcode.app/Contents/Developer/Platforms/iPhoneOS.platform/Developer/SDKs/iPhoneOS13.5.sdk   -w -Werror=date-time -MD -MT MultiSource/Benchmarks/DOE-ProxyApps-C++/PENNANT/CMakeFiles/PENNANT.dir/TTS.cc.o -MF MultiSource/Benchmarks/DOE-ProxyApps-C++/PENNANT/CMakeFiles/PENNANT.dir/TTS.cc.o.d -o MultiSource/Benchmarks/DOE-ProxyApps-C++/PENNANT/CMakeFiles/PENNANT.dir/TTS.cc.o -c /Users/buildslave/jenkins/workspace/test-suite-verify-machineinstrs-aarch64-O3/test-suite/MultiSource/Benchmarks/DOE-ProxyApps-C++/PENNANT/TTS.cc
[7319/11527] /Users/buildslave/jenkins/workspace/test-suite-verify-machineinstrs-aarch64-O3/test-suite-build/tools/timeit --summary MultiSource/Benchmarks/DOE-ProxyApps-C++/PENNANT/CMakeFiles/PENNANT.dir/main.cc.o.time /Users/buildslave/jenkins/workspace/test-suite-verify-machineinstrs-aarch64-O3/compiler/bin/clang++  -DNDEBUG  -B /Applications/Xcode.app/Contents/Developer/Toolchains/XcodeDefault.xctoolchain/usr/bin    -Wno-unused-command-line-argument -mllvm -verify-machineinstrs -O3 -arch arm64 -isysroot /Applications/Xcode.app/Contents/Developer/Platforms/iPhoneOS.platform/Developer/SDKs/iPhoneOS13.5.sdk   -w -Werror=date-time -MD -MT MultiSource/Benchmarks/DOE-ProxyApps-C++/PENNANT/CMakeFiles/PENNANT.dir/main.cc.o -MF MultiSource/Benchmarks/DOE-ProxyApps-C++/PENNANT/CMakeFiles/PENNANT.dir/main.cc.o.d -o MultiSource/Benchmarks/DOE-ProxyApps-C++/PENNANT/CMakeFiles/PENNANT.dir/main.cc.o -c /Users/buildslave/jenkins/workspace/test-suite-verify-machineinstrs-aarch64-O3/test-suite/MultiSource/Benchmarks/DOE-ProxyApps-C++/PENNANT/main.cc
[7320/11527] /Users/buildslave/jenkins/workspace/test-suite-verify-machineinstrs-aarch64-O3/test-suite-build/tools/timeit --summary MultiSource/Benchmarks/DOE-ProxyApps-C++/miniFE/CMakeFiles/miniFE.dir/mytimer.cpp.o.time /Users/buildslave/jenkins/workspace/test-suite-verify-machineinstrs-aarch64-O3/compiler/bin/clang++  -DNDEBUG -I/Users/buildslave/jenkins/workspace/test-suite-verify-machineinstrs-aarch64-O3/test-suite/MultiSource/Benchmarks/DOE-ProxyApps-C++/miniFE -B /Applications/Xcode.app/Contents/Developer/Toolchains/XcodeDefault.xctoolchain/usr/bin    -Wno-unused-command-line-argument -mllvm -verify-machineinstrs -O3 -arch arm64 -isysroot /Applications/Xcode.app/Contents/Developer/Platforms/iPhoneOS.platform/Developer/SDKs/iPhoneOS13.5.sdk   -w -Werror=date-time -I. -DMINIFE_SCALAR=double -DMINIFE_LOCAL_ORDINAL=int -DMINIFE_GLOBAL_ORDINAL=int -DMINIFE_CSR_MATRIX -DREDSTORM -D_XOPEN_SOURCE=700 -MD -MT MultiSource/Benchmarks/DOE-ProxyApps-C++/miniFE/CMakeFiles/miniFE.dir/mytimer.cpp.o -MF MultiSource/Benchmarks/DOE-ProxyApps-C++/miniFE/CMakeFiles/miniFE.dir/mytimer.cpp.o.d -o MultiSource/Benchmarks/DOE-ProxyApps-C++/miniFE/CMakeFiles/miniFE.dir/mytimer.cpp.o -c /Users/buildslave/jenkins/workspace/test-suite-verify-machineinstrs-aarch64-O3/test-suite/MultiSource/Benchmarks/DOE-ProxyApps-C++/miniFE/mytimer.cpp
FAILED: MultiSource/Benchmarks/DOE-ProxyApps-C++/miniFE/CMakeFiles/miniFE.dir/mytimer.cpp.o 
/Users/buildslave/jenkins/workspace/test-suite-verify-machineinstrs-aarch64-O3/test-suite-build/tools/timeit --summary MultiSource/Benchmarks/DOE-ProxyApps-C++/miniFE/CMakeFiles/miniFE.dir/mytimer.cpp.o.time /Users/buildslave/jenkins/workspace/test-suite-verify-machineinstrs-aarch64-O3/compiler/bin/clang++  -DNDEBUG -I/Users/buildslave/jenkins/workspace/test-suite-verify-machineinstrs-aarch64-O3/test-suite/MultiSource/Benchmarks/DOE-ProxyApps-C++/miniFE -B /Applications/Xcode.app/Contents/Developer/Toolchains/XcodeDefault.xctoolchain/usr/bin    -Wno-unused-command-line-argument -mllvm -verify-machineinstrs -O3 -arch arm64 -isysroot /Applications/Xcode.app/Contents/Developer/Platforms/iPhoneOS.platform/Developer/SDKs/iPhoneOS13.5.sdk   -w -Werror=date-time -I. -DMINIFE_SCALAR=double -DMINIFE_LOCAL_ORDINAL=int -DMINIFE_GLOBAL_ORDINAL=int -DMINIFE_CSR_MATRIX -DREDSTORM -D_XOPEN_SOURCE=700 -MD -MT MultiSource/Benchmarks/DOE-ProxyApps-C++/miniFE/CMakeFiles/miniFE.dir/mytimer.cpp.o -MF MultiSource/Benchmarks/DOE-ProxyApps-C++/miniFE/CMakeFiles/miniFE.dir/mytimer.cpp.o.d -o MultiSource/Benchmarks/DOE-ProxyApps-C++/miniFE/CMakeFiles/miniFE.dir/mytimer.cpp.o -c /Users/buildslave/jenkins/workspace/test-suite-verify-machineinstrs-aarch64-O3/test-suite/MultiSource/Benchmarks/DOE-ProxyApps-C++/miniFE/mytimer.cpp
/Users/buildslave/jenkins/workspace/test-suite-verify-machineinstrs-aarch64-O3/test-suite/MultiSource/Benchmarks/DOE-ProxyApps-C++/miniFE/mytimer.cpp:116:19: error: variable has incomplete type 'struct timezone'
mytimer.cpp error: variable has incomplete type 'struct timezone'
[7318/11527] /Users/buildslave/jenkins/workspace/test-suite-verify-machineinstrs-aarch64-O3/test-suite-build/tools/timeit --summary MultiSource/Benchmarks/DOE-ProxyApps-C++/PENNANT/CMakeFiles/PENNANT.dir/TTS.cc.o.time /Users/buildslave/jenkins/workspace/test-suite-verify-machineinstrs-aarch64-O3/compiler/bin/clang++  -DNDEBUG  -B /Applications/Xcode.app/Contents/Developer/Toolchains/XcodeDefault.xctoolchain/usr/bin    -Wno-unused-command-line-argument -mllvm -verify-machineinstrs -O3 -arch arm64 -isysroot /Applications/Xcode.app/Contents/Developer/Platforms/iPhoneOS.platform/Developer/SDKs/iPhoneOS13.5.sdk   -w -Werror=date-time -MD -MT MultiSource/Benchmarks/DOE-ProxyApps-C++/PENNANT/CMakeFiles/PENNANT.dir/TTS.cc.o -MF MultiSource/Benchmarks/DOE-ProxyApps-C++/PENNANT/CMakeFiles/PENNANT.dir/TTS.cc.o.d -o MultiSource/Benchmarks/DOE-ProxyApps-C++/PENNANT/CMakeFiles/PENNANT.dir/TTS.cc.o -c /Users/buildslave/jenkins/workspace/test-suite-verify-machineinstrs-aarch64-O3/test-suite/MultiSource/Benchmarks/DOE-ProxyApps-C++/PENNANT/TTS.cc
[7319/11527] /Users/buildslave/jenkins/workspace/test-suite-verify-machineinstrs-aarch64-O3/test-suite-build/tools/timeit --summary MultiSource/Benchmarks/DOE-ProxyApps-C++/PENNANT/CMakeFiles/PENNANT.dir/main.cc.o.time /Users/buildslave/jenkins/workspace/test-suite-verify-machineinstrs-aarch64-O3/compiler/bin/clang++  -DNDEBUG  -B /Applications/Xcode.app/Contents/Developer/Toolchains/XcodeDefault.xctoolchain/usr/bin    -Wno-unused-command-line-argument -mllvm -verify-machineinstrs -O3 -arch arm64 -isysroot /Applications/Xcode.app/Contents/Developer/Platforms/iPhoneOS.platform/Developer/SDKs/iPhoneOS13.5.sdk   -w -Werror=date-time -MD -MT MultiSource/Benchmarks/DOE-ProxyApps-C++/PENNANT/CMakeFiles/PENNANT.dir/main.cc.o -MF MultiSource/Benchmarks/DOE-ProxyApps-C++/PENNANT/CMakeFiles/PENNANT.dir/main.cc.o.d -o MultiSource/Benchmarks/DOE-ProxyApps-C++/PENNANT/CMakeFiles/PENNANT.dir/main.cc.o -c /Users/buildslave/jenkins/workspace/test-suite-verify-machineinstrs-aarch64-O3/test-suite/MultiSource/Benchmarks/DOE-ProxyApps-C++/PENNANT/main.cc
[7320/11527] /Users/buildslave/jenkins/workspace/test-suite-verify-machineinstrs-aarch64-O3/test-suite-build/tools/timeit --summary MultiSource/Benchmarks/DOE-ProxyApps-C++/miniFE/CMakeFiles/miniFE.dir/mytimer.cpp.o.time /Users/buildslave/jenkins/workspace/test-suite-verify-machineinstrs-aarch64-O3/compiler/bin/clang++  -DNDEBUG -I/Users/buildslave/jenkins/workspace/test-suite-verify-machineinstrs-aarch64-O3/test-suite/MultiSource/Benchmarks/DOE-ProxyApps-C++/miniFE -B /Applications/Xcode.app/Contents/Developer/Toolchains/XcodeDefault.xctoolchain/usr/bin    -Wno-unused-command-line-argument -mllvm -verify-machineinstrs -O3 -arch arm64 -isysroot /Applications/Xcode.app/Contents/Developer/Platforms/iPhoneOS.platform/Developer/SDKs/iPhoneOS13.5.sdk   -w -Werror=date-time -I. -DMINIFE_SCALAR=double -DMINIFE_LOCAL_ORDINAL=int -DMINIFE_GLOBAL_ORDINAL=int -DMINIFE_CSR_MATRIX -DREDSTORM -D_XOPEN_SOURCE=700 -MD -MT MultiSource/Benchmarks/DOE-ProxyApps-C++/miniFE/CMakeFiles/miniFE.dir/mytimer.cpp.o -MF MultiSource/Benchmarks/DOE-ProxyApps-C++/miniFE/CMakeFiles/miniFE.dir/mytimer.cpp.o.d -o MultiSource/Benchmarks/DOE-ProxyApps-C++/miniFE/CMakeFiles/miniFE.dir/mytimer.cpp.o -c /Users/buildslave/jenkins/workspace/test-suite-verify-machineinstrs-aarch64-O3/test-suite/MultiSource/Benchmarks/DOE-ProxyApps-C++/miniFE/mytimer.cpp
FAILED: MultiSource/Benchmarks/DOE-ProxyApps-C++/miniFE/CMakeFiles/miniFE.dir/mytimer.cpp.o 
/Users/buildslave/jenkins/workspace/test-suite-verify-machineinstrs-aarch64-O3/test-suite-build/tools/timeit --summary MultiSource/Benchmarks/DOE-ProxyApps-C++/miniFE/CMakeFiles/miniFE.dir/mytimer.cpp.o.time /Users/buildslave/jenkins/workspace/test-suite-verify-machineinstrs-aarch64-O3/compiler/bin/clang++  -DNDEBUG -I/Users/buildslave/jenkins/workspace/test-suite-verify-machineinstrs-aarch64-O3/test-suite/MultiSource/Benchmarks/DOE-ProxyApps-C++/miniFE -B /Applications/Xcode.app/Contents/Developer/Toolchains/XcodeDefault.xctoolchain/usr/bin    -Wno-unused-command-line-argument -mllvm -verify-machineinstrs -O3 -arch arm64 -isysroot /Applications/Xcode.app/Contents/Developer/Platforms/iPhoneOS.platform/Developer/SDKs/iPhoneOS13.5.sdk   -w -Werror=date-time -I. -DMINIFE_SCALAR=double -DMINIFE_LOCAL_ORDINAL=int -DMINIFE_GLOBAL_ORDINAL=int -DMINIFE_CSR_MATRIX -DREDSTORM -D_XOPEN_SOURCE=700 -MD -MT MultiSource/Benchmarks/DOE-ProxyApps-C++/miniFE/CMakeFiles/miniFE.dir/mytimer.cpp.o -MF MultiSource/Benchmarks/DOE-ProxyApps-C++/miniFE/CMakeFiles/miniFE.dir/mytimer.cpp.o.d -o MultiSource/Benchmarks/DOE-ProxyApps-C++/miniFE/CMakeFiles/miniFE.dir/mytimer.cpp.o -c /Users/buildslave/jenkins/workspace/test-suite-verify-machineinstrs-aarch64-O3/test-suite/MultiSource/Benchmarks/DOE-ProxyApps-C++/miniFE/mytimer.cpp
/Users/buildslave/jenkins/workspace/test-suite-verify-machineinstrs-aarch64-O3/test-suite/MultiSource/Benchmarks/DOE-ProxyApps-C++/miniFE/mytimer.cpp:116:19: error: variable has incomplete type 'struct timezone'
  struct timezone tz;
                  ^

Build Log

Changes
  1. [clang-tidy] Allows the prevailing include header guard in Flang to be recognized rather than flagged as a violation in phabricator. (details)
  2. [flang][openmp] Use common Directive and Clause enum from llvm/Frontend (details)
  3. [flang] Add the Runtime.h to prepare for more code being upstreamed. (details)
  4. [AMDGPU] Update DWARF proposal (details)
  5. [ELF] Don't resolve a relocation in .debug_line referencing an ICF folded symbol to the tombstone value (details)
  6. [libTooling] Fix `maybeExtendRange` to support `CharRange`s. (details)
  7. [CallGraph] Add support for callback call sites (details)
  8. [flang] Implement cross-set EQUIVALENCE impossibility checking (details)
  9. [compiler-rt][Android] Use correct builtins library name for tests (details)
  10. [InstSimplify] Move assume icmp test (NFC) (details)
  11. [lldb/API] Add missing LLDB_RECORD_RESULT (details)
  12. [RISCV][NFC] Pre-commit tests for D82660 (details)
  13. Revert "[X86] Enable multibyte NOPs in 64-bit mode for padding/alignment." (details)
  14. [NFC][ScalarEvolution] Add udiv-disguised-as-sdiv test (details)
  15. Revert "[flang][openmp] Use common Directive and Clause enum from llvm/Frontend" (details)
  16. [AMDGPU] Limit promote alloca to vector with VGPR budget (details)
  17. AMDGPU: Fix missing tracksRegLiveness in tests (details)
  18. RegAllocGreedy: Use TargetInstrInfo already in the class (details)
  19. AMDGPU: Set more mov flags on V_ACCVGPR_{READ|WRITE}_B32 (details)
  20. [NFCI] Actually provide correct check lines in sdiv.ll (details)
  21. clang CoverageMapping tests bot cleanup (details)
  22. typo fixes to cycle bots (details)
  23. Update lto.ll test after 3367e9da enabled multibyte NOPs in 64-bit mode. (details)
  24. Revert "Update lto.ll test after 3367e9da enabled multibyte NOPs in 64-bit mode." (details)
  25. [gcov] Move llvm_writeout_files from atexit to a static destructor (details)
  26. [flang][NFC] Get formatting in sync with latest clang-format (details)
  27. [mlir][NFC] Move conversion of scf to spir-v ops in their own file (details)
  28. [mlir][spirv] Add support for lowering scf.for scf/if with return value (details)
  29. [PowerPC] Exploit xxspltiw and xxspltidp instructions (details)
  30. [flang] Add more support for alternate returns (details)
  31. [PowerPC][NFC] Update doc for FeatureISA3_1/FeatureISA3_0 definitions (details)
  32. [X86-64] Support Intel AMX instructions (details)
  33. [flang][openmp] Use common Directive and Clause enum from llvm/Frontend (details)
  34. [PowerPC]Implement Vector Shift Double Bit Immediate Builtins (details)
  35. [lld-macho] Make sure ZeroFill sections are at the end of their segments (details)
  36. [AMDGPU] Control num waves per EU for implicit work-group size (details)
  37. [lldb/ObjCRuntime] Implement support for small method lists (details)
  38. [lldb/ObjC] Add support for direct selector references (details)
  39. [lldb/build.py] Always pass an SDK to the compiler on Darwin (details)
  40. lld/MachO: Remove a useless temporary (details)
  41. ld64.lld: Add janky support for tbd files (details)
  42. [mlir][OpFormatGen] Add support for resolving variadic types from non-variadic (details)
  43. Add parenthesized expression to SyntaxTree (details)
  44. This patch adds basic debug info support with basic block sections. (details)
  45. [clang] Re-add deleted forward declaration. (details)
  46. [X86] Enable multibyte NOPs in 64-bit mode for padding/alignment. (details)
  47. [lldb][NFC] Fix a variable name in ClangDiagnosticManagerAdapter (details)
  48. Revert "[clang-tidy] For `run-clang-tidy.py` escape the paths that are used for analysis." (details)
  49. [CodeGen] Fix warnings in getCopyToPartsVector (details)
  50. Fix missing build dependency on omp_gen. (details)
  51. [ARM] Rearrange SizeReduction when using -Oz (details)
  52. [NFC] Fix typo in triples from unkown to unknown (details)
  53. [lldb][NFC] Don't pass around passthrough from ClangDiagnosticManagerAdapter (details)
  54. [SVE] ACLE: Fix builtins for svdup_lane_bf16 and svcvtnt_bf16_f32_x (details)
  55. [AArch64][SVE] Add unpred load/store patterns for bf16 types (details)
  56. [CodeGen][SVE] Don't drop scalable flag in DAGCombiner::visitEXTRACT_SUBVECTOR (details)
  57. [AMDGPU] Fix formatting in MIR tests (details)
  58. DSE: fix builtin function recognition to take decl into account (details)
  59. [Support][Windows] Prevent 2s delay when renaming a file that does not exist (details)
  60. [SVE] Add warnings checks in four more LLVM SVE tests (details)
  61. [VE] Rename VE toolchain source files (details)
  62. [gn build] Port 804d9687443 (details)
  63. [BasicAA] New basic-aa-recphi test. NFC (details)
  64. [ScalarEvolution] createSCEV(): recognize `udiv`/`urem` disguised as an `sdiv`/`srem` (details)
  65. Regenerate llvm/test/CodeGen/X86/optimize-max-0.ll (details)
  66. [LV] Enable the LoopVectorizer to create pointer inductions (details)
  67. Fix some typos (unkown -> unknown); NFC (details)
  68. Regenerate apint-shift tests and replace %tmp variable names to silence update_test_checks warnings (details)
  69. [InstCombine] Add some (vXi1 trunc(lshr(x,c))) -> icmp_eq(and(x,c')) tests for non-uniform vectors (details)
  70. [AArch64][SVE] Add reg+imm addressing mode for unpredicated stores (details)
  71. [Alignment][NFC] VectorLayout now uses Align internally (details)
  72. [Alignment][NFC] Transition and simplify calls to DL::getABITypeAlignment (details)
  73. [NFC][clang] Add missing VALIDATE_DIAG_SIZE() (details)
  74. [clangd] Switch FindSymbolsTests to use TestTU (details)
  75. [analyzer][StdLibraryFunctionsChecker] Add POSIX file handling functions (details)
  76. [lldb] Skip TestLimitDebugInfo on windows (details)
  77. [clang] Fix a null-NSS-access crash in DependentNameType. (details)
  78. [BasicAA] Fix recursive phi MustAlias calculations (details)
  79. [flang] Add changes to codegen to convert it to tablegen passes. (details)
  80. [flang] Add inliner pass. (details)
  81. [clang][Serialization] Don't duplicate the body of LambdaExpr during deserialization (details)
  82. [AArch64][SVE] Put zeroing pseudos and patterns under flag. (details)
  83. Regenerate sext/trunc tests and replace %tmp variable names to silence update_test_checks warnings (details)
  84. call ::pthread_detach on llvm_execute_on_thread_impl (details)
  85. [lldb] Add a host-independent test for handling -flimit-debug-info (details)
  86. [ASTMatchers] Enhanced support for matchers taking Regex arguments (details)
  87. Fix missing build dependencies on omp_gen (details)
  88. [AMDGPU][CODEGEN] Added support of new inline assembler constraints (details)
  89. [MLIR] Exact integer emptiness checks for FlatAffineConstraints (details)
  90. [ASTImporter] Add unittest case for friend decl import (details)
  91. Preserve GlobalsAA analysis result in LowerConstantIntrinsics (details)
  92. [ELF][test] Add some additional .eh_frame/.eh_frame_hdr testing (details)
  93. [InstCombine] Add some (vXi1 trunc(lshr(x,c))) -> icmp_eq(and(x,c')) tests for vectors with undef elements (details)
  94. [InstCombine] Add (vXi1 trunc(lshr(x,c))) -> icmp_eq(and(x,c')) support for non-uniform vectors (details)
  95. [AArch64][SVE] NFC: Rename isOrig -> isReverseInstr (details)
  96. [lldb] Fix type conversion in the Scalar getters (details)
  97. [InstCombine] Add some sext/trunc tests to show missing support for non-uniform vectors (details)
  98. [MLIR][SPIRVToLLVM] Implementation of spv.BitFieldInsert pattern (details)
  99. [MLIR][SPIRVToLLVM] SPIR-V function call conversion pattern (details)
  100. [MLIR][SPIRV] Support two memory access attributes in OpCopyMemory. (details)
  101. [PowerPC] Remove undefs from splat input when changing shuffle mask (details)
  102. [LLD] Add required dependency after shared libs break due to ba5087f13025 (details)
  103. [OpenMP][CMake] Fix version detection of testing compiler (details)
  104. [OpenMPOpt][Fix] Remove double initialization of omp::types. (details)
  105. [NewPM][LSR] Rename strength-reduce -> loop-reduce (details)
  106. [gn build] make building on an arm mac work (details)
  107. [MLIR][SPIRVToLLVM] Convert spv.constant scalars and vectors (details)
  108. [NewPM] Add -basic-aa to pr33196.ll (details)
  109. [clang][NFC] Store a pointer to the ASTContext in ASTDumper and TextNodeDumper (details)
  110. [DebugInfo] Fix LineTest byteswap for cross-targeting builds (details)
  111. Revert "[clang][NFC] Store a pointer to the ASTContext in ASTDumper and TextNodeDumper" (details)
  112. [flang] Fix bug determining alternate return (details)
  113. [flang] Clean up binary dependences of runtime libraries (details)
  114. ld64.lld: Make janky support for tbd files actually work sometimes (details)
  115. [PowerPC]Implement Vector Permute Extended Builtin (details)
  116. Revert "[MLIR][SPIRV] Support two memory access attributes in OpCopyMemory." (details)
  117. [X86] Add test cases for v32i8 rotate with min-legal-vector-width=256 (details)
  118. [X86] Modify the conditions for when we stop making v16i8/v32i8 rotate Custom based on having avx512 features. (details)
  119. [x86] add tests for vector select with bit-test condition; NFC (details)
  120. [mlir] [VectorOps] Add choice between dot and axpy lowering of vector.contract (details)
  121. [InstSimplify] Add test for sext/zext comparisons (NFC) (details)
  122. [test] Deflake test/profile/ContinuousSyncMode/online-merging.c (details)
  123. [X86] Add test case for unfolding broadcast load from vpternlog. (details)
  124. [X86] Add vpternlog to the broadcast unfolding table. (details)
  125. [PowerPC]Add Vector Insert Instruction Definitions and MC Test (details)
  126. [SelectionDAG] don't split branch on logic-of-vector-compares (details)
  127. [x86] remove redundant tests with no check lines; NFC (details)
  128. Fix typo and check commit access. (details)
  129. [PowerPC] Implement Vector Blend Builtins in LLVM/Clang (details)
  130. [flang] External I/O runtime work, repackaged (part 1) (details)
  131. [X86] Teach lower512BitShuffle to try bitmask and bitblend before splitting v32i16/v64i8 on av512f only targets. (details)
  132. [gn build] get everything to build when llvm_targets_to_build is just AArch64 (details)
  133. [NFC][Scalarizer] Add some insertelement/extractelement tests (details)
  134. [NFC][Scalarizer] Also scalarize loads in newly-added tests (details)
  135. [flang] External I/O runtime work, repackaged (part 2) (details)
  136. [AMDGPU] Unify early PS termination blocks (details)
  137. [AMDGPU] Insert PS early exit at end of control flow (details)
  138. [PowerPC][NFC] Refactor lowerDynamicAlloc (details)
  139. Revert "[AMDGPU] Insert PS early exit at end of control flow" (details)
  140. [lld-macho] Support binding dysyms to any section (details)
  141. [PowerPC][NFC] Prevent unused error when assertion is disabled. (details)
  142. [AMDGPU] Insert PS early exit at end of control flow (details)
  143. [X86] Add back support for matching VPTERNLOG from back to back logic ops. (details)
  144. [PowerPC] Implement probing for dynamic stack allocation (details)
  145. [CostModel] Fix cast crash (details)
  146. [clang] Check ValueDependent instead of InstantiationDependent before executing the align expr for builtin align functions. (details)
  147. [X86] Remove MODRM_SPLITREGM from the disassembler tables. (details)
  148. [NFC] Use ADT/Bitfields in Instructions (details)
  149. Fix stack-clash probing for large static alloca (details)
  150. [Attributor] Create getName() method for abstract attribute (details)
  151. [OpenMP][OMPT]Add event callbacks for taskwait with depend (details)
  152. [Alignment][NFC] Use proper getter to retrieve alignment from ConstantInt and ConstantSDNode (details)
  153. [flang][NFC] Move and rework pgmath description used in folding (details)
  154. [Alignment][NFC] Use 5 bits to store Instructions Alignment (details)
  155. [llvm-readelf] - Do not error out when dumping symbols. (details)
  156. [llvm-readelf] - Do not report a misleading warning when there is no string table. (details)
  157. Regenerate PR19420 tests (details)
  158. [InstCombine] Add sext(ashr(shl(trunc(x),c),c)) folding support for vectors (details)
  159. [clangd] Improve hover on arguments to function call (details)
  160. Fix MSVC "result of 32-bit shift implicitly converted to 64 bits" warning. (details)
  161. [DWARFYAML][debug_gnu_*] Add the missing context `IsGNUStyle`. NFC. (details)
  162. [lldb] Fix missing characters when autocompleting LLDB commands in REPL (details)
  163. Regenerate mul-trunc tests, add vector variants and replace %tmp variable names to silence update_test_checks warnings (details)
  164. Add nonuniform vector trunc(or(shl(zext(x),c1),srl(zext(x),c2))) tests (details)
  165. Regenerate apint-cast tests and replace %tmp variable names to silence update_test_checks warnings (details)
  166. [DebugInfo] Use Cursor to detect errors in debug line prologue parser (details)
  167. [libcxx testing] Remove ALLOW_RETRIES from another test (details)
  168. Added tests for RecursiveASTVisitor for AST nodes that are special cased (details)
  169. RecursiveASTVisitor: don't call WalkUp unnecessarily in post-order traversal (details)
  170. Make RecursiveASTVisitor call WalkUpFrom for unary and binary operators in post-order traversal mode (details)
  171. Make RecursiveASTVisitor call WalkUpFrom for operators when the data recursion queue is absent (details)
  172. Revert RecursiveASTVisitor fixes. (details)
  173. [ARM] Add Cortex-A77 Support for Clang and LLVM (details)
  174. [AMDGPU] Don't combine DPP if DPP register is used more than once per instruction (details)
  175. [LLD][ELF][Windows] Allow LLD to overwrite existing output files that are in use (details)
  176. Add vector trunc(or(shl(zext(x),c1),zext(x))) tests (details)
  177. Add tests for trunc(shl/lshr/ashr(*ext(x),zext(and(y,c)))) patterns with variable shifts with clamped shift amounts (details)
  178. [clang][NFC] Store a pointer to the ASTContext in ASTDumper and TextNodeDumper (details)
  179. [clang][NFC] Also test for serialization in test/AST/ast-dump-comment.cpp (details)
  180. [clang][NFC] Add a missing /dev/null in test/AST/ast-dump-lambda.cpp (details)
  181. [IR] Short-circuit comparison with itself for Attributes (details)
  182. [llvm-readobj] - Use cantFail() for all `Obj->sections()` calls. NFCI. (details)
  183. [NFC][SimplifyCFG] Move X86 tests into subdir (details)
  184. [mlir] Add redundant copy removal transform (details)
  185. [DWARFYAML][unittest] Use parseDWARFYAML() in unit test. NFC. (details)
  186. [lldb/Utility] Simplify more Scalar methods (details)
  187. [ObjectYAML][ELF] Add support for emitting the .debug_gnu_pubnames/pubtypes sections. (details)
  188. [mlir] Add check for ViewLikeOpInterface that creates additional aliases. (details)
  189. [lldb/DWARF] Look for complete member definitions in other modules (details)
  190. [ARM] Generate [SU]RHADD from (b - (~a)) >> 1 (details)
  191. [AMDGPU] Added support of new inline assembler constraints (details)
  192. [InstCombine] canEvaluateTruncated - use KnownBits to check for inrange shift amounts (details)
  193. [clang][NFC] Removed unused parameters in InitializeSourceManager (details)
  194. [flang] Improve API for runtime allocator (I/O runtime work part 3) (details)
  195. [DWARFYAML][test] Use --ignore-case to suppress errors. (details)
  196. [InstCombine] add tests to show missing one-use checks; NFC (details)
  197. [InstCombine] add one-use check to cast+select narrowing transform (details)
  198. Enable basepointer for AIX. (details)
  199. [InstCombine] Precommit tests for PR43580. (details)
  200. [SLP] Precommit test for which spill cost is computed incorrectly. (details)
  201. [ARM][HWLoops] Create hardware loops for sibling loops (details)
  202. [SLP] Make sure instructions are ordered when computing spill cost. (details)
  203. [ELF] Resolve R_DTPREL in .debug_* referencing discarded symbols to -1 (details)
  204. [InstSimplify] Fold icmp with dominating assume (details)
  205. [NFC][InstCombine] Add some more tests for select based on non-canonical bit-test (details)
  206. [InstCombine] add tests for mul of bools; NFC (details)
  207. [InstCombine] fold mul of zext bools to 'and' (details)
  208. [llvm-ar][test] Unsupport error-opening-directory.test on FreeBSD (details)
  209. [XCOFF][AIX] Use 'L..' instead of '.L' for getPrivateGlobalPrefix in DataLayout (details)
  210. [flang] Add FIRBuilder.cpp (details)
  211. [libc++/libc++abi] Automatically detect whether exceptions are enabled (details)
  212. [InstCombine] Try to narrow expr if trunc cannot be removed. (details)
  213. [flang] Define new runtime error IOSTAT values (I/O runtime work part 4) (details)
  214. [flang] Track known file size, add IsATerminal (ext. I/O work part 5) (details)
  215. Revert AST Matchers default to AsIs mode (details)
  216. [PowerPC] Implement Vector Insert Builtins in LLVM/Clang (details)
  217. [clangd] Fix hover crash on invalid decls (details)
  218. [libcxx] Put clang::trivial_abi on std::unique_ptr, std::shared_ptr, and std::weak_ptr (details)
  219. [InstCombine] add more tests for mul of bools; NFC (details)
  220. [InstCombine] fold mul of sext bools to 'and' (details)
  221. [x86] improve codegen for bit-masked vector compare and select (PR46531) (details)
  222. [NFCI][InstCombine] shift.ll: s/%tmp/%i/ to silence update script warning (details)
  223. [NFCI][LoopUnroll] s/%tmp/%i/ in one test to silence update script warning (details)
  224. [PowerPC][NFC] Fix indentation (details)
  225. [LoopDeletion] Emit a remark when a dead loop is deleted (details)
  226. [gcov][test] Reorganize some compiler-rt/test/profile tests (details)
  227. [gcov][test] Add `UNSUPPORTED: host-byteorder-big-endian` to gcov-fork.c (details)
  228. [WebAssembly] Do not omit range checks for i64 switches (details)
  229. [flang] Further implementation of external I/O unit operations (part 6) (details)
  230. [X86] Add matching support for X86ISD::ANDNP to X86DAGToDAGISel::tryVPTERNLOG. (details)
  231. [PowerPC] Implement probing for prologue (details)
  232. [X86] Directly emit VPTERNLOG from canonicalizeBitSelect when possible. (details)
  233. [clangd] Config: loading and caching config from disk. (details)
  234. [gn build] Port 8bd000a65fe (details)
  235. [InstSimplify] Add additional zext/sext comparison tests (NFC) (details)
  236. [InstSimplify] Simplify comparison between zext(x) and sext(x) (details)
  237. [clangd] Config: compute config in TUScheduler and BackgroundIndex (details)
  238. [SVE] Fix invalid assert in expand_DestructiveOp. (details)
  239. [MLIR][Linalg] Generate the right type of load/store when lowering max/min pooling ops (details)
  240. [clangd] Try to fix windows buildbot. NFC (details)
  241. [analyzer][NFC] Move the data structures from CheckerRegistry to the Core library (details)
  242. [gn build] Port b6cbe6cb039 (details)
  243. [X86][AVX] Fold PACK(LOSUBVECTOR(SHUFFLE(X)),HISUBVECTOR(SHUFFLE(X))) -> SHUFFLE(PACK(LOSUBVECTOR(X),HISUBVECTOR(X))) (details)
  244. [MLIR] Parallelize affine.for op to 1-D affine.parallel op (details)
  245. [X86][SSE] Add add/fadd reduction shuffle+subvector tests (details)
  246. [libcxx testing] Remove ALLOW_RETRIES from another test (details)
  247. [DAG] matchBinOpReduction - match subvector reduction patterns beyond a matched shufflevector reduction (details)
  248. [InstCombine] add test for miscompile (PR46561); NFC (details)
  249. [InstCombine] improve debug value names; NFC (details)
  250. [InstCombine] Always try to invert non-canonical predicate of an icmp (details)
  251. [InstCombine] fix miscompile from umul_with_overflow matching (details)
  252. [clang] Fix two tests that are affected by llvm opt change (details)
  253. Revert "[libcxx] Put clang::trivial_abi on std::unique_ptr, std::shared_ptr, and std::weak_ptr" (details)
  254. [X86] Disable VPBLENDVB formation in combineLogicBlendIntoPBLENDV if VPTERNLOG is supported. (details)
  255. [X86] Teach lowerShuffleAsBlend to use bit blend for v16i8/v32i8/v16i16 when avx512vl is enabled but not avx512bw. (details)
  256. [profile] Mark gcov test as unsupported on Darwin. (details)
  257. [flang] Extend & fix per-I/O-statement state (ext. I/O work part 7) (details)
  258. [Utils] Make -assume-builder/-assume-simplify actually work on Old-PM (details)

Started by upstream project relay-test-suite-verify-machineinstrs build number 8295
originally caused by:

This run spent:

  • 49 min waiting;
  • 1 hr 20 min build duration;
  • 1 hr 21 min total from scheduled to completion.
Revision: ac4c27ddd9bf6b75f4430476a1f63a3377b38f2c
  • refs/remotes/origin/master
Revision: 11a3f040c71020b0247144268570d571858b119c
  • detached
Revision: 53229320df0e57a7b779a3dcded72fc9e6d44e01
  • refs/remotes/origin/master
Revision: 0bfeb655e49fc6feeeb63d534019019bf4bb4d7c
  • refs/remotes/origin/master

Identified problems

Compile Error

This build failed because of a compile error. Below is a list of all errors in the build log:
Indication 1

Ninja target failed

Below is a link to the first failed ninja target.
Indication 2