Started 5 hr 56 min ago
Took 2 hr 41 min

Failed Build clang-d390919-g0a0800c4d10c-t21578-b21578.tar.gz (Jun 11, 2021 11:14:11 PM)

Issues

Found 9 issues:
Ninja target: oggenc.c.o
[2196/7685] /Users/buildslave/jenkins/workspace/test-suite-verify-machineinstrs-x86_64-O3/test-suite-build/tools/timeit --summary MultiSource/Benchmarks/MallocBench/espresso/CMakeFiles/espresso.dir/gimpel.c.o.time /Users/buildslave/jenkins/workspace/test-suite-verify-machineinstrs-x86_64-O3/compiler/bin/clang -DNDEBUG  -B /Applications/Xcode.app/Contents/Developer/Toolchains/XcodeDefault.xctoolchain/usr/bin    -Wno-unused-command-line-argument -mllvm -verify-machineinstrs -O3 -arch x86_64 -isysroot /Applications/Xcode.app/Contents/Developer/Platforms/MacOSX.platform/Developer/SDKs/MacOSX10.15.sdk   -w -Werror=date-time -std=gnu89 -DNOMEMOPT -MD -MT MultiSource/Benchmarks/MallocBench/espresso/CMakeFiles/espresso.dir/gimpel.c.o -MF MultiSource/Benchmarks/MallocBench/espresso/CMakeFiles/espresso.dir/gimpel.c.o.d -o MultiSource/Benchmarks/MallocBench/espresso/CMakeFiles/espresso.dir/gimpel.c.o   -c /Users/buildslave/jenkins/workspace/test-suite-verify-machineinstrs-x86_64-O3/test-suite/MultiSource/Benchmarks/MallocBench/espresso/gimpel.c
[2197/7685] /Users/buildslave/jenkins/workspace/test-suite-verify-machineinstrs-x86_64-O3/test-suite-build/tools/timeit --summary MultiSource/Benchmarks/MallocBench/espresso/CMakeFiles/espresso.dir/gasp.c.o.time /Users/buildslave/jenkins/workspace/test-suite-verify-machineinstrs-x86_64-O3/compiler/bin/clang -DNDEBUG  -B /Applications/Xcode.app/Contents/Developer/Toolchains/XcodeDefault.xctoolchain/usr/bin    -Wno-unused-command-line-argument -mllvm -verify-machineinstrs -O3 -arch x86_64 -isysroot /Applications/Xcode.app/Contents/Developer/Platforms/MacOSX.platform/Developer/SDKs/MacOSX10.15.sdk   -w -Werror=date-time -std=gnu89 -DNOMEMOPT -MD -MT MultiSource/Benchmarks/MallocBench/espresso/CMakeFiles/espresso.dir/gasp.c.o -MF MultiSource/Benchmarks/MallocBench/espresso/CMakeFiles/espresso.dir/gasp.c.o.d -o MultiSource/Benchmarks/MallocBench/espresso/CMakeFiles/espresso.dir/gasp.c.o   -c /Users/buildslave/jenkins/workspace/test-suite-verify-machineinstrs-x86_64-O3/test-suite/MultiSource/Benchmarks/MallocBench/espresso/gasp.c
[2198/7685] /Users/buildslave/jenkins/workspace/test-suite-verify-machineinstrs-x86_64-O3/test-suite-build/tools/timeit --summary MultiSource/Benchmarks/MallocBench/espresso/CMakeFiles/espresso.dir/indep.c.o.time /Users/buildslave/jenkins/workspace/test-suite-verify-machineinstrs-x86_64-O3/compiler/bin/clang -DNDEBUG  -B /Applications/Xcode.app/Contents/Developer/Toolchains/XcodeDefault.xctoolchain/usr/bin    -Wno-unused-command-line-argument -mllvm -verify-machineinstrs -O3 -arch x86_64 -isysroot /Applications/Xcode.app/Contents/Developer/Platforms/MacOSX.platform/Developer/SDKs/MacOSX10.15.sdk   -w -Werror=date-time -std=gnu89 -DNOMEMOPT -MD -MT MultiSource/Benchmarks/MallocBench/espresso/CMakeFiles/espresso.dir/indep.c.o -MF MultiSource/Benchmarks/MallocBench/espresso/CMakeFiles/espresso.dir/indep.c.o.d -o MultiSource/Benchmarks/MallocBench/espresso/CMakeFiles/espresso.dir/indep.c.o   -c /Users/buildslave/jenkins/workspace/test-suite-verify-machineinstrs-x86_64-O3/test-suite/MultiSource/Benchmarks/MallocBench/espresso/indep.c
[2199/7685] /Users/buildslave/jenkins/workspace/test-suite-verify-machineinstrs-x86_64-O3/test-suite-build/tools/timeit --summary MultiSource/Benchmarks/MallocBench/espresso/CMakeFiles/espresso.dir/map.c.o.time /Users/buildslave/jenkins/workspace/test-suite-verify-machineinstrs-x86_64-O3/compiler/bin/clang -DNDEBUG  -B /Applications/Xcode.app/Contents/Developer/Toolchains/XcodeDefault.xctoolchain/usr/bin    -Wno-unused-command-line-argument -mllvm -verify-machineinstrs -O3 -arch x86_64 -isysroot /Applications/Xcode.app/Contents/Developer/Platforms/MacOSX.platform/Developer/SDKs/MacOSX10.15.sdk   -w -Werror=date-time -std=gnu89 -DNOMEMOPT -MD -MT MultiSource/Benchmarks/MallocBench/espresso/CMakeFiles/espresso.dir/map.c.o -MF MultiSource/Benchmarks/MallocBench/espresso/CMakeFiles/espresso.dir/map.c.o.d -o MultiSource/Benchmarks/MallocBench/espresso/CMakeFiles/espresso.dir/map.c.o   -c /Users/buildslave/jenkins/workspace/test-suite-verify-machineinstrs-x86_64-O3/test-suite/MultiSource/Benchmarks/MallocBench/espresso/map.c
[2200/7685] /Users/buildslave/jenkins/workspace/test-suite-verify-machineinstrs-x86_64-O3/test-suite-build/tools/timeit --summary MultiSource/Applications/oggenc/CMakeFiles/oggenc.dir/oggenc.c.o.time /Users/buildslave/jenkins/workspace/test-suite-verify-machineinstrs-x86_64-O3/compiler/bin/clang -DNDEBUG  -B /Applications/Xcode.app/Contents/Developer/Toolchains/XcodeDefault.xctoolchain/usr/bin    -Wno-unused-command-line-argument -mllvm -verify-machineinstrs -O3 -arch x86_64 -isysroot /Applications/Xcode.app/Contents/Developer/Platforms/MacOSX.platform/Developer/SDKs/MacOSX10.15.sdk   -w -Werror=date-time -fno-strict-aliasing -MD -MT MultiSource/Applications/oggenc/CMakeFiles/oggenc.dir/oggenc.c.o -MF MultiSource/Applications/oggenc/CMakeFiles/oggenc.dir/oggenc.c.o.d -o MultiSource/Applications/oggenc/CMakeFiles/oggenc.dir/oggenc.c.o   -c /Users/buildslave/jenkins/workspace/test-suite-verify-machineinstrs-x86_64-O3/test-suite/MultiSource/Applications/oggenc/oggenc.c
FAILED: MultiSource/Applications/oggenc/CMakeFiles/oggenc.dir/oggenc.c.o 
/Users/buildslave/jenkins/workspace/test-suite-verify-machineinstrs-x86_64-O3/test-suite-build/tools/timeit --summary MultiSource/Applications/oggenc/CMakeFiles/oggenc.dir/oggenc.c.o.time /Users/buildslave/jenkins/workspace/test-suite-verify-machineinstrs-x86_64-O3/compiler/bin/clang -DNDEBUG  -B /Applications/Xcode.app/Contents/Developer/Toolchains/XcodeDefault.xctoolchain/usr/bin    -Wno-unused-command-line-argument -mllvm -verify-machineinstrs -O3 -arch x86_64 -isysroot /Applications/Xcode.app/Contents/Developer/Platforms/MacOSX.platform/Developer/SDKs/MacOSX10.15.sdk   -w -Werror=date-time -fno-strict-aliasing -MD -MT MultiSource/Applications/oggenc/CMakeFiles/oggenc.dir/oggenc.c.o -MF MultiSource/Applications/oggenc/CMakeFiles/oggenc.dir/oggenc.c.o.d -o MultiSource/Applications/oggenc/CMakeFiles/oggenc.dir/oggenc.c.o   -c /Users/buildslave/jenkins/workspace/test-suite-verify-machineinstrs-x86_64-O3/test-suite/MultiSource/Applications/oggenc/oggenc.c
Fatal Error: error in backend: Found 2 machine code errors.
*** Bad machine code: Using an undefined physical register ***
- function:    vorbis_analysis_blockout
- basic block: %bb.17 if.end.i (0x7fb4cccc4080)
- instruction: $rax = SUB64rr $rax(tied-def 0), $rcx, implicit-def dead $eflags
- operand 2:   $rcx
fatal error: error in backend: Found 2 machine code errors.
PLEASE submit a bug report to https://bugs.llvm.org/ and include the crash backtrace, preprocessed source, and associated run script.
Stack dump:
Error: clang frontend command failed with exit code 70 (use -v to see invocation)
26 clang         0x000000010be4244d clang::driver::Compilation::ExecuteJobs(clang::driver::JobList const&, llvm::SmallVectorImpl<std::__1::pair<int, clang::driver::Command const*> >&) const + 125
27 clang         0x000000010be58e9c clang::driver::Driver::ExecuteCompilation(clang::driver::Compilation&, llvm::SmallVectorImpl<std::__1::pair<int, clang::driver::Command const*> >&) + 204
28 clang         0x0000000109578d85 main + 10309
29 libdyld.dylib 0x00007fff67a6fcc9 start + 1
30 libdyld.dylib 0x0000000000000018 start + 18446603338777166672
clang-13: error: clang frontend command failed with exit code 70 (use -v to see invocation)
clang version 13.0.0 (https://github.com/llvm/llvm-project.git 0a0800c4d10c250ffb152b5f059d6f9a19ed8efe)
Target: x86_64-apple-darwin19.5.0
Ninja target: block.c.o
[2801/7685] /Users/buildslave/jenkins/workspace/test-suite-verify-machineinstrs-x86_64-O3/test-suite-build/tools/timeit --summary MultiSource/Applications/JM/ldecod/CMakeFiles/ldecod.dir/fmo.c.o.time /Users/buildslave/jenkins/workspace/test-suite-verify-machineinstrs-x86_64-O3/compiler/bin/clang -DNDEBUG  -B /Applications/Xcode.app/Contents/Developer/Toolchains/XcodeDefault.xctoolchain/usr/bin    -Wno-unused-command-line-argument -mllvm -verify-machineinstrs -O3 -arch x86_64 -isysroot /Applications/Xcode.app/Contents/Developer/Platforms/MacOSX.platform/Developer/SDKs/MacOSX10.15.sdk   -w -Werror=date-time -fcommon -D__USE_LARGEFILE64 -D_FILE_OFFSET_BITS=64 -MD -MT MultiSource/Applications/JM/ldecod/CMakeFiles/ldecod.dir/fmo.c.o -MF MultiSource/Applications/JM/ldecod/CMakeFiles/ldecod.dir/fmo.c.o.d -o MultiSource/Applications/JM/ldecod/CMakeFiles/ldecod.dir/fmo.c.o   -c /Users/buildslave/jenkins/workspace/test-suite-verify-machineinstrs-x86_64-O3/test-suite/MultiSource/Applications/JM/ldecod/fmo.c
[2802/7685] /Users/buildslave/jenkins/workspace/test-suite-verify-machineinstrs-x86_64-O3/test-suite-build/tools/timeit --summary MultiSource/Applications/JM/ldecod/CMakeFiles/ldecod.dir/header.c.o.time /Users/buildslave/jenkins/workspace/test-suite-verify-machineinstrs-x86_64-O3/compiler/bin/clang -DNDEBUG  -B /Applications/Xcode.app/Contents/Developer/Toolchains/XcodeDefault.xctoolchain/usr/bin    -Wno-unused-command-line-argument -mllvm -verify-machineinstrs -O3 -arch x86_64 -isysroot /Applications/Xcode.app/Contents/Developer/Platforms/MacOSX.platform/Developer/SDKs/MacOSX10.15.sdk   -w -Werror=date-time -fcommon -D__USE_LARGEFILE64 -D_FILE_OFFSET_BITS=64 -MD -MT MultiSource/Applications/JM/ldecod/CMakeFiles/ldecod.dir/header.c.o -MF MultiSource/Applications/JM/ldecod/CMakeFiles/ldecod.dir/header.c.o.d -o MultiSource/Applications/JM/ldecod/CMakeFiles/ldecod.dir/header.c.o   -c /Users/buildslave/jenkins/workspace/test-suite-verify-machineinstrs-x86_64-O3/test-suite/MultiSource/Applications/JM/ldecod/header.c
[2803/7685] /Users/buildslave/jenkins/workspace/test-suite-verify-machineinstrs-x86_64-O3/test-suite-build/tools/timeit --summary MultiSource/Applications/JM/ldecod/CMakeFiles/ldecod.dir/ldecod.c.o.time /Users/buildslave/jenkins/workspace/test-suite-verify-machineinstrs-x86_64-O3/compiler/bin/clang -DNDEBUG  -B /Applications/Xcode.app/Contents/Developer/Toolchains/XcodeDefault.xctoolchain/usr/bin    -Wno-unused-command-line-argument -mllvm -verify-machineinstrs -O3 -arch x86_64 -isysroot /Applications/Xcode.app/Contents/Developer/Platforms/MacOSX.platform/Developer/SDKs/MacOSX10.15.sdk   -w -Werror=date-time -fcommon -D__USE_LARGEFILE64 -D_FILE_OFFSET_BITS=64 -MD -MT MultiSource/Applications/JM/ldecod/CMakeFiles/ldecod.dir/ldecod.c.o -MF MultiSource/Applications/JM/ldecod/CMakeFiles/ldecod.dir/ldecod.c.o.d -o MultiSource/Applications/JM/ldecod/CMakeFiles/ldecod.dir/ldecod.c.o   -c /Users/buildslave/jenkins/workspace/test-suite-verify-machineinstrs-x86_64-O3/test-suite/MultiSource/Applications/JM/ldecod/ldecod.c
[2804/7685] /Users/buildslave/jenkins/workspace/test-suite-verify-machineinstrs-x86_64-O3/test-suite-build/tools/timeit --summary MultiSource/Applications/JM/ldecod/CMakeFiles/ldecod.dir/leaky_bucket.c.o.time /Users/buildslave/jenkins/workspace/test-suite-verify-machineinstrs-x86_64-O3/compiler/bin/clang -DNDEBUG  -B /Applications/Xcode.app/Contents/Developer/Toolchains/XcodeDefault.xctoolchain/usr/bin    -Wno-unused-command-line-argument -mllvm -verify-machineinstrs -O3 -arch x86_64 -isysroot /Applications/Xcode.app/Contents/Developer/Platforms/MacOSX.platform/Developer/SDKs/MacOSX10.15.sdk   -w -Werror=date-time -fcommon -D__USE_LARGEFILE64 -D_FILE_OFFSET_BITS=64 -MD -MT MultiSource/Applications/JM/ldecod/CMakeFiles/ldecod.dir/leaky_bucket.c.o -MF MultiSource/Applications/JM/ldecod/CMakeFiles/ldecod.dir/leaky_bucket.c.o.d -o MultiSource/Applications/JM/ldecod/CMakeFiles/ldecod.dir/leaky_bucket.c.o   -c /Users/buildslave/jenkins/workspace/test-suite-verify-machineinstrs-x86_64-O3/test-suite/MultiSource/Applications/JM/ldecod/leaky_bucket.c
[2805/7685] /Users/buildslave/jenkins/workspace/test-suite-verify-machineinstrs-x86_64-O3/test-suite-build/tools/timeit --summary MultiSource/Applications/JM/ldecod/CMakeFiles/ldecod.dir/block.c.o.time /Users/buildslave/jenkins/workspace/test-suite-verify-machineinstrs-x86_64-O3/compiler/bin/clang -DNDEBUG  -B /Applications/Xcode.app/Contents/Developer/Toolchains/XcodeDefault.xctoolchain/usr/bin    -Wno-unused-command-line-argument -mllvm -verify-machineinstrs -O3 -arch x86_64 -isysroot /Applications/Xcode.app/Contents/Developer/Platforms/MacOSX.platform/Developer/SDKs/MacOSX10.15.sdk   -w -Werror=date-time -fcommon -D__USE_LARGEFILE64 -D_FILE_OFFSET_BITS=64 -MD -MT MultiSource/Applications/JM/ldecod/CMakeFiles/ldecod.dir/block.c.o -MF MultiSource/Applications/JM/ldecod/CMakeFiles/ldecod.dir/block.c.o.d -o MultiSource/Applications/JM/ldecod/CMakeFiles/ldecod.dir/block.c.o   -c /Users/buildslave/jenkins/workspace/test-suite-verify-machineinstrs-x86_64-O3/test-suite/MultiSource/Applications/JM/ldecod/block.c
FAILED: MultiSource/Applications/JM/ldecod/CMakeFiles/ldecod.dir/block.c.o 
/Users/buildslave/jenkins/workspace/test-suite-verify-machineinstrs-x86_64-O3/test-suite-build/tools/timeit --summary MultiSource/Applications/JM/ldecod/CMakeFiles/ldecod.dir/block.c.o.time /Users/buildslave/jenkins/workspace/test-suite-verify-machineinstrs-x86_64-O3/compiler/bin/clang -DNDEBUG  -B /Applications/Xcode.app/Contents/Developer/Toolchains/XcodeDefault.xctoolchain/usr/bin    -Wno-unused-command-line-argument -mllvm -verify-machineinstrs -O3 -arch x86_64 -isysroot /Applications/Xcode.app/Contents/Developer/Platforms/MacOSX.platform/Developer/SDKs/MacOSX10.15.sdk   -w -Werror=date-time -fcommon -D__USE_LARGEFILE64 -D_FILE_OFFSET_BITS=64 -MD -MT MultiSource/Applications/JM/ldecod/CMakeFiles/ldecod.dir/block.c.o -MF MultiSource/Applications/JM/ldecod/CMakeFiles/ldecod.dir/block.c.o.d -o MultiSource/Applications/JM/ldecod/CMakeFiles/ldecod.dir/block.c.o   -c /Users/buildslave/jenkins/workspace/test-suite-verify-machineinstrs-x86_64-O3/test-suite/MultiSource/Applications/JM/ldecod/block.c
Fatal Error: error in backend: Found 2 machine code errors.
*** Bad machine code: Using an undefined physical register ***
- function:    itrans_sp
- basic block: %bb.0 entry (0x7fbcc00100c8)
- instruction: $ecx = SUB32rr $ecx(tied-def 0), $esi, implicit-def dead $eflags
- operand 2:   $esi
fatal error: error in backend: Found 2 machine code errors.
PLEASE submit a bug report to https://bugs.llvm.org/ and include the crash backtrace, preprocessed source, and associated run script.
Stack dump:
Error: clang frontend command failed with exit code 70 (use -v to see invocation)
25 clang         0x000000010b527eed clang::driver::Compilation::ExecuteCommand(clang::driver::Command const&, clang::driver::Command const*&) const + 221
26 clang         0x000000010b52844d clang::driver::Compilation::ExecuteJobs(clang::driver::JobList const&, llvm::SmallVectorImpl<std::__1::pair<int, clang::driver::Command const*> >&) const + 125
27 clang         0x000000010b53ee9c clang::driver::Driver::ExecuteCompilation(clang::driver::Compilation&, llvm::SmallVectorImpl<std::__1::pair<int, clang::driver::Command const*> >&) + 204
28 clang         0x0000000108c5ed85 main + 10309
29 libdyld.dylib 0x00007fff67a6fcc9 start + 1
clang-13: error: clang frontend command failed with exit code 70 (use -v to see invocation)
clang version 13.0.0 (https://github.com/llvm/llvm-project.git 0a0800c4d10c250ffb152b5f059d6f9a19ed8efe)
Target: x86_64-apple-darwin19.5.0
Ninja target: machine.c.o
[3517/7685] /Users/buildslave/jenkins/workspace/test-suite-verify-machineinstrs-x86_64-O3/test-suite-build/tools/timeit --summary MultiSource/Benchmarks/Prolangs-C/unix-tbl/CMakeFiles/unix-tbl.dir/t2.c.o.time /Users/buildslave/jenkins/workspace/test-suite-verify-machineinstrs-x86_64-O3/compiler/bin/clang -DNDEBUG  -B /Applications/Xcode.app/Contents/Developer/Toolchains/XcodeDefault.xctoolchain/usr/bin    -Wno-unused-command-line-argument -mllvm -verify-machineinstrs -O3 -arch x86_64 -isysroot /Applications/Xcode.app/Contents/Developer/Platforms/MacOSX.platform/Developer/SDKs/MacOSX10.15.sdk   -w -Werror=date-time -MD -MT MultiSource/Benchmarks/Prolangs-C/unix-tbl/CMakeFiles/unix-tbl.dir/t2.c.o -MF MultiSource/Benchmarks/Prolangs-C/unix-tbl/CMakeFiles/unix-tbl.dir/t2.c.o.d -o MultiSource/Benchmarks/Prolangs-C/unix-tbl/CMakeFiles/unix-tbl.dir/t2.c.o   -c /Users/buildslave/jenkins/workspace/test-suite-verify-machineinstrs-x86_64-O3/test-suite/MultiSource/Benchmarks/Prolangs-C/unix-tbl/t2.c
[3518/7685] : && /Users/buildslave/jenkins/workspace/test-suite-verify-machineinstrs-x86_64-O3/test-suite-build/tools/timeit --summary MultiSource/Benchmarks/Prolangs-C/compiler/compiler.link.time /Users/buildslave/jenkins/workspace/test-suite-verify-machineinstrs-x86_64-O3/compiler/bin/clang -B /Applications/Xcode.app/Contents/Developer/Toolchains/XcodeDefault.xctoolchain/usr/bin    -Wno-unused-command-line-argument -mllvm -verify-machineinstrs -O3 -arch x86_64 -isysroot /Applications/Xcode.app/Contents/Developer/Platforms/MacOSX.platform/Developer/SDKs/MacOSX10.15.sdk -Wl,-search_paths_first -Wl,-headerpad_max_install_names -B /Applications/Xcode.app/Contents/Developer/Toolchains/XcodeDefault.xctoolchain/usr/bin MultiSource/Benchmarks/Prolangs-C/compiler/CMakeFiles/compiler.dir/emitter.c.o MultiSource/Benchmarks/Prolangs-C/compiler/CMakeFiles/compiler.dir/error.c.o MultiSource/Benchmarks/Prolangs-C/compiler/CMakeFiles/compiler.dir/init.c.o MultiSource/Benchmarks/Prolangs-C/compiler/CMakeFiles/compiler.dir/lexer.c.o MultiSource/Benchmarks/Prolangs-C/compiler/CMakeFiles/compiler.dir/main.c.o MultiSource/Benchmarks/Prolangs-C/compiler/CMakeFiles/compiler.dir/parser.c.o MultiSource/Benchmarks/Prolangs-C/compiler/CMakeFiles/compiler.dir/symbol.c.o  -o MultiSource/Benchmarks/Prolangs-C/compiler/compiler  -Wl,-no_pie && cd /Users/buildslave/jenkins/workspace/test-suite-verify-machineinstrs-x86_64-O3/test-suite-build/MultiSource/Benchmarks/Prolangs-C/compiler && /usr/local/Cellar/cmake/3.17.2/bin/cmake -E create_symlink /Users/buildslave/jenkins/workspace/test-suite-verify-machineinstrs-x86_64-O3/test-suite/MultiSource/Benchmarks/Prolangs-C/compiler/compiler.reference_output /Users/buildslave/jenkins/workspace/test-suite-verify-machineinstrs-x86_64-O3/test-suite-build/MultiSource/Benchmarks/Prolangs-C/compiler/compiler.reference_output
[3519/7685] /Users/buildslave/jenkins/workspace/test-suite-verify-machineinstrs-x86_64-O3/test-suite-build/tools/timeit --summary MultiSource/Benchmarks/Prolangs-C/unix-tbl/CMakeFiles/unix-tbl.dir/t1.c.o.time /Users/buildslave/jenkins/workspace/test-suite-verify-machineinstrs-x86_64-O3/compiler/bin/clang -DNDEBUG  -B /Applications/Xcode.app/Contents/Developer/Toolchains/XcodeDefault.xctoolchain/usr/bin    -Wno-unused-command-line-argument -mllvm -verify-machineinstrs -O3 -arch x86_64 -isysroot /Applications/Xcode.app/Contents/Developer/Platforms/MacOSX.platform/Developer/SDKs/MacOSX10.15.sdk   -w -Werror=date-time -MD -MT MultiSource/Benchmarks/Prolangs-C/unix-tbl/CMakeFiles/unix-tbl.dir/t1.c.o -MF MultiSource/Benchmarks/Prolangs-C/unix-tbl/CMakeFiles/unix-tbl.dir/t1.c.o.d -o MultiSource/Benchmarks/Prolangs-C/unix-tbl/CMakeFiles/unix-tbl.dir/t1.c.o   -c /Users/buildslave/jenkins/workspace/test-suite-verify-machineinstrs-x86_64-O3/test-suite/MultiSource/Benchmarks/Prolangs-C/unix-tbl/t1.c
[3520/7685] /Users/buildslave/jenkins/workspace/test-suite-verify-machineinstrs-x86_64-O3/test-suite-build/tools/timeit --summary MultiSource/Benchmarks/Prolangs-C/unix-tbl/CMakeFiles/unix-tbl.dir/t3.c.o.time /Users/buildslave/jenkins/workspace/test-suite-verify-machineinstrs-x86_64-O3/compiler/bin/clang -DNDEBUG  -B /Applications/Xcode.app/Contents/Developer/Toolchains/XcodeDefault.xctoolchain/usr/bin    -Wno-unused-command-line-argument -mllvm -verify-machineinstrs -O3 -arch x86_64 -isysroot /Applications/Xcode.app/Contents/Developer/Platforms/MacOSX.platform/Developer/SDKs/MacOSX10.15.sdk   -w -Werror=date-time -MD -MT MultiSource/Benchmarks/Prolangs-C/unix-tbl/CMakeFiles/unix-tbl.dir/t3.c.o -MF MultiSource/Benchmarks/Prolangs-C/unix-tbl/CMakeFiles/unix-tbl.dir/t3.c.o.d -o MultiSource/Benchmarks/Prolangs-C/unix-tbl/CMakeFiles/unix-tbl.dir/t3.c.o   -c /Users/buildslave/jenkins/workspace/test-suite-verify-machineinstrs-x86_64-O3/test-suite/MultiSource/Benchmarks/Prolangs-C/unix-tbl/t3.c
[3521/7685] /Users/buildslave/jenkins/workspace/test-suite-verify-machineinstrs-x86_64-O3/test-suite-build/tools/timeit --summary MultiSource/Benchmarks/Prolangs-C/simulator/CMakeFiles/simulator.dir/machine.c.o.time /Users/buildslave/jenkins/workspace/test-suite-verify-machineinstrs-x86_64-O3/compiler/bin/clang -DNDEBUG  -B /Applications/Xcode.app/Contents/Developer/Toolchains/XcodeDefault.xctoolchain/usr/bin    -Wno-unused-command-line-argument -mllvm -verify-machineinstrs -O3 -arch x86_64 -isysroot /Applications/Xcode.app/Contents/Developer/Platforms/MacOSX.platform/Developer/SDKs/MacOSX10.15.sdk   -w -Werror=date-time -fcommon -MD -MT MultiSource/Benchmarks/Prolangs-C/simulator/CMakeFiles/simulator.dir/machine.c.o -MF MultiSource/Benchmarks/Prolangs-C/simulator/CMakeFiles/simulator.dir/machine.c.o.d -o MultiSource/Benchmarks/Prolangs-C/simulator/CMakeFiles/simulator.dir/machine.c.o   -c /Users/buildslave/jenkins/workspace/test-suite-verify-machineinstrs-x86_64-O3/test-suite/MultiSource/Benchmarks/Prolangs-C/simulator/machine.c
FAILED: MultiSource/Benchmarks/Prolangs-C/simulator/CMakeFiles/simulator.dir/machine.c.o 
/Users/buildslave/jenkins/workspace/test-suite-verify-machineinstrs-x86_64-O3/test-suite-build/tools/timeit --summary MultiSource/Benchmarks/Prolangs-C/simulator/CMakeFiles/simulator.dir/machine.c.o.time /Users/buildslave/jenkins/workspace/test-suite-verify-machineinstrs-x86_64-O3/compiler/bin/clang -DNDEBUG  -B /Applications/Xcode.app/Contents/Developer/Toolchains/XcodeDefault.xctoolchain/usr/bin    -Wno-unused-command-line-argument -mllvm -verify-machineinstrs -O3 -arch x86_64 -isysroot /Applications/Xcode.app/Contents/Developer/Platforms/MacOSX.platform/Developer/SDKs/MacOSX10.15.sdk   -w -Werror=date-time -fcommon -MD -MT MultiSource/Benchmarks/Prolangs-C/simulator/CMakeFiles/simulator.dir/machine.c.o -MF MultiSource/Benchmarks/Prolangs-C/simulator/CMakeFiles/simulator.dir/machine.c.o.d -o MultiSource/Benchmarks/Prolangs-C/simulator/CMakeFiles/simulator.dir/machine.c.o   -c /Users/buildslave/jenkins/workspace/test-suite-verify-machineinstrs-x86_64-O3/test-suite/MultiSource/Benchmarks/Prolangs-C/simulator/machine.c
Fatal Error: error in backend: Found 4 machine code errors.
*** Bad machine code: Using an undefined physical register ***
- function:    SET_CC
- basic block: %bb.1 if.then (0x7ffdbd8b11a8)
- instruction: $esi = SUB32rr $esi(tied-def 0), $r13d, implicit-def dead $eflags
- operand 2:   $r13d
fatal error: error in backend: Found 4 machine code errors.
PLEASE submit a bug report to https://bugs.llvm.org/ and include the crash backtrace, preprocessed source, and associated run script.
Stack dump:
Error: clang frontend command failed with exit code 70 (use -v to see invocation)
26 clang         0x000000010d47644d clang::driver::Compilation::ExecuteJobs(clang::driver::JobList const&, llvm::SmallVectorImpl<std::__1::pair<int, clang::driver::Command const*> >&) const + 125
27 clang         0x000000010d48ce9c clang::driver::Driver::ExecuteCompilation(clang::driver::Compilation&, llvm::SmallVectorImpl<std::__1::pair<int, clang::driver::Command const*> >&) + 204
28 clang         0x000000010abacd85 main + 10309
29 libdyld.dylib 0x00007fff67a6fcc9 start + 1
30 libdyld.dylib 0x0000000000000018 start + 18446603338777166672
clang-13: error: clang frontend command failed with exit code 70 (use -v to see invocation)
clang version 13.0.0 (https://github.com/llvm/llvm-project.git 0a0800c4d10c250ffb152b5f059d6f9a19ed8efe)
Target: x86_64-apple-darwin19.5.0

Build Log

Changes
  1. [mlir] make normalizeAffineFor public (details)
  2. [Flang][test] Fix Windows buildbot. (details)
  3. A post-processing for BFI inference (details)

Started by upstream project relay-test-suite-verify-machineinstrs build number 10042
originally caused by:

This run spent:

  • 2 hr 13 min waiting;
  • 2 hr 41 min build duration;
  • 2 hr 41 min total from scheduled to completion.
Revision: d631fe591d8ff09edb895ef124e8370875d8d523
  • refs/remotes/origin/main
Revision: 0a0800c4d10c250ffb152b5f059d6f9a19ed8efe
  • detached
Revision: f48d431f44610e339d00a33d57564c6029c4ff43
  • refs/remotes/origin/main
Revision: fa3daaf3ee14627cf614ecec62c4341346e4b065
  • refs/remotes/origin/main

Identified problems

Compile Error

This build failed because of a compile error. Below is a list of all errors in the build log:
Indication 1

Ninja target failed

Below is a link to the first failed ninja target.
Indication 2