Started 6 days 10 hr ago
Took 43 min

Failed Build clang-d355691-g6a4714030e4-t10789-b10789.tar.gz (May 29, 2020 3:27:58 PM)

Issues

Found 6 issues:
Ninja target: sim4b1.c.o
[5791/11529] /Users/buildslave/jenkins/workspace/test-suite-verify-machineinstrs-aarch64-O3/test-suite-build/tools/timeit --summary MultiSource/Applications/d/CMakeFiles/make_dparser.dir/make_dparser.c.o.time /Users/buildslave/jenkins/workspace/test-suite-verify-machineinstrs-aarch64-O3/compiler/bin/clang -DNDEBUG  -B /Applications/Xcode.app/Contents/Developer/Toolchains/XcodeDefault.xctoolchain/usr/bin    -Wno-unused-command-line-argument -mllvm -verify-machineinstrs -O3 -arch arm64 -isysroot /Applications/Xcode.app/Contents/Developer/Platforms/iPhoneOS.platform/Developer/SDKs/iPhoneOS12.1.sdk   -w -Werror=date-time -DD_BUILD_VERSION=5725 -MD -MT MultiSource/Applications/d/CMakeFiles/make_dparser.dir/make_dparser.c.o -MF MultiSource/Applications/d/CMakeFiles/make_dparser.dir/make_dparser.c.o.d -o MultiSource/Applications/d/CMakeFiles/make_dparser.dir/make_dparser.c.o   -c /Users/buildslave/jenkins/workspace/test-suite-verify-machineinstrs-aarch64-O3/test-suite/MultiSource/Applications/d/make_dparser.c
[5792/11529] /Users/buildslave/jenkins/workspace/test-suite-verify-machineinstrs-aarch64-O3/test-suite-build/tools/timeit --summary MultiSource/Applications/aha/CMakeFiles/aha.dir/aha.c.o.time /Users/buildslave/jenkins/workspace/test-suite-verify-machineinstrs-aarch64-O3/compiler/bin/clang -DNDEBUG  -B /Applications/Xcode.app/Contents/Developer/Toolchains/XcodeDefault.xctoolchain/usr/bin    -Wno-unused-command-line-argument -mllvm -verify-machineinstrs -O3 -arch arm64 -isysroot /Applications/Xcode.app/Contents/Developer/Platforms/iPhoneOS.platform/Developer/SDKs/iPhoneOS12.1.sdk   -w -Werror=date-time -MD -MT MultiSource/Applications/aha/CMakeFiles/aha.dir/aha.c.o -MF MultiSource/Applications/aha/CMakeFiles/aha.dir/aha.c.o.d -o MultiSource/Applications/aha/CMakeFiles/aha.dir/aha.c.o   -c /Users/buildslave/jenkins/workspace/test-suite-verify-machineinstrs-aarch64-O3/test-suite/MultiSource/Applications/aha/aha.c
[5793/11529] /Users/buildslave/jenkins/workspace/test-suite-verify-machineinstrs-aarch64-O3/test-suite-build/tools/timeit --summary MultiSource/Applications/SIBsim4/CMakeFiles/SIBsim4.dir/sim4.init.c.o.time /Users/buildslave/jenkins/workspace/test-suite-verify-machineinstrs-aarch64-O3/compiler/bin/clang -DNDEBUG  -B /Applications/Xcode.app/Contents/Developer/Toolchains/XcodeDefault.xctoolchain/usr/bin    -Wno-unused-command-line-argument -mllvm -verify-machineinstrs -O3 -arch arm64 -isysroot /Applications/Xcode.app/Contents/Developer/Platforms/iPhoneOS.platform/Developer/SDKs/iPhoneOS12.1.sdk   -w -Werror=date-time -MD -MT MultiSource/Applications/SIBsim4/CMakeFiles/SIBsim4.dir/sim4.init.c.o -MF MultiSource/Applications/SIBsim4/CMakeFiles/SIBsim4.dir/sim4.init.c.o.d -o MultiSource/Applications/SIBsim4/CMakeFiles/SIBsim4.dir/sim4.init.c.o   -c /Users/buildslave/jenkins/workspace/test-suite-verify-machineinstrs-aarch64-O3/test-suite/MultiSource/Applications/SIBsim4/sim4.init.c
[5794/11529] : && /Users/buildslave/jenkins/workspace/test-suite-verify-machineinstrs-aarch64-O3/test-suite-build/tools/timeit --summary MultiSource/Applications/aha/aha.link.time /Users/buildslave/jenkins/workspace/test-suite-verify-machineinstrs-aarch64-O3/compiler/bin/clang -B /Applications/Xcode.app/Contents/Developer/Toolchains/XcodeDefault.xctoolchain/usr/bin    -Wno-unused-command-line-argument -mllvm -verify-machineinstrs -O3 -arch arm64 -isysroot /Applications/Xcode.app/Contents/Developer/Platforms/iPhoneOS.platform/Developer/SDKs/iPhoneOS12.1.sdk -Wl,-search_paths_first -Wl,-headerpad_max_install_names -B /Applications/Xcode.app/Contents/Developer/Toolchains/XcodeDefault.xctoolchain/usr/bin MultiSource/Applications/aha/CMakeFiles/aha.dir/aha.c.o MultiSource/Applications/aha/CMakeFiles/aha.dir/userfun.c.o  -o MultiSource/Applications/aha/aha   && cd /Users/buildslave/jenkins/workspace/test-suite-verify-machineinstrs-aarch64-O3/test-suite-build/MultiSource/Applications/aha && /usr/local/Cellar/cmake/3.17.2/bin/cmake -E create_symlink /Users/buildslave/jenkins/workspace/test-suite-verify-machineinstrs-aarch64-O3/test-suite/MultiSource/Applications/aha/aha.reference_output /Users/buildslave/jenkins/workspace/test-suite-verify-machineinstrs-aarch64-O3/test-suite-build/MultiSource/Applications/aha/aha.reference_output
[5795/11529] /Users/buildslave/jenkins/workspace/test-suite-verify-machineinstrs-aarch64-O3/test-suite-build/tools/timeit --summary MultiSource/Applications/SIBsim4/CMakeFiles/SIBsim4.dir/sim4b1.c.o.time /Users/buildslave/jenkins/workspace/test-suite-verify-machineinstrs-aarch64-O3/compiler/bin/clang -DNDEBUG  -B /Applications/Xcode.app/Contents/Developer/Toolchains/XcodeDefault.xctoolchain/usr/bin    -Wno-unused-command-line-argument -mllvm -verify-machineinstrs -O3 -arch arm64 -isysroot /Applications/Xcode.app/Contents/Developer/Platforms/iPhoneOS.platform/Developer/SDKs/iPhoneOS12.1.sdk   -w -Werror=date-time -MD -MT MultiSource/Applications/SIBsim4/CMakeFiles/SIBsim4.dir/sim4b1.c.o -MF MultiSource/Applications/SIBsim4/CMakeFiles/SIBsim4.dir/sim4b1.c.o.d -o MultiSource/Applications/SIBsim4/CMakeFiles/SIBsim4.dir/sim4b1.c.o   -c /Users/buildslave/jenkins/workspace/test-suite-verify-machineinstrs-aarch64-O3/test-suite/MultiSource/Applications/SIBsim4/sim4b1.c
FAILED: MultiSource/Applications/SIBsim4/CMakeFiles/SIBsim4.dir/sim4b1.c.o 
/Users/buildslave/jenkins/workspace/test-suite-verify-machineinstrs-aarch64-O3/test-suite-build/tools/timeit --summary MultiSource/Applications/SIBsim4/CMakeFiles/SIBsim4.dir/sim4b1.c.o.time /Users/buildslave/jenkins/workspace/test-suite-verify-machineinstrs-aarch64-O3/compiler/bin/clang -DNDEBUG  -B /Applications/Xcode.app/Contents/Developer/Toolchains/XcodeDefault.xctoolchain/usr/bin    -Wno-unused-command-line-argument -mllvm -verify-machineinstrs -O3 -arch arm64 -isysroot /Applications/Xcode.app/Contents/Developer/Platforms/iPhoneOS.platform/Developer/SDKs/iPhoneOS12.1.sdk   -w -Werror=date-time -MD -MT MultiSource/Applications/SIBsim4/CMakeFiles/SIBsim4.dir/sim4b1.c.o -MF MultiSource/Applications/SIBsim4/CMakeFiles/SIBsim4.dir/sim4b1.c.o.d -o MultiSource/Applications/SIBsim4/CMakeFiles/SIBsim4.dir/sim4b1.c.o   -c /Users/buildslave/jenkins/workspace/test-suite-verify-machineinstrs-aarch64-O3/test-suite/MultiSource/Applications/SIBsim4/sim4b1.c
Assertion failed: (BI->getSuccessor(!isTrueDest) == BBTo && "BBTo isn't a successor of BBFrom"), function getEdgeValueLocal, file /Users/buildslave/jenkins/workspace/clang-stage1-RA/llvm-project/llvm/lib/Analysis/LazyValueInfo.cpp, line 1319.
assertion: BI->getSuccessor(!isTrueDest) == BBTo && "BBTo isn't a successor of BBFrom"
[5793/11529] /Users/buildslave/jenkins/workspace/test-suite-verify-machineinstrs-aarch64-O3/test-suite-build/tools/timeit --summary MultiSource/Applications/SIBsim4/CMakeFiles/SIBsim4.dir/sim4.init.c.o.time /Users/buildslave/jenkins/workspace/test-suite-verify-machineinstrs-aarch64-O3/compiler/bin/clang -DNDEBUG  -B /Applications/Xcode.app/Contents/Developer/Toolchains/XcodeDefault.xctoolchain/usr/bin    -Wno-unused-command-line-argument -mllvm -verify-machineinstrs -O3 -arch arm64 -isysroot /Applications/Xcode.app/Contents/Developer/Platforms/iPhoneOS.platform/Developer/SDKs/iPhoneOS12.1.sdk   -w -Werror=date-time -MD -MT MultiSource/Applications/SIBsim4/CMakeFiles/SIBsim4.dir/sim4.init.c.o -MF MultiSource/Applications/SIBsim4/CMakeFiles/SIBsim4.dir/sim4.init.c.o.d -o MultiSource/Applications/SIBsim4/CMakeFiles/SIBsim4.dir/sim4.init.c.o   -c /Users/buildslave/jenkins/workspace/test-suite-verify-machineinstrs-aarch64-O3/test-suite/MultiSource/Applications/SIBsim4/sim4.init.c
[5794/11529] : && /Users/buildslave/jenkins/workspace/test-suite-verify-machineinstrs-aarch64-O3/test-suite-build/tools/timeit --summary MultiSource/Applications/aha/aha.link.time /Users/buildslave/jenkins/workspace/test-suite-verify-machineinstrs-aarch64-O3/compiler/bin/clang -B /Applications/Xcode.app/Contents/Developer/Toolchains/XcodeDefault.xctoolchain/usr/bin    -Wno-unused-command-line-argument -mllvm -verify-machineinstrs -O3 -arch arm64 -isysroot /Applications/Xcode.app/Contents/Developer/Platforms/iPhoneOS.platform/Developer/SDKs/iPhoneOS12.1.sdk -Wl,-search_paths_first -Wl,-headerpad_max_install_names -B /Applications/Xcode.app/Contents/Developer/Toolchains/XcodeDefault.xctoolchain/usr/bin MultiSource/Applications/aha/CMakeFiles/aha.dir/aha.c.o MultiSource/Applications/aha/CMakeFiles/aha.dir/userfun.c.o  -o MultiSource/Applications/aha/aha   && cd /Users/buildslave/jenkins/workspace/test-suite-verify-machineinstrs-aarch64-O3/test-suite-build/MultiSource/Applications/aha && /usr/local/Cellar/cmake/3.17.2/bin/cmake -E create_symlink /Users/buildslave/jenkins/workspace/test-suite-verify-machineinstrs-aarch64-O3/test-suite/MultiSource/Applications/aha/aha.reference_output /Users/buildslave/jenkins/workspace/test-suite-verify-machineinstrs-aarch64-O3/test-suite-build/MultiSource/Applications/aha/aha.reference_output
[5795/11529] /Users/buildslave/jenkins/workspace/test-suite-verify-machineinstrs-aarch64-O3/test-suite-build/tools/timeit --summary MultiSource/Applications/SIBsim4/CMakeFiles/SIBsim4.dir/sim4b1.c.o.time /Users/buildslave/jenkins/workspace/test-suite-verify-machineinstrs-aarch64-O3/compiler/bin/clang -DNDEBUG  -B /Applications/Xcode.app/Contents/Developer/Toolchains/XcodeDefault.xctoolchain/usr/bin    -Wno-unused-command-line-argument -mllvm -verify-machineinstrs -O3 -arch arm64 -isysroot /Applications/Xcode.app/Contents/Developer/Platforms/iPhoneOS.platform/Developer/SDKs/iPhoneOS12.1.sdk   -w -Werror=date-time -MD -MT MultiSource/Applications/SIBsim4/CMakeFiles/SIBsim4.dir/sim4b1.c.o -MF MultiSource/Applications/SIBsim4/CMakeFiles/SIBsim4.dir/sim4b1.c.o.d -o MultiSource/Applications/SIBsim4/CMakeFiles/SIBsim4.dir/sim4b1.c.o   -c /Users/buildslave/jenkins/workspace/test-suite-verify-machineinstrs-aarch64-O3/test-suite/MultiSource/Applications/SIBsim4/sim4b1.c
FAILED: MultiSource/Applications/SIBsim4/CMakeFiles/SIBsim4.dir/sim4b1.c.o 
/Users/buildslave/jenkins/workspace/test-suite-verify-machineinstrs-aarch64-O3/test-suite-build/tools/timeit --summary MultiSource/Applications/SIBsim4/CMakeFiles/SIBsim4.dir/sim4b1.c.o.time /Users/buildslave/jenkins/workspace/test-suite-verify-machineinstrs-aarch64-O3/compiler/bin/clang -DNDEBUG  -B /Applications/Xcode.app/Contents/Developer/Toolchains/XcodeDefault.xctoolchain/usr/bin    -Wno-unused-command-line-argument -mllvm -verify-machineinstrs -O3 -arch arm64 -isysroot /Applications/Xcode.app/Contents/Developer/Platforms/iPhoneOS.platform/Developer/SDKs/iPhoneOS12.1.sdk   -w -Werror=date-time -MD -MT MultiSource/Applications/SIBsim4/CMakeFiles/SIBsim4.dir/sim4b1.c.o -MF MultiSource/Applications/SIBsim4/CMakeFiles/SIBsim4.dir/sim4b1.c.o.d -o MultiSource/Applications/SIBsim4/CMakeFiles/SIBsim4.dir/sim4b1.c.o   -c /Users/buildslave/jenkins/workspace/test-suite-verify-machineinstrs-aarch64-O3/test-suite/MultiSource/Applications/SIBsim4/sim4b1.c
Assertion failed: (BI->getSuccessor(!isTrueDest) == BBTo && "BBTo isn't a successor of BBFrom"), function getEdgeValueLocal, file /Users/buildslave/jenkins/workspace/clang-stage1-RA/llvm-project/llvm/lib/Analysis/LazyValueInfo.cpp, line 1319.
PLEASE submit a bug report to https://bugs.llvm.org/ and include the crash backtrace, preprocessed source, and associated run script.
Stack dump:
Error: clang frontend command failed due to signal (use -v to see invocation)
28 clang                    0x000000010a18b25d clang::driver::Compilation::ExecuteCommand(clang::driver::Command const&, clang::driver::Command const*&) const + 221
29 clang                    0x000000010a18b69b clang::driver::Compilation::ExecuteJobs(clang::driver::JobList const&, llvm::SmallVectorImpl<std::__1::pair<int, clang::driver::Command const*> >&) const + 123
30 clang                    0x000000010a19fadb clang::driver::Driver::ExecuteCompilation(clang::driver::Compilation&, llvm::SmallVectorImpl<std::__1::pair<int, clang::driver::Command const*> >&) + 203
31 clang                    0x0000000107c2f729 main + 10777
32 libdyld.dylib            0x00007fff5feb2085 start + 1
clang-11: error: clang frontend command failed due to signal (use -v to see invocation)
clang version 11.0.0 (https://github.com/llvm/llvm-project.git 6a4714030e467293e839433a6754685ed3bdc108)
Target: aarch64-apple-darwin18.0.0
Ninja target: sqlite3.c.o
[6133/11529] /Users/buildslave/jenkins/workspace/test-suite-verify-machineinstrs-aarch64-O3/test-suite-build/tools/timeit --summary MultiSource/Applications/Burg/CMakeFiles/burg.dir/string.c.o.time /Users/buildslave/jenkins/workspace/test-suite-verify-machineinstrs-aarch64-O3/compiler/bin/clang -DNDEBUG -IMultiSource/Applications/Burg -B /Applications/Xcode.app/Contents/Developer/Toolchains/XcodeDefault.xctoolchain/usr/bin    -Wno-unused-command-line-argument -mllvm -verify-machineinstrs -O3 -arch arm64 -isysroot /Applications/Xcode.app/Contents/Developer/Platforms/iPhoneOS.platform/Developer/SDKs/iPhoneOS12.1.sdk   -w -Werror=date-time -std=gnu89 -DDEBUG -MD -MT MultiSource/Applications/Burg/CMakeFiles/burg.dir/string.c.o -MF MultiSource/Applications/Burg/CMakeFiles/burg.dir/string.c.o.d -o MultiSource/Applications/Burg/CMakeFiles/burg.dir/string.c.o   -c /Users/buildslave/jenkins/workspace/test-suite-verify-machineinstrs-aarch64-O3/test-suite/MultiSource/Applications/Burg/string.c
[6134/11529] /Users/buildslave/jenkins/workspace/test-suite-verify-machineinstrs-aarch64-O3/test-suite-build/tools/timeit --summary MultiSource/Applications/Burg/CMakeFiles/burg.dir/symtab.c.o.time /Users/buildslave/jenkins/workspace/test-suite-verify-machineinstrs-aarch64-O3/compiler/bin/clang -DNDEBUG -IMultiSource/Applications/Burg -B /Applications/Xcode.app/Contents/Developer/Toolchains/XcodeDefault.xctoolchain/usr/bin    -Wno-unused-command-line-argument -mllvm -verify-machineinstrs -O3 -arch arm64 -isysroot /Applications/Xcode.app/Contents/Developer/Platforms/iPhoneOS.platform/Developer/SDKs/iPhoneOS12.1.sdk   -w -Werror=date-time -std=gnu89 -DDEBUG -MD -MT MultiSource/Applications/Burg/CMakeFiles/burg.dir/symtab.c.o -MF MultiSource/Applications/Burg/CMakeFiles/burg.dir/symtab.c.o.d -o MultiSource/Applications/Burg/CMakeFiles/burg.dir/symtab.c.o   -c /Users/buildslave/jenkins/workspace/test-suite-verify-machineinstrs-aarch64-O3/test-suite/MultiSource/Applications/Burg/symtab.c
[6135/11529] /Users/buildslave/jenkins/workspace/test-suite-verify-machineinstrs-aarch64-O3/test-suite-build/tools/timeit --summary MultiSource/Applications/sqlite3/CMakeFiles/sqlite3.dir/shell.c.o.time /Users/buildslave/jenkins/workspace/test-suite-verify-machineinstrs-aarch64-O3/compiler/bin/clang -DNDEBUG  -B /Applications/Xcode.app/Contents/Developer/Toolchains/XcodeDefault.xctoolchain/usr/bin    -Wno-unused-command-line-argument -mllvm -verify-machineinstrs -O3 -arch arm64 -isysroot /Applications/Xcode.app/Contents/Developer/Platforms/iPhoneOS.platform/Developer/SDKs/iPhoneOS12.1.sdk   -w -Werror=date-time -DSTDC_HEADERS=1 -DHAVE_SYS_TYPES_H=1 -DHAVE_SYS_STAT_H=1 -DHAVE_STDLIB_H=1 -DHAVE_STRING_H=1 -DHAVE_MEMORY_H=1 -DHAVE_STRINGS_H=1 -DHAVE_INTTYPES_H=1 -DHAVE_STDINT_H=1 -DHAVE_UNISTD_H=1 -DSQLITE_OMIT_LOAD_EXTENSION=1 -DSQLITE_THREADSAFE=0 -I. -MD -MT MultiSource/Applications/sqlite3/CMakeFiles/sqlite3.dir/shell.c.o -MF MultiSource/Applications/sqlite3/CMakeFiles/sqlite3.dir/shell.c.o.d -o MultiSource/Applications/sqlite3/CMakeFiles/sqlite3.dir/shell.c.o   -c /Users/buildslave/jenkins/workspace/test-suite-verify-machineinstrs-aarch64-O3/test-suite/MultiSource/Applications/sqlite3/shell.c
[6136/11529] /Users/buildslave/jenkins/workspace/test-suite-verify-machineinstrs-aarch64-O3/test-suite-build/tools/timeit --summary MultiSource/Applications/Burg/CMakeFiles/burg.dir/plank.c.o.time /Users/buildslave/jenkins/workspace/test-suite-verify-machineinstrs-aarch64-O3/compiler/bin/clang -DNDEBUG -IMultiSource/Applications/Burg -B /Applications/Xcode.app/Contents/Developer/Toolchains/XcodeDefault.xctoolchain/usr/bin    -Wno-unused-command-line-argument -mllvm -verify-machineinstrs -O3 -arch arm64 -isysroot /Applications/Xcode.app/Contents/Developer/Platforms/iPhoneOS.platform/Developer/SDKs/iPhoneOS12.1.sdk   -w -Werror=date-time -std=gnu89 -DDEBUG -MD -MT MultiSource/Applications/Burg/CMakeFiles/burg.dir/plank.c.o -MF MultiSource/Applications/Burg/CMakeFiles/burg.dir/plank.c.o.d -o MultiSource/Applications/Burg/CMakeFiles/burg.dir/plank.c.o   -c /Users/buildslave/jenkins/workspace/test-suite-verify-machineinstrs-aarch64-O3/test-suite/MultiSource/Applications/Burg/plank.c
[6137/11529] /Users/buildslave/jenkins/workspace/test-suite-verify-machineinstrs-aarch64-O3/test-suite-build/tools/timeit --summary MultiSource/Applications/sqlite3/CMakeFiles/sqlite3.dir/sqlite3.c.o.time /Users/buildslave/jenkins/workspace/test-suite-verify-machineinstrs-aarch64-O3/compiler/bin/clang -DNDEBUG  -B /Applications/Xcode.app/Contents/Developer/Toolchains/XcodeDefault.xctoolchain/usr/bin    -Wno-unused-command-line-argument -mllvm -verify-machineinstrs -O3 -arch arm64 -isysroot /Applications/Xcode.app/Contents/Developer/Platforms/iPhoneOS.platform/Developer/SDKs/iPhoneOS12.1.sdk   -w -Werror=date-time -DSTDC_HEADERS=1 -DHAVE_SYS_TYPES_H=1 -DHAVE_SYS_STAT_H=1 -DHAVE_STDLIB_H=1 -DHAVE_STRING_H=1 -DHAVE_MEMORY_H=1 -DHAVE_STRINGS_H=1 -DHAVE_INTTYPES_H=1 -DHAVE_STDINT_H=1 -DHAVE_UNISTD_H=1 -DSQLITE_OMIT_LOAD_EXTENSION=1 -DSQLITE_THREADSAFE=0 -I. -MD -MT MultiSource/Applications/sqlite3/CMakeFiles/sqlite3.dir/sqlite3.c.o -MF MultiSource/Applications/sqlite3/CMakeFiles/sqlite3.dir/sqlite3.c.o.d -o MultiSource/Applications/sqlite3/CMakeFiles/sqlite3.dir/sqlite3.c.o   -c /Users/buildslave/jenkins/workspace/test-suite-verify-machineinstrs-aarch64-O3/test-suite/MultiSource/Applications/sqlite3/sqlite3.c
FAILED: MultiSource/Applications/sqlite3/CMakeFiles/sqlite3.dir/sqlite3.c.o 
/Users/buildslave/jenkins/workspace/test-suite-verify-machineinstrs-aarch64-O3/test-suite-build/tools/timeit --summary MultiSource/Applications/sqlite3/CMakeFiles/sqlite3.dir/sqlite3.c.o.time /Users/buildslave/jenkins/workspace/test-suite-verify-machineinstrs-aarch64-O3/compiler/bin/clang -DNDEBUG  -B /Applications/Xcode.app/Contents/Developer/Toolchains/XcodeDefault.xctoolchain/usr/bin    -Wno-unused-command-line-argument -mllvm -verify-machineinstrs -O3 -arch arm64 -isysroot /Applications/Xcode.app/Contents/Developer/Platforms/iPhoneOS.platform/Developer/SDKs/iPhoneOS12.1.sdk   -w -Werror=date-time -DSTDC_HEADERS=1 -DHAVE_SYS_TYPES_H=1 -DHAVE_SYS_STAT_H=1 -DHAVE_STDLIB_H=1 -DHAVE_STRING_H=1 -DHAVE_MEMORY_H=1 -DHAVE_STRINGS_H=1 -DHAVE_INTTYPES_H=1 -DHAVE_STDINT_H=1 -DHAVE_UNISTD_H=1 -DSQLITE_OMIT_LOAD_EXTENSION=1 -DSQLITE_THREADSAFE=0 -I. -MD -MT MultiSource/Applications/sqlite3/CMakeFiles/sqlite3.dir/sqlite3.c.o -MF MultiSource/Applications/sqlite3/CMakeFiles/sqlite3.dir/sqlite3.c.o.d -o MultiSource/Applications/sqlite3/CMakeFiles/sqlite3.dir/sqlite3.c.o   -c /Users/buildslave/jenkins/workspace/test-suite-verify-machineinstrs-aarch64-O3/test-suite/MultiSource/Applications/sqlite3/sqlite3.c
Assertion failed: (i_nocapture < OperandTraits<PHINode>::operands(this) && "getOperand() out of range!"), function getOperand, file /Users/buildslave/jenkins/workspace/clang-stage1-RA/llvm-project/llvm/include/llvm/IR/Instructions.h, line 2703.
assertion: i_nocapture < OperandTraits<PHINode>::operands(this) && "getOperand() out of range!"
[6135/11529] /Users/buildslave/jenkins/workspace/test-suite-verify-machineinstrs-aarch64-O3/test-suite-build/tools/timeit --summary MultiSource/Applications/sqlite3/CMakeFiles/sqlite3.dir/shell.c.o.time /Users/buildslave/jenkins/workspace/test-suite-verify-machineinstrs-aarch64-O3/compiler/bin/clang -DNDEBUG  -B /Applications/Xcode.app/Contents/Developer/Toolchains/XcodeDefault.xctoolchain/usr/bin    -Wno-unused-command-line-argument -mllvm -verify-machineinstrs -O3 -arch arm64 -isysroot /Applications/Xcode.app/Contents/Developer/Platforms/iPhoneOS.platform/Developer/SDKs/iPhoneOS12.1.sdk   -w -Werror=date-time -DSTDC_HEADERS=1 -DHAVE_SYS_TYPES_H=1 -DHAVE_SYS_STAT_H=1 -DHAVE_STDLIB_H=1 -DHAVE_STRING_H=1 -DHAVE_MEMORY_H=1 -DHAVE_STRINGS_H=1 -DHAVE_INTTYPES_H=1 -DHAVE_STDINT_H=1 -DHAVE_UNISTD_H=1 -DSQLITE_OMIT_LOAD_EXTENSION=1 -DSQLITE_THREADSAFE=0 -I. -MD -MT MultiSource/Applications/sqlite3/CMakeFiles/sqlite3.dir/shell.c.o -MF MultiSource/Applications/sqlite3/CMakeFiles/sqlite3.dir/shell.c.o.d -o MultiSource/Applications/sqlite3/CMakeFiles/sqlite3.dir/shell.c.o   -c /Users/buildslave/jenkins/workspace/test-suite-verify-machineinstrs-aarch64-O3/test-suite/MultiSource/Applications/sqlite3/shell.c
[6136/11529] /Users/buildslave/jenkins/workspace/test-suite-verify-machineinstrs-aarch64-O3/test-suite-build/tools/timeit --summary MultiSource/Applications/Burg/CMakeFiles/burg.dir/plank.c.o.time /Users/buildslave/jenkins/workspace/test-suite-verify-machineinstrs-aarch64-O3/compiler/bin/clang -DNDEBUG -IMultiSource/Applications/Burg -B /Applications/Xcode.app/Contents/Developer/Toolchains/XcodeDefault.xctoolchain/usr/bin    -Wno-unused-command-line-argument -mllvm -verify-machineinstrs -O3 -arch arm64 -isysroot /Applications/Xcode.app/Contents/Developer/Platforms/iPhoneOS.platform/Developer/SDKs/iPhoneOS12.1.sdk   -w -Werror=date-time -std=gnu89 -DDEBUG -MD -MT MultiSource/Applications/Burg/CMakeFiles/burg.dir/plank.c.o -MF MultiSource/Applications/Burg/CMakeFiles/burg.dir/plank.c.o.d -o MultiSource/Applications/Burg/CMakeFiles/burg.dir/plank.c.o   -c /Users/buildslave/jenkins/workspace/test-suite-verify-machineinstrs-aarch64-O3/test-suite/MultiSource/Applications/Burg/plank.c
[6137/11529] /Users/buildslave/jenkins/workspace/test-suite-verify-machineinstrs-aarch64-O3/test-suite-build/tools/timeit --summary MultiSource/Applications/sqlite3/CMakeFiles/sqlite3.dir/sqlite3.c.o.time /Users/buildslave/jenkins/workspace/test-suite-verify-machineinstrs-aarch64-O3/compiler/bin/clang -DNDEBUG  -B /Applications/Xcode.app/Contents/Developer/Toolchains/XcodeDefault.xctoolchain/usr/bin    -Wno-unused-command-line-argument -mllvm -verify-machineinstrs -O3 -arch arm64 -isysroot /Applications/Xcode.app/Contents/Developer/Platforms/iPhoneOS.platform/Developer/SDKs/iPhoneOS12.1.sdk   -w -Werror=date-time -DSTDC_HEADERS=1 -DHAVE_SYS_TYPES_H=1 -DHAVE_SYS_STAT_H=1 -DHAVE_STDLIB_H=1 -DHAVE_STRING_H=1 -DHAVE_MEMORY_H=1 -DHAVE_STRINGS_H=1 -DHAVE_INTTYPES_H=1 -DHAVE_STDINT_H=1 -DHAVE_UNISTD_H=1 -DSQLITE_OMIT_LOAD_EXTENSION=1 -DSQLITE_THREADSAFE=0 -I. -MD -MT MultiSource/Applications/sqlite3/CMakeFiles/sqlite3.dir/sqlite3.c.o -MF MultiSource/Applications/sqlite3/CMakeFiles/sqlite3.dir/sqlite3.c.o.d -o MultiSource/Applications/sqlite3/CMakeFiles/sqlite3.dir/sqlite3.c.o   -c /Users/buildslave/jenkins/workspace/test-suite-verify-machineinstrs-aarch64-O3/test-suite/MultiSource/Applications/sqlite3/sqlite3.c
FAILED: MultiSource/Applications/sqlite3/CMakeFiles/sqlite3.dir/sqlite3.c.o 
/Users/buildslave/jenkins/workspace/test-suite-verify-machineinstrs-aarch64-O3/test-suite-build/tools/timeit --summary MultiSource/Applications/sqlite3/CMakeFiles/sqlite3.dir/sqlite3.c.o.time /Users/buildslave/jenkins/workspace/test-suite-verify-machineinstrs-aarch64-O3/compiler/bin/clang -DNDEBUG  -B /Applications/Xcode.app/Contents/Developer/Toolchains/XcodeDefault.xctoolchain/usr/bin    -Wno-unused-command-line-argument -mllvm -verify-machineinstrs -O3 -arch arm64 -isysroot /Applications/Xcode.app/Contents/Developer/Platforms/iPhoneOS.platform/Developer/SDKs/iPhoneOS12.1.sdk   -w -Werror=date-time -DSTDC_HEADERS=1 -DHAVE_SYS_TYPES_H=1 -DHAVE_SYS_STAT_H=1 -DHAVE_STDLIB_H=1 -DHAVE_STRING_H=1 -DHAVE_MEMORY_H=1 -DHAVE_STRINGS_H=1 -DHAVE_INTTYPES_H=1 -DHAVE_STDINT_H=1 -DHAVE_UNISTD_H=1 -DSQLITE_OMIT_LOAD_EXTENSION=1 -DSQLITE_THREADSAFE=0 -I. -MD -MT MultiSource/Applications/sqlite3/CMakeFiles/sqlite3.dir/sqlite3.c.o -MF MultiSource/Applications/sqlite3/CMakeFiles/sqlite3.dir/sqlite3.c.o.d -o MultiSource/Applications/sqlite3/CMakeFiles/sqlite3.dir/sqlite3.c.o   -c /Users/buildslave/jenkins/workspace/test-suite-verify-machineinstrs-aarch64-O3/test-suite/MultiSource/Applications/sqlite3/sqlite3.c
Assertion failed: (i_nocapture < OperandTraits<PHINode>::operands(this) && "getOperand() out of range!"), function getOperand, file /Users/buildslave/jenkins/workspace/clang-stage1-RA/llvm-project/llvm/include/llvm/IR/Instructions.h, line 2703.
PLEASE submit a bug report to https://bugs.llvm.org/ and include the crash backtrace, preprocessed source, and associated run script.
Stack dump:
Error: clang frontend command failed due to signal (use -v to see invocation)
27 clang                    0x000000010a0e725d clang::driver::Compilation::ExecuteCommand(clang::driver::Command const&, clang::driver::Command const*&) const + 221
28 clang                    0x000000010a0e769b clang::driver::Compilation::ExecuteJobs(clang::driver::JobList const&, llvm::SmallVectorImpl<std::__1::pair<int, clang::driver::Command const*> >&) const + 123
29 clang                    0x000000010a0fbadb clang::driver::Driver::ExecuteCompilation(clang::driver::Compilation&, llvm::SmallVectorImpl<std::__1::pair<int, clang::driver::Command const*> >&) + 203
30 clang                    0x0000000107b8b729 main + 10777
31 libdyld.dylib            0x00007fff5feb2085 start + 1
clang-11: error: clang frontend command failed due to signal (use -v to see invocation)
clang version 11.0.0 (https://github.com/llvm/llvm-project.git 6a4714030e467293e839433a6754685ed3bdc108)
Target: aarch64-apple-darwin18.0.0

Build Log

Changes
  1. [tests] Fix AMDGPU test (details)
  2. AMDGPU: Remove fp-exceptions feature (details)
  3. [lldb/CMake] Set both the BUILD and INSTALL RPATH on macOS (2/2) (details)
  4. [clang-format] Create a python documentation tool to generate a summary of the clang-format status for the whole of the LLVM project (details)
  5. Add NoMerge MIFlag to avoid MIR branch folding (details)
  6. [ASTMatchers] Matchers related to C++ inheritance (details)
  7. [Matrix] Implement + and - operators for MatrixType. (details)
  8. Process gep (phi ptr1, ptr2) in SROA (details)
  9. [DebugInfo][DAG] Don't reuse debug location on COPY if width changes. (details)

Started by upstream project relay-test-suite-verify-machineinstrs build number 7945
originally caused by:

This run spent:

  • 6.1 sec waiting;
  • 43 min build duration;
  • 43 min total from scheduled to completion.
Revision: 32a881a12e43a709ffa19d161f6559cc58e94abe
  • refs/remotes/origin/master
Revision: 6a4714030e467293e839433a6754685ed3bdc108
  • detached
Revision: f34ad041dce4f3b55a013ab6e7d712349a2844a0
  • refs/remotes/origin/master
Revision: 2c3c4a6286d453f763c0245c6536ddd368f0db99
  • refs/remotes/origin/master

Identified problems

Assertion failure

This build failed because of an assertion failure. Below is a list of all errors in the build log:
Indication 1

Ninja target failed

Below is a link to the first failed ninja target.
Indication 2

Compile Error

This build failed because of a compile error. Below is a list of all errors in the build log:
Indication 3