Started 4 days 2 hr ago
Took 15 min

Failed Build clang-d354902-gcb2a8be8842-t10456-b10456.tar.gz (May 21, 2020 9:51:16 AM)

Issues

Found 3 issues:
Ninja target: AArch64_halide_runtime.bc.o
ld: warning: direct access in function 'ltmp1' from file 'Bitcode/simd_ops/CMakeFiles/simd_ops_test_op_umlal_162.dir/AArch64_halide_runtime.bc.o' to global weak symbol 'Halide::Runtime::Internal::default_trace(void*, halide_trace_event const*)' from file 'Bitcode/simd_ops/CMakeFiles/simd_ops_test_op_umlal_162.dir/AArch64_halide_runtime.bc.o' means the weak symbol cannot be overridden at runtime. This was likely caused by different translation units being compiled with different visibility settings.
ld: warning: direct access in function 'ltmp1' from file 'Bitcode/simd_ops/CMakeFiles/simd_ops_test_op_umlal_162.dir/AArch64_halide_runtime.bc.o' to global weak symbol 'Halide::Runtime::Internal::default_trace(void*, halide_trace_event const*)' from file 'Bitcode/simd_ops/CMakeFiles/simd_ops_test_op_umlal_162.dir/AArch64_halide_runtime.bc.o' means the weak symbol cannot be overridden at runtime. This was likely caused by different translation units being compiled with different visibility settings.
ld: warning: direct access in function 'ltmp1' from file 'Bitcode/simd_ops/CMakeFiles/simd_ops_test_op_umlal_162.dir/AArch64_halide_runtime.bc.o' to global weak symbol 'Halide::Runtime::Internal::default_trace(void*, halide_trace_event const*)' from file 'Bitcode/simd_ops/CMakeFiles/simd_ops_test_op_umlal_162.dir/AArch64_halide_runtime.bc.o' means the weak symbol cannot be overridden at runtime. This was likely caused by different translation units being compiled with different visibility settings.
ld: warning: direct access in function 'ltmp1' from file 'Bitcode/simd_ops/CMakeFiles/simd_ops_test_op_umlal_162.dir/AArch64_halide_runtime.bc.o' to global weak symbol 'Halide::Runtime::Internal::default_trace(void*, halide_trace_event const*)' from file 'Bitcode/simd_ops/CMakeFiles/simd_ops_test_op_umlal_162.dir/AArch64_halide_runtime.bc.o' means the weak symbol cannot be overridden at runtime. This was likely caused by different translation units being compiled with different visibility settings.
[5022/11529] /Users/buildslave/jenkins/workspace/test-suite-verify-machineinstrs-aarch64-O0-g/test-suite-build/tools/timeit --summary Bitcode/simd_ops/CMakeFiles/simd_ops_test_op_cmeq_71.dir/AArch64_halide_runtime.bc.o.time /Users/buildslave/jenkins/workspace/test-suite-verify-machineinstrs-aarch64-O0-g/compiler/bin/clang++  -DNDEBUG  -B /Applications/Xcode.app/Contents/Developer/Toolchains/XcodeDefault.xctoolchain/usr/bin    -Wno-unused-command-line-argument -mllvm -verify-machineinstrs -O0 -g -arch arm64 -isysroot /Applications/Xcode.app/Contents/Developer/Platforms/iPhoneOS.platform/Developer/SDKs/iPhoneOS12.1.sdk   -w -Werror=date-time -MD -MT Bitcode/simd_ops/CMakeFiles/simd_ops_test_op_cmeq_71.dir/AArch64_halide_runtime.bc.o -MF Bitcode/simd_ops/CMakeFiles/simd_ops_test_op_cmeq_71.dir/AArch64_halide_runtime.bc.o.d -o Bitcode/simd_ops/CMakeFiles/simd_ops_test_op_cmeq_71.dir/AArch64_halide_runtime.bc.o -c /Users/buildslave/jenkins/workspace/test-suite-verify-machineinstrs-aarch64-O0-g/test-suite/Bitcode/simd_ops/AArch64_halide_runtime.bc
FAILED: Bitcode/simd_ops/CMakeFiles/simd_ops_test_op_cmeq_71.dir/AArch64_halide_runtime.bc.o 
/Users/buildslave/jenkins/workspace/test-suite-verify-machineinstrs-aarch64-O0-g/test-suite-build/tools/timeit --summary Bitcode/simd_ops/CMakeFiles/simd_ops_test_op_cmeq_71.dir/AArch64_halide_runtime.bc.o.time /Users/buildslave/jenkins/workspace/test-suite-verify-machineinstrs-aarch64-O0-g/compiler/bin/clang++  -DNDEBUG  -B /Applications/Xcode.app/Contents/Developer/Toolchains/XcodeDefault.xctoolchain/usr/bin    -Wno-unused-command-line-argument -mllvm -verify-machineinstrs -O0 -g -arch arm64 -isysroot /Applications/Xcode.app/Contents/Developer/Platforms/iPhoneOS.platform/Developer/SDKs/iPhoneOS12.1.sdk   -w -Werror=date-time -MD -MT Bitcode/simd_ops/CMakeFiles/simd_ops_test_op_cmeq_71.dir/AArch64_halide_runtime.bc.o -MF Bitcode/simd_ops/CMakeFiles/simd_ops_test_op_cmeq_71.dir/AArch64_halide_runtime.bc.o.d -o Bitcode/simd_ops/CMakeFiles/simd_ops_test_op_cmeq_71.dir/AArch64_halide_runtime.bc.o -c /Users/buildslave/jenkins/workspace/test-suite-verify-machineinstrs-aarch64-O0-g/test-suite/Bitcode/simd_ops/AArch64_halide_runtime.bc
Assertion failed: (NumOperands == (isCopyLike(MI) ? 1 : MI.getNumOperands()) && "NumOperands must match, see constructor"), function verify, file /Users/buildslave/jenkins/workspace/clang-stage1-RA/llvm-project/llvm/lib/CodeGen/GlobalISel/RegisterBankInfo.cpp, line 602.
assertion: NumOperands == (isCopyLike(MI) ? 1 : MI.getNumOperands()) && "NumOperands must match, see constructor"
ld: warning: direct access in function 'ltmp1' from file 'Bitcode/simd_ops/CMakeFiles/simd_ops_test_op_umlal_162.dir/AArch64_halide_runtime.bc.o' to global weak symbol 'Halide::Runtime::Internal::default_trace(void*, halide_trace_event const*)' from file 'Bitcode/simd_ops/CMakeFiles/simd_ops_test_op_umlal_162.dir/AArch64_halide_runtime.bc.o' means the weak symbol cannot be overridden at runtime. This was likely caused by different translation units being compiled with different visibility settings.
ld: warning: direct access in function 'ltmp1' from file 'Bitcode/simd_ops/CMakeFiles/simd_ops_test_op_umlal_162.dir/AArch64_halide_runtime.bc.o' to global weak symbol 'Halide::Runtime::Internal::default_trace(void*, halide_trace_event const*)' from file 'Bitcode/simd_ops/CMakeFiles/simd_ops_test_op_umlal_162.dir/AArch64_halide_runtime.bc.o' means the weak symbol cannot be overridden at runtime. This was likely caused by different translation units being compiled with different visibility settings.
[5022/11529] /Users/buildslave/jenkins/workspace/test-suite-verify-machineinstrs-aarch64-O0-g/test-suite-build/tools/timeit --summary Bitcode/simd_ops/CMakeFiles/simd_ops_test_op_cmeq_71.dir/AArch64_halide_runtime.bc.o.time /Users/buildslave/jenkins/workspace/test-suite-verify-machineinstrs-aarch64-O0-g/compiler/bin/clang++  -DNDEBUG  -B /Applications/Xcode.app/Contents/Developer/Toolchains/XcodeDefault.xctoolchain/usr/bin    -Wno-unused-command-line-argument -mllvm -verify-machineinstrs -O0 -g -arch arm64 -isysroot /Applications/Xcode.app/Contents/Developer/Platforms/iPhoneOS.platform/Developer/SDKs/iPhoneOS12.1.sdk   -w -Werror=date-time -MD -MT Bitcode/simd_ops/CMakeFiles/simd_ops_test_op_cmeq_71.dir/AArch64_halide_runtime.bc.o -MF Bitcode/simd_ops/CMakeFiles/simd_ops_test_op_cmeq_71.dir/AArch64_halide_runtime.bc.o.d -o Bitcode/simd_ops/CMakeFiles/simd_ops_test_op_cmeq_71.dir/AArch64_halide_runtime.bc.o -c /Users/buildslave/jenkins/workspace/test-suite-verify-machineinstrs-aarch64-O0-g/test-suite/Bitcode/simd_ops/AArch64_halide_runtime.bc
FAILED: Bitcode/simd_ops/CMakeFiles/simd_ops_test_op_cmeq_71.dir/AArch64_halide_runtime.bc.o 
/Users/buildslave/jenkins/workspace/test-suite-verify-machineinstrs-aarch64-O0-g/test-suite-build/tools/timeit --summary Bitcode/simd_ops/CMakeFiles/simd_ops_test_op_cmeq_71.dir/AArch64_halide_runtime.bc.o.time /Users/buildslave/jenkins/workspace/test-suite-verify-machineinstrs-aarch64-O0-g/compiler/bin/clang++  -DNDEBUG  -B /Applications/Xcode.app/Contents/Developer/Toolchains/XcodeDefault.xctoolchain/usr/bin    -Wno-unused-command-line-argument -mllvm -verify-machineinstrs -O0 -g -arch arm64 -isysroot /Applications/Xcode.app/Contents/Developer/Platforms/iPhoneOS.platform/Developer/SDKs/iPhoneOS12.1.sdk   -w -Werror=date-time -MD -MT Bitcode/simd_ops/CMakeFiles/simd_ops_test_op_cmeq_71.dir/AArch64_halide_runtime.bc.o -MF Bitcode/simd_ops/CMakeFiles/simd_ops_test_op_cmeq_71.dir/AArch64_halide_runtime.bc.o.d -o Bitcode/simd_ops/CMakeFiles/simd_ops_test_op_cmeq_71.dir/AArch64_halide_runtime.bc.o -c /Users/buildslave/jenkins/workspace/test-suite-verify-machineinstrs-aarch64-O0-g/test-suite/Bitcode/simd_ops/AArch64_halide_runtime.bc
Assertion failed: (NumOperands == (isCopyLike(MI) ? 1 : MI.getNumOperands()) && "NumOperands must match, see constructor"), function verify, file /Users/buildslave/jenkins/workspace/clang-stage1-RA/llvm-project/llvm/lib/CodeGen/GlobalISel/RegisterBankInfo.cpp, line 602.
PLEASE submit a bug report to https://bugs.llvm.org/ and include the crash backtrace, preprocessed source, and associated run script.
Stack dump:
Error: clang frontend command failed due to signal (use -v to see invocation)
27 clang++                  0x00000001080db2eb clang::driver::Compilation::ExecuteJobs(clang::driver::JobList const&, llvm::SmallVectorImpl<std::__1::pair<int, clang::driver::Command const*> >&) const + 123
28 clang++                  0x00000001080ef72b clang::driver::Driver::ExecuteCompilation(clang::driver::Compilation&, llvm::SmallVectorImpl<std::__1::pair<int, clang::driver::Command const*> >&) + 203
29 clang++                  0x0000000105b8d929 main + 10777
30 libdyld.dylib            0x00007fff5feb2085 start + 1
31 libdyld.dylib            0x0000000000000018 start + 18446603338906918804
clang-11: error: clang frontend command failed due to signal (use -v to see invocation)
clang version 11.0.0 (https://github.com/llvm/llvm-project.git cb2a8be8842a39ed9b657fa9928733f8d70079f0)
Target: aarch64-apple-darwin18.0.0

Build Log

Changes
  1. [mlir][gpu] Refactor ConvertGpuLaunchFuncToCudaCalls pass. (details)
  2. [StringRef] Use some trickery to avoid initializing the std::string returned by upper()/lower() (details)
  3. [BitcodeReader] Simplify code. NFCI. (details)
  4. [mlir][rocdl] Exposing buffer load/store intrinsic (details)
  5. GenericDomTree.h - remove unused PointerIntPair.h include. NFC. (details)
  6. [x86] NFC: Fix typo in command line option description (details)
  7. Fix DeferredDiagnosticsEmitter for bug#45987 (details)
  8. [ModuloSchedule] Trivial fix for instruction with more than one destination in modulo peeler. (details)
  9. [SLP][NFC] PR45269 getVectorElementSize() is slow (details)
  10. [llvm][test] Add COM: directives before colon-less non-CHECKs in comments. NFC (details)
  11. [llvm][test] Add missing FileCheck colons. NFC (details)
  12. Revert "[YAMLTraits] Add trait for char" (details)
  13. [ADT] NFC: Fix typos in header comments (details)

Started by upstream project relay-test-suite-verify-machineinstrs build number 7853
originally caused by:

This run spent:

  • 8.6 sec waiting;
  • 15 min build duration;
  • 15 min total from scheduled to completion.
Revision: a7a76fa8237f576172d2f30e3a29ab5bca0d838d
  • refs/remotes/origin/master
Revision: cb2a8be8842a39ed9b657fa9928733f8d70079f0
  • detached
Revision: f34ad041dce4f3b55a013ab6e7d712349a2844a0
  • refs/remotes/origin/master
Revision: 2c3c4a6286d453f763c0245c6536ddd368f0db99
  • refs/remotes/origin/master

Identified problems

Ninja target failed

Below is a link to the first failed ninja target.
Indication 1

Assertion failure

This build failed because of an assertion failure. Below is a list of all errors in the build log:
Indication 2

Compile Error

This build failed because of a compile error. Below is a list of all errors in the build log:
Indication 3