FailedConsole Output

Started by upstream project "clang-stage1-RA" build number 14574
originally caused by:
 Started by an SCM change
 Started by an SCM change
 Started by an SCM change
 Started by an SCM change
 Started by an SCM change
 Started by an SCM change
 Started by an SCM change
 Started by an SCM change
 Started by an SCM change
 Started by an SCM change
Started by upstream project "clang-stage1-RA" build number 14575
originally caused by:
 Started by an SCM change
 Started by an SCM change
 Started by an SCM change
 Started by an SCM change
 Started by an SCM change
 Started by an SCM change
 Started by an SCM change
 Started by an SCM change
 Started by an SCM change
 Started by an SCM change
Started by upstream project "clang-stage1-RA" build number 14576
originally caused by:
 Started by an SCM change
 Started by an SCM change
 Started by an SCM change
 Started by an SCM change
 Started by an SCM change
 Started by an SCM change
 Started by an SCM change
 Started by an SCM change
 Started by an SCM change
 Started by an SCM change
 Started by an SCM change
 Started by an SCM change
 Started by an SCM change
Started by upstream project "clang-stage1-RA" build number 14577
originally caused by:
 Started by an SCM change
 Started by an SCM change
 Started by an SCM change
 Started by an SCM change
 Started by an SCM change
 Started by an SCM change
 Started by an SCM change
 Started by an SCM change
 Started by an SCM change
 Started by an SCM change
Started by upstream project "clang-stage1-RA" build number 14578
originally caused by:
 Started by an SCM change
 Started by an SCM change
 Started by an SCM change
 Started by an SCM change
 Started by an SCM change
 Started by an SCM change
 Started by an SCM change
 Started by an SCM change
 Started by an SCM change
 Started by an SCM change
Started by upstream project "clang-stage1-RA" build number 14579
originally caused by:
 Started by an SCM change
 Started by an SCM change
 Started by an SCM change
 Started by an SCM change
 Started by an SCM change
 Started by an SCM change
 Started by an SCM change
 Started by an SCM change
 Started by an SCM change
 Started by an SCM change
 Started by an SCM change
Started by upstream project "clang-stage1-RA" build number 14580
originally caused by:
 Started by an SCM change
 Started by an SCM change
 Started by an SCM change
 Started by an SCM change
 Started by an SCM change
 Started by an SCM change
 Started by an SCM change
 Started by an SCM change
 Started by an SCM change
 Started by an SCM change
 Started by an SCM change
 Started by an SCM change
 Started by an SCM change
 Started by an SCM change
Started by upstream project "clang-stage1-RA" build number 14581
originally caused by:
 Started by an SCM change
 Started by an SCM change
 Started by an SCM change
 Started by an SCM change
 Started by an SCM change
 Started by an SCM change
 Started by an SCM change
 Started by an SCM change
 Started by an SCM change
 Started by an SCM change
 Started by an SCM change
 Started by an SCM change
 Started by an SCM change
 Started by an SCM change
 Started by an SCM change
Started by upstream project "clang-stage1-RA" build number 14582
originally caused by:
 Started by an SCM change
 Started by an SCM change
 Started by an SCM change
 Started by an SCM change
 Started by an SCM change
 Started by an SCM change
 Started by an SCM change
 Started by an SCM change
 Started by an SCM change
 Started by an SCM change
 Started by an SCM change
Running as SYSTEM
Building remotely on green-dragon-06 (Zorg 10.15.5 performance Xcode11.5 10.15 Xcode11 MacMini performance2) in workspace /Users/buildslave/jenkins/workspace/clang-stage2-cmake-RgTSan
No credentials specified
 > git rev-parse --is-inside-work-tree # timeout=10
Fetching changes from the remote Git repository
 > git config remote.origin.url http://labmaster3.local/git/llvm-project.git # timeout=10
Fetching upstream changes from http://labmaster3.local/git/llvm-project.git
 > git --version # timeout=10
 > git fetch --tags --force --progress -- http://labmaster3.local/git/llvm-project.git +refs/heads/*:refs/remotes/origin/* # timeout=10
Seen branch in repository origin/277873ce0f48
Seen branch in repository origin/51f23efbef48
Seen branch in repository origin/LitFixes
Seen branch in repository origin/lntue-libc-fmin
Seen branch in repository origin/master
Seen branch in repository origin/release/1.0.x
Seen branch in repository origin/release/1.1.x
Seen branch in repository origin/release/1.2.x
Seen branch in repository origin/release/1.3.x
Seen branch in repository origin/release/1.4.x
Seen branch in repository origin/release/1.5.x
Seen branch in repository origin/release/1.6.x
Seen branch in repository origin/release/1.7.x
Seen branch in repository origin/release/1.8.x
Seen branch in repository origin/release/1.9.x
Seen branch in repository origin/release/10.x
Seen branch in repository origin/release/11.x
Seen branch in repository origin/release/2.0.x
Seen branch in repository origin/release/2.1.x
Seen branch in repository origin/release/2.2.x
Seen branch in repository origin/release/2.3.x
Seen branch in repository origin/release/2.4.x
Seen branch in repository origin/release/2.5.x
Seen branch in repository origin/release/2.6.x
Seen branch in repository origin/release/2.7.x
Seen branch in repository origin/release/2.8.x
Seen branch in repository origin/release/2.9.x
Seen branch in repository origin/release/3.0.x
Seen branch in repository origin/release/3.1.x
Seen branch in repository origin/release/3.2.x
Seen branch in repository origin/release/3.3.x
Seen branch in repository origin/release/3.4.x
Seen branch in repository origin/release/3.5.x
Seen branch in repository origin/release/3.6.x
Seen branch in repository origin/release/3.7.x
Seen branch in repository origin/release/3.8.x
Seen branch in repository origin/release/3.9.x
Seen branch in repository origin/release/4.x
Seen branch in repository origin/release/5.x
Seen branch in repository origin/release/6.x
Seen branch in repository origin/release/7.x
Seen branch in repository origin/release/8.x
Seen branch in repository origin/release/9.x
Seen branch in repository origin/upstream
Seen 44 remote branches
 > git show-ref --tags -d # timeout=10
Checking out Revision 6859d95ea2d0f3fe0de2923a3f642170e66a1a14 (origin/master)
 > git config core.sparsecheckout # timeout=10
 > git checkout -f 6859d95ea2d0f3fe0de2923a3f642170e66a1a14 # timeout=10
Commit message: "Fix build."
 > git rev-list --no-walk dbd45b2db8e0c396fa20d4c72734c4f31f54af96 # timeout=10
No credentials specified
 > git rev-parse --is-inside-work-tree # timeout=10
Fetching changes from the remote Git repository
 > git config remote.origin.url http://labmaster3.local/git/llvm-zorg.git # timeout=10
Fetching upstream changes from http://labmaster3.local/git/llvm-zorg.git
 > git --version # timeout=10
 > git fetch --tags --force --progress -- http://labmaster3.local/git/llvm-zorg.git +refs/heads/*:refs/remotes/origin/* # timeout=10
 > git rev-parse refs/remotes/origin/master^{commit} # timeout=10
 > git rev-parse refs/remotes/origin/origin/master^{commit} # timeout=10
Checking out Revision 29eb67693d9ac60038068870cb44710d81073021 (refs/remotes/origin/master)
 > git config core.sparsecheckout # timeout=10
 > git checkout -f 29eb67693d9ac60038068870cb44710d81073021 # timeout=10
Commit message: "Cleaned status.py from old notifiers."
 > git rev-list --no-walk 29eb67693d9ac60038068870cb44710d81073021 # timeout=10
[clang-stage2-cmake-RgTSan] $ /bin/sh -xe /var/folders/09/r4vw4v8n5kb67jl66zvlbljw0000gn/T/jenkins4655003821044829677.sh
+ echo @@@ JOB SETUP STEP @@@
JOB SETUP STEP

Hide Details

@@@ JOB SETUP STEP @@@ + curl -fvO http://labmaster2.local/artifacts/clang-stage1-RA/last_good_build.properties % Total % Received % Xferd Average Speed Time Time Time Current Dload Upload Total Spent Left Speed 0 0 0 0 0 0 0 0 --:--:-- --:--:-- --:--:-- 0 0 0 0 0 0 0 0 0 --:--:-- --:--:-- --:--:-- 0 0 0 0 0 0 0 0 0 --:--:-- 0:00:01 --:--:-- 0 0 0 0 0 0 0 0 0 --:--:-- 0:00:02 --:--:-- 0 0 0 0 0 0 0 0 0 --:--:-- 0:00:03 --:--:-- 0 0 0 0 0 0 0 0 0 --:--:-- 0:00:04 --:--:-- 0* Trying 10.1.1.12... * TCP_NODELAY set * Connected to labmaster2.local (10.1.1.12) port 80 (#0) > GET /artifacts/clang-stage1-RA/last_good_build.properties HTTP/1.1 > Host: labmaster2.local > User-Agent: curl/7.64.1 > Accept: */* > < HTTP/1.1 200 OK < Server: nginx/1.12.2 < Date: Wed, 16 Sep 2020 18:56:40 GMT < Content-Type: application/octet-stream < Content-Length: 123 < Last-Modified: Wed, 16 Sep 2020 18:53:50 GMT < Connection: keep-alive < ETag: "5f625f3e-7b" < Accept-Ranges: bytes < { [123 bytes data] 100 123 100 123 0 0 23 0 0:00:05 0:00:05 --:--:-- 28 * Connection #0 to host labmaster2.local left intact * Closing connection 0 + source last_good_build.properties ++ LLVM_REV= ++ GIT_DISTANCE=366366 ++ GIT_SHA=88bdcbbf1aa ++ ARTIFACT=clang-stage1-RA/clang-d366366-g88bdcbbf1aa-t14584-b14584.tar.gz + echo GIT_DISTANCE=366366 + echo GIT_SHA=88bdcbbf1aa + echo ARTIFACT=clang-stage2-cmake-RgTSan/clang-d366366-g88bdcbbf1aa-t21733-b21733.tar.gz + echo @@@@@@ @@@@@@
[clang-stage2-cmake-RgTSan] $ /bin/sh -xe /var/folders/09/r4vw4v8n5kb67jl66zvlbljw0000gn/T/jenkins16072721174303984711.sh + echo @@@ BUILD STEP @@@
BUILD STEP

Hide Details

@@@ BUILD STEP @@@ + set -eu + echo @@@ Cleanup @@@
Cleanup

Hide Details

@@@ Cleanup @@@ + rm -rf clang-build clang-install host-compiler + export PATH=/usr/local/bin:/usr/local/sbin:/usr/bin:/bin:/usr/sbin:/sbin:/usr/bin:/usr/local/bin + PATH=/usr/local/bin:/usr/local/sbin:/usr/bin:/bin:/usr/sbin:/sbin:/usr/bin:/usr/local/bin + echo @@@ Fetch @@@
Fetch

Hide Details

@@@ Fetch @@@ + echo clang-stage2-configure-Rlto/latest clang-stage2-configure-Rlto/latest + python llvm-zorg/zorg/jenkins/monorepo_build.py fetch
Fetching Compiler

Hide Details

@@@ Fetching Compiler @@@ GETting http://labmaster2.local/artifacts//clang-stage2-configure-Rlto/latest to /Users/buildslave/jenkins/workspace/clang-stage2-cmake-RgTSan/host-compiler.tar.gz ... done. Decompressing... cd /Users/buildslave/jenkins/workspace/clang-stage2-cmake-RgTSan/host-compiler/ 'tar' 'zxf' '../host-compiler.tar.gz' Completed at: 2020-09-16T11:56:53 @@@@@@
+ ls /Users/buildslave/jenkins/workspace/clang-stage2-cmake-RgTSan/host-compiler/lib/clang/ 7.0.99 ++ ls /Users/buildslave/jenkins/workspace/clang-stage2-cmake-RgTSan/host-compiler/lib/clang/ + VERSION=7.0.99 + echo @@@ Build @@@
Build

Hide Details

@@@ Build @@@ + export DYLD_LIBRARY_PATH=/Users/buildslave/jenkins/workspace/clang-stage2-cmake-RgTSan/host-compiler/lib/ + DYLD_LIBRARY_PATH=/Users/buildslave/jenkins/workspace/clang-stage2-cmake-RgTSan/host-compiler/lib/ + ls /Users/buildslave/jenkins/workspace/clang-stage2-cmake-RgTSan/host-compiler/lib/ clang libLTO.dylib libclang.dylib + python llvm-zorg/zorg/jenkins/monorepo_build.py cmake build --cmake-type=RelWithDebInfo '--projects=clang;clang-tools-extra;compiler-rt;libcxx' --cmake-flag=-DLIBCXX_ENABLE_SHARED=OFF --cmake-flag=-DLIBCXX_ENABLE_STATIC=OFF --cmake-flag=-DLIBCXX_INCLUDE_TESTS=OFF --cmake-flag=-DLIBCXX_ENABLE_EXPERIMENTAL_LIBRARY=OFF --cmake-flag=-DLLVM_USE_SANITIZER=Thread --cmake-flag=-DLLVM_ENABLE_LTO=Thin --cmake-flag=-DLLVM_BUILD_RUNTIME=OFF --cmake-flag=-DDYLD_LIBRARY_PATH=/Users/buildslave/jenkins/workspace/clang-stage2-cmake-RgTSan/host-compiler/lib/ --cmake-build-target=LTO --noinstall --sccache You are using pip version 18.1, however version 20.2.3 is available. You should consider upgrading via the 'pip install --upgrade pip' command. You are using pip version 18.1, however version 20.2.3 is available. You should consider upgrading via the 'pip install --upgrade pip' command. Dependency met os_version v10.15.5 Dependency met brew cmake v3.17.2 Dependency met brew ninja v1.8.2 Dependency met pip psutil v5.4.5 Dependency met pip six v1.11.0 Dependency met xcode v11.5 cd /Users/buildslave/jenkins/workspace/clang-stage2-cmake-RgTSan 'env' 'SCCACHE_IDLE_TIMEOUT=0' '/usr/local/bin/sccache' '--stop-server' Stopping sccache server... error: couldn't connect to server caused by: Connection refused (os error 61) cd /Users/buildslave/jenkins/workspace/clang-stage2-cmake-RgTSan 'env' 'SCCACHE_IDLE_TIMEOUT=0' '/usr/local/bin/sccache' '--start-server' Starting sccache server...
Cmake

Hide Details

@@@ Cmake @@@ cd /Users/buildslave/jenkins/workspace/clang-stage2-cmake-RgTSan/clang-build '/usr/local/bin/cmake' '-G' 'Ninja' '-DCMAKE_MAKE_PROGRAM=/usr/local/bin/ninja' '-DCMAKE_INSTALL_PREFIX=/Users/buildslave/jenkins/workspace/clang-stage2-cmake-RgTSan/clang-install' '-DLLVM_ENABLE_PROJECTS=clang;clang-tools-extra;compiler-rt;libcxx' '/Users/buildslave/jenkins/workspace/clang-stage2-cmake-RgTSan/llvm-project/llvm' '-DLLVM_ENABLE_LTO=Off' '-DLLVM_BUILD_EXAMPLES=On' '-DCMAKE_MACOSX_RPATH=On' '-DCMAKE_LIBTOOL=/Applications/Xcode.app/Contents/Developer/Toolchains/XcodeDefault.xctoolchain/usr/bin/libtool' '-DCMAKE_C_COMPILER=/Users/buildslave/jenkins/workspace/clang-stage2-cmake-RgTSan/host-compiler/bin/clang' '-DCMAKE_CXX_COMPILER=/Users/buildslave/jenkins/workspace/clang-stage2-cmake-RgTSan/host-compiler/bin/clang++' '-DCMAKE_BUILD_TYPE=RelWithDebInfo' '-DLLVM_BUILD_EXTERNAL_COMPILER_RT=On' '-DLIBCXX_ENABLE_SHARED=OFF' '-DLIBCXX_ENABLE_STATIC=OFF' '-DLIBCXX_INCLUDE_TESTS=OFF' '-DLIBCXX_ENABLE_EXPERIMENTAL_LIBRARY=OFF' '-DLLVM_USE_SANITIZER=Thread' '-DLLVM_ENABLE_LTO=Thin' '-DLLVM_BUILD_RUNTIME=OFF' '-DDYLD_LIBRARY_PATH=/Users/buildslave/jenkins/workspace/clang-stage2-cmake-RgTSan/host-compiler/lib/' '-DLLVM_ENABLE_ASSERTIONS=Off' '-DCMAKE_C_COMPILER_LAUNCHER=/usr/local/bin/sccache' '-DCMAKE_CXX_COMPILER_LAUNCHER=/usr/local/bin/sccache' '-DLLVM_LIT_ARGS=--xunit-xml-output=testresults.xunit.xml -v -vv --timeout=600' -- The C compiler identification is Clang 7.0.99 -- The CXX compiler identification is Clang 7.0.99 -- The ASM compiler identification is Clang -- Found assembler: /Users/buildslave/jenkins/workspace/clang-stage2-cmake-RgTSan/host-compiler/bin/clang -- Check for working C compiler: /Users/buildslave/jenkins/workspace/clang-stage2-cmake-RgTSan/host-compiler/bin/clang -- Check for working C compiler: /Users/buildslave/jenkins/workspace/clang-stage2-cmake-RgTSan/host-compiler/bin/clang - works -- Detecting C compiler ABI info -- Detecting C compiler ABI info - done -- Detecting C compile features -- Detecting C compile features - done -- Check for working CXX compiler: /Users/buildslave/jenkins/workspace/clang-stage2-cmake-RgTSan/host-compiler/bin/clang++ -- Check for working CXX compiler: /Users/buildslave/jenkins/workspace/clang-stage2-cmake-RgTSan/host-compiler/bin/clang++ - works -- Detecting CXX compiler ABI info -- Detecting CXX compiler ABI info - done -- Detecting CXX compile features -- Detecting CXX compile features - done -- clang project is enabled -- clang-tools-extra project is enabled -- compiler-rt project is enabled -- debuginfo-tests project is disabled -- libc project is disabled -- libclc project is disabled -- libcxx project is enabled -- libcxxabi project is disabled -- libunwind project is disabled -- lld project is disabled -- lldb project is disabled -- mlir project is disabled -- openmp project is disabled -- parallel-libs project is disabled -- polly project is disabled -- pstl project is disabled -- flang project is disabled -- Found libtool - /Applications/Xcode.app/Contents/Developer/Toolchains/XcodeDefault.xctoolchain/usr/bin/libtool -- Performing Test LLVM_LIBSTDCXX_MIN -- Performing Test LLVM_LIBSTDCXX_MIN - Success -- Performing Test LLVM_LIBSTDCXX_SOFT_ERROR -- Performing Test LLVM_LIBSTDCXX_SOFT_ERROR - Success -- Looking for dlfcn.h -- Looking for dlfcn.h - found -- Looking for errno.h -- Looking for errno.h - found -- Looking for fcntl.h -- Looking for fcntl.h - found -- Looking for link.h -- Looking for link.h - not found -- Looking for malloc/malloc.h -- Looking for malloc/malloc.h - found -- Looking for pthread.h -- Looking for pthread.h - found -- Looking for signal.h -- Looking for signal.h - found -- Looking for sys/ioctl.h -- Looking for sys/ioctl.h - found -- Looking for sys/mman.h -- Looking for sys/mman.h - found -- Looking for sys/param.h -- Looking for sys/param.h - found -- Looking for sys/resource.h -- Looking for sys/resource.h - found -- Looking for sys/stat.h -- Looking for sys/stat.h - found -- Looking for sys/time.h -- Looking for sys/time.h - found -- Looking for sys/types.h -- Looking for sys/types.h - found -- Looking for sysexits.h -- Looking for sysexits.h - found -- Looking for termios.h -- Looking for termios.h - found -- Looking for unistd.h -- Looking for unistd.h - found -- Looking for valgrind/valgrind.h -- Looking for valgrind/valgrind.h - not found -- Looking for fenv.h -- Looking for fenv.h - found -- Looking for FE_ALL_EXCEPT -- Looking for FE_ALL_EXCEPT - found -- Looking for FE_INEXACT -- Looking for FE_INEXACT - found -- Looking for mach/mach.h -- Looking for mach/mach.h - found -- Looking for histedit.h -- Looking for histedit.h - found -- Looking for CrashReporterClient.h -- Looking for CrashReporterClient.h - not found -- Performing Test HAVE_CRASHREPORTER_INFO -- Performing Test HAVE_CRASHREPORTER_INFO - Success -- Looking for pthread_create in pthread -- Looking for pthread_create in pthread - found -- Looking for pthread_getspecific in pthread -- Looking for pthread_getspecific in pthread - found -- Looking for pthread_rwlock_init in pthread -- Looking for pthread_rwlock_init in pthread - found -- Looking for pthread_mutex_lock in pthread -- Looking for pthread_mutex_lock in pthread - found -- Looking for dlopen in dl -- Looking for dlopen in dl - found -- Looking for clock_gettime in rt -- Looking for clock_gettime in rt - not found -- Looking for pfm_initialize in pfm -- Looking for pfm_initialize in pfm - not found -- Looking for pthread.h -- Looking for pthread.h - found -- Performing Test CMAKE_HAVE_LIBC_PTHREAD -- Performing Test CMAKE_HAVE_LIBC_PTHREAD - Success -- Found Threads: TRUE -- Found ZLIB: /usr/lib/libz.dylib (found version "1.2.11") -- Looking for compress2 -- Looking for compress2 - found -- Found LibXml2: /usr/lib/libxml2.dylib (found version "2.9.4") -- Looking for xmlReadMemory -- Looking for xmlReadMemory - found -- Looking for el_init in edit -- Looking for el_init in edit - found -- Looking for xar_open in xar -- Looking for xar_open in xar - found -- Looking for arc4random -- Looking for arc4random - found -- Looking for backtrace -- Looking for backtrace - found -- backtrace facility detected in default set of libraries -- Found Backtrace: /Applications/Xcode.app/Contents/Developer/Platforms/MacOSX.platform/Developer/SDKs/MacOSX10.15.sdk/usr/include -- Performing Test C_SUPPORTS_WERROR_UNGUARDED_AVAILABILITY_NEW -- Performing Test C_SUPPORTS_WERROR_UNGUARDED_AVAILABILITY_NEW - Success -- Looking for _Unwind_Backtrace -- Looking for _Unwind_Backtrace - found -- Looking for getpagesize -- Looking for getpagesize - found -- Looking for sysconf -- Looking for sysconf - found -- Looking for getrusage -- Looking for getrusage - found -- Looking for setrlimit -- Looking for setrlimit - found -- Looking for isatty -- Looking for isatty - found -- Looking for futimens -- Looking for futimens - found -- Looking for futimes -- Looking for futimes - found -- Looking for posix_fallocate -- Looking for posix_fallocate - not found -- Looking for lseek64 -- Looking for lseek64 - not found -- Looking for mallctl -- Looking for mallctl - not found -- Looking for mallinfo -- Looking for mallinfo - not found -- Looking for malloc_zone_statistics -- Looking for malloc_zone_statistics - found -- Looking for getrlimit -- Looking for getrlimit - found -- Looking for posix_spawn -- Looking for posix_spawn - found -- Looking for pread -- Looking for pread - found -- Looking for sbrk -- Looking for sbrk - found -- Looking for strerror -- Looking for strerror - found -- Looking for strerror_r -- Looking for strerror_r - found -- Looking for strerror_s -- Looking for strerror_s - not found -- Looking for setenv -- Looking for setenv - found -- Looking for dlopen -- Looking for dlopen - found -- Looking for dladdr -- Looking for dladdr - found -- Performing Test HAVE_STRUCT_STAT_ST_MTIMESPEC_TV_NSEC -- Performing Test HAVE_STRUCT_STAT_ST_MTIMESPEC_TV_NSEC - Success -- Performing Test HAVE_STRUCT_STAT_ST_MTIM_TV_NSEC -- Performing Test HAVE_STRUCT_STAT_ST_MTIM_TV_NSEC - Failed -- Looking for __GLIBC__ -- Looking for __GLIBC__ - not found -- Looking for pthread_getname_np -- Looking for pthread_getname_np - found -- Looking for pthread_setname_np -- Looking for pthread_setname_np - found -- Performing Test HAVE_STD_IS_TRIVIALLY_COPYABLE -- Performing Test HAVE_STD_IS_TRIVIALLY_COPYABLE - Success -- Performing Test HAVE_CXX_ATOMICS_WITHOUT_LIB -- Performing Test HAVE_CXX_ATOMICS_WITHOUT_LIB - Success -- Performing Test HAVE_CXX_ATOMICS64_WITHOUT_LIB -- Performing Test HAVE_CXX_ATOMICS64_WITHOUT_LIB - Success -- Performing Test LLVM_HAS_ATOMICS -- Performing Test LLVM_HAS_ATOMICS - Success -- Performing Test SUPPORTS_VARIADIC_MACROS_FLAG -- Performing Test SUPPORTS_VARIADIC_MACROS_FLAG - Success -- Performing Test SUPPORTS_GNU_ZERO_VARIADIC_MACRO_ARGUMENTS_FLAG -- Performing Test SUPPORTS_GNU_ZERO_VARIADIC_MACRO_ARGUMENTS_FLAG - Success -- Native target architecture is X86 -- Threads enabled. -- Doxygen disabled. -- Go bindings disabled. -- Ninja version: 1.8.2 -- Found ld64 - /Applications/Xcode.app/Contents/Developer/Toolchains/XcodeDefault.xctoolchain/usr/bin/ld -- Could NOT find OCaml (missing: OCAMLFIND OCAML_VERSION OCAML_STDLIB_PATH) -- Could NOT find OCaml (missing: OCAMLFIND OCAML_VERSION OCAML_STDLIB_PATH) -- OCaml bindings disabled. -- Could NOT find Python module pygments -- Could NOT find Python module pygments.lexers.c_cpp -- Could NOT find Python module yaml -- LLVM host triple: x86_64-apple-darwin19.5.0 -- LLVM default target triple: x86_64-apple-darwin19.5.0 -- ThinLTO provides its own parallel linking - limiting parallel link jobs to 2. -- Performing Test C_SUPPORTS_FPIC -- Performing Test C_SUPPORTS_FPIC - Success -- Performing Test CXX_SUPPORTS_FPIC -- Performing Test CXX_SUPPORTS_FPIC - Success -- Building with -fPIC -- Performing Test SUPPORTS_FVISIBILITY_INLINES_HIDDEN_FLAG -- Performing Test SUPPORTS_FVISIBILITY_INLINES_HIDDEN_FLAG - Success -- Performing Test C_SUPPORTS_WERROR_DATE_TIME -- Performing Test C_SUPPORTS_WERROR_DATE_TIME - Success -- Performing Test CXX_SUPPORTS_WERROR_DATE_TIME -- Performing Test CXX_SUPPORTS_WERROR_DATE_TIME - Success -- Performing Test CXX_SUPPORTS_WERROR_UNGUARDED_AVAILABILITY_NEW -- Performing Test CXX_SUPPORTS_WERROR_UNGUARDED_AVAILABILITY_NEW - Success -- Performing Test CXX_SUPPORTS_MISSING_FIELD_INITIALIZERS_FLAG -- Performing Test CXX_SUPPORTS_MISSING_FIELD_INITIALIZERS_FLAG - Success -- Performing Test C_SUPPORTS_IMPLICIT_FALLTHROUGH_FLAG -- Performing Test C_SUPPORTS_IMPLICIT_FALLTHROUGH_FLAG - Success -- Performing Test CXX_SUPPORTS_IMPLICIT_FALLTHROUGH_FLAG -- Performing Test CXX_SUPPORTS_IMPLICIT_FALLTHROUGH_FLAG - Success -- Performing Test C_SUPPORTS_COVERED_SWITCH_DEFAULT_FLAG -- Performing Test C_SUPPORTS_COVERED_SWITCH_DEFAULT_FLAG - Success -- Performing Test CXX_SUPPORTS_COVERED_SWITCH_DEFAULT_FLAG -- Performing Test CXX_SUPPORTS_COVERED_SWITCH_DEFAULT_FLAG - Success -- Performing Test CXX_SUPPORTS_CLASS_MEMACCESS_FLAG -- Performing Test CXX_SUPPORTS_CLASS_MEMACCESS_FLAG - Failed -- Performing Test CXX_SUPPORTS_NOEXCEPT_TYPE_FLAG -- Performing Test CXX_SUPPORTS_NOEXCEPT_TYPE_FLAG - Success -- Performing Test CXX_WONT_WARN_ON_FINAL_NONVIRTUALDTOR -- Performing Test CXX_WONT_WARN_ON_FINAL_NONVIRTUALDTOR - Success -- Performing Test C_SUPPORTS_DELETE_NON_VIRTUAL_DTOR_FLAG -- Performing Test C_SUPPORTS_DELETE_NON_VIRTUAL_DTOR_FLAG - Success -- Performing Test CXX_SUPPORTS_DELETE_NON_VIRTUAL_DTOR_FLAG -- Performing Test CXX_SUPPORTS_DELETE_NON_VIRTUAL_DTOR_FLAG - Success -- Performing Test CXX_SUPPORTS_SUGGEST_OVERRIDE_FLAG -- Performing Test CXX_SUPPORTS_SUGGEST_OVERRIDE_FLAG - Failed -- Performing Test C_WCOMMENT_ALLOWS_LINE_WRAP -- Performing Test C_WCOMMENT_ALLOWS_LINE_WRAP - Success -- Performing Test C_SUPPORTS_STRING_CONVERSION_FLAG -- Performing Test C_SUPPORTS_STRING_CONVERSION_FLAG - Success -- Performing Test CXX_SUPPORTS_STRING_CONVERSION_FLAG -- Performing Test CXX_SUPPORTS_STRING_CONVERSION_FLAG - Success -- Performing Test C_SUPPORTS_FNO_OMIT_FRAME_POINTER -- Performing Test C_SUPPORTS_FNO_OMIT_FRAME_POINTER - Success -- Performing Test CXX_SUPPORTS_FNO_OMIT_FRAME_POINTER -- Performing Test CXX_SUPPORTS_FNO_OMIT_FRAME_POINTER - Success -- Performing Test LINKER_SUPPORTS_COLOR_DIAGNOSTICS -- Performing Test LINKER_SUPPORTS_COLOR_DIAGNOSTICS - Failed -- Looking for os_signpost_interval_begin -- Looking for os_signpost_interval_begin - found -- Performing Test macos_signposts_usable -- Performing Test macos_signposts_usable - Success -- Found Python3: /usr/local/Frameworks/Python.framework/Versions/3.7/bin/python3.7 (found version "3.7.1") found components: Interpreter -- Constructing LLVMBuild project information -- Linker detection: ld64 -- Found Git: /usr/bin/git (found version "2.24.3 (Apple Git-128)") -- Targeting AArch64 -- Targeting AMDGPU -- Targeting ARM -- Targeting AVR -- Targeting BPF -- Targeting Hexagon -- Targeting Lanai -- Targeting Mips -- Targeting MSP430 -- Targeting NVPTX -- Targeting PowerPC -- Targeting RISCV -- Targeting Sparc -- Targeting SystemZ -- Targeting WebAssembly -- Targeting X86 -- Targeting XCore -- Looking for sys/resource.h -- Looking for sys/resource.h - found -- Clang version: 12.0.0 -- Performing Test CXX_SUPPORTS_NO_NESTED_ANON_TYPES_FLAG -- Performing Test CXX_SUPPORTS_NO_NESTED_ANON_TYPES_FLAG - Success -- Host linker version: 556.6 -- Looking for include file CoreServices/CoreServices.h -- Looking for include file CoreServices/CoreServices.h - found -- Registering Bye as a pass plugin (static build: OFF) -- LLVM FileCheck Found: /usr/local/bin/FileCheck -- Version: 0.0.0 -- Performing Test HAVE_CXX_FLAG_STD_CXX11 -- Performing Test HAVE_CXX_FLAG_STD_CXX11 - Success -- Performing Test HAVE_CXX_FLAG_WALL -- Performing Test HAVE_CXX_FLAG_WALL - Success -- Performing Test HAVE_CXX_FLAG_WEXTRA -- Performing Test HAVE_CXX_FLAG_WEXTRA - Success -- Performing Test HAVE_CXX_FLAG_WSHADOW -- Performing Test HAVE_CXX_FLAG_WSHADOW - Success -- Performing Test HAVE_CXX_FLAG_PEDANTIC -- Performing Test HAVE_CXX_FLAG_PEDANTIC - Success -- Performing Test HAVE_CXX_FLAG_PEDANTIC_ERRORS -- Performing Test HAVE_CXX_FLAG_PEDANTIC_ERRORS - Success -- Performing Test HAVE_CXX_FLAG_WSHORTEN_64_TO_32 -- Performing Test HAVE_CXX_FLAG_WSHORTEN_64_TO_32 - Success -- Performing Test HAVE_CXX_FLAG_WFLOAT_EQUAL -- Performing Test HAVE_CXX_FLAG_WFLOAT_EQUAL - Success -- Performing Test HAVE_CXX_FLAG_FSTRICT_ALIASING -- Performing Test HAVE_CXX_FLAG_FSTRICT_ALIASING - Success -- Performing Test HAVE_CXX_FLAG_FNO_EXCEPTIONS -- Performing Test HAVE_CXX_FLAG_FNO_EXCEPTIONS - Success -- Performing Test HAVE_CXX_FLAG_WSTRICT_ALIASING -- Performing Test HAVE_CXX_FLAG_WSTRICT_ALIASING - Success -- Performing Test HAVE_CXX_FLAG_WD654 -- Performing Test HAVE_CXX_FLAG_WD654 - Failed -- Performing Test HAVE_CXX_FLAG_WTHREAD_SAFETY -- Performing Test HAVE_CXX_FLAG_WTHREAD_SAFETY - Success -- Performing Test HAVE_THREAD_SAFETY_ATTRIBUTES -- Performing Test HAVE_THREAD_SAFETY_ATTRIBUTES -- Performing Test HAVE_THREAD_SAFETY_ATTRIBUTES -- failed to compile -- Performing Test HAVE_CXX_FLAG_COVERAGE -- Performing Test HAVE_CXX_FLAG_COVERAGE - Success -- Performing Test HAVE_GNU_POSIX_REGEX -- Performing Test HAVE_GNU_POSIX_REGEX -- Performing Test HAVE_GNU_POSIX_REGEX -- failed to compile -- Performing Test HAVE_POSIX_REGEX -- Performing Test HAVE_POSIX_REGEX -- Performing Test HAVE_POSIX_REGEX -- success -- Performing Test HAVE_STEADY_CLOCK -- Performing Test HAVE_STEADY_CLOCK -- Performing Test HAVE_STEADY_CLOCK -- success -- Configuring done FATAL: command execution failed java.io.IOException at hudson.remoting.Channel.close(Channel.java:1490) at hudson.remoting.Channel.close(Channel.java:1446) at hudson.slaves.SlaveComputer.closeChannel(SlaveComputer.java:872) at hudson.slaves.SlaveComputer.kill(SlaveComputer.java:839) at hudson.model.AbstractCIBase.killComputer(AbstractCIBase.java:86) at jenkins.model.Jenkins.access$2000(Jenkins.java:318) at jenkins.model.Jenkins$19.run(Jenkins.java:3545) at hudson.model.Queue._withLock(Queue.java:1398) at hudson.model.Queue.withLock(Queue.java:1275) at jenkins.model.Jenkins._cleanUpDisconnectComputers(Jenkins.java:3539) at jenkins.model.Jenkins.cleanUp(Jenkins.java:3421) at hudson.WebAppMain.contextDestroyed(WebAppMain.java:408) at org.eclipse.jetty.server.handler.ContextHandler.callContextDestroyed(ContextHandler.java:1009) at org.eclipse.jetty.servlet.ServletContextHandler.callContextDestroyed(ServletContextHandler.java:565) at org.eclipse.jetty.server.handler.ContextHandler.contextDestroyed(ContextHandler.java:972) at org.eclipse.jetty.servlet.ServletHandler.doStop(ServletHandler.java:313) at org.eclipse.jetty.util.component.AbstractLifeCycle.stop(AbstractLifeCycle.java:93) at org.eclipse.jetty.util.component.ContainerLifeCycle.stop(ContainerLifeCycle.java:180) at org.eclipse.jetty.util.component.ContainerLifeCycle.doStop(ContainerLifeCycle.java:201) at org.eclipse.jetty.server.handler.AbstractHandler.doStop(AbstractHandler.java:108) at org.eclipse.jetty.security.SecurityHandler.doStop(SecurityHandler.java:437) at org.eclipse.jetty.security.ConstraintSecurityHandler.doStop(ConstraintSecurityHandler.java:425) at org.eclipse.jetty.util.component.AbstractLifeCycle.stop(AbstractLifeCycle.java:93) at org.eclipse.jetty.util.component.ContainerLifeCycle.stop(ContainerLifeCycle.java:180) at org.eclipse.jetty.util.component.ContainerLifeCycle.doStop(ContainerLifeCycle.java:201) at org.eclipse.jetty.server.handler.AbstractHandler.doStop(AbstractHandler.java:108) at org.eclipse.jetty.server.session.SessionHandler.doStop(SessionHandler.java:519) at org.eclipse.jetty.util.component.AbstractLifeCycle.stop(AbstractLifeCycle.java:93) at org.eclipse.jetty.util.component.ContainerLifeCycle.stop(ContainerLifeCycle.java:180) at org.eclipse.jetty.util.component.ContainerLifeCycle.doStop(ContainerLifeCycle.java:201) at org.eclipse.jetty.server.handler.AbstractHandler.doStop(AbstractHandler.java:108) at org.eclipse.jetty.server.handler.ContextHandler.stopContext(ContextHandler.java:995) at org.eclipse.jetty.servlet.ServletContextHandler.stopContext(ServletContextHandler.java:367) at org.eclipse.jetty.webapp.WebAppContext.stopWebapp(WebAppContext.java:1450) at org.eclipse.jetty.webapp.WebAppContext.stopContext(WebAppContext.java:1415) at org.eclipse.jetty.server.handler.ContextHandler.doStop(ContextHandler.java:1049) at org.eclipse.jetty.servlet.ServletContextHandler.doStop(ServletContextHandler.java:284) at org.eclipse.jetty.webapp.WebAppContext.doStop(WebAppContext.java:547) at org.eclipse.jetty.util.component.AbstractLifeCycle.stop(AbstractLifeCycle.java:93) at org.eclipse.jetty.util.component.ContainerLifeCycle.stop(ContainerLifeCycle.java:180) at org.eclipse.jetty.util.component.ContainerLifeCycle.doStop(ContainerLifeCycle.java:201) at org.eclipse.jetty.server.handler.AbstractHandler.doStop(AbstractHandler.java:108) at org.eclipse.jetty.server.Server.doStop(Server.java:455) at org.eclipse.jetty.util.component.AbstractLifeCycle.stop(AbstractLifeCycle.java:93) at winstone.Launcher.shutdown(Launcher.java:304) at winstone.ShutdownHook.run(ShutdownHook.java:25) Caused: hudson.remoting.ChannelClosedException: Channel "hudson.remoting.Channel@55e365fc:green-dragon-06": Remote call on green-dragon-06 failed. The channel is closing down or has closed down at hudson.remoting.Channel.call(Channel.java:991) at hudson.remoting.RemoteInvocationHandler.invoke(RemoteInvocationHandler.java:285) at com.sun.proxy.$Proxy91.isAlive(Unknown Source) at hudson.Launcher$RemoteLauncher$ProcImpl.isAlive(Launcher.java:1147) at hudson.Launcher$RemoteLauncher$ProcImpl.join(Launcher.java:1139) at hudson.tasks.CommandInterpreter.join(CommandInterpreter.java:155) at hudson.tasks.CommandInterpreter.perform(CommandInterpreter.java:109) at hudson.tasks.CommandInterpreter.perform(CommandInterpreter.java:66) at hudson.tasks.BuildStepMonitor$1.perform(BuildStepMonitor.java:20) at hudson.model.AbstractBuild$AbstractBuildExecution.perform(AbstractBuild.java:741) at hudson.model.Build$BuildExecution.build(Build.java:206) at hudson.model.Build$BuildExecution.doRun(Build.java:163) at hudson.model.AbstractBuild$AbstractBuildExecution.run(AbstractBuild.java:504) at hudson.model.Run.execute(Run.java:1880) at hudson.model.FreeStyleBuild.run(FreeStyleBuild.java:43) at hudson.model.ResourceController.execute(ResourceController.java:97) at hudson.model.Executor.run(Executor.java:428) FATAL: Unable to delete script file /var/folders/09/r4vw4v8n5kb67jl66zvlbljw0000gn/T/jenkins16072721174303984711.sh java.io.IOException at hudson.remoting.Channel.close(Channel.java:1490) at hudson.remoting.Channel.close(Channel.java:1446) at hudson.slaves.SlaveComputer.closeChannel(SlaveComputer.java:872) at hudson.slaves.SlaveComputer.kill(SlaveComputer.java:839) at hudson.model.AbstractCIBase.killComputer(AbstractCIBase.java:86) at jenkins.model.Jenkins.access$2000(Jenkins.java:318) at jenkins.model.Jenkins$19.run(Jenkins.java:3545) at hudson.model.Queue._withLock(Queue.java:1398) at hudson.model.Queue.withLock(Queue.java:1275) at jenkins.model.Jenkins._cleanUpDisconnectComputers(Jenkins.java:3539) at jenkins.model.Jenkins.cleanUp(Jenkins.java:3421) at hudson.WebAppMain.contextDestroyed(WebAppMain.java:408) at org.eclipse.jetty.server.handler.ContextHandler.callContextDestroyed(ContextHandler.java:1009) at org.eclipse.jetty.servlet.ServletContextHandler.callContextDestroyed(ServletContextHandler.java:565) at org.eclipse.jetty.server.handler.ContextHandler.contextDestroyed(ContextHandler.java:972) at org.eclipse.jetty.servlet.ServletHandler.doStop(ServletHandler.java:313) at org.eclipse.jetty.util.component.AbstractLifeCycle.stop(AbstractLifeCycle.java:93) at org.eclipse.jetty.util.component.ContainerLifeCycle.stop(ContainerLifeCycle.java:180) at org.eclipse.jetty.util.component.ContainerLifeCycle.doStop(ContainerLifeCycle.java:201) at org.eclipse.jetty.server.handler.AbstractHandler.doStop(AbstractHandler.java:108) at org.eclipse.jetty.security.SecurityHandler.doStop(SecurityHandler.java:437) at org.eclipse.jetty.security.ConstraintSecurityHandler.doStop(ConstraintSecurityHandler.java:425) at org.eclipse.jetty.util.component.AbstractLifeCycle.stop(AbstractLifeCycle.java:93) at org.eclipse.jetty.util.component.ContainerLifeCycle.stop(ContainerLifeCycle.java:180) at org.eclipse.jetty.util.component.ContainerLifeCycle.doStop(ContainerLifeCycle.java:201) at org.eclipse.jetty.server.handler.AbstractHandler.doStop(AbstractHandler.java:108) at org.eclipse.jetty.server.session.SessionHandler.doStop(SessionHandler.java:519) at org.eclipse.jetty.util.component.AbstractLifeCycle.stop(AbstractLifeCycle.java:93) at org.eclipse.jetty.util.component.ContainerLifeCycle.stop(ContainerLifeCycle.java:180) at org.eclipse.jetty.util.component.ContainerLifeCycle.doStop(ContainerLifeCycle.java:201) at org.eclipse.jetty.server.handler.AbstractHandler.doStop(AbstractHandler.java:108) at org.eclipse.jetty.server.handler.ContextHandler.stopContext(ContextHandler.java:995) at org.eclipse.jetty.servlet.ServletContextHandler.stopContext(ServletContextHandler.java:367) at org.eclipse.jetty.webapp.WebAppContext.stopWebapp(WebAppContext.java:1450) at org.eclipse.jetty.webapp.WebAppContext.stopContext(WebAppContext.java:1415) at org.eclipse.jetty.server.handler.ContextHandler.doStop(ContextHandler.java:1049) at org.eclipse.jetty.servlet.ServletContextHandler.doStop(ServletContextHandler.java:284) at org.eclipse.jetty.webapp.WebAppContext.doStop(WebAppContext.java:547) at org.eclipse.jetty.util.component.AbstractLifeCycle.stop(AbstractLifeCycle.java:93) at org.eclipse.jetty.util.component.ContainerLifeCycle.stop(ContainerLifeCycle.java:180) at org.eclipse.jetty.util.component.ContainerLifeCycle.doStop(ContainerLifeCycle.java:201) at org.eclipse.jetty.server.handler.AbstractHandler.doStop(AbstractHandler.java:108) at org.eclipse.jetty.server.Server.doStop(Server.java:455) at org.eclipse.jetty.util.component.AbstractLifeCycle.stop(AbstractLifeCycle.java:93) at winstone.Launcher.shutdown(Launcher.java:304) at winstone.ShutdownHook.run(ShutdownHook.java:25) Caused: hudson.remoting.ChannelClosedException: Channel "hudson.remoting.Channel@55e365fc:green-dragon-06": Remote call on green-dragon-06 failed. The channel is closing down or has closed down at hudson.remoting.Channel.call(Channel.java:991) at hudson.FilePath.act(FilePath.java:1069) at hudson.FilePath.act(FilePath.java:1058) at hudson.FilePath.delete(FilePath.java:1543) at hudson.tasks.CommandInterpreter.perform(CommandInterpreter.java:123) at hudson.tasks.CommandInterpreter.perform(CommandInterpreter.java:66) at hudson.tasks.BuildStepMonitor$1.perform(BuildStepMonitor.java:20) at hudson.model.AbstractBuild$AbstractBuildExecution.perform(AbstractBuild.java:741) at hudson.model.Build$BuildExecution.build(Build.java:206) at hudson.model.Build$BuildExecution.doRun(Build.java:163) at hudson.model.AbstractBuild$AbstractBuildExecution.run(AbstractBuild.java:504) at hudson.model.Run.execute(Run.java:1880) at hudson.model.FreeStyleBuild.run(FreeStyleBuild.java:43) at hudson.model.ResourceController.execute(ResourceController.java:97) at hudson.model.Executor.run(Executor.java:428) Build step 'Execute shell' marked build as failure ERROR: Step ‘[Deprecated] Scan for compiler warnings’ failed: no workspace for clang-stage2-cmake-RgTSan #21733 Finished: FAILURE