AbortedConsole Output

Skipping 2,149 KB.. Full Log
/docCLAMexe.rtf
cd /Users/buildslave/jenkins/workspace/lnt-ctmark-aarch64-O3-flto/lnt-sandbox/build/CTMark/ClamAV && /usr/local/Cellar/cmake/3.13.1/bin/cmake -E make_directory inputs/rtf-test
cd /Users/buildslave/jenkins/workspace/lnt-ctmark-aarch64-O3-flto/lnt-sandbox/build/CTMark/ClamAV && /usr/local/Cellar/cmake/3.13.1/bin/cmake -E create_symlink /Users/buildslave/jenkins/workspace/lnt-ctmark-aarch64-O3-flto/test-suite/CTMark/ClamAV/inputs/rtf-test/rtf1.rtf /Users/buildslave/jenkins/workspace/lnt-ctmark-aarch64-O3-flto/lnt-sandbox/build/CTMark/ClamAV/inputs/rtf-test/rtf1.rtf
cd /Users/buildslave/jenkins/workspace/lnt-ctmark-aarch64-O3-flto/lnt-sandbox/build/CTMark/ClamAV && /usr/local/Cellar/cmake/3.13.1/bin/cmake -E make_directory inputs/rtf-test
cd /Users/buildslave/jenkins/workspace/lnt-ctmark-aarch64-O3-flto/lnt-sandbox/build/CTMark/ClamAV && /usr/local/Cellar/cmake/3.13.1/bin/cmake -E create_symlink /Users/buildslave/jenkins/workspace/lnt-ctmark-aarch64-O3-flto/test-suite/CTMark/ClamAV/inputs/rtf-test/rtf-novirus.rtf /Users/buildslave/jenkins/workspace/lnt-ctmark-aarch64-O3-flto/lnt-sandbox/build/CTMark/ClamAV/inputs/rtf-test/rtf-novirus.rtf
cd /Users/buildslave/jenkins/workspace/lnt-ctmark-aarch64-O3-flto/lnt-sandbox/build/CTMark/ClamAV && /usr/local/Cellar/cmake/3.13.1/bin/cmake -E create_symlink /Users/buildslave/jenkins/workspace/lnt-ctmark-aarch64-O3-flto/test-suite/CTMark/ClamAV/dbdir /Users/buildslave/jenkins/workspace/lnt-ctmark-aarch64-O3-flto/lnt-sandbox/build/CTMark/ClamAV/dbdir
[ 86%] Built target clamscan
/Applications/Xcode.app/Contents/Developer/usr/bin/make -f CTMark/sqlite3/CMakeFiles/sqlite_input.dir/build.make CTMark/sqlite3/CMakeFiles/sqlite_input.dir/depend
cd /Users/buildslave/jenkins/workspace/lnt-ctmark-aarch64-O3-flto/lnt-sandbox/build && /usr/local/Cellar/cmake/3.13.1/bin/cmake -E cmake_depends "Unix Makefiles" /Users/buildslave/jenkins/workspace/lnt-ctmark-aarch64-O3-flto/test-suite /Users/buildslave/jenkins/workspace/lnt-ctmark-aarch64-O3-flto/test-suite/CTMark/sqlite3 /Users/buildslave/jenkins/workspace/lnt-ctmark-aarch64-O3-flto/lnt-sandbox/build /Users/buildslave/jenkins/workspace/lnt-ctmark-aarch64-O3-flto/lnt-sandbox/build/CTMark/sqlite3 /Users/buildslave/jenkins/workspace/lnt-ctmark-aarch64-O3-flto/lnt-sandbox/build/CTMark/sqlite3/CMakeFiles/sqlite_input.dir/DependInfo.cmake --color=
Dependee "/Users/buildslave/jenkins/workspace/lnt-ctmark-aarch64-O3-flto/lnt-sandbox/build/CTMark/sqlite3/CMakeFiles/sqlite_input.dir/DependInfo.cmake" is newer than depender "/Users/buildslave/jenkins/workspace/lnt-ctmark-aarch64-O3-flto/lnt-sandbox/build/CTMark/sqlite3/CMakeFiles/sqlite_input.dir/depend.internal".
Dependee "/Users/buildslave/jenkins/workspace/lnt-ctmark-aarch64-O3-flto/lnt-sandbox/build/CTMark/sqlite3/CMakeFiles/CMakeDirectoryInformation.cmake" is newer than depender "/Users/buildslave/jenkins/workspace/lnt-ctmark-aarch64-O3-flto/lnt-sandbox/build/CTMark/sqlite3/CMakeFiles/sqlite_input.dir/depend.internal".
Scanning dependencies of target sqlite_input
/Applications/Xcode.app/Contents/Developer/usr/bin/make -f CTMark/sqlite3/CMakeFiles/sqlite_input.dir/build.make CTMark/sqlite3/CMakeFiles/sqlite_input.dir/build
[ 86%] Generating sqlite test inputs
cd /Users/buildslave/jenkins/workspace/lnt-ctmark-aarch64-O3-flto/lnt-sandbox/build/CTMark/sqlite3 && /usr/bin/tclsh /Users/buildslave/jenkins/workspace/lnt-ctmark-aarch64-O3-flto/test-suite/CTMark/sqlite3/speedtest.tcl
[ 86%] Built target sqlite_input
/Applications/Xcode.app/Contents/Developer/usr/bin/make -f CTMark/sqlite3/CMakeFiles/sqlite3.dir/build.make CTMark/sqlite3/CMakeFiles/sqlite3.dir/depend
cd /Users/buildslave/jenkins/workspace/lnt-ctmark-aarch64-O3-flto/lnt-sandbox/build && /usr/local/Cellar/cmake/3.13.1/bin/cmake -E cmake_depends "Unix Makefiles" /Users/buildslave/jenkins/workspace/lnt-ctmark-aarch64-O3-flto/test-suite /Users/buildslave/jenkins/workspace/lnt-ctmark-aarch64-O3-flto/test-suite/CTMark/sqlite3 /Users/buildslave/jenkins/workspace/lnt-ctmark-aarch64-O3-flto/lnt-sandbox/build /Users/buildslave/jenkins/workspace/lnt-ctmark-aarch64-O3-flto/lnt-sandbox/build/CTMark/sqlite3 /Users/buildslave/jenkins/workspace/lnt-ctmark-aarch64-O3-flto/lnt-sandbox/build/CTMark/sqlite3/CMakeFiles/sqlite3.dir/DependInfo.cmake --color=
Dependee "/Users/buildslave/jenkins/workspace/lnt-ctmark-aarch64-O3-flto/lnt-sandbox/build/CTMark/sqlite3/CMakeFiles/sqlite3.dir/DependInfo.cmake" is newer than depender "/Users/buildslave/jenkins/workspace/lnt-ctmark-aarch64-O3-flto/lnt-sandbox/build/CTMark/sqlite3/CMakeFiles/sqlite3.dir/depend.internal".
Dependee "/Users/buildslave/jenkins/workspace/lnt-ctmark-aarch64-O3-flto/lnt-sandbox/build/CTMark/sqlite3/CMakeFiles/CMakeDirectoryInformation.cmake" is newer than depender "/Users/buildslave/jenkins/workspace/lnt-ctmark-aarch64-O3-flto/lnt-sandbox/build/CTMark/sqlite3/CMakeFiles/sqlite3.dir/depend.internal".
Scanning dependencies of target sqlite3
/Applications/Xcode.app/Contents/Developer/usr/bin/make -f CTMark/sqlite3/CMakeFiles/sqlite3.dir/build.make CTMark/sqlite3/CMakeFiles/sqlite3.dir/build
[ 86%] Building C object CTMark/sqlite3/CMakeFiles/sqlite3.dir/sqlite3.c.o
cd /Users/buildslave/jenkins/workspace/lnt-ctmark-aarch64-O3-flto/lnt-sandbox/build/CTMark/sqlite3 && /Users/buildslave/jenkins/workspace/lnt-ctmark-aarch64-O3-flto/lnt-sandbox/build/tools/timeit --summary CMakeFiles/sqlite3.dir/sqlite3.c.o.time /Users/buildslave/jenkins/workspace/lnt-ctmark-aarch64-O3-flto/compiler/bin/clang -DNDEBUG  -B /Applications/Xcode.app/Contents/Developer/Toolchains/XcodeDefault.xctoolchain/usr/bin    -O3 -flto -arch arm64 -isysroot /Applications/Xcode.app/Contents/Developer/Platforms/iPhoneOS.platform/Developer/SDKs/iPhoneOS12.2.sdk   -w -Werror=date-time -DSTDC_HEADERS=1 -DHAVE_SYS_TYPES_H=1 -DHAVE_SYS_STAT_H=1 -DHAVE_STDLIB_H=1 -DHAVE_STRING_H=1 -DHAVE_MEMORY_H=1 -DHAVE_STRINGS_H=1 -DHAVE_INTTYPES_H=1 -DHAVE_STDINT_H=1 -DHAVE_UNISTD_H=1 -DSQLITE_OMIT_LOAD_EXTENSION=1 -DSQLITE_THREADSAFE=0 -I. -o CMakeFiles/sqlite3.dir/sqlite3.c.o   -c /Users/buildslave/jenkins/workspace/lnt-ctmark-aarch64-O3-flto/test-suite/CTMark/sqlite3/sqlite3.c
[ 87%] Building C object CTMark/sqlite3/CMakeFiles/sqlite3.dir/shell.c.o
cd /Users/buildslave/jenkins/workspace/lnt-ctmark-aarch64-O3-flto/lnt-sandbox/build/CTMark/sqlite3 && /Users/buildslave/jenkins/workspace/lnt-ctmark-aarch64-O3-flto/lnt-sandbox/build/tools/timeit --summary CMakeFiles/sqlite3.dir/shell.c.o.time /Users/buildslave/jenkins/workspace/lnt-ctmark-aarch64-O3-flto/compiler/bin/clang -DNDEBUG  -B /Applications/Xcode.app/Contents/Developer/Toolchains/XcodeDefault.xctoolchain/usr/bin    -O3 -flto -arch arm64 -isysroot /Applications/Xcode.app/Contents/Developer/Platforms/iPhoneOS.platform/Developer/SDKs/iPhoneOS12.2.sdk   -w -Werror=date-time -DSTDC_HEADERS=1 -DHAVE_SYS_TYPES_H=1 -DHAVE_SYS_STAT_H=1 -DHAVE_STDLIB_H=1 -DHAVE_STRING_H=1 -DHAVE_MEMORY_H=1 -DHAVE_STRINGS_H=1 -DHAVE_INTTYPES_H=1 -DHAVE_STDINT_H=1 -DHAVE_UNISTD_H=1 -DSQLITE_OMIT_LOAD_EXTENSION=1 -DSQLITE_THREADSAFE=0 -I. -o CMakeFiles/sqlite3.dir/shell.c.o   -c /Users/buildslave/jenkins/workspace/lnt-ctmark-aarch64-O3-flto/test-suite/CTMark/sqlite3/shell.c
[ 87%] Linking C executable sqlite3
cd /Users/buildslave/jenkins/workspace/lnt-ctmark-aarch64-O3-flto/lnt-sandbox/build/CTMark/sqlite3 && /usr/local/Cellar/cmake/3.13.1/bin/cmake -E cmake_link_script CMakeFiles/sqlite3.dir/link.txt --verbose=1
/Users/buildslave/jenkins/workspace/lnt-ctmark-aarch64-O3-flto/lnt-sandbox/build/tools/timeit --summary sqlite3.link.time /Users/buildslave/jenkins/workspace/lnt-ctmark-aarch64-O3-flto/compiler/bin/clang   -B /Applications/Xcode.app/Contents/Developer/Toolchains/XcodeDefault.xctoolchain/usr/bin    -O3 -flto -arch arm64 -isysroot /Applications/Xcode.app/Contents/Developer/Platforms/iPhoneOS.platform/Developer/SDKs/iPhoneOS12.2.sdk -Wl,-search_paths_first -Wl,-headerpad_max_install_names   -B /Applications/Xcode.app/Contents/Developer/Toolchains/XcodeDefault.xctoolchain/usr/bin   CMakeFiles/sqlite3.dir/sqlite3.c.o CMakeFiles/sqlite3.dir/shell.c.o  -o sqlite3 
cd /Users/buildslave/jenkins/workspace/lnt-ctmark-aarch64-O3-flto/lnt-sandbox/build/CTMark/sqlite3 && /usr/local/Cellar/cmake/3.13.1/bin/cmake -E create_symlink /Users/buildslave/jenkins/workspace/lnt-ctmark-aarch64-O3-flto/test-suite/CTMark/sqlite3/sqlite3.reference_output /Users/buildslave/jenkins/workspace/lnt-ctmark-aarch64-O3-flto/lnt-sandbox/build/CTMark/sqlite3/sqlite3.reference_output
cd /Users/buildslave/jenkins/workspace/lnt-ctmark-aarch64-O3-flto/lnt-sandbox/build/CTMark/sqlite3 && /usr/local/Cellar/cmake/3.13.1/bin/cmake -E create_symlink /Users/buildslave/jenkins/workspace/lnt-ctmark-aarch64-O3-flto/test-suite/CTMark/sqlite3/sqlite3rc /Users/buildslave/jenkins/workspace/lnt-ctmark-aarch64-O3-flto/lnt-sandbox/build/CTMark/sqlite3/sqlite3rc
cd /Users/buildslave/jenkins/workspace/lnt-ctmark-aarch64-O3-flto/lnt-sandbox/build/CTMark/sqlite3 && /usr/local/Cellar/cmake/3.13.1/bin/cmake -E create_symlink /Users/buildslave/jenkins/workspace/lnt-ctmark-aarch64-O3-flto/test-suite/CTMark/sqlite3/commands /Users/buildslave/jenkins/workspace/lnt-ctmark-aarch64-O3-flto/lnt-sandbox/build/CTMark/sqlite3/commands
[ 87%] Built target sqlite3
/Applications/Xcode.app/Contents/Developer/usr/bin/make -f CTMark/consumer-typeset/CMakeFiles/consumer-typeset.dir/build.make CTMark/consumer-typeset/CMakeFiles/consumer-typeset.dir/depend
cd /Users/buildslave/jenkins/workspace/lnt-ctmark-aarch64-O3-flto/lnt-sandbox/build && /usr/local/Cellar/cmake/3.13.1/bin/cmake -E cmake_depends "Unix Makefiles" /Users/buildslave/jenkins/workspace/lnt-ctmark-aarch64-O3-flto/test-suite /Users/buildslave/jenkins/workspace/lnt-ctmark-aarch64-O3-flto/test-suite/CTMark/consumer-typeset /Users/buildslave/jenkins/workspace/lnt-ctmark-aarch64-O3-flto/lnt-sandbox/build /Users/buildslave/jenkins/workspace/lnt-ctmark-aarch64-O3-flto/lnt-sandbox/build/CTMark/consumer-typeset /Users/buildslave/jenkins/workspace/lnt-ctmark-aarch64-O3-flto/lnt-sandbox/build/CTMark/consumer-typeset/CMakeFiles/consumer-typeset.dir/DependInfo.cmake --color=
Dependee "/Users/buildslave/jenkins/workspace/lnt-ctmark-aarch64-O3-flto/lnt-sandbox/build/CTMark/consumer-typeset/CMakeFiles/consumer-typeset.dir/DependInfo.cmake" is newer than depender "/Users/buildslave/jenkins/workspace/lnt-ctmark-aarch64-O3-flto/lnt-sandbox/build/CTMark/consumer-typeset/CMakeFiles/consumer-typeset.dir/depend.internal".
Dependee "/Users/buildslave/jenkins/workspace/lnt-ctmark-aarch64-O3-flto/lnt-sandbox/build/CTMark/consumer-typeset/CMakeFiles/CMakeDirectoryInformation.cmake" is newer than depender "/Users/buildslave/jenkins/workspace/lnt-ctmark-aarch64-O3-flto/lnt-sandbox/build/CTMark/consumer-typeset/CMakeFiles/consumer-typeset.dir/depend.internal".
Scanning dependencies of target consumer-typeset
/Applications/Xcode.app/Contents/Developer/usr/bin/make -f CTMark/consumer-typeset/CMakeFiles/consumer-typeset.dir/build.make CTMark/consumer-typeset/CMakeFiles/consumer-typeset.dir/build
[ 87%] Building C object CTMark/consumer-typeset/CMakeFiles/consumer-typeset.dir/z01.c.o
cd /Users/buildslave/jenkins/workspace/lnt-ctmark-aarch64-O3-flto/lnt-sandbox/build/CTMark/consumer-typeset && /Users/buildslave/jenkins/workspace/lnt-ctmark-aarch64-O3-flto/lnt-sandbox/build/tools/timeit --summary CMakeFiles/consumer-typeset.dir/z01.c.o.time /Users/buildslave/jenkins/workspace/lnt-ctmark-aarch64-O3-flto/compiler/bin/clang -DNDEBUG  -B /Applications/Xcode.app/Contents/Developer/Toolchains/XcodeDefault.xctoolchain/usr/bin    -O3 -flto -arch arm64 -isysroot /Applications/Xcode.app/Contents/Developer/Platforms/iPhoneOS.platform/Developer/SDKs/iPhoneOS12.2.sdk   -w -Werror=date-time -DOS_UNIX=1 -DOS_DOS=0 -DOS_MAC=0 -DDB_FIX=0 -DUSE_STAT=1 -DSAFE_DFT=0 -DCOLLATE=1 -DLIB_DIR=\"lout.lib\" -DFONT_DIR=\"font\" -DMAPS_DIR=\"maps\" -DINCL_DIR=\"include\" -DDATA_DIR=\"data\" -DHYPH_DIR=\"hyph\" -DLOCALE_DIR=\"locale\" -DCHAR_IN=1 -DCHAR_OUT=0 -DLOCALE_ON=1 -DASSERT_ON=1 -DDEBUG_ON=0 -DPDF_COMPRESSION=0 -D_FORTIFY_SOURCE=0 -o CMakeFiles/consumer-typeset.dir/z01.c.o   -c /Users/buildslave/jenkins/workspace/lnt-ctmark-aarch64-O3-flto/test-suite/CTMark/consumer-typeset/z01.c
[ 87%] Building C object CTMark/consumer-typeset/CMakeFiles/consumer-typeset.dir/z02.c.o
cd /Users/buildslave/jenkins/workspace/lnt-ctmark-aarch64-O3-flto/lnt-sandbox/build/CTMark/consumer-typeset && /Users/buildslave/jenkins/workspace/lnt-ctmark-aarch64-O3-flto/lnt-sandbox/build/tools/timeit --summary CMakeFiles/consumer-typeset.dir/z02.c.o.time /Users/buildslave/jenkins/workspace/lnt-ctmark-aarch64-O3-flto/compiler/bin/clang -DNDEBUG  -B /Applications/Xcode.app/Contents/Developer/Toolchains/XcodeDefault.xctoolchain/usr/bin    -O3 -flto -arch arm64 -isysroot /Applications/Xcode.app/Contents/Developer/Platforms/iPhoneOS.platform/Developer/SDKs/iPhoneOS12.2.sdk   -w -Werror=date-time -DOS_UNIX=1 -DOS_DOS=0 -DOS_MAC=0 -DDB_FIX=0 -DUSE_STAT=1 -DSAFE_DFT=0 -DCOLLATE=1 -DLIB_DIR=\"lout.lib\" -DFONT_DIR=\"font\" -DMAPS_DIR=\"maps\" -DINCL_DIR=\"include\" -DDATA_DIR=\"data\" -DHYPH_DIR=\"hyph\" -DLOCALE_DIR=\"locale\" -DCHAR_IN=1 -DCHAR_OUT=0 -DLOCALE_ON=1 -DASSERT_ON=1 -DDEBUG_ON=0 -DPDF_COMPRESSION=0 -D_FORTIFY_SOURCE=0 -o CMakeFiles/consumer-typeset.dir/z02.c.o   -c /Users/buildslave/jenkins/workspace/lnt-ctmark-aarch64-O3-flto/test-suite/CTMark/consumer-typeset/z02.c
[ 87%] Building C object CTMark/consumer-typeset/CMakeFiles/consumer-typeset.dir/z03.c.o
cd /Users/buildslave/jenkins/workspace/lnt-ctmark-aarch64-O3-flto/lnt-sandbox/build/CTMark/consumer-typeset && /Users/buildslave/jenkins/workspace/lnt-ctmark-aarch64-O3-flto/lnt-sandbox/build/tools/timeit --summary CMakeFiles/consumer-typeset.dir/z03.c.o.time /Users/buildslave/jenkins/workspace/lnt-ctmark-aarch64-O3-flto/compiler/bin/clang -DNDEBUG  -B /Applications/Xcode.app/Contents/Developer/Toolchains/XcodeDefault.xctoolchain/usr/bin    -O3 -flto -arch arm64 -isysroot /Applications/Xcode.app/Contents/Developer/Platforms/iPhoneOS.platform/Developer/SDKs/iPhoneOS12.2.sdk   -w -Werror=date-time -DOS_UNIX=1 -DOS_DOS=0 -DOS_MAC=0 -DDB_FIX=0 -DUSE_STAT=1 -DSAFE_DFT=0 -DCOLLATE=1 -DLIB_DIR=\"lout.lib\" -DFONT_DIR=\"font\" -DMAPS_DIR=\"maps\" -DINCL_DIR=\"include\" -DDATA_DIR=\"data\" -DHYPH_DIR=\"hyph\" -DLOCALE_DIR=\"locale\" -DCHAR_IN=1 -DCHAR_OUT=0 -DLOCALE_ON=1 -DASSERT_ON=1 -DDEBUG_ON=0 -DPDF_COMPRESSION=0 -D_FORTIFY_SOURCE=0 -o CMakeFiles/consumer-typeset.dir/z03.c.o   -c /Users/buildslave/jenkins/workspace/lnt-ctmark-aarch64-O3-flto/test-suite/CTMark/consumer-typeset/z03.c
[ 87%] Building C object CTMark/consumer-typeset/CMakeFiles/consumer-typeset.dir/z04.c.o
cd /Users/buildslave/jenkins/workspace/lnt-ctmark-aarch64-O3-flto/lnt-sandbox/build/CTMark/consumer-typeset && /Users/buildslave/jenkins/workspace/lnt-ctmark-aarch64-O3-flto/lnt-sandbox/build/tools/timeit --summary CMakeFiles/consumer-typeset.dir/z04.c.o.time /Users/buildslave/jenkins/workspace/lnt-ctmark-aarch64-O3-flto/compiler/bin/clang -DNDEBUG  -B /Applications/Xcode.app/Contents/Developer/Toolchains/XcodeDefault.xctoolchain/usr/bin    -O3 -flto -arch arm64 -isysroot /Applications/Xcode.app/Contents/Developer/Platforms/iPhoneOS.platform/Developer/SDKs/iPhoneOS12.2.sdk   -w -Werror=date-time -DOS_UNIX=1 -DOS_DOS=0 -DOS_MAC=0 -DDB_FIX=0 -DUSE_STAT=1 -DSAFE_DFT=0 -DCOLLATE=1 -DLIB_DIR=\"lout.lib\" -DFONT_DIR=\"font\" -DMAPS_DIR=\"maps\" -DINCL_DIR=\"include\" -DDATA_DIR=\"data\" -DHYPH_DIR=\"hyph\" -DLOCALE_DIR=\"locale\" -DCHAR_IN=1 -DCHAR_OUT=0 -DLOCALE_ON=1 -DASSERT_ON=1 -DDEBUG_ON=0 -DPDF_COMPRESSION=0 -D_FORTIFY_SOURCE=0 -o CMakeFiles/consumer-typeset.dir/z04.c.o   -c /Users/buildslave/jenkins/workspace/lnt-ctmark-aarch64-O3-flto/test-suite/CTMark/consumer-typeset/z04.c
[ 88%] Building C object CTMark/consumer-typeset/CMakeFiles/consumer-typeset.dir/z05.c.o
cd /Users/buildslave/jenkins/workspace/lnt-ctmark-aarch64-O3-flto/lnt-sandbox/build/CTMark/consumer-typeset && /Users/buildslave/jenkins/workspace/lnt-ctmark-aarch64-O3-flto/lnt-sandbox/build/tools/timeit --summary CMakeFiles/consumer-typeset.dir/z05.c.o.time /Users/buildslave/jenkins/workspace/lnt-ctmark-aarch64-O3-flto/compiler/bin/clang -DNDEBUG  -B /Applications/Xcode.app/Contents/Developer/Toolchains/XcodeDefault.xctoolchain/usr/bin    -O3 -flto -arch arm64 -isysroot /Applications/Xcode.app/Contents/Developer/Platforms/iPhoneOS.platform/Developer/SDKs/iPhoneOS12.2.sdk   -w -Werror=date-time -DOS_UNIX=1 -DOS_DOS=0 -DOS_MAC=0 -DDB_FIX=0 -DUSE_STAT=1 -DSAFE_DFT=0 -DCOLLATE=1 -DLIB_DIR=\"lout.lib\" -DFONT_DIR=\"font\" -DMAPS_DIR=\"maps\" -DINCL_DIR=\"include\" -DDATA_DIR=\"data\" -DHYPH_DIR=\"hyph\" -DLOCALE_DIR=\"locale\" -DCHAR_IN=1 -DCHAR_OUT=0 -DLOCALE_ON=1 -DASSERT_ON=1 -DDEBUG_ON=0 -DPDF_COMPRESSION=0 -D_FORTIFY_SOURCE=0 -o CMakeFiles/consumer-typeset.dir/z05.c.o   -c /Users/buildslave/jenkins/workspace/lnt-ctmark-aarch64-O3-flto/test-suite/CTMark/consumer-typeset/z05.c
[ 88%] Building C object CTMark/consumer-typeset/CMakeFiles/consumer-typeset.dir/z06.c.o
cd /Users/buildslave/jenkins/workspace/lnt-ctmark-aarch64-O3-flto/lnt-sandbox/build/CTMark/consumer-typeset && /Users/buildslave/jenkins/workspace/lnt-ctmark-aarch64-O3-flto/lnt-sandbox/build/tools/timeit --summary CMakeFiles/consumer-typeset.dir/z06.c.o.time /Users/buildslave/jenkins/workspace/lnt-ctmark-aarch64-O3-flto/compiler/bin/clang -DNDEBUG  -B /Applications/Xcode.app/Contents/Developer/Toolchains/XcodeDefault.xctoolchain/usr/bin    -O3 -flto -arch arm64 -isysroot /Applications/Xcode.app/Contents/Developer/Platforms/iPhoneOS.platform/Developer/SDKs/iPhoneOS12.2.sdk   -w -Werror=date-time -DOS_UNIX=1 -DOS_DOS=0 -DOS_MAC=0 -DDB_FIX=0 -DUSE_STAT=1 -DSAFE_DFT=0 -DCOLLATE=1 -DLIB_DIR=\"lout.lib\" -DFONT_DIR=\"font\" -DMAPS_DIR=\"maps\" -DINCL_DIR=\"include\" -DDATA_DIR=\"data\" -DHYPH_DIR=\"hyph\" -DLOCALE_DIR=\"locale\" -DCHAR_IN=1 -DCHAR_OUT=0 -DLOCALE_ON=1 -DASSERT_ON=1 -DDEBUG_ON=0 -DPDF_COMPRESSION=0 -D_FORTIFY_SOURCE=0 -o CMakeFiles/consumer-typeset.dir/z06.c.o   -c /Users/buildslave/jenkins/workspace/lnt-ctmark-aarch64-O3-flto/test-suite/CTMark/consumer-typeset/z06.c
[ 88%] Building C object CTMark/consumer-typeset/CMakeFiles/consumer-typeset.dir/z07.c.o
cd /Users/buildslave/jenkins/workspace/lnt-ctmark-aarch64-O3-flto/lnt-sandbox/build/CTMark/consumer-typeset && /Users/buildslave/jenkins/workspace/lnt-ctmark-aarch64-O3-flto/lnt-sandbox/build/tools/timeit --summary CMakeFiles/consumer-typeset.dir/z07.c.o.time /Users/buildslave/jenkins/workspace/lnt-ctmark-aarch64-O3-flto/compiler/bin/clang -DNDEBUG  -B /Applications/Xcode.app/Contents/Developer/Toolchains/XcodeDefault.xctoolchain/usr/bin    -O3 -flto -arch arm64 -isysroot /Applications/Xcode.app/Contents/Developer/Platforms/iPhoneOS.platform/Developer/SDKs/iPhoneOS12.2.sdk   -w -Werror=date-time -DOS_UNIX=1 -DOS_DOS=0 -DOS_MAC=0 -DDB_FIX=0 -DUSE_STAT=1 -DSAFE_DFT=0 -DCOLLATE=1 -DLIB_DIR=\"lout.lib\" -DFONT_DIR=\"font\" -DMAPS_DIR=\"maps\" -DINCL_DIR=\"include\" -DDATA_DIR=\"data\" -DHYPH_DIR=\"hyph\" -DLOCALE_DIR=\"locale\" -DCHAR_IN=1 -DCHAR_OUT=0 -DLOCALE_ON=1 -DASSERT_ON=1 -DDEBUG_ON=0 -DPDF_COMPRESSION=0 -D_FORTIFY_SOURCE=0 -o CMakeFiles/consumer-typeset.dir/z07.c.o   -c /Users/buildslave/jenkins/workspace/lnt-ctmark-aarch64-O3-flto/test-suite/CTMark/consumer-typeset/z07.c
[ 88%] Building C object CTMark/consumer-typeset/CMakeFiles/consumer-typeset.dir/z08.c.o
cd /Users/buildslave/jenkins/workspace/lnt-ctmark-aarch64-O3-flto/lnt-sandbox/build/CTMark/consumer-typeset && /Users/buildslave/jenkins/workspace/lnt-ctmark-aarch64-O3-flto/lnt-sandbox/build/tools/timeit --summary CMakeFiles/consumer-typeset.dir/z08.c.o.time /Users/buildslave/jenkins/workspace/lnt-ctmark-aarch64-O3-flto/compiler/bin/clang -DNDEBUG  -B /Applications/Xcode.app/Contents/Developer/Toolchains/XcodeDefault.xctoolchain/usr/bin    -O3 -flto -arch arm64 -isysroot /Applications/Xcode.app/Contents/Developer/Platforms/iPhoneOS.platform/Developer/SDKs/iPhoneOS12.2.sdk   -w -Werror=date-time -DOS_UNIX=1 -DOS_DOS=0 -DOS_MAC=0 -DDB_FIX=0 -DUSE_STAT=1 -DSAFE_DFT=0 -DCOLLATE=1 -DLIB_DIR=\"lout.lib\" -DFONT_DIR=\"font\" -DMAPS_DIR=\"maps\" -DINCL_DIR=\"include\" -DDATA_DIR=\"data\" -DHYPH_DIR=\"hyph\" -DLOCALE_DIR=\"locale\" -DCHAR_IN=1 -DCHAR_OUT=0 -DLOCALE_ON=1 -DASSERT_ON=1 -DDEBUG_ON=0 -DPDF_COMPRESSION=0 -D_FORTIFY_SOURCE=0 -o CMakeFiles/consumer-typeset.dir/z08.c.o   -c /Users/buildslave/jenkins/workspace/lnt-ctmark-aarch64-O3-flto/test-suite/CTMark/consumer-typeset/z08.c
[ 88%] Building C object CTMark/consumer-typeset/CMakeFiles/consumer-typeset.dir/z09.c.o
cd /Users/buildslave/jenkins/workspace/lnt-ctmark-aarch64-O3-flto/lnt-sandbox/build/CTMark/consumer-typeset && /Users/buildslave/jenkins/workspace/lnt-ctmark-aarch64-O3-flto/lnt-sandbox/build/tools/timeit --summary CMakeFiles/consumer-typeset.dir/z09.c.o.time /Users/buildslave/jenkins/workspace/lnt-ctmark-aarch64-O3-flto/compiler/bin/clang -DNDEBUG  -B /Applications/Xcode.app/Contents/Developer/Toolchains/XcodeDefault.xctoolchain/usr/bin    -O3 -flto -arch arm64 -isysroot /Applications/Xcode.app/Contents/Developer/Platforms/iPhoneOS.platform/Developer/SDKs/iPhoneOS12.2.sdk   -w -Werror=date-time -DOS_UNIX=1 -DOS_DOS=0 -DOS_MAC=0 -DDB_FIX=0 -DUSE_STAT=1 -DSAFE_DFT=0 -DCOLLATE=1 -DLIB_DIR=\"lout.lib\" -DFONT_DIR=\"font\" -DMAPS_DIR=\"maps\" -DINCL_DIR=\"include\" -DDATA_DIR=\"data\" -DHYPH_DIR=\"hyph\" -DLOCALE_DIR=\"locale\" -DCHAR_IN=1 -DCHAR_OUT=0 -DLOCALE_ON=1 -DASSERT_ON=1 -DDEBUG_ON=0 -DPDF_COMPRESSION=0 -D_FORTIFY_SOURCE=0 -o CMakeFiles/consumer-typeset.dir/z09.c.o   -c /Users/buildslave/jenkins/workspace/lnt-ctmark-aarch64-O3-flto/test-suite/CTMark/consumer-typeset/z09.c
[ 88%] Building C object CTMark/consumer-typeset/CMakeFiles/consumer-typeset.dir/z10.c.o
cd /Users/buildslave/jenkins/workspace/lnt-ctmark-aarch64-O3-flto/lnt-sandbox/build/CTMark/consumer-typeset && /Users/buildslave/jenkins/workspace/lnt-ctmark-aarch64-O3-flto/lnt-sandbox/build/tools/timeit --summary CMakeFiles/consumer-typeset.dir/z10.c.o.time /Users/buildslave/jenkins/workspace/lnt-ctmark-aarch64-O3-flto/compiler/bin/clang -DNDEBUG  -B /Applications/Xcode.app/Contents/Developer/Toolchains/XcodeDefault.xctoolchain/usr/bin    -O3 -flto -arch arm64 -isysroot /Applications/Xcode.app/Contents/Developer/Platforms/iPhoneOS.platform/Developer/SDKs/iPhoneOS12.2.sdk   -w -Werror=date-time -DOS_UNIX=1 -DOS_DOS=0 -DOS_MAC=0 -DDB_FIX=0 -DUSE_STAT=1 -DSAFE_DFT=0 -DCOLLATE=1 -DLIB_DIR=\"lout.lib\" -DFONT_DIR=\"font\" -DMAPS_DIR=\"maps\" -DINCL_DIR=\"include\" -DDATA_DIR=\"data\" -DHYPH_DIR=\"hyph\" -DLOCALE_DIR=\"locale\" -DCHAR_IN=1 -DCHAR_OUT=0 -DLOCALE_ON=1 -DASSERT_ON=1 -DDEBUG_ON=0 -DPDF_COMPRESSION=0 -D_FORTIFY_SOURCE=0 -o CMakeFiles/consumer-typeset.dir/z10.c.o   -c /Users/buildslave/jenkins/workspace/lnt-ctmark-aarch64-O3-flto/test-suite/CTMark/consumer-typeset/z10.c
[ 88%] Building C object CTMark/consumer-typeset/CMakeFiles/consumer-typeset.dir/z11.c.o
cd /Users/buildslave/jenkins/workspace/lnt-ctmark-aarch64-O3-flto/lnt-sandbox/build/CTMark/consumer-typeset && /Users/buildslave/jenkins/workspace/lnt-ctmark-aarch64-O3-flto/lnt-sandbox/build/tools/timeit --summary CMakeFiles/consumer-typeset.dir/z11.c.o.time /Users/buildslave/jenkins/workspace/lnt-ctmark-aarch64-O3-flto/compiler/bin/clang -DNDEBUG  -B /Applications/Xcode.app/Contents/Developer/Toolchains/XcodeDefault.xctoolchain/usr/bin    -O3 -flto -arch arm64 -isysroot /Applications/Xcode.app/Contents/Developer/Platforms/iPhoneOS.platform/Developer/SDKs/iPhoneOS12.2.sdk   -w -Werror=date-time -DOS_UNIX=1 -DOS_DOS=0 -DOS_MAC=0 -DDB_FIX=0 -DUSE_STAT=1 -DSAFE_DFT=0 -DCOLLATE=1 -DLIB_DIR=\"lout.lib\" -DFONT_DIR=\"font\" -DMAPS_DIR=\"maps\" -DINCL_DIR=\"include\" -DDATA_DIR=\"data\" -DHYPH_DIR=\"hyph\" -DLOCALE_DIR=\"locale\" -DCHAR_IN=1 -DCHAR_OUT=0 -DLOCALE_ON=1 -DASSERT_ON=1 -DDEBUG_ON=0 -DPDF_COMPRESSION=0 -D_FORTIFY_SOURCE=0 -o CMakeFiles/consumer-typeset.dir/z11.c.o   -c /Users/buildslave/jenkins/workspace/lnt-ctmark-aarch64-O3-flto/test-suite/CTMark/consumer-typeset/z11.c
[ 89%] Building C object CTMark/consumer-typeset/CMakeFiles/consumer-typeset.dir/z12.c.o
cd /Users/buildslave/jenkins/workspace/lnt-ctmark-aarch64-O3-flto/lnt-sandbox/build/CTMark/consumer-typeset && /Users/buildslave/jenkins/workspace/lnt-ctmark-aarch64-O3-flto/lnt-sandbox/build/tools/timeit --summary CMakeFiles/consumer-typeset.dir/z12.c.o.time /Users/buildslave/jenkins/workspace/lnt-ctmark-aarch64-O3-flto/compiler/bin/clang -DNDEBUG  -B /Applications/Xcode.app/Contents/Developer/Toolchains/XcodeDefault.xctoolchain/usr/bin    -O3 -flto -arch arm64 -isysroot /Applications/Xcode.app/Contents/Developer/Platforms/iPhoneOS.platform/Developer/SDKs/iPhoneOS12.2.sdk   -w -Werror=date-time -DOS_UNIX=1 -DOS_DOS=0 -DOS_MAC=0 -DDB_FIX=0 -DUSE_STAT=1 -DSAFE_DFT=0 -DCOLLATE=1 -DLIB_DIR=\"lout.lib\" -DFONT_DIR=\"font\" -DMAPS_DIR=\"maps\" -DINCL_DIR=\"include\" -DDATA_DIR=\"data\" -DHYPH_DIR=\"hyph\" -DLOCALE_DIR=\"locale\" -DCHAR_IN=1 -DCHAR_OUT=0 -DLOCALE_ON=1 -DASSERT_ON=1 -DDEBUG_ON=0 -DPDF_COMPRESSION=0 -D_FORTIFY_SOURCE=0 -o CMakeFiles/consumer-typeset.dir/z12.c.o   -c /Users/buildslave/jenkins/workspace/lnt-ctmark-aarch64-O3-flto/test-suite/CTMark/consumer-typeset/z12.c
[ 89%] Building C object CTMark/consumer-typeset/CMakeFiles/consumer-typeset.dir/z13.c.o
cd /Users/buildslave/jenkins/workspace/lnt-ctmark-aarch64-O3-flto/lnt-sandbox/build/CTMark/consumer-typeset && /Users/buildslave/jenkins/workspace/lnt-ctmark-aarch64-O3-flto/lnt-sandbox/build/tools/timeit --summary CMakeFiles/consumer-typeset.dir/z13.c.o.time /Users/buildslave/jenkins/workspace/lnt-ctmark-aarch64-O3-flto/compiler/bin/clang -DNDEBUG  -B /Applications/Xcode.app/Contents/Developer/Toolchains/XcodeDefault.xctoolchain/usr/bin    -O3 -flto -arch arm64 -isysroot /Applications/Xcode.app/Contents/Developer/Platforms/iPhoneOS.platform/Developer/SDKs/iPhoneOS12.2.sdk   -w -Werror=date-time -DOS_UNIX=1 -DOS_DOS=0 -DOS_MAC=0 -DDB_FIX=0 -DUSE_STAT=1 -DSAFE_DFT=0 -DCOLLATE=1 -DLIB_DIR=\"lout.lib\" -DFONT_DIR=\"font\" -DMAPS_DIR=\"maps\" -DINCL_DIR=\"include\" -DDATA_DIR=\"data\" -DHYPH_DIR=\"hyph\" -DLOCALE_DIR=\"locale\" -DCHAR_IN=1 -DCHAR_OUT=0 -DLOCALE_ON=1 -DASSERT_ON=1 -DDEBUG_ON=0 -DPDF_COMPRESSION=0 -D_FORTIFY_SOURCE=0 -o CMakeFiles/consumer-typeset.dir/z13.c.o   -c /Users/buildslave/jenkins/workspace/lnt-ctmark-aarch64-O3-flto/test-suite/CTMark/consumer-typeset/z13.c
[ 89%] Building C object CTMark/consumer-typeset/CMakeFiles/consumer-typeset.dir/z14.c.o
cd /Users/buildslave/jenkins/workspace/lnt-ctmark-aarch64-O3-flto/lnt-sandbox/build/CTMark/consumer-typeset && /Users/buildslave/jenkins/workspace/lnt-ctmark-aarch64-O3-flto/lnt-sandbox/build/tools/timeit --summary CMakeFiles/consumer-typeset.dir/z14.c.o.time /Users/buildslave/jenkins/workspace/lnt-ctmark-aarch64-O3-flto/compiler/bin/clang -DNDEBUG  -B /Applications/Xcode.app/Contents/Developer/Toolchains/XcodeDefault.xctoolchain/usr/bin    -O3 -flto -arch arm64 -isysroot /Applications/Xcode.app/Contents/Developer/Platforms/iPhoneOS.platform/Developer/SDKs/iPhoneOS12.2.sdk   -w -Werror=date-time -DOS_UNIX=1 -DOS_DOS=0 -DOS_MAC=0 -DDB_FIX=0 -DUSE_STAT=1 -DSAFE_DFT=0 -DCOLLATE=1 -DLIB_DIR=\"lout.lib\" -DFONT_DIR=\"font\" -DMAPS_DIR=\"maps\" -DINCL_DIR=\"include\" -DDATA_DIR=\"data\" -DHYPH_DIR=\"hyph\" -DLOCALE_DIR=\"locale\" -DCHAR_IN=1 -DCHAR_OUT=0 -DLOCALE_ON=1 -DASSERT_ON=1 -DDEBUG_ON=0 -DPDF_COMPRESSION=0 -D_FORTIFY_SOURCE=0 -o CMakeFiles/consumer-typeset.dir/z14.c.o   -c /Users/buildslave/jenkins/workspace/lnt-ctmark-aarch64-O3-flto/test-suite/CTMark/consumer-typeset/z14.c
[ 89%] Building C object CTMark/consumer-typeset/CMakeFiles/consumer-typeset.dir/z15.c.o
cd /Users/buildslave/jenkins/workspace/lnt-ctmark-aarch64-O3-flto/lnt-sandbox/build/CTMark/consumer-typeset && /Users/buildslave/jenkins/workspace/lnt-ctmark-aarch64-O3-flto/lnt-sandbox/build/tools/timeit --summary CMakeFiles/consumer-typeset.dir/z15.c.o.time /Users/buildslave/jenkins/workspace/lnt-ctmark-aarch64-O3-flto/compiler/bin/clang -DNDEBUG  -B /Applications/Xcode.app/Contents/Developer/Toolchains/XcodeDefault.xctoolchain/usr/bin    -O3 -flto -arch arm64 -isysroot /Applications/Xcode.app/Contents/Developer/Platforms/iPhoneOS.platform/Developer/SDKs/iPhoneOS12.2.sdk   -w -Werror=date-time -DOS_UNIX=1 -DOS_DOS=0 -DOS_MAC=0 -DDB_FIX=0 -DUSE_STAT=1 -DSAFE_DFT=0 -DCOLLATE=1 -DLIB_DIR=\"lout.lib\" -DFONT_DIR=\"font\" -DMAPS_DIR=\"maps\" -DINCL_DIR=\"include\" -DDATA_DIR=\"data\" -DHYPH_DIR=\"hyph\" -DLOCALE_DIR=\"locale\" -DCHAR_IN=1 -DCHAR_OUT=0 -DLOCALE_ON=1 -DASSERT_ON=1 -DDEBUG_ON=0 -DPDF_COMPRESSION=0 -D_FORTIFY_SOURCE=0 -o CMakeFiles/consumer-typeset.dir/z15.c.o   -c /Users/buildslave/jenkins/workspace/lnt-ctmark-aarch64-O3-flto/test-suite/CTMark/consumer-typeset/z15.c
[ 89%] Building C object CTMark/consumer-typeset/CMakeFiles/consumer-typeset.dir/z16.c.o
cd /Users/buildslave/jenkins/workspace/lnt-ctmark-aarch64-O3-flto/lnt-sandbox/build/CTMark/consumer-typeset && /Users/buildslave/jenkins/workspace/lnt-ctmark-aarch64-O3-flto/lnt-sandbox/build/tools/timeit --summary CMakeFiles/consumer-typeset.dir/z16.c.o.time /Users/buildslave/jenkins/workspace/lnt-ctmark-aarch64-O3-flto/compiler/bin/clang -DNDEBUG  -B /Applications/Xcode.app/Contents/Developer/Toolchains/XcodeDefault.xctoolchain/usr/bin    -O3 -flto -arch arm64 -isysroot /Applications/Xcode.app/Contents/Developer/Platforms/iPhoneOS.platform/Developer/SDKs/iPhoneOS12.2.sdk   -w -Werror=date-time -DOS_UNIX=1 -DOS_DOS=0 -DOS_MAC=0 -DDB_FIX=0 -DUSE_STAT=1 -DSAFE_DFT=0 -DCOLLATE=1 -DLIB_DIR=\"lout.lib\" -DFONT_DIR=\"font\" -DMAPS_DIR=\"maps\" -DINCL_DIR=\"include\" -DDATA_DIR=\"data\" -DHYPH_DIR=\"hyph\" -DLOCALE_DIR=\"locale\" -DCHAR_IN=1 -DCHAR_OUT=0 -DLOCALE_ON=1 -DASSERT_ON=1 -DDEBUG_ON=0 -DPDF_COMPRESSION=0 -D_FORTIFY_SOURCE=0 -o CMakeFiles/consumer-typeset.dir/z16.c.o   -c /Users/buildslave/jenkins/workspace/lnt-ctmark-aarch64-O3-flto/test-suite/CTMark/consumer-typeset/z16.c
[ 89%] Building C object CTMark/consumer-typeset/CMakeFiles/consumer-typeset.dir/z17.c.o
cd /Users/buildslave/jenkins/workspace/lnt-ctmark-aarch64-O3-flto/lnt-sandbox/build/CTMark/consumer-typeset && /Users/buildslave/jenkins/workspace/lnt-ctmark-aarch64-O3-flto/lnt-sandbox/build/tools/timeit --summary CMakeFiles/consumer-typeset.dir/z17.c.o.time /Users/buildslave/jenkins/workspace/lnt-ctmark-aarch64-O3-flto/compiler/bin/clang -DNDEBUG  -B /Applications/Xcode.app/Contents/Developer/Toolchains/XcodeDefault.xctoolchain/usr/bin    -O3 -flto -arch arm64 -isysroot /Applications/Xcode.app/Contents/Developer/Platforms/iPhoneOS.platform/Developer/SDKs/iPhoneOS12.2.sdk   -w -Werror=date-time -DOS_UNIX=1 -DOS_DOS=0 -DOS_MAC=0 -DDB_FIX=0 -DUSE_STAT=1 -DSAFE_DFT=0 -DCOLLATE=1 -DLIB_DIR=\"lout.lib\" -DFONT_DIR=\"font\" -DMAPS_DIR=\"maps\" -DINCL_DIR=\"include\" -DDATA_DIR=\"data\" -DHYPH_DIR=\"hyph\" -DLOCALE_DIR=\"locale\" -DCHAR_IN=1 -DCHAR_OUT=0 -DLOCALE_ON=1 -DASSERT_ON=1 -DDEBUG_ON=0 -DPDF_COMPRESSION=0 -D_FORTIFY_SOURCE=0 -o CMakeFiles/consumer-typeset.dir/z17.c.o   -c /Users/buildslave/jenkins/workspace/lnt-ctmark-aarch64-O3-flto/test-suite/CTMark/consumer-typeset/z17.c
[ 90%] Building C object CTMark/consumer-typeset/CMakeFiles/consumer-typeset.dir/z18.c.o
cd /Users/buildslave/jenkins/workspace/lnt-ctmark-aarch64-O3-flto/lnt-sandbox/build/CTMark/consumer-typeset && /Users/buildslave/jenkins/workspace/lnt-ctmark-aarch64-O3-flto/lnt-sandbox/build/tools/timeit --summary CMakeFiles/consumer-typeset.dir/z18.c.o.time /Users/buildslave/jenkins/workspace/lnt-ctmark-aarch64-O3-flto/compiler/bin/clang -DNDEBUG  -B /Applications/Xcode.app/Contents/Developer/Toolchains/XcodeDefault.xctoolchain/usr/bin    -O3 -flto -arch arm64 -isysroot /Applications/Xcode.app/Contents/Developer/Platforms/iPhoneOS.platform/Developer/SDKs/iPhoneOS12.2.sdk   -w -Werror=date-time -DOS_UNIX=1 -DOS_DOS=0 -DOS_MAC=0 -DDB_FIX=0 -DUSE_STAT=1 -DSAFE_DFT=0 -DCOLLATE=1 -DLIB_DIR=\"lout.lib\" -DFONT_DIR=\"font\" -DMAPS_DIR=\"maps\" -DINCL_DIR=\"include\" -DDATA_DIR=\"data\" -DHYPH_DIR=\"hyph\" -DLOCALE_DIR=\"locale\" -DCHAR_IN=1 -DCHAR_OUT=0 -DLOCALE_ON=1 -DASSERT_ON=1 -DDEBUG_ON=0 -DPDF_COMPRESSION=0 -D_FORTIFY_SOURCE=0 -o CMakeFiles/consumer-typeset.dir/z18.c.o   -c /Users/buildslave/jenkins/workspace/lnt-ctmark-aarch64-O3-flto/test-suite/CTMark/consumer-typeset/z18.c
[ 90%] Building C object CTMark/consumer-typeset/CMakeFiles/consumer-typeset.dir/z19.c.o
cd /Users/buildslave/jenkins/workspace/lnt-ctmark-aarch64-O3-flto/lnt-sandbox/build/CTMark/consumer-typeset && /Users/buildslave/jenkins/workspace/lnt-ctmark-aarch64-O3-flto/lnt-sandbox/build/tools/timeit --summary CMakeFiles/consumer-typeset.dir/z19.c.o.time /Users/buildslave/jenkins/workspace/lnt-ctmark-aarch64-O3-flto/compiler/bin/clang -DNDEBUG  -B /Applications/Xcode.app/Contents/Developer/Toolchains/XcodeDefault.xctoolchain/usr/bin    -O3 -flto -arch arm64 -isysroot /Applications/Xcode.app/Contents/Developer/Platforms/iPhoneOS.platform/Developer/SDKs/iPhoneOS12.2.sdk   -w -Werror=date-time -DOS_UNIX=1 -DOS_DOS=0 -DOS_MAC=0 -DDB_FIX=0 -DUSE_STAT=1 -DSAFE_DFT=0 -DCOLLATE=1 -DLIB_DIR=\"lout.lib\" -DFONT_DIR=\"font\" -DMAPS_DIR=\"maps\" -DINCL_DIR=\"include\" -DDATA_DIR=\"data\" -DHYPH_DIR=\"hyph\" -DLOCALE_DIR=\"locale\" -DCHAR_IN=1 -DCHAR_OUT=0 -DLOCALE_ON=1 -DASSERT_ON=1 -DDEBUG_ON=0 -DPDF_COMPRESSION=0 -D_FORTIFY_SOURCE=0 -o CMakeFiles/consumer-typeset.dir/z19.c.o   -c /Users/buildslave/jenkins/workspace/lnt-ctmark-aarch64-O3-flto/test-suite/CTMark/consumer-typeset/z19.c
[ 90%] Building C object CTMark/consumer-typeset/CMakeFiles/consumer-typeset.dir/z20.c.o
cd /Users/buildslave/jenkins/workspace/lnt-ctmark-aarch64-O3-flto/lnt-sandbox/build/CTMark/consumer-typeset && /Users/buildslave/jenkins/workspace/lnt-ctmark-aarch64-O3-flto/lnt-sandbox/build/tools/timeit --summary CMakeFiles/consumer-typeset.dir/z20.c.o.time /Users/buildslave/jenkins/workspace/lnt-ctmark-aarch64-O3-flto/compiler/bin/clang -DNDEBUG  -B /Applications/Xcode.app/Contents/Developer/Toolchains/XcodeDefault.xctoolchain/usr/bin    -O3 -flto -arch arm64 -isysroot /Applications/Xcode.app/Contents/Developer/Platforms/iPhoneOS.platform/Developer/SDKs/iPhoneOS12.2.sdk   -w -Werror=date-time -DOS_UNIX=1 -DOS_DOS=0 -DOS_MAC=0 -DDB_FIX=0 -DUSE_STAT=1 -DSAFE_DFT=0 -DCOLLATE=1 -DLIB_DIR=\"lout.lib\" -DFONT_DIR=\"font\" -DMAPS_DIR=\"maps\" -DINCL_DIR=\"include\" -DDATA_DIR=\"data\" -DHYPH_DIR=\"hyph\" -DLOCALE_DIR=\"locale\" -DCHAR_IN=1 -DCHAR_OUT=0 -DLOCALE_ON=1 -DASSERT_ON=1 -DDEBUG_ON=0 -DPDF_COMPRESSION=0 -D_FORTIFY_SOURCE=0 -o CMakeFiles/consumer-typeset.dir/z20.c.o   -c /Users/buildslave/jenkins/workspace/lnt-ctmark-aarch64-O3-flto/test-suite/CTMark/consumer-typeset/z20.c
[ 90%] Building C object CTMark/consumer-typeset/CMakeFiles/consumer-typeset.dir/z21.c.o
cd /Users/buildslave/jenkins/workspace/lnt-ctmark-aarch64-O3-flto/lnt-sandbox/build/CTMark/consumer-typeset && /Users/buildslave/jenkins/workspace/lnt-ctmark-aarch64-O3-flto/lnt-sandbox/build/tools/timeit --summary CMakeFiles/consumer-typeset.dir/z21.c.o.time /Users/buildslave/jenkins/workspace/lnt-ctmark-aarch64-O3-flto/compiler/bin/clang -DNDEBUG  -B /Applications/Xcode.app/Contents/Developer/Toolchains/XcodeDefault.xctoolchain/usr/bin    -O3 -flto -arch arm64 -isysroot /Applications/Xcode.app/Contents/Developer/Platforms/iPhoneOS.platform/Developer/SDKs/iPhoneOS12.2.sdk   -w -Werror=date-time -DOS_UNIX=1 -DOS_DOS=0 -DOS_MAC=0 -DDB_FIX=0 -DUSE_STAT=1 -DSAFE_DFT=0 -DCOLLATE=1 -DLIB_DIR=\"lout.lib\" -DFONT_DIR=\"font\" -DMAPS_DIR=\"maps\" -DINCL_DIR=\"include\" -DDATA_DIR=\"data\" -DHYPH_DIR=\"hyph\" -DLOCALE_DIR=\"locale\" -DCHAR_IN=1 -DCHAR_OUT=0 -DLOCALE_ON=1 -DASSERT_ON=1 -DDEBUG_ON=0 -DPDF_COMPRESSION=0 -D_FORTIFY_SOURCE=0 -o CMakeFiles/consumer-typeset.dir/z21.c.o   -c /Users/buildslave/jenkins/workspace/lnt-ctmark-aarch64-O3-flto/test-suite/CTMark/consumer-typeset/z21.c
[ 90%] Building C object CTMark/consumer-typeset/CMakeFiles/consumer-typeset.dir/z22.c.o
cd /Users/buildslave/jenkins/workspace/lnt-ctmark-aarch64-O3-flto/lnt-sandbox/build/CTMark/consumer-typeset && /Users/buildslave/jenkins/workspace/lnt-ctmark-aarch64-O3-flto/lnt-sandbox/build/tools/timeit --summary CMakeFiles/consumer-typeset.dir/z22.c.o.time /Users/buildslave/jenkins/workspace/lnt-ctmark-aarch64-O3-flto/compiler/bin/clang -DNDEBUG  -B /Applications/Xcode.app/Contents/Developer/Toolchains/XcodeDefault.xctoolchain/usr/bin    -O3 -flto -arch arm64 -isysroot /Applications/Xcode.app/Contents/Developer/Platforms/iPhoneOS.platform/Developer/SDKs/iPhoneOS12.2.sdk   -w -Werror=date-time -DOS_UNIX=1 -DOS_DOS=0 -DOS_MAC=0 -DDB_FIX=0 -DUSE_STAT=1 -DSAFE_DFT=0 -DCOLLATE=1 -DLIB_DIR=\"lout.lib\" -DFONT_DIR=\"font\" -DMAPS_DIR=\"maps\" -DINCL_DIR=\"include\" -DDATA_DIR=\"data\" -DHYPH_DIR=\"hyph\" -DLOCALE_DIR=\"locale\" -DCHAR_IN=1 -DCHAR_OUT=0 -DLOCALE_ON=1 -DASSERT_ON=1 -DDEBUG_ON=0 -DPDF_COMPRESSION=0 -D_FORTIFY_SOURCE=0 -o CMakeFiles/consumer-typeset.dir/z22.c.o   -c /Users/buildslave/jenkins/workspace/lnt-ctmark-aarch64-O3-flto/test-suite/CTMark/consumer-typeset/z22.c
[ 90%] Building C object CTMark/consumer-typeset/CMakeFiles/consumer-typeset.dir/z23.c.o
cd /Users/buildslave/jenkins/workspace/lnt-ctmark-aarch64-O3-flto/lnt-sandbox/build/CTMark/consumer-typeset && /Users/buildslave/jenkins/workspace/lnt-ctmark-aarch64-O3-flto/lnt-sandbox/build/tools/timeit --summary CMakeFiles/consumer-typeset.dir/z23.c.o.time /Users/buildslave/jenkins/workspace/lnt-ctmark-aarch64-O3-flto/compiler/bin/clang -DNDEBUG  -B /Applications/Xcode.app/Contents/Developer/Toolchains/XcodeDefault.xctoolchain/usr/bin    -O3 -flto -arch arm64 -isysroot /Applications/Xcode.app/Contents/Developer/Platforms/iPhoneOS.platform/Developer/SDKs/iPhoneOS12.2.sdk   -w -Werror=date-time -DOS_UNIX=1 -DOS_DOS=0 -DOS_MAC=0 -DDB_FIX=0 -DUSE_STAT=1 -DSAFE_DFT=0 -DCOLLATE=1 -DLIB_DIR=\"lout.lib\" -DFONT_DIR=\"font\" -DMAPS_DIR=\"maps\" -DINCL_DIR=\"include\" -DDATA_DIR=\"data\" -DHYPH_DIR=\"hyph\" -DLOCALE_DIR=\"locale\" -DCHAR_IN=1 -DCHAR_OUT=0 -DLOCALE_ON=1 -DASSERT_ON=1 -DDEBUG_ON=0 -DPDF_COMPRESSION=0 -D_FORTIFY_SOURCE=0 -o CMakeFiles/consumer-typeset.dir/z23.c.o   -c /Users/buildslave/jenkins/workspace/lnt-ctmark-aarch64-O3-flto/test-suite/CTMark/consumer-typeset/z23.c
[ 90%] Building C object CTMark/consumer-typeset/CMakeFiles/consumer-typeset.dir/z24.c.o
cd /Users/buildslave/jenkins/workspace/lnt-ctmark-aarch64-O3-flto/lnt-sandbox/build/CTMark/consumer-typeset && /Users/buildslave/jenkins/workspace/lnt-ctmark-aarch64-O3-flto/lnt-sandbox/build/tools/timeit --summary CMakeFiles/consumer-typeset.dir/z24.c.o.time /Users/buildslave/jenkins/workspace/lnt-ctmark-aarch64-O3-flto/compiler/bin/clang -DNDEBUG  -B /Applications/Xcode.app/Contents/Developer/Toolchains/XcodeDefault.xctoolchain/usr/bin    -O3 -flto -arch arm64 -isysroot /Applications/Xcode.app/Contents/Developer/Platforms/iPhoneOS.platform/Developer/SDKs/iPhoneOS12.2.sdk   -w -Werror=date-time -DOS_UNIX=1 -DOS_DOS=0 -DOS_MAC=0 -DDB_FIX=0 -DUSE_STAT=1 -DSAFE_DFT=0 -DCOLLATE=1 -DLIB_DIR=\"lout.lib\" -DFONT_DIR=\"font\" -DMAPS_DIR=\"maps\" -DINCL_DIR=\"include\" -DDATA_DIR=\"data\" -DHYPH_DIR=\"hyph\" -DLOCALE_DIR=\"locale\" -DCHAR_IN=1 -DCHAR_OUT=0 -DLOCALE_ON=1 -DASSERT_ON=1 -DDEBUG_ON=0 -DPDF_COMPRESSION=0 -D_FORTIFY_SOURCE=0 -o CMakeFiles/consumer-typeset.dir/z24.c.o   -c /Users/buildslave/jenkins/workspace/lnt-ctmark-aarch64-O3-flto/test-suite/CTMark/consumer-typeset/z24.c
[ 91%] Building C object CTMark/consumer-typeset/CMakeFiles/consumer-typeset.dir/z25.c.o
cd /Users/buildslave/jenkins/workspace/lnt-ctmark-aarch64-O3-flto/lnt-sandbox/build/CTMark/consumer-typeset && /Users/buildslave/jenkins/workspace/lnt-ctmark-aarch64-O3-flto/lnt-sandbox/build/tools/timeit --summary CMakeFiles/consumer-typeset.dir/z25.c.o.time /Users/buildslave/jenkins/workspace/lnt-ctmark-aarch64-O3-flto/compiler/bin/clang -DNDEBUG  -B /Applications/Xcode.app/Contents/Developer/Toolchains/XcodeDefault.xctoolchain/usr/bin    -O3 -flto -arch arm64 -isysroot /Applications/Xcode.app/Contents/Developer/Platforms/iPhoneOS.platform/Developer/SDKs/iPhoneOS12.2.sdk   -w -Werror=date-time -DOS_UNIX=1 -DOS_DOS=0 -DOS_MAC=0 -DDB_FIX=0 -DUSE_STAT=1 -DSAFE_DFT=0 -DCOLLATE=1 -DLIB_DIR=\"lout.lib\" -DFONT_DIR=\"font\" -DMAPS_DIR=\"maps\" -DINCL_DIR=\"include\" -DDATA_DIR=\"data\" -DHYPH_DIR=\"hyph\" -DLOCALE_DIR=\"locale\" -DCHAR_IN=1 -DCHAR_OUT=0 -DLOCALE_ON=1 -DASSERT_ON=1 -DDEBUG_ON=0 -DPDF_COMPRESSION=0 -D_FORTIFY_SOURCE=0 -o CMakeFiles/consumer-typeset.dir/z25.c.o   -c /Users/buildslave/jenkins/workspace/lnt-ctmark-aarch64-O3-flto/test-suite/CTMark/consumer-typeset/z25.c
[ 91%] Building C object CTMark/consumer-typeset/CMakeFiles/consumer-typeset.dir/z26.c.o
cd /Users/buildslave/jenkins/workspace/lnt-ctmark-aarch64-O3-flto/lnt-sandbox/build/CTMark/consumer-typeset && /Users/buildslave/jenkins/workspace/lnt-ctmark-aarch64-O3-flto/lnt-sandbox/build/tools/timeit --summary CMakeFiles/consumer-typeset.dir/z26.c.o.time /Users/buildslave/jenkins/workspace/lnt-ctmark-aarch64-O3-flto/compiler/bin/clang -DNDEBUG  -B /Applications/Xcode.app/Contents/Developer/Toolchains/XcodeDefault.xctoolchain/usr/bin    -O3 -flto -arch arm64 -isysroot /Applications/Xcode.app/Contents/Developer/Platforms/iPhoneOS.platform/Developer/SDKs/iPhoneOS12.2.sdk   -w -Werror=date-time -DOS_UNIX=1 -DOS_DOS=0 -DOS_MAC=0 -DDB_FIX=0 -DUSE_STAT=1 -DSAFE_DFT=0 -DCOLLATE=1 -DLIB_DIR=\"lout.lib\" -DFONT_DIR=\"font\" -DMAPS_DIR=\"maps\" -DINCL_DIR=\"include\" -DDATA_DIR=\"data\" -DHYPH_DIR=\"hyph\" -DLOCALE_DIR=\"locale\" -DCHAR_IN=1 -DCHAR_OUT=0 -DLOCALE_ON=1 -DASSERT_ON=1 -DDEBUG_ON=0 -DPDF_COMPRESSION=0 -D_FORTIFY_SOURCE=0 -o CMakeFiles/consumer-typeset.dir/z26.c.o   -c /Users/buildslave/jenkins/workspace/lnt-ctmark-aarch64-O3-flto/test-suite/CTMark/consumer-typeset/z26.c
[ 91%] Building C object CTMark/consumer-typeset/CMakeFiles/consumer-typeset.dir/z27.c.o
cd /Users/buildslave/jenkins/workspace/lnt-ctmark-aarch64-O3-flto/lnt-sandbox/build/CTMark/consumer-typeset && /Users/buildslave/jenkins/workspace/lnt-ctmark-aarch64-O3-flto/lnt-sandbox/build/tools/timeit --summary CMakeFiles/consumer-typeset.dir/z27.c.o.time /Users/buildslave/jenkins/workspace/lnt-ctmark-aarch64-O3-flto/compiler/bin/clang -DNDEBUG  -B /Applications/Xcode.app/Contents/Developer/Toolchains/XcodeDefault.xctoolchain/usr/bin    -O3 -flto -arch arm64 -isysroot /Applications/Xcode.app/Contents/Developer/Platforms/iPhoneOS.platform/Developer/SDKs/iPhoneOS12.2.sdk   -w -Werror=date-time -DOS_UNIX=1 -DOS_DOS=0 -DOS_MAC=0 -DDB_FIX=0 -DUSE_STAT=1 -DSAFE_DFT=0 -DCOLLATE=1 -DLIB_DIR=\"lout.lib\" -DFONT_DIR=\"font\" -DMAPS_DIR=\"maps\" -DINCL_DIR=\"include\" -DDATA_DIR=\"data\" -DHYPH_DIR=\"hyph\" -DLOCALE_DIR=\"locale\" -DCHAR_IN=1 -DCHAR_OUT=0 -DLOCALE_ON=1 -DASSERT_ON=1 -DDEBUG_ON=0 -DPDF_COMPRESSION=0 -D_FORTIFY_SOURCE=0 -o CMakeFiles/consumer-typeset.dir/z27.c.o   -c /Users/buildslave/jenkins/workspace/lnt-ctmark-aarch64-O3-flto/test-suite/CTMark/consumer-typeset/z27.c
[ 91%] Building C object CTMark/consumer-typeset/CMakeFiles/consumer-typeset.dir/z28.c.o
cd /Users/buildslave/jenkins/workspace/lnt-ctmark-aarch64-O3-flto/lnt-sandbox/build/CTMark/consumer-typeset && /Users/buildslave/jenkins/workspace/lnt-ctmark-aarch64-O3-flto/lnt-sandbox/build/tools/timeit --summary CMakeFiles/consumer-typeset.dir/z28.c.o.time /Users/buildslave/jenkins/workspace/lnt-ctmark-aarch64-O3-flto/compiler/bin/clang -DNDEBUG  -B /Applications/Xcode.app/Contents/Developer/Toolchains/XcodeDefault.xctoolchain/usr/bin    -O3 -flto -arch arm64 -isysroot /Applications/Xcode.app/Contents/Developer/Platforms/iPhoneOS.platform/Developer/SDKs/iPhoneOS12.2.sdk   -w -Werror=date-time -DOS_UNIX=1 -DOS_DOS=0 -DOS_MAC=0 -DDB_FIX=0 -DUSE_STAT=1 -DSAFE_DFT=0 -DCOLLATE=1 -DLIB_DIR=\"lout.lib\" -DFONT_DIR=\"font\" -DMAPS_DIR=\"maps\" -DINCL_DIR=\"include\" -DDATA_DIR=\"data\" -DHYPH_DIR=\"hyph\" -DLOCALE_DIR=\"locale\" -DCHAR_IN=1 -DCHAR_OUT=0 -DLOCALE_ON=1 -DASSERT_ON=1 -DDEBUG_ON=0 -DPDF_COMPRESSION=0 -D_FORTIFY_SOURCE=0 -o CMakeFiles/consumer-typeset.dir/z28.c.o   -c /Users/buildslave/jenkins/workspace/lnt-ctmark-aarch64-O3-flto/test-suite/CTMark/consumer-typeset/z28.c
[ 91%] Building C object CTMark/consumer-typeset/CMakeFiles/consumer-typeset.dir/z29.c.o
cd /Users/buildslave/jenkins/workspace/lnt-ctmark-aarch64-O3-flto/lnt-sandbox/build/CTMark/consumer-typeset && /Users/buildslave/jenkins/workspace/lnt-ctmark-aarch64-O3-flto/lnt-sandbox/build/tools/timeit --summary CMakeFiles/consumer-typeset.dir/z29.c.o.time /Users/buildslave/jenkins/workspace/lnt-ctmark-aarch64-O3-flto/compiler/bin/clang -DNDEBUG  -B /Applications/Xcode.app/Contents/Developer/Toolchains/XcodeDefault.xctoolchain/usr/bin    -O3 -flto -arch arm64 -isysroot /Applications/Xcode.app/Contents/Developer/Platforms/iPhoneOS.platform/Developer/SDKs/iPhoneOS12.2.sdk   -w -Werror=date-time -DOS_UNIX=1 -DOS_DOS=0 -DOS_MAC=0 -DDB_FIX=0 -DUSE_STAT=1 -DSAFE_DFT=0 -DCOLLATE=1 -DLIB_DIR=\"lout.lib\" -DFONT_DIR=\"font\" -DMAPS_DIR=\"maps\" -DINCL_DIR=\"include\" -DDATA_DIR=\"data\" -DHYPH_DIR=\"hyph\" -DLOCALE_DIR=\"locale\" -DCHAR_IN=1 -DCHAR_OUT=0 -DLOCALE_ON=1 -DASSERT_ON=1 -DDEBUG_ON=0 -DPDF_COMPRESSION=0 -D_FORTIFY_SOURCE=0 -o CMakeFiles/consumer-typeset.dir/z29.c.o   -c /Users/buildslave/jenkins/workspace/lnt-ctmark-aarch64-O3-flto/test-suite/CTMark/consumer-typeset/z29.c
[ 91%] Building C object CTMark/consumer-typeset/CMakeFiles/consumer-typeset.dir/z30.c.o
cd /Users/buildslave/jenkins/workspace/lnt-ctmark-aarch64-O3-flto/lnt-sandbox/build/CTMark/consumer-typeset && /Users/buildslave/jenkins/workspace/lnt-ctmark-aarch64-O3-flto/lnt-sandbox/build/tools/timeit --summary CMakeFiles/consumer-typeset.dir/z30.c.o.time /Users/buildslave/jenkins/workspace/lnt-ctmark-aarch64-O3-flto/compiler/bin/clang -DNDEBUG  -B /Applications/Xcode.app/Contents/Developer/Toolchains/XcodeDefault.xctoolchain/usr/bin    -O3 -flto -arch arm64 -isysroot /Applications/Xcode.app/Contents/Developer/Platforms/iPhoneOS.platform/Developer/SDKs/iPhoneOS12.2.sdk   -w -Werror=date-time -DOS_UNIX=1 -DOS_DOS=0 -DOS_MAC=0 -DDB_FIX=0 -DUSE_STAT=1 -DSAFE_DFT=0 -DCOLLATE=1 -DLIB_DIR=\"lout.lib\" -DFONT_DIR=\"font\" -DMAPS_DIR=\"maps\" -DINCL_DIR=\"include\" -DDATA_DIR=\"data\" -DHYPH_DIR=\"hyph\" -DLOCALE_DIR=\"locale\" -DCHAR_IN=1 -DCHAR_OUT=0 -DLOCALE_ON=1 -DASSERT_ON=1 -DDEBUG_ON=0 -DPDF_COMPRESSION=0 -D_FORTIFY_SOURCE=0 -o CMakeFiles/consumer-typeset.dir/z30.c.o   -c /Users/buildslave/jenkins/workspace/lnt-ctmark-aarch64-O3-flto/test-suite/CTMark/consumer-typeset/z30.c
[ 92%] Building C object CTMark/consumer-typeset/CMakeFiles/consumer-typeset.dir/z31.c.o
cd /Users/buildslave/jenkins/workspace/lnt-ctmark-aarch64-O3-flto/lnt-sandbox/build/CTMark/consumer-typeset && /Users/buildslave/jenkins/workspace/lnt-ctmark-aarch64-O3-flto/lnt-sandbox/build/tools/timeit --summary CMakeFiles/consumer-typeset.dir/z31.c.o.time /Users/buildslave/jenkins/workspace/lnt-ctmark-aarch64-O3-flto/compiler/bin/clang -DNDEBUG  -B /Applications/Xcode.app/Contents/Developer/Toolchains/XcodeDefault.xctoolchain/usr/bin    -O3 -flto -arch arm64 -isysroot /Applications/Xcode.app/Contents/Developer/Platforms/iPhoneOS.platform/Developer/SDKs/iPhoneOS12.2.sdk   -w -Werror=date-time -DOS_UNIX=1 -DOS_DOS=0 -DOS_MAC=0 -DDB_FIX=0 -DUSE_STAT=1 -DSAFE_DFT=0 -DCOLLATE=1 -DLIB_DIR=\"lout.lib\" -DFONT_DIR=\"font\" -DMAPS_DIR=\"maps\" -DINCL_DIR=\"include\" -DDATA_DIR=\"data\" -DHYPH_DIR=\"hyph\" -DLOCALE_DIR=\"locale\" -DCHAR_IN=1 -DCHAR_OUT=0 -DLOCALE_ON=1 -DASSERT_ON=1 -DDEBUG_ON=0 -DPDF_COMPRESSION=0 -D_FORTIFY_SOURCE=0 -o CMakeFiles/consumer-typeset.dir/z31.c.o   -c /Users/buildslave/jenkins/workspace/lnt-ctmark-aarch64-O3-flto/test-suite/CTMark/consumer-typeset/z31.c
[ 92%] Building C object CTMark/consumer-typeset/CMakeFiles/consumer-typeset.dir/z32.c.o
cd /Users/buildslave/jenkins/workspace/lnt-ctmark-aarch64-O3-flto/lnt-sandbox/build/CTMark/consumer-typeset && /Users/buildslave/jenkins/workspace/lnt-ctmark-aarch64-O3-flto/lnt-sandbox/build/tools/timeit --summary CMakeFiles/consumer-typeset.dir/z32.c.o.time /Users/buildslave/jenkins/workspace/lnt-ctmark-aarch64-O3-flto/compiler/bin/clang -DNDEBUG  -B /Applications/Xcode.app/Contents/Developer/Toolchains/XcodeDefault.xctoolchain/usr/bin    -O3 -flto -arch arm64 -isysroot /Applications/Xcode.app/Contents/Developer/Platforms/iPhoneOS.platform/Developer/SDKs/iPhoneOS12.2.sdk   -w -Werror=date-time -DOS_UNIX=1 -DOS_DOS=0 -DOS_MAC=0 -DDB_FIX=0 -DUSE_STAT=1 -DSAFE_DFT=0 -DCOLLATE=1 -DLIB_DIR=\"lout.lib\" -DFONT_DIR=\"font\" -DMAPS_DIR=\"maps\" -DINCL_DIR=\"include\" -DDATA_DIR=\"data\" -DHYPH_DIR=\"hyph\" -DLOCALE_DIR=\"locale\" -DCHAR_IN=1 -DCHAR_OUT=0 -DLOCALE_ON=1 -DASSERT_ON=1 -DDEBUG_ON=0 -DPDF_COMPRESSION=0 -D_FORTIFY_SOURCE=0 -o CMakeFiles/consumer-typeset.dir/z32.c.o   -c /Users/buildslave/jenkins/workspace/lnt-ctmark-aarch64-O3-flto/test-suite/CTMark/consumer-typeset/z32.c
[ 92%] Building C object CTMark/consumer-typeset/CMakeFiles/consumer-typeset.dir/z33.c.o
cd /Users/buildslave/jenkins/workspace/lnt-ctmark-aarch64-O3-flto/lnt-sandbox/build/CTMark/consumer-typeset && /Users/buildslave/jenkins/workspace/lnt-ctmark-aarch64-O3-flto/lnt-sandbox/build/tools/timeit --summary CMakeFiles/consumer-typeset.dir/z33.c.o.time /Users/buildslave/jenkins/workspace/lnt-ctmark-aarch64-O3-flto/compiler/bin/clang -DNDEBUG  -B /Applications/Xcode.app/Contents/Developer/Toolchains/XcodeDefault.xctoolchain/usr/bin    -O3 -flto -arch arm64 -isysroot /Applications/Xcode.app/Contents/Developer/Platforms/iPhoneOS.platform/Developer/SDKs/iPhoneOS12.2.sdk   -w -Werror=date-time -DOS_UNIX=1 -DOS_DOS=0 -DOS_MAC=0 -DDB_FIX=0 -DUSE_STAT=1 -DSAFE_DFT=0 -DCOLLATE=1 -DLIB_DIR=\"lout.lib\" -DFONT_DIR=\"font\" -DMAPS_DIR=\"maps\" -DINCL_DIR=\"include\" -DDATA_DIR=\"data\" -DHYPH_DIR=\"hyph\" -DLOCALE_DIR=\"locale\" -DCHAR_IN=1 -DCHAR_OUT=0 -DLOCALE_ON=1 -DASSERT_ON=1 -DDEBUG_ON=0 -DPDF_COMPRESSION=0 -D_FORTIFY_SOURCE=0 -o CMakeFiles/consumer-typeset.dir/z33.c.o   -c /Users/buildslave/jenkins/workspace/lnt-ctmark-aarch64-O3-flto/test-suite/CTMark/consumer-typeset/z33.c
[ 92%] Building C object CTMark/consumer-typeset/CMakeFiles/consumer-typeset.dir/z34.c.o
cd /Users/buildslave/jenkins/workspace/lnt-ctmark-aarch64-O3-flto/lnt-sandbox/build/CTMark/consumer-typeset && /Users/buildslave/jenkins/workspace/lnt-ctmark-aarch64-O3-flto/lnt-sandbox/build/tools/timeit --summary CMakeFiles/consumer-typeset.dir/z34.c.o.time /Users/buildslave/jenkins/workspace/lnt-ctmark-aarch64-O3-flto/compiler/bin/clang -DNDEBUG  -B /Applications/Xcode.app/Contents/Developer/Toolchains/XcodeDefault.xctoolchain/usr/bin    -O3 -flto -arch arm64 -isysroot /Applications/Xcode.app/Contents/Developer/Platforms/iPhoneOS.platform/Developer/SDKs/iPhoneOS12.2.sdk   -w -Werror=date-time -DOS_UNIX=1 -DOS_DOS=0 -DOS_MAC=0 -DDB_FIX=0 -DUSE_STAT=1 -DSAFE_DFT=0 -DCOLLATE=1 -DLIB_DIR=\"lout.lib\" -DFONT_DIR=\"font\" -DMAPS_DIR=\"maps\" -DINCL_DIR=\"include\" -DDATA_DIR=\"data\" -DHYPH_DIR=\"hyph\" -DLOCALE_DIR=\"locale\" -DCHAR_IN=1 -DCHAR_OUT=0 -DLOCALE_ON=1 -DASSERT_ON=1 -DDEBUG_ON=0 -DPDF_COMPRESSION=0 -D_FORTIFY_SOURCE=0 -o CMakeFiles/consumer-typeset.dir/z34.c.o   -c /Users/buildslave/jenkins/workspace/lnt-ctmark-aarch64-O3-flto/test-suite/CTMark/consumer-typeset/z34.c
[ 92%] Building C object CTMark/consumer-typeset/CMakeFiles/consumer-typeset.dir/z35.c.o
cd /Users/buildslave/jenkins/workspace/lnt-ctmark-aarch64-O3-flto/lnt-sandbox/build/CTMark/consumer-typeset && /Users/buildslave/jenkins/workspace/lnt-ctmark-aarch64-O3-flto/lnt-sandbox/build/tools/timeit --summary CMakeFiles/consumer-typeset.dir/z35.c.o.time /Users/buildslave/jenkins/workspace/lnt-ctmark-aarch64-O3-flto/compiler/bin/clang -DNDEBUG  -B /Applications/Xcode.app/Contents/Developer/Toolchains/XcodeDefault.xctoolchain/usr/bin    -O3 -flto -arch arm64 -isysroot /Applications/Xcode.app/Contents/Developer/Platforms/iPhoneOS.platform/Developer/SDKs/iPhoneOS12.2.sdk   -w -Werror=date-time -DOS_UNIX=1 -DOS_DOS=0 -DOS_MAC=0 -DDB_FIX=0 -DUSE_STAT=1 -DSAFE_DFT=0 -DCOLLATE=1 -DLIB_DIR=\"lout.lib\" -DFONT_DIR=\"font\" -DMAPS_DIR=\"maps\" -DINCL_DIR=\"include\" -DDATA_DIR=\"data\" -DHYPH_DIR=\"hyph\" -DLOCALE_DIR=\"locale\" -DCHAR_IN=1 -DCHAR_OUT=0 -DLOCALE_ON=1 -DASSERT_ON=1 -DDEBUG_ON=0 -DPDF_COMPRESSION=0 -D_FORTIFY_SOURCE=0 -o CMakeFiles/consumer-typeset.dir/z35.c.o   -c /Users/buildslave/jenkins/workspace/lnt-ctmark-aarch64-O3-flto/test-suite/CTMark/consumer-typeset/z35.c
[ 92%] Building C object CTMark/consumer-typeset/CMakeFiles/consumer-typeset.dir/z36.c.o
cd /Users/buildslave/jenkins/workspace/lnt-ctmark-aarch64-O3-flto/lnt-sandbox/build/CTMark/consumer-typeset && /Users/buildslave/jenkins/workspace/lnt-ctmark-aarch64-O3-flto/lnt-sandbox/build/tools/timeit --summary CMakeFiles/consumer-typeset.dir/z36.c.o.time /Users/buildslave/jenkins/workspace/lnt-ctmark-aarch64-O3-flto/compiler/bin/clang -DNDEBUG  -B /Applications/Xcode.app/Contents/Developer/Toolchains/XcodeDefault.xctoolchain/usr/bin    -O3 -flto -arch arm64 -isysroot /Applications/Xcode.app/Contents/Developer/Platforms/iPhoneOS.platform/Developer/SDKs/iPhoneOS12.2.sdk   -w -Werror=date-time -DOS_UNIX=1 -DOS_DOS=0 -DOS_MAC=0 -DDB_FIX=0 -DUSE_STAT=1 -DSAFE_DFT=0 -DCOLLATE=1 -DLIB_DIR=\"lout.lib\" -DFONT_DIR=\"font\" -DMAPS_DIR=\"maps\" -DINCL_DIR=\"include\" -DDATA_DIR=\"data\" -DHYPH_DIR=\"hyph\" -DLOCALE_DIR=\"locale\" -DCHAR_IN=1 -DCHAR_OUT=0 -DLOCALE_ON=1 -DASSERT_ON=1 -DDEBUG_ON=0 -DPDF_COMPRESSION=0 -D_FORTIFY_SOURCE=0 -o CMakeFiles/consumer-typeset.dir/z36.c.o   -c /Users/buildslave/jenkins/workspace/lnt-ctmark-aarch64-O3-flto/test-suite/CTMark/consumer-typeset/z36.c
[ 92%] Building C object CTMark/consumer-typeset/CMakeFiles/consumer-typeset.dir/z37.c.o
cd /Users/buildslave/jenkins/workspace/lnt-ctmark-aarch64-O3-flto/lnt-sandbox/build/CTMark/consumer-typeset && /Users/buildslave/jenkins/workspace/lnt-ctmark-aarch64-O3-flto/lnt-sandbox/build/tools/timeit --summary CMakeFiles/consumer-typeset.dir/z37.c.o.time /Users/buildslave/jenkins/workspace/lnt-ctmark-aarch64-O3-flto/compiler/bin/clang -DNDEBUG  -B /Applications/Xcode.app/Contents/Developer/Toolchains/XcodeDefault.xctoolchain/usr/bin    -O3 -flto -arch arm64 -isysroot /Applications/Xcode.app/Contents/Developer/Platforms/iPhoneOS.platform/Developer/SDKs/iPhoneOS12.2.sdk   -w -Werror=date-time -DOS_UNIX=1 -DOS_DOS=0 -DOS_MAC=0 -DDB_FIX=0 -DUSE_STAT=1 -DSAFE_DFT=0 -DCOLLATE=1 -DLIB_DIR=\"lout.lib\" -DFONT_DIR=\"font\" -DMAPS_DIR=\"maps\" -DINCL_DIR=\"include\" -DDATA_DIR=\"data\" -DHYPH_DIR=\"hyph\" -DLOCALE_DIR=\"locale\" -DCHAR_IN=1 -DCHAR_OUT=0 -DLOCALE_ON=1 -DASSERT_ON=1 -DDEBUG_ON=0 -DPDF_COMPRESSION=0 -D_FORTIFY_SOURCE=0 -o CMakeFiles/consumer-typeset.dir/z37.c.o   -c /Users/buildslave/jenkins/workspace/lnt-ctmark-aarch64-O3-flto/test-suite/CTMark/consumer-typeset/z37.c
[ 93%] Building C object CTMark/consumer-typeset/CMakeFiles/consumer-typeset.dir/z38.c.o
cd /Users/buildslave/jenkins/workspace/lnt-ctmark-aarch64-O3-flto/lnt-sandbox/build/CTMark/consumer-typeset && /Users/buildslave/jenkins/workspace/lnt-ctmark-aarch64-O3-flto/lnt-sandbox/build/tools/timeit --summary CMakeFiles/consumer-typeset.dir/z38.c.o.time /Users/buildslave/jenkins/workspace/lnt-ctmark-aarch64-O3-flto/compiler/bin/clang -DNDEBUG  -B /Applications/Xcode.app/Contents/Developer/Toolchains/XcodeDefault.xctoolchain/usr/bin    -O3 -flto -arch arm64 -isysroot /Applications/Xcode.app/Contents/Developer/Platforms/iPhoneOS.platform/Developer/SDKs/iPhoneOS12.2.sdk   -w -Werror=date-time -DOS_UNIX=1 -DOS_DOS=0 -DOS_MAC=0 -DDB_FIX=0 -DUSE_STAT=1 -DSAFE_DFT=0 -DCOLLATE=1 -DLIB_DIR=\"lout.lib\" -DFONT_DIR=\"font\" -DMAPS_DIR=\"maps\" -DINCL_DIR=\"include\" -DDATA_DIR=\"data\" -DHYPH_DIR=\"hyph\" -DLOCALE_DIR=\"locale\" -DCHAR_IN=1 -DCHAR_OUT=0 -DLOCALE_ON=1 -DASSERT_ON=1 -DDEBUG_ON=0 -DPDF_COMPRESSION=0 -D_FORTIFY_SOURCE=0 -o CMakeFiles/consumer-typeset.dir/z38.c.o   -c /Users/buildslave/jenkins/workspace/lnt-ctmark-aarch64-O3-flto/test-suite/CTMark/consumer-typeset/z38.c
[ 93%] Building C object CTMark/consumer-typeset/CMakeFiles/consumer-typeset.dir/z39.c.o
cd /Users/buildslave/jenkins/workspace/lnt-ctmark-aarch64-O3-flto/lnt-sandbox/build/CTMark/consumer-typeset && /Users/buildslave/jenkins/workspace/lnt-ctmark-aarch64-O3-flto/lnt-sandbox/build/tools/timeit --summary CMakeFiles/consumer-typeset.dir/z39.c.o.time /Users/buildslave/jenkins/workspace/lnt-ctmark-aarch64-O3-flto/compiler/bin/clang -DNDEBUG  -B /Applications/Xcode.app/Contents/Developer/Toolchains/XcodeDefault.xctoolchain/usr/bin    -O3 -flto -arch arm64 -isysroot /Applications/Xcode.app/Contents/Developer/Platforms/iPhoneOS.platform/Developer/SDKs/iPhoneOS12.2.sdk   -w -Werror=date-time -DOS_UNIX=1 -DOS_DOS=0 -DOS_MAC=0 -DDB_FIX=0 -DUSE_STAT=1 -DSAFE_DFT=0 -DCOLLATE=1 -DLIB_DIR=\"lout.lib\" -DFONT_DIR=\"font\" -DMAPS_DIR=\"maps\" -DINCL_DIR=\"include\" -DDATA_DIR=\"data\" -DHYPH_DIR=\"hyph\" -DLOCALE_DIR=\"locale\" -DCHAR_IN=1 -DCHAR_OUT=0 -DLOCALE_ON=1 -DASSERT_ON=1 -DDEBUG_ON=0 -DPDF_COMPRESSION=0 -D_FORTIFY_SOURCE=0 -o CMakeFiles/consumer-typeset.dir/z39.c.o   -c /Users/buildslave/jenkins/workspace/lnt-ctmark-aarch64-O3-flto/test-suite/CTMark/consumer-typeset/z39.c
[ 93%] Building C object CTMark/consumer-typeset/CMakeFiles/consumer-typeset.dir/z40.c.o
cd /Users/buildslave/jenkins/workspace/lnt-ctmark-aarch64-O3-flto/lnt-sandbox/build/CTMark/consumer-typeset && /Users/buildslave/jenkins/workspace/lnt-ctmark-aarch64-O3-flto/lnt-sandbox/build/tools/timeit --summary CMakeFiles/consumer-typeset.dir/z40.c.o.time /Users/buildslave/jenkins/workspace/lnt-ctmark-aarch64-O3-flto/compiler/bin/clang -DNDEBUG  -B /Applications/Xcode.app/Contents/Developer/Toolchains/XcodeDefault.xctoolchain/usr/bin    -O3 -flto -arch arm64 -isysroot /Applications/Xcode.app/Contents/Developer/Platforms/iPhoneOS.platform/Developer/SDKs/iPhoneOS12.2.sdk   -w -Werror=date-time -DOS_UNIX=1 -DOS_DOS=0 -DOS_MAC=0 -DDB_FIX=0 -DUSE_STAT=1 -DSAFE_DFT=0 -DCOLLATE=1 -DLIB_DIR=\"lout.lib\" -DFONT_DIR=\"font\" -DMAPS_DIR=\"maps\" -DINCL_DIR=\"include\" -DDATA_DIR=\"data\" -DHYPH_DIR=\"hyph\" -DLOCALE_DIR=\"locale\" -DCHAR_IN=1 -DCHAR_OUT=0 -DLOCALE_ON=1 -DASSERT_ON=1 -DDEBUG_ON=0 -DPDF_COMPRESSION=0 -D_FORTIFY_SOURCE=0 -o CMakeFiles/consumer-typeset.dir/z40.c.o   -c /Users/buildslave/jenkins/workspace/lnt-ctmark-aarch64-O3-flto/test-suite/CTMark/consumer-typeset/z40.c
[ 93%] Building C object CTMark/consumer-typeset/CMakeFiles/consumer-typeset.dir/z41.c.o
cd /Users/buildslave/jenkins/workspace/lnt-ctmark-aarch64-O3-flto/lnt-sandbox/build/CTMark/consumer-typeset && /Users/buildslave/jenkins/workspace/lnt-ctmark-aarch64-O3-flto/lnt-sandbox/build/tools/timeit --summary CMakeFiles/consumer-typeset.dir/z41.c.o.time /Users/buildslave/jenkins/workspace/lnt-ctmark-aarch64-O3-flto/compiler/bin/clang -DNDEBUG  -B /Applications/Xcode.app/Contents/Developer/Toolchains/XcodeDefault.xctoolchain/usr/bin    -O3 -flto -arch arm64 -isysroot /Applications/Xcode.app/Contents/Developer/Platforms/iPhoneOS.platform/Developer/SDKs/iPhoneOS12.2.sdk   -w -Werror=date-time -DOS_UNIX=1 -DOS_DOS=0 -DOS_MAC=0 -DDB_FIX=0 -DUSE_STAT=1 -DSAFE_DFT=0 -DCOLLATE=1 -DLIB_DIR=\"lout.lib\" -DFONT_DIR=\"font\" -DMAPS_DIR=\"maps\" -DINCL_DIR=\"include\" -DDATA_DIR=\"data\" -DHYPH_DIR=\"hyph\" -DLOCALE_DIR=\"locale\" -DCHAR_IN=1 -DCHAR_OUT=0 -DLOCALE_ON=1 -DASSERT_ON=1 -DDEBUG_ON=0 -DPDF_COMPRESSION=0 -D_FORTIFY_SOURCE=0 -o CMakeFiles/consumer-typeset.dir/z41.c.o   -c /Users/buildslave/jenkins/workspace/lnt-ctmark-aarch64-O3-flto/test-suite/CTMark/consumer-typeset/z41.c
[ 93%] Building C object CTMark/consumer-typeset/CMakeFiles/consumer-typeset.dir/z42.c.o
cd /Users/buildslave/jenkins/workspace/lnt-ctmark-aarch64-O3-flto/lnt-sandbox/build/CTMark/consumer-typeset && /Users/buildslave/jenkins/workspace/lnt-ctmark-aarch64-O3-flto/lnt-sandbox/build/tools/timeit --summary CMakeFiles/consumer-typeset.dir/z42.c.o.time /Users/buildslave/jenkins/workspace/lnt-ctmark-aarch64-O3-flto/compiler/bin/clang -DNDEBUG  -B /Applications/Xcode.app/Contents/Developer/Toolchains/XcodeDefault.xctoolchain/usr/bin    -O3 -flto -arch arm64 -isysroot /Applications/Xcode.app/Contents/Developer/Platforms/iPhoneOS.platform/Developer/SDKs/iPhoneOS12.2.sdk   -w -Werror=date-time -DOS_UNIX=1 -DOS_DOS=0 -DOS_MAC=0 -DDB_FIX=0 -DUSE_STAT=1 -DSAFE_DFT=0 -DCOLLATE=1 -DLIB_DIR=\"lout.lib\" -DFONT_DIR=\"font\" -DMAPS_DIR=\"maps\" -DINCL_DIR=\"include\" -DDATA_DIR=\"data\" -DHYPH_DIR=\"hyph\" -DLOCALE_DIR=\"locale\" -DCHAR_IN=1 -DCHAR_OUT=0 -DLOCALE_ON=1 -DASSERT_ON=1 -DDEBUG_ON=0 -DPDF_COMPRESSION=0 -D_FORTIFY_SOURCE=0 -o CMakeFiles/consumer-typeset.dir/z42.c.o   -c /Users/buildslave/jenkins/workspace/lnt-ctmark-aarch64-O3-flto/test-suite/CTMark/consumer-typeset/z42.c
[ 93%] Building C object CTMark/consumer-typeset/CMakeFiles/consumer-typeset.dir/z43.c.o
cd /Users/buildslave/jenkins/workspace/lnt-ctmark-aarch64-O3-flto/lnt-sandbox/build/CTMark/consumer-typeset && /Users/buildslave/jenkins/workspace/lnt-ctmark-aarch64-O3-flto/lnt-sandbox/build/tools/timeit --summary CMakeFiles/consumer-typeset.dir/z43.c.o.time /Users/buildslave/jenkins/workspace/lnt-ctmark-aarch64-O3-flto/compiler/bin/clang -DNDEBUG  -B /Applications/Xcode.app/Contents/Developer/Toolchains/XcodeDefault.xctoolchain/usr/bin    -O3 -flto -arch arm64 -isysroot /Applications/Xcode.app/Contents/Developer/Platforms/iPhoneOS.platform/Developer/SDKs/iPhoneOS12.2.sdk   -w -Werror=date-time -DOS_UNIX=1 -DOS_DOS=0 -DOS_MAC=0 -DDB_FIX=0 -DUSE_STAT=1 -DSAFE_DFT=0 -DCOLLATE=1 -DLIB_DIR=\"lout.lib\" -DFONT_DIR=\"font\" -DMAPS_DIR=\"maps\" -DINCL_DIR=\"include\" -DDATA_DIR=\"data\" -DHYPH_DIR=\"hyph\" -DLOCALE_DIR=\"locale\" -DCHAR_IN=1 -DCHAR_OUT=0 -DLOCALE_ON=1 -DASSERT_ON=1 -DDEBUG_ON=0 -DPDF_COMPRESSION=0 -D_FORTIFY_SOURCE=0 -o CMakeFiles/consumer-typeset.dir/z43.c.o   -c /Users/buildslave/jenkins/workspace/lnt-ctmark-aarch64-O3-flto/test-suite/CTMark/consumer-typeset/z43.c
[ 94%] Building C object CTMark/consumer-typeset/CMakeFiles/consumer-typeset.dir/z44.c.o
cd /Users/buildslave/jenkins/workspace/lnt-ctmark-aarch64-O3-flto/lnt-sandbox/build/CTMark/consumer-typeset && /Users/buildslave/jenkins/workspace/lnt-ctmark-aarch64-O3-flto/lnt-sandbox/build/tools/timeit --summary CMakeFiles/consumer-typeset.dir/z44.c.o.time /Users/buildslave/jenkins/workspace/lnt-ctmark-aarch64-O3-flto/compiler/bin/clang -DNDEBUG  -B /Applications/Xcode.app/Contents/Developer/Toolchains/XcodeDefault.xctoolchain/usr/bin    -O3 -flto -arch arm64 -isysroot /Applications/Xcode.app/Contents/Developer/Platforms/iPhoneOS.platform/Developer/SDKs/iPhoneOS12.2.sdk   -w -Werror=date-time -DOS_UNIX=1 -DOS_DOS=0 -DOS_MAC=0 -DDB_FIX=0 -DUSE_STAT=1 -DSAFE_DFT=0 -DCOLLATE=1 -DLIB_DIR=\"lout.lib\" -DFONT_DIR=\"font\" -DMAPS_DIR=\"maps\" -DINCL_DIR=\"include\" -DDATA_DIR=\"data\" -DHYPH_DIR=\"hyph\" -DLOCALE_DIR=\"locale\" -DCHAR_IN=1 -DCHAR_OUT=0 -DLOCALE_ON=1 -DASSERT_ON=1 -DDEBUG_ON=0 -DPDF_COMPRESSION=0 -D_FORTIFY_SOURCE=0 -o CMakeFiles/consumer-typeset.dir/z44.c.o   -c /Users/buildslave/jenkins/workspace/lnt-ctmark-aarch64-O3-flto/test-suite/CTMark/consumer-typeset/z44.c
[ 94%] Building C object CTMark/consumer-typeset/CMakeFiles/consumer-typeset.dir/z45.c.o
cd /Users/buildslave/jenkins/workspace/lnt-ctmark-aarch64-O3-flto/lnt-sandbox/build/CTMark/consumer-typeset && /Users/buildslave/jenkins/workspace/lnt-ctmark-aarch64-O3-flto/lnt-sandbox/build/tools/timeit --summary CMakeFiles/consumer-typeset.dir/z45.c.o.time /Users/buildslave/jenkins/workspace/lnt-ctmark-aarch64-O3-flto/compiler/bin/clang -DNDEBUG  -B /Applications/Xcode.app/Contents/Developer/Toolchains/XcodeDefault.xctoolchain/usr/bin    -O3 -flto -arch arm64 -isysroot /Applications/Xcode.app/Contents/Developer/Platforms/iPhoneOS.platform/Developer/SDKs/iPhoneOS12.2.sdk   -w -Werror=date-time -DOS_UNIX=1 -DOS_DOS=0 -DOS_MAC=0 -DDB_FIX=0 -DUSE_STAT=1 -DSAFE_DFT=0 -DCOLLATE=1 -DLIB_DIR=\"lout.lib\" -DFONT_DIR=\"font\" -DMAPS_DIR=\"maps\" -DINCL_DIR=\"include\" -DDATA_DIR=\"data\" -DHYPH_DIR=\"hyph\" -DLOCALE_DIR=\"locale\" -DCHAR_IN=1 -DCHAR_OUT=0 -DLOCALE_ON=1 -DASSERT_ON=1 -DDEBUG_ON=0 -DPDF_COMPRESSION=0 -D_FORTIFY_SOURCE=0 -o CMakeFiles/consumer-typeset.dir/z45.c.o   -c /Users/buildslave/jenkins/workspace/lnt-ctmark-aarch64-O3-flto/test-suite/CTMark/consumer-typeset/z45.c
[ 94%] Building C object CTMark/consumer-typeset/CMakeFiles/consumer-typeset.dir/z46.c.o
cd /Users/buildslave/jenkins/workspace/lnt-ctmark-aarch64-O3-flto/lnt-sandbox/build/CTMark/consumer-typeset && /Users/buildslave/jenkins/workspace/lnt-ctmark-aarch64-O3-flto/lnt-sandbox/build/tools/timeit --summary CMakeFiles/consumer-typeset.dir/z46.c.o.time /Users/buildslave/jenkins/workspace/lnt-ctmark-aarch64-O3-flto/compiler/bin/clang -DNDEBUG  -B /Applications/Xcode.app/Contents/Developer/Toolchains/XcodeDefault.xctoolchain/usr/bin    -O3 -flto -arch arm64 -isysroot /Applications/Xcode.app/Contents/Developer/Platforms/iPhoneOS.platform/Developer/SDKs/iPhoneOS12.2.sdk   -w -Werror=date-time -DOS_UNIX=1 -DOS_DOS=0 -DOS_MAC=0 -DDB_FIX=0 -DUSE_STAT=1 -DSAFE_DFT=0 -DCOLLATE=1 -DLIB_DIR=\"lout.lib\" -DFONT_DIR=\"font\" -DMAPS_DIR=\"maps\" -DINCL_DIR=\"include\" -DDATA_DIR=\"data\" -DHYPH_DIR=\"hyph\" -DLOCALE_DIR=\"locale\" -DCHAR_IN=1 -DCHAR_OUT=0 -DLOCALE_ON=1 -DASSERT_ON=1 -DDEBUG_ON=0 -DPDF_COMPRESSION=0 -D_FORTIFY_SOURCE=0 -o CMakeFiles/consumer-typeset.dir/z46.c.o   -c /Users/buildslave/jenkins/workspace/lnt-ctmark-aarch64-O3-flto/test-suite/CTMark/consumer-typeset/z46.c
[ 94%] Building C object CTMark/consumer-typeset/CMakeFiles/consumer-typeset.dir/z47.c.o
cd /Users/buildslave/jenkins/workspace/lnt-ctmark-aarch64-O3-flto/lnt-sandbox/build/CTMark/consumer-typeset && /Users/buildslave/jenkins/workspace/lnt-ctmark-aarch64-O3-flto/lnt-sandbox/build/tools/timeit --summary CMakeFiles/consumer-typeset.dir/z47.c.o.time /Users/buildslave/jenkins/workspace/lnt-ctmark-aarch64-O3-flto/compiler/bin/clang -DNDEBUG  -B /Applications/Xcode.app/Contents/Developer/Toolchains/XcodeDefault.xctoolchain/usr/bin    -O3 -flto -arch arm64 -isysroot /Applications/Xcode.app/Contents/Developer/Platforms/iPhoneOS.platform/Developer/SDKs/iPhoneOS12.2.sdk   -w -Werror=date-time -DOS_UNIX=1 -DOS_DOS=0 -DOS_MAC=0 -DDB_FIX=0 -DUSE_STAT=1 -DSAFE_DFT=0 -DCOLLATE=1 -DLIB_DIR=\"lout.lib\" -DFONT_DIR=\"font\" -DMAPS_DIR=\"maps\" -DINCL_DIR=\"include\" -DDATA_DIR=\"data\" -DHYPH_DIR=\"hyph\" -DLOCALE_DIR=\"locale\" -DCHAR_IN=1 -DCHAR_OUT=0 -DLOCALE_ON=1 -DASSERT_ON=1 -DDEBUG_ON=0 -DPDF_COMPRESSION=0 -D_FORTIFY_SOURCE=0 -o CMakeFiles/consumer-typeset.dir/z47.c.o   -c /Users/buildslave/jenkins/workspace/lnt-ctmark-aarch64-O3-flto/test-suite/CTMark/consumer-typeset/z47.c
[ 94%] Building C object CTMark/consumer-typeset/CMakeFiles/consumer-typeset.dir/z48.c.o
cd /Users/buildslave/jenkins/workspace/lnt-ctmark-aarch64-O3-flto/lnt-sandbox/build/CTMark/consumer-typeset && /Users/buildslave/jenkins/workspace/lnt-ctmark-aarch64-O3-flto/lnt-sandbox/build/tools/timeit --summary CMakeFiles/consumer-typeset.dir/z48.c.o.time /Users/buildslave/jenkins/workspace/lnt-ctmark-aarch64-O3-flto/compiler/bin/clang -DNDEBUG  -B /Applications/Xcode.app/Contents/Developer/Toolchains/XcodeDefault.xctoolchain/usr/bin    -O3 -flto -arch arm64 -isysroot /Applications/Xcode.app/Contents/Developer/Platforms/iPhoneOS.platform/Developer/SDKs/iPhoneOS12.2.sdk   -w -Werror=date-time -DOS_UNIX=1 -DOS_DOS=0 -DOS_MAC=0 -DDB_FIX=0 -DUSE_STAT=1 -DSAFE_DFT=0 -DCOLLATE=1 -DLIB_DIR=\"lout.lib\" -DFONT_DIR=\"font\" -DMAPS_DIR=\"maps\" -DINCL_DIR=\"include\" -DDATA_DIR=\"data\" -DHYPH_DIR=\"hyph\" -DLOCALE_DIR=\"locale\" -DCHAR_IN=1 -DCHAR_OUT=0 -DLOCALE_ON=1 -DASSERT_ON=1 -DDEBUG_ON=0 -DPDF_COMPRESSION=0 -D_FORTIFY_SOURCE=0 -o CMakeFiles/consumer-typeset.dir/z48.c.o   -c /Users/buildslave/jenkins/workspace/lnt-ctmark-aarch64-O3-flto/test-suite/CTMark/consumer-typeset/z48.c
[ 94%] Building C object CTMark/consumer-typeset/CMakeFiles/consumer-typeset.dir/z49.c.o
cd /Users/buildslave/jenkins/workspace/lnt-ctmark-aarch64-O3-flto/lnt-sandbox/build/CTMark/consumer-typeset && /Users/buildslave/jenkins/workspace/lnt-ctmark-aarch64-O3-flto/lnt-sandbox/build/tools/timeit --summary CMakeFiles/consumer-typeset.dir/z49.c.o.time /Users/buildslave/jenkins/workspace/lnt-ctmark-aarch64-O3-flto/compiler/bin/clang -DNDEBUG  -B /Applications/Xcode.app/Contents/Developer/Toolchains/XcodeDefault.xctoolchain/usr/bin    -O3 -flto -arch arm64 -isysroot /Applications/Xcode.app/Contents/Developer/Platforms/iPhoneOS.platform/Developer/SDKs/iPhoneOS12.2.sdk   -w -Werror=date-time -DOS_UNIX=1 -DOS_DOS=0 -DOS_MAC=0 -DDB_FIX=0 -DUSE_STAT=1 -DSAFE_DFT=0 -DCOLLATE=1 -DLIB_DIR=\"lout.lib\" -DFONT_DIR=\"font\" -DMAPS_DIR=\"maps\" -DINCL_DIR=\"include\" -DDATA_DIR=\"data\" -DHYPH_DIR=\"hyph\" -DLOCALE_DIR=\"locale\" -DCHAR_IN=1 -DCHAR_OUT=0 -DLOCALE_ON=1 -DASSERT_ON=1 -DDEBUG_ON=0 -DPDF_COMPRESSION=0 -D_FORTIFY_SOURCE=0 -o CMakeFiles/consumer-typeset.dir/z49.c.o   -c /Users/buildslave/jenkins/workspace/lnt-ctmark-aarch64-O3-flto/test-suite/CTMark/consumer-typeset/z49.c
[ 94%] Building C object CTMark/consumer-typeset/CMakeFiles/consumer-typeset.dir/z50.c.o
cd /Users/buildslave/jenkins/workspace/lnt-ctmark-aarch64-O3-flto/lnt-sandbox/build/CTMark/consumer-typeset && /Users/buildslave/jenkins/workspace/lnt-ctmark-aarch64-O3-flto/lnt-sandbox/build/tools/timeit --summary CMakeFiles/consumer-typeset.dir/z50.c.o.time /Users/buildslave/jenkins/workspace/lnt-ctmark-aarch64-O3-flto/compiler/bin/clang -DNDEBUG  -B /Applications/Xcode.app/Contents/Developer/Toolchains/XcodeDefault.xctoolchain/usr/bin    -O3 -flto -arch arm64 -isysroot /Applications/Xcode.app/Contents/Developer/Platforms/iPhoneOS.platform/Developer/SDKs/iPhoneOS12.2.sdk   -w -Werror=date-time -DOS_UNIX=1 -DOS_DOS=0 -DOS_MAC=0 -DDB_FIX=0 -DUSE_STAT=1 -DSAFE_DFT=0 -DCOLLATE=1 -DLIB_DIR=\"lout.lib\" -DFONT_DIR=\"font\" -DMAPS_DIR=\"maps\" -DINCL_DIR=\"include\" -DDATA_DIR=\"data\" -DHYPH_DIR=\"hyph\" -DLOCALE_DIR=\"locale\" -DCHAR_IN=1 -DCHAR_OUT=0 -DLOCALE_ON=1 -DASSERT_ON=1 -DDEBUG_ON=0 -DPDF_COMPRESSION=0 -D_FORTIFY_SOURCE=0 -o CMakeFiles/consumer-typeset.dir/z50.c.o   -c /Users/buildslave/jenkins/workspace/lnt-ctmark-aarch64-O3-flto/test-suite/CTMark/consumer-typeset/z50.c
[ 95%] Building C object CTMark/consumer-typeset/CMakeFiles/consumer-typeset.dir/z51.c.o
cd /Users/buildslave/jenkins/workspace/lnt-ctmark-aarch64-O3-flto/lnt-sandbox/build/CTMark/consumer-typeset && /Users/buildslave/jenkins/workspace/lnt-ctmark-aarch64-O3-flto/lnt-sandbox/build/tools/timeit --summary CMakeFiles/consumer-typeset.dir/z51.c.o.time /Users/buildslave/jenkins/workspace/lnt-ctmark-aarch64-O3-flto/compiler/bin/clang -DNDEBUG  -B /Applications/Xcode.app/Contents/Developer/Toolchains/XcodeDefault.xctoolchain/usr/bin    -O3 -flto -arch arm64 -isysroot /Applications/Xcode.app/Contents/Developer/Platforms/iPhoneOS.platform/Developer/SDKs/iPhoneOS12.2.sdk   -w -Werror=date-time -DOS_UNIX=1 -DOS_DOS=0 -DOS_MAC=0 -DDB_FIX=0 -DUSE_STAT=1 -DSAFE_DFT=0 -DCOLLATE=1 -DLIB_DIR=\"lout.lib\" -DFONT_DIR=\"font\" -DMAPS_DIR=\"maps\" -DINCL_DIR=\"include\" -DDATA_DIR=\"data\" -DHYPH_DIR=\"hyph\" -DLOCALE_DIR=\"locale\" -DCHAR_IN=1 -DCHAR_OUT=0 -DLOCALE_ON=1 -DASSERT_ON=1 -DDEBUG_ON=0 -DPDF_COMPRESSION=0 -D_FORTIFY_SOURCE=0 -o CMakeFiles/consumer-typeset.dir/z51.c.o   -c /Users/buildslave/jenkins/workspace/lnt-ctmark-aarch64-O3-flto/test-suite/CTMark/consumer-typeset/z51.c
[ 95%] Linking C executable consumer-typeset
cd /Users/buildslave/jenkins/workspace/lnt-ctmark-aarch64-O3-flto/lnt-sandbox/build/CTMark/consumer-typeset && /usr/local/Cellar/cmake/3.13.1/bin/cmake -E cmake_link_script CMakeFiles/consumer-typeset.dir/link.txt --verbose=1
/Users/buildslave/jenkins/workspace/lnt-ctmark-aarch64-O3-flto/lnt-sandbox/build/tools/timeit --summary consumer-typeset.link.time /Users/buildslave/jenkins/workspace/lnt-ctmark-aarch64-O3-flto/compiler/bin/clang   -B /Applications/Xcode.app/Contents/Developer/Toolchains/XcodeDefault.xctoolchain/usr/bin    -O3 -flto -arch arm64 -isysroot /Applications/Xcode.app/Contents/Developer/Platforms/iPhoneOS.platform/Developer/SDKs/iPhoneOS12.2.sdk -Wl,-search_paths_first -Wl,-headerpad_max_install_names   -B /Applications/Xcode.app/Contents/Developer/Toolchains/XcodeDefault.xctoolchain/usr/bin   CMakeFiles/consumer-typeset.dir/z01.c.o CMakeFiles/consumer-typeset.dir/z02.c.o CMakeFiles/consumer-typeset.dir/z03.c.o CMakeFiles/consumer-typeset.dir/z04.c.o CMakeFiles/consumer-typeset.dir/z05.c.o CMakeFiles/consumer-typeset.dir/z06.c.o CMakeFiles/consumer-typeset.dir/z07.c.o CMakeFiles/consumer-typeset.dir/z08.c.o CMakeFiles/consumer-typeset.dir/z09.c.o CMakeFiles/consumer-typeset.dir/z10.c.o CMakeFiles/consumer-typeset.dir/z11.c.o CMakeFiles/consumer-typeset.dir/z12.c.o CMakeFiles/consumer-typeset.dir/z13.c.o CMakeFiles/consumer-typeset.dir/z14.c.o CMakeFiles/consumer-typeset.dir/z15.c.o CMakeFiles/consumer-typeset.dir/z16.c.o CMakeFiles/consumer-typeset.dir/z17.c.o CMakeFiles/consumer-typeset.dir/z18.c.o CMakeFiles/consumer-typeset.dir/z19.c.o CMakeFiles/consumer-typeset.dir/z20.c.o CMakeFiles/consumer-typeset.dir/z21.c.o CMakeFiles/consumer-typeset.dir/z22.c.o CMakeFiles/consumer-typeset.dir/z23.c.o CMakeFiles/consumer-typeset.dir/z24.c.o CMakeFiles/consumer-typeset.dir/z25.c.o CMakeFiles/consumer-typeset.dir/z26.c.o CMakeFiles/consumer-typeset.dir/z27.c.o CMakeFiles/consumer-typeset.dir/z28.c.o CMakeFiles/consumer-typeset.dir/z29.c.o CMakeFiles/consumer-typeset.dir/z30.c.o CMakeFiles/consumer-typeset.dir/z31.c.o CMakeFiles/consumer-typeset.dir/z32.c.o CMakeFiles/consumer-typeset.dir/z33.c.o CMakeFiles/consumer-typeset.dir/z34.c.o CMakeFiles/consumer-typeset.dir/z35.c.o CMakeFiles/consumer-typeset.dir/z36.c.o CMakeFiles/consumer-typeset.dir/z37.c.o CMakeFiles/consumer-typeset.dir/z38.c.o CMakeFiles/consumer-typeset.dir/z39.c.o CMakeFiles/consumer-typeset.dir/z40.c.o CMakeFiles/consumer-typeset.dir/z41.c.o CMakeFiles/consumer-typeset.dir/z42.c.o CMakeFiles/consumer-typeset.dir/z43.c.o CMakeFiles/consumer-typeset.dir/z44.c.o CMakeFiles/consumer-typeset.dir/z45.c.o CMakeFiles/consumer-typeset.dir/z46.c.o CMakeFiles/consumer-typeset.dir/z47.c.o CMakeFiles/consumer-typeset.dir/z48.c.o CMakeFiles/consumer-typeset.dir/z49.c.o CMakeFiles/consumer-typeset.dir/z50.c.o CMakeFiles/consumer-typeset.dir/z51.c.o  -o consumer-typeset -lm 
cd /Users/buildslave/jenkins/workspace/lnt-ctmark-aarch64-O3-flto/lnt-sandbox/build/CTMark/consumer-typeset && /usr/local/Cellar/cmake/3.13.1/bin/cmake -E create_symlink /Users/buildslave/jenkins/workspace/lnt-ctmark-aarch64-O3-flto/test-suite/CTMark/consumer-typeset/consumer-typeset.reference_output /Users/buildslave/jenkins/workspace/lnt-ctmark-aarch64-O3-flto/lnt-sandbox/build/CTMark/consumer-typeset/consumer-typeset.reference_output
cd /Users/buildslave/jenkins/workspace/lnt-ctmark-aarch64-O3-flto/lnt-sandbox/build/CTMark/consumer-typeset && /usr/local/Cellar/cmake/3.13.1/bin/cmake -E create_symlink /Users/buildslave/jenkins/workspace/lnt-ctmark-aarch64-O3-flto/test-suite/CTMark/consumer-typeset/large.lout /Users/buildslave/jenkins/workspace/lnt-ctmark-aarch64-O3-flto/lnt-sandbox/build/CTMark/consumer-typeset/large.lout
cd /Users/buildslave/jenkins/workspace/lnt-ctmark-aarch64-O3-flto/lnt-sandbox/build/CTMark/consumer-typeset && /usr/local/Cellar/cmake/3.13.1/bin/cmake -E create_symlink /Users/buildslave/jenkins/workspace/lnt-ctmark-aarch64-O3-flto/test-suite/CTMark/consumer-typeset/data /Users/buildslave/jenkins/workspace/lnt-ctmark-aarch64-O3-flto/lnt-sandbox/build/CTMark/consumer-typeset/data
[ 95%] Built target consumer-typeset
/Applications/Xcode.app/Contents/Developer/usr/bin/make -f CTMark/mafft/CMakeFiles/pairlocalalign.dir/build.make CTMark/mafft/CMakeFiles/pairlocalalign.dir/depend
cd /Users/buildslave/jenkins/workspace/lnt-ctmark-aarch64-O3-flto/lnt-sandbox/build && /usr/local/Cellar/cmake/3.13.1/bin/cmake -E cmake_depends "Unix Makefiles" /Users/buildslave/jenkins/workspace/lnt-ctmark-aarch64-O3-flto/test-suite /Users/buildslave/jenkins/workspace/lnt-ctmark-aarch64-O3-flto/test-suite/CTMark/mafft /Users/buildslave/jenkins/workspace/lnt-ctmark-aarch64-O3-flto/lnt-sandbox/build /Users/buildslave/jenkins/workspace/lnt-ctmark-aarch64-O3-flto/lnt-sandbox/build/CTMark/mafft /Users/buildslave/jenkins/workspace/lnt-ctmark-aarch64-O3-flto/lnt-sandbox/build/CTMark/mafft/CMakeFiles/pairlocalalign.dir/DependInfo.cmake --color=
Dependee "/Users/buildslave/jenkins/workspace/lnt-ctmark-aarch64-O3-flto/lnt-sandbox/build/CTMark/mafft/CMakeFiles/pairlocalalign.dir/DependInfo.cmake" is newer than depender "/Users/buildslave/jenkins/workspace/lnt-ctmark-aarch64-O3-flto/lnt-sandbox/build/CTMark/mafft/CMakeFiles/pairlocalalign.dir/depend.internal".
Dependee "/Users/buildslave/jenkins/workspace/lnt-ctmark-aarch64-O3-flto/lnt-sandbox/build/CTMark/mafft/CMakeFiles/CMakeDirectoryInformation.cmake" is newer than depender "/Users/buildslave/jenkins/workspace/lnt-ctmark-aarch64-O3-flto/lnt-sandbox/build/CTMark/mafft/CMakeFiles/pairlocalalign.dir/depend.internal".
Scanning dependencies of target pairlocalalign
/Applications/Xcode.app/Contents/Developer/usr/bin/make -f CTMark/mafft/CMakeFiles/pairlocalalign.dir/build.make CTMark/mafft/CMakeFiles/pairlocalalign.dir/build
[ 95%] Building C object CTMark/mafft/CMakeFiles/pairlocalalign.dir/Calignm1.c.o
cd /Users/buildslave/jenkins/workspace/lnt-ctmark-aarch64-O3-flto/lnt-sandbox/build/CTMark/mafft && /Users/buildslave/jenkins/workspace/lnt-ctmark-aarch64-O3-flto/lnt-sandbox/build/tools/timeit --summary CMakeFiles/pairlocalalign.dir/Calignm1.c.o.time /Users/buildslave/jenkins/workspace/lnt-ctmark-aarch64-O3-flto/compiler/bin/clang -DNDEBUG  -B /Applications/Xcode.app/Contents/Developer/Toolchains/XcodeDefault.xctoolchain/usr/bin    -O3 -flto -arch arm64 -isysroot /Applications/Xcode.app/Contents/Developer/Platforms/iPhoneOS.platform/Developer/SDKs/iPhoneOS12.2.sdk   -w -Werror=date-time -DLLVM -o CMakeFiles/pairlocalalign.dir/Calignm1.c.o   -c /Users/buildslave/jenkins/workspace/lnt-ctmark-aarch64-O3-flto/test-suite/CTMark/mafft/Calignm1.c
[ 95%] Building C object CTMark/mafft/CMakeFiles/pairlocalalign.dir/constants.c.o
cd /Users/buildslave/jenkins/workspace/lnt-ctmark-aarch64-O3-flto/lnt-sandbox/build/CTMark/mafft && /Users/buildslave/jenkins/workspace/lnt-ctmark-aarch64-O3-flto/lnt-sandbox/build/tools/timeit --summary CMakeFiles/pairlocalalign.dir/constants.c.o.time /Users/buildslave/jenkins/workspace/lnt-ctmark-aarch64-O3-flto/compiler/bin/clang -DNDEBUG  -B /Applications/Xcode.app/Contents/Developer/Toolchains/XcodeDefault.xctoolchain/usr/bin    -O3 -flto -arch arm64 -isysroot /Applications/Xcode.app/Contents/Developer/Platforms/iPhoneOS.platform/Developer/SDKs/iPhoneOS12.2.sdk   -w -Werror=date-time -DLLVM -o CMakeFiles/pairlocalalign.dir/constants.c.o   -c /Users/buildslave/jenkins/workspace/lnt-ctmark-aarch64-O3-flto/test-suite/CTMark/mafft/constants.c
[ 95%] Building C object CTMark/mafft/CMakeFiles/pairlocalalign.dir/defs.c.o
cd /Users/buildslave/jenkins/workspace/lnt-ctmark-aarch64-O3-flto/lnt-sandbox/build/CTMark/mafft && /Users/buildslave/jenkins/workspace/lnt-ctmark-aarch64-O3-flto/lnt-sandbox/build/tools/timeit --summary CMakeFiles/pairlocalalign.dir/defs.c.o.time /Users/buildslave/jenkins/workspace/lnt-ctmark-aarch64-O3-flto/compiler/bin/clang -DNDEBUG  -B /Applications/Xcode.app/Contents/Developer/Toolchains/XcodeDefault.xctoolchain/usr/bin    -O3 -flto -arch arm64 -isysroot /Applications/Xcode.app/Contents/Developer/Platforms/iPhoneOS.platform/Developer/SDKs/iPhoneOS12.2.sdk   -w -Werror=date-time -DLLVM -o CMakeFiles/pairlocalalign.dir/defs.c.o   -c /Users/buildslave/jenkins/workspace/lnt-ctmark-aarch64-O3-flto/test-suite/CTMark/mafft/defs.c
[ 96%] Building C object CTMark/mafft/CMakeFiles/pairlocalalign.dir/Falign.c.o
cd /Users/buildslave/jenkins/workspace/lnt-ctmark-aarch64-O3-flto/lnt-sandbox/build/CTMark/mafft && /Users/buildslave/jenkins/workspace/lnt-ctmark-aarch64-O3-flto/lnt-sandbox/build/tools/timeit --summary CMakeFiles/pairlocalalign.dir/Falign.c.o.time /Users/buildslave/jenkins/workspace/lnt-ctmark-aarch64-O3-flto/compiler/bin/clang -DNDEBUG  -B /Applications/Xcode.app/Contents/Developer/Toolchains/XcodeDefault.xctoolchain/usr/bin    -O3 -flto -arch arm64 -isysroot /Applications/Xcode.app/Contents/Developer/Platforms/iPhoneOS.platform/Developer/SDKs/iPhoneOS12.2.sdk   -w -Werror=date-time -DLLVM -o CMakeFiles/pairlocalalign.dir/Falign.c.o   -c /Users/buildslave/jenkins/workspace/lnt-ctmark-aarch64-O3-flto/test-suite/CTMark/mafft/Falign.c
[ 96%] Building C object CTMark/mafft/CMakeFiles/pairlocalalign.dir/fft.c.o
cd /Users/buildslave/jenkins/workspace/lnt-ctmark-aarch64-O3-flto/lnt-sandbox/build/CTMark/mafft && /Users/buildslave/jenkins/workspace/lnt-ctmark-aarch64-O3-flto/lnt-sandbox/build/tools/timeit --summary CMakeFiles/pairlocalalign.dir/fft.c.o.time /Users/buildslave/jenkins/workspace/lnt-ctmark-aarch64-O3-flto/compiler/bin/clang -DNDEBUG  -B /Applications/Xcode.app/Contents/Developer/Toolchains/XcodeDefault.xctoolchain/usr/bin    -O3 -flto -arch arm64 -isysroot /Applications/Xcode.app/Contents/Developer/Platforms/iPhoneOS.platform/Developer/SDKs/iPhoneOS12.2.sdk   -w -Werror=date-time -DLLVM -o CMakeFiles/pairlocalalign.dir/fft.c.o   -c /Users/buildslave/jenkins/workspace/lnt-ctmark-aarch64-O3-flto/test-suite/CTMark/mafft/fft.c
[ 96%] Building C object CTMark/mafft/CMakeFiles/pairlocalalign.dir/fftFunctions.c.o
cd /Users/buildslave/jenkins/workspace/lnt-ctmark-aarch64-O3-flto/lnt-sandbox/build/CTMark/mafft && /Users/buildslave/jenkins/workspace/lnt-ctmark-aarch64-O3-flto/lnt-sandbox/build/tools/timeit --summary CMakeFiles/pairlocalalign.dir/fftFunctions.c.o.time /Users/buildslave/jenkins/workspace/lnt-ctmark-aarch64-O3-flto/compiler/bin/clang -DNDEBUG  -B /Applications/Xcode.app/Contents/Developer/Toolchains/XcodeDefault.xctoolchain/usr/bin    -O3 -flto -arch arm64 -isysroot /Applications/Xcode.app/Contents/Developer/Platforms/iPhoneOS.platform/Developer/SDKs/iPhoneOS12.2.sdk   -w -Werror=date-time -DLLVM -o CMakeFiles/pairlocalalign.dir/fftFunctions.c.o   -c /Users/buildslave/jenkins/workspace/lnt-ctmark-aarch64-O3-flto/test-suite/CTMark/mafft/fftFunctions.c
[ 96%] Building C object CTMark/mafft/CMakeFiles/pairlocalalign.dir/Galign11.c.o
cd /Users/buildslave/jenkins/workspace/lnt-ctmark-aarch64-O3-flto/lnt-sandbox/build/CTMark/mafft && /Users/buildslave/jenkins/workspace/lnt-ctmark-aarch64-O3-flto/lnt-sandbox/build/tools/timeit --summary CMakeFiles/pairlocalalign.dir/Galign11.c.o.time /Users/buildslave/jenkins/workspace/lnt-ctmark-aarch64-O3-flto/compiler/bin/clang -DNDEBUG  -B /Applications/Xcode.app/Contents/Developer/Toolchains/XcodeDefault.xctoolchain/usr/bin    -O3 -flto -arch arm64 -isysroot /Applications/Xcode.app/Contents/Developer/Platforms/iPhoneOS.platform/Developer/SDKs/iPhoneOS12.2.sdk   -w -Werror=date-time -DLLVM -o CMakeFiles/pairlocalalign.dir/Galign11.c.o   -c /Users/buildslave/jenkins/workspace/lnt-ctmark-aarch64-O3-flto/test-suite/CTMark/mafft/Galign11.c
[ 96%] Building C object CTMark/mafft/CMakeFiles/pairlocalalign.dir/genalign11.c.o
cd /Users/buildslave/jenkins/workspace/lnt-ctmark-aarch64-O3-flto/lnt-sandbox/build/CTMark/mafft && /Users/buildslave/jenkins/workspace/lnt-ctmark-aarch64-O3-flto/lnt-sandbox/build/tools/timeit --summary CMakeFiles/pairlocalalign.dir/genalign11.c.o.time /Users/buildslave/jenkins/workspace/lnt-ctmark-aarch64-O3-flto/compiler/bin/clang -DNDEBUG  -B /Applications/Xcode.app/Contents/Developer/Toolchains/XcodeDefault.xctoolchain/usr/bin    -O3 -flto -arch arm64 -isysroot /Applications/Xcode.app/Contents/Developer/Platforms/iPhoneOS.platform/Developer/SDKs/iPhoneOS12.2.sdk   -w -Werror=date-time -DLLVM -o CMakeFiles/pairlocalalign.dir/genalign11.c.o   -c /Users/buildslave/jenkins/workspace/lnt-ctmark-aarch64-O3-flto/test-suite/CTMark/mafft/genalign11.c
[ 96%] Building C object CTMark/mafft/CMakeFiles/pairlocalalign.dir/genGalign11.c.o
cd /Users/buildslave/jenkins/workspace/lnt-ctmark-aarch64-O3-flto/lnt-sandbox/build/CTMark/mafft && /Users/buildslave/jenkins/workspace/lnt-ctmark-aarch64-O3-flto/lnt-sandbox/build/tools/timeit --summary CMakeFiles/pairlocalalign.dir/genGalign11.c.o.time /Users/buildslave/jenkins/workspace/lnt-ctmark-aarch64-O3-flto/compiler/bin/clang -DNDEBUG  -B /Applications/Xcode.app/Contents/Developer/Toolchains/XcodeDefault.xctoolchain/usr/bin    -O3 -flto -arch arm64 -isysroot /Applications/Xcode.app/Contents/Developer/Platforms/iPhoneOS.platform/Developer/SDKs/iPhoneOS12.2.sdk   -w -Werror=date-time -DLLVM -o CMakeFiles/pairlocalalign.dir/genGalign11.c.o   -c /Users/buildslave/jenkins/workspace/lnt-ctmark-aarch64-O3-flto/test-suite/CTMark/mafft/genGalign11.c
[ 97%] Building C object CTMark/mafft/CMakeFiles/pairlocalalign.dir/Halignmm.c.o
cd /Users/buildslave/jenkins/workspace/lnt-ctmark-aarch64-O3-flto/lnt-sandbox/build/CTMark/mafft && /Users/buildslave/jenkins/workspace/lnt-ctmark-aarch64-O3-flto/lnt-sandbox/build/tools/timeit --summary CMakeFiles/pairlocalalign.dir/Halignmm.c.o.time /Users/buildslave/jenkins/workspace/lnt-ctmark-aarch64-O3-flto/compiler/bin/clang -DNDEBUG  -B /Applications/Xcode.app/Contents/Developer/Toolchains/XcodeDefault.xctoolchain/usr/bin    -O3 -flto -arch arm64 -isysroot /Applications/Xcode.app/Contents/Developer/Platforms/iPhoneOS.platform/Developer/SDKs/iPhoneOS12.2.sdk   -w -Werror=date-time -DLLVM -o CMakeFiles/pairlocalalign.dir/Halignmm.c.o   -c /Users/buildslave/jenkins/workspace/lnt-ctmark-aarch64-O3-flto/test-suite/CTMark/mafft/Halignmm.c
[ 97%] Building C object CTMark/mafft/CMakeFiles/pairlocalalign.dir/io.c.o
cd /Users/buildslave/jenkins/workspace/lnt-ctmark-aarch64-O3-flto/lnt-sandbox/build/CTMark/mafft && /Users/buildslave/jenkins/workspace/lnt-ctmark-aarch64-O3-flto/lnt-sandbox/build/tools/timeit --summary CMakeFiles/pairlocalalign.dir/io.c.o.time /Users/buildslave/jenkins/workspace/lnt-ctmark-aarch64-O3-flto/compiler/bin/clang -DNDEBUG  -B /Applications/Xcode.app/Contents/Developer/Toolchains/XcodeDefault.xctoolchain/usr/bin    -O3 -flto -arch arm64 -isysroot /Applications/Xcode.app/Contents/Developer/Platforms/iPhoneOS.platform/Developer/SDKs/iPhoneOS12.2.sdk   -w -Werror=date-time -DLLVM -o CMakeFiles/pairlocalalign.dir/io.c.o   -c /Users/buildslave/jenkins/workspace/lnt-ctmark-aarch64-O3-flto/test-suite/CTMark/mafft/io.c
[ 97%] Building C object CTMark/mafft/CMakeFiles/pairlocalalign.dir/Lalign11.c.o
cd /Users/buildslave/jenkins/workspace/lnt-ctmark-aarch64-O3-flto/lnt-sandbox/build/CTMark/mafft && /Users/buildslave/jenkins/workspace/lnt-ctmark-aarch64-O3-flto/lnt-sandbox/build/tools/timeit --summary CMakeFiles/pairlocalalign.dir/Lalign11.c.o.time /Users/buildslave/jenkins/workspace/lnt-ctmark-aarch64-O3-flto/compiler/bin/clang -DNDEBUG  -B /Applications/Xcode.app/Contents/Developer/Toolchains/XcodeDefault.xctoolchain/usr/bin    -O3 -flto -arch arm64 -isysroot /Applications/Xcode.app/Contents/Developer/Platforms/iPhoneOS.platform/Developer/SDKs/iPhoneOS12.2.sdk   -w -Werror=date-time -DLLVM -o CMakeFiles/pairlocalalign.dir/Lalign11.c.o   -c /Users/buildslave/jenkins/workspace/lnt-ctmark-aarch64-O3-flto/test-suite/CTMark/mafft/Lalign11.c
[ 97%] Building C object CTMark/mafft/CMakeFiles/pairlocalalign.dir/Lalignmm.c.o
cd /Users/buildslave/jenkins/workspace/lnt-ctmark-aarch64-O3-flto/lnt-sandbox/build/CTMark/mafft && /Users/buildslave/jenkins/workspace/lnt-ctmark-aarch64-O3-flto/lnt-sandbox/build/tools/timeit --summary CMakeFiles/pairlocalalign.dir/Lalignmm.c.o.time /Users/buildslave/jenkins/workspace/lnt-ctmark-aarch64-O3-flto/compiler/bin/clang -DNDEBUG  -B /Applications/Xcode.app/Contents/Developer/Toolchains/XcodeDefault.xctoolchain/usr/bin    -O3 -flto -arch arm64 -isysroot /Applications/Xcode.app/Contents/Developer/Platforms/iPhoneOS.platform/Developer/SDKs/iPhoneOS12.2.sdk   -w -Werror=date-time -DLLVM -o CMakeFiles/pairlocalalign.dir/Lalignmm.c.o   -c /Users/buildslave/jenkins/workspace/lnt-ctmark-aarch64-O3-flto/test-suite/CTMark/mafft/Lalignmm.c
[ 97%] Building C object CTMark/mafft/CMakeFiles/pairlocalalign.dir/mltaln9.c.o
cd /Users/buildslave/jenkins/workspace/lnt-ctmark-aarch64-O3-flto/lnt-sandbox/build/CTMark/mafft && /Users/buildslave/jenkins/workspace/lnt-ctmark-aarch64-O3-flto/lnt-sandbox/build/tools/timeit --summary CMakeFiles/pairlocalalign.dir/mltaln9.c.o.time /Users/buildslave/jenkins/workspace/lnt-ctmark-aarch64-O3-flto/compiler/bin/clang -DNDEBUG  -B /Applications/Xcode.app/Contents/Developer/Toolchains/XcodeDefault.xctoolchain/usr/bin    -O3 -flto -arch arm64 -isysroot /Applications/Xcode.app/Contents/Developer/Platforms/iPhoneOS.platform/Developer/SDKs/iPhoneOS12.2.sdk   -w -Werror=date-time -DLLVM -o CMakeFiles/pairlocalalign.dir/mltaln9.c.o   -c /Users/buildslave/jenkins/workspace/lnt-ctmark-aarch64-O3-flto/test-suite/CTMark/mafft/mltaln9.c
[ 97%] Building C object CTMark/mafft/CMakeFiles/pairlocalalign.dir/MSalign11.c.o
cd /Users/buildslave/jenkins/workspace/lnt-ctmark-aarch64-O3-flto/lnt-sandbox/build/CTMark/mafft && /Users/buildslave/jenkins/workspace/lnt-ctmark-aarch64-O3-flto/lnt-sandbox/build/tools/timeit --summary CMakeFiles/pairlocalalign.dir/MSalign11.c.o.time /Users/buildslave/jenkins/workspace/lnt-ctmark-aarch64-O3-flto/compiler/bin/clang -DNDEBUG  -B /Applications/Xcode.app/Contents/Developer/Toolchains/XcodeDefault.xctoolchain/usr/bin    -O3 -flto -arch arm64 -isysroot /Applications/Xcode.app/Contents/Developer/Platforms/iPhoneOS.platform/Developer/SDKs/iPhoneOS12.2.sdk   -w -Werror=date-time -DLLVM -o CMakeFiles/pairlocalalign.dir/MSalign11.c.o   -c /Users/buildslave/jenkins/workspace/lnt-ctmark-aarch64-O3-flto/test-suite/CTMark/mafft/MSalign11.c
[ 97%] Building C object CTMark/mafft/CMakeFiles/pairlocalalign.dir/MSalignmm.c.o
cd /Users/buildslave/jenkins/workspace/lnt-ctmark-aarch64-O3-flto/lnt-sandbox/build/CTMark/mafft && /Users/buildslave/jenkins/workspace/lnt-ctmark-aarch64-O3-flto/lnt-sandbox/build/tools/timeit --summary CMakeFiles/pairlocalalign.dir/MSalignmm.c.o.time /Users/buildslave/jenkins/workspace/lnt-ctmark-aarch64-O3-flto/compiler/bin/clang -DNDEBUG  -B /Applications/Xcode.app/Contents/Developer/Toolchains/XcodeDefault.xctoolchain/usr/bin    -O3 -flto -arch arm64 -isysroot /Applications/Xcode.app/Contents/Developer/Platforms/iPhoneOS.platform/Developer/SDKs/iPhoneOS12.2.sdk   -w -Werror=date-time -DLLVM -o CMakeFiles/pairlocalalign.dir/MSalignmm.c.o   -c /Users/buildslave/jenkins/workspace/lnt-ctmark-aarch64-O3-flto/test-suite/CTMark/mafft/MSalignmm.c
[ 98%] Building C object CTMark/mafft/CMakeFiles/pairlocalalign.dir/mtxutl.c.o
cd /Users/buildslave/jenkins/workspace/lnt-ctmark-aarch64-O3-flto/lnt-sandbox/build/CTMark/mafft && /Users/buildslave/jenkins/workspace/lnt-ctmark-aarch64-O3-flto/lnt-sandbox/build/tools/timeit --summary CMakeFiles/pairlocalalign.dir/mtxutl.c.o.time /Users/buildslave/jenkins/workspace/lnt-ctmark-aarch64-O3-flto/compiler/bin/clang -DNDEBUG  -B /Applications/Xcode.app/Contents/Developer/Toolchains/XcodeDefault.xctoolchain/usr/bin    -O3 -flto -arch arm64 -isysroot /Applications/Xcode.app/Contents/Developer/Platforms/iPhoneOS.platform/Developer/SDKs/iPhoneOS12.2.sdk   -w -Werror=date-time -DLLVM -o CMakeFiles/pairlocalalign.dir/mtxutl.c.o   -c /Users/buildslave/jenkins/workspace/lnt-ctmark-aarch64-O3-flto/test-suite/CTMark/mafft/mtxutl.c
[ 98%] Building C object CTMark/mafft/CMakeFiles/pairlocalalign.dir/pairlocalalign.c.o
cd /Users/buildslave/jenkins/workspace/lnt-ctmark-aarch64-O3-flto/lnt-sandbox/build/CTMark/mafft && /Users/buildslave/jenkins/workspace/lnt-ctmark-aarch64-O3-flto/lnt-sandbox/build/tools/timeit --summary CMakeFiles/pairlocalalign.dir/pairlocalalign.c.o.time /Users/buildslave/jenkins/workspace/lnt-ctmark-aarch64-O3-flto/compiler/bin/clang -DNDEBUG  -B /Applications/Xcode.app/Contents/Developer/Toolchains/XcodeDefault.xctoolchain/usr/bin    -O3 -flto -arch arm64 -isysroot /Applications/Xcode.app/Contents/Developer/Platforms/iPhoneOS.platform/Developer/SDKs/iPhoneOS12.2.sdk   -w -Werror=date-time -DLLVM -o CMakeFiles/pairlocalalign.dir/pairlocalalign.c.o   -c /Users/buildslave/jenkins/workspace/lnt-ctmark-aarch64-O3-flto/test-suite/CTMark/mafft/pairlocalalign.c
[ 98%] Building C object CTMark/mafft/CMakeFiles/pairlocalalign.dir/partQalignmm.c.o
cd /Users/buildslave/jenkins/workspace/lnt-ctmark-aarch64-O3-flto/lnt-sandbox/build/CTMark/mafft && /Users/buildslave/jenkins/workspace/lnt-ctmark-aarch64-O3-flto/lnt-sandbox/build/tools/timeit --summary CMakeFiles/pairlocalalign.dir/partQalignmm.c.o.time /Users/buildslave/jenkins/workspace/lnt-ctmark-aarch64-O3-flto/compiler/bin/clang -DNDEBUG  -B /Applications/Xcode.app/Contents/Developer/Toolchains/XcodeDefault.xctoolchain/usr/bin    -O3 -flto -arch arm64 -isysroot /Applications/Xcode.app/Contents/Developer/Platforms/iPhoneOS.platform/Developer/SDKs/iPhoneOS12.2.sdk   -w -Werror=date-time -DLLVM -o CMakeFiles/pairlocalalign.dir/partQalignmm.c.o   -c /Users/buildslave/jenkins/workspace/lnt-ctmark-aarch64-O3-flto/test-suite/CTMark/mafft/partQalignmm.c
[ 98%] Building C object CTMark/mafft/CMakeFiles/pairlocalalign.dir/partSalignmm.c.o
cd /Users/buildslave/jenkins/workspace/lnt-ctmark-aarch64-O3-flto/lnt-sandbox/build/CTMark/mafft && /Users/buildslave/jenkins/workspace/lnt-ctmark-aarch64-O3-flto/lnt-sandbox/build/tools/timeit --summary CMakeFiles/pairlocalalign.dir/partSalignmm.c.o.time /Users/buildslave/jenkins/workspace/lnt-ctmark-aarch64-O3-flto/compiler/bin/clang -DNDEBUG  -B /Applications/Xcode.app/Contents/Developer/Toolchains/XcodeDefault.xctoolchain/usr/bin    -O3 -flto -arch arm64 -isysroot /Applications/Xcode.app/Contents/Developer/Platforms/iPhoneOS.platform/Developer/SDKs/iPhoneOS12.2.sdk   -w -Werror=date-time -DLLVM -o CMakeFiles/pairlocalalign.dir/partSalignmm.c.o   -c /Users/buildslave/jenkins/workspace/lnt-ctmark-aarch64-O3-flto/test-suite/CTMark/mafft/partSalignmm.c
[ 98%] Building C object CTMark/mafft/CMakeFiles/pairlocalalign.dir/Qalignmm.c.o
cd /Users/buildslave/jenkins/workspace/lnt-ctmark-aarch64-O3-flto/lnt-sandbox/build/CTMark/mafft && /Users/buildslave/jenkins/workspace/lnt-ctmark-aarch64-O3-flto/lnt-sandbox/build/tools/timeit --summary CMakeFiles/pairlocalalign.dir/Qalignmm.c.o.time /Users/buildslave/jenkins/workspace/lnt-ctmark-aarch64-O3-flto/compiler/bin/clang -DNDEBUG  -B /Applications/Xcode.app/Contents/Developer/Toolchains/XcodeDefault.xctoolchain/usr/bin    -O3 -flto -arch arm64 -isysroot /Applications/Xcode.app/Contents/Developer/Platforms/iPhoneOS.platform/Developer/SDKs/iPhoneOS12.2.sdk   -w -Werror=date-time -DLLVM -o CMakeFiles/pairlocalalign.dir/Qalignmm.c.o   -c /Users/buildslave/jenkins/workspace/lnt-ctmark-aarch64-O3-flto/test-suite/CTMark/mafft/Qalignmm.c
[ 98%] Building C object CTMark/mafft/CMakeFiles/pairlocalalign.dir/Ralignmm.c.o
cd /Users/buildslave/jenkins/workspace/lnt-ctmark-aarch64-O3-flto/lnt-sandbox/build/CTMark/mafft && /Users/buildslave/jenkins/workspace/lnt-ctmark-aarch64-O3-flto/lnt-sandbox/build/tools/timeit --summary CMakeFiles/pairlocalalign.dir/Ralignmm.c.o.time /Users/buildslave/jenkins/workspace/lnt-ctmark-aarch64-O3-flto/compiler/bin/clang -DNDEBUG  -B /Applications/Xcode.app/Contents/Developer/Toolchains/XcodeDefault.xctoolchain/usr/bin    -O3 -flto -arch arm64 -isysroot /Applications/Xcode.app/Contents/Developer/Platforms/iPhoneOS.platform/Developer/SDKs/iPhoneOS12.2.sdk   -w -Werror=date-time -DLLVM -o CMakeFiles/pairlocalalign.dir/Ralignmm.c.o   -c /Users/buildslave/jenkins/workspace/lnt-ctmark-aarch64-O3-flto/test-suite/CTMark/mafft/Ralignmm.c
[ 99%] Building C object CTMark/mafft/CMakeFiles/pairlocalalign.dir/rna.c.o
cd /Users/buildslave/jenkins/workspace/lnt-ctmark-aarch64-O3-flto/lnt-sandbox/build/CTMark/mafft && /Users/buildslave/jenkins/workspace/lnt-ctmark-aarch64-O3-flto/lnt-sandbox/build/tools/timeit --summary CMakeFiles/pairlocalalign.dir/rna.c.o.time /Users/buildslave/jenkins/workspace/lnt-ctmark-aarch64-O3-flto/compiler/bin/clang -DNDEBUG  -B /Applications/Xcode.app/Contents/Developer/Toolchains/XcodeDefault.xctoolchain/usr/bin    -O3 -flto -arch arm64 -isysroot /Applications/Xcode.app/Contents/Developer/Platforms/iPhoneOS.platform/Developer/SDKs/iPhoneOS12.2.sdk   -w -Werror=date-time -DLLVM -o CMakeFiles/pairlocalalign.dir/rna.c.o   -c /Users/buildslave/jenkins/workspace/lnt-ctmark-aarch64-O3-flto/test-suite/CTMark/mafft/rna.c
[ 99%] Building C object CTMark/mafft/CMakeFiles/pairlocalalign.dir/SAalignmm.c.o
cd /Users/buildslave/jenkins/workspace/lnt-ctmark-aarch64-O3-flto/lnt-sandbox/build/CTMark/mafft && /Users/buildslave/jenkins/workspace/lnt-ctmark-aarch64-O3-flto/lnt-sandbox/build/tools/timeit --summary CMakeFiles/pairlocalalign.dir/SAalignmm.c.o.time /Users/buildslave/jenkins/workspace/lnt-ctmark-aarch64-O3-flto/compiler/bin/clang -DNDEBUG  -B /Applications/Xcode.app/Contents/Developer/Toolchains/XcodeDefault.xctoolchain/usr/bin    -O3 -flto -arch arm64 -isysroot /Applications/Xcode.app/Contents/Developer/Platforms/iPhoneOS.platform/Developer/SDKs/iPhoneOS12.2.sdk   -w -Werror=date-time -DLLVM -o CMakeFiles/pairlocalalign.dir/SAalignmm.c.o   -c /Users/buildslave/jenkins/workspace/lnt-ctmark-aarch64-O3-flto/test-suite/CTMark/mafft/SAalignmm.c
[ 99%] Building C object CTMark/mafft/CMakeFiles/pairlocalalign.dir/Salignmm.c.o
cd /Users/buildslave/jenkins/workspace/lnt-ctmark-aarch64-O3-flto/lnt-sandbox/build/CTMark/mafft && /Users/buildslave/jenkins/workspace/lnt-ctmark-aarch64-O3-flto/lnt-sandbox/build/tools/timeit --summary CMakeFiles/pairlocalalign.dir/Salignmm.c.o.time /Users/buildslave/jenkins/workspace/lnt-ctmark-aarch64-O3-flto/compiler/bin/clang -DNDEBUG  -B /Applications/Xcode.app/Contents/Developer/Toolchains/XcodeDefault.xctoolchain/usr/bin    -O3 -flto -arch arm64 -isysroot /Applications/Xcode.app/Contents/Developer/Platforms/iPhoneOS.platform/Developer/SDKs/iPhoneOS12.2.sdk   -w -Werror=date-time -DLLVM -o CMakeFiles/pairlocalalign.dir/Salignmm.c.o   -c /Users/buildslave/jenkins/workspace/lnt-ctmark-aarch64-O3-flto/test-suite/CTMark/mafft/Salignmm.c
[ 99%] Building C object CTMark/mafft/CMakeFiles/pairlocalalign.dir/suboptalign11.c.o
cd /Users/buildslave/jenkins/workspace/lnt-ctmark-aarch64-O3-flto/lnt-sandbox/build/CTMark/mafft && /Users/buildslave/jenkins/workspace/lnt-ctmark-aarch64-O3-flto/lnt-sandbox/build/tools/timeit --summary CMakeFiles/pairlocalalign.dir/suboptalign11.c.o.time /Users/buildslave/jenkins/workspace/lnt-ctmark-aarch64-O3-flto/compiler/bin/clang -DNDEBUG  -B /Applications/Xcode.app/Contents/Developer/Toolchains/XcodeDefault.xctoolchain/usr/bin    -O3 -flto -arch arm64 -isysroot /Applications/Xcode.app/Contents/Developer/Platforms/iPhoneOS.platform/Developer/SDKs/iPhoneOS12.2.sdk   -w -Werror=date-time -DLLVM -o CMakeFiles/pairlocalalign.dir/suboptalign11.c.o   -c /Users/buildslave/jenkins/workspace/lnt-ctmark-aarch64-O3-flto/test-suite/CTMark/mafft/suboptalign11.c
[ 99%] Building C object CTMark/mafft/CMakeFiles/pairlocalalign.dir/tddis.c.o
cd /Users/buildslave/jenkins/workspace/lnt-ctmark-aarch64-O3-flto/lnt-sandbox/build/CTMark/mafft && /Users/buildslave/jenkins/workspace/lnt-ctmark-aarch64-O3-flto/lnt-sandbox/build/tools/timeit --summary CMakeFiles/pairlocalalign.dir/tddis.c.o.time /Users/buildslave/jenkins/workspace/lnt-ctmark-aarch64-O3-flto/compiler/bin/clang -DNDEBUG  -B /Applications/Xcode.app/Contents/Developer/Toolchains/XcodeDefault.xctoolchain/usr/bin    -O3 -flto -arch arm64 -isysroot /Applications/Xcode.app/Contents/Developer/Platforms/iPhoneOS.platform/Developer/SDKs/iPhoneOS12.2.sdk   -w -Werror=date-time -DLLVM -o CMakeFiles/pairlocalalign.dir/tddis.c.o   -c /Users/buildslave/jenkins/workspace/lnt-ctmark-aarch64-O3-flto/test-suite/CTMark/mafft/tddis.c
[ 99%] Linking C executable pairlocalalign
cd /Users/buildslave/jenkins/workspace/lnt-ctmark-aarch64-O3-flto/lnt-sandbox/build/CTMark/mafft && /usr/local/Cellar/cmake/3.13.1/bin/cmake -E cmake_link_script CMakeFiles/pairlocalalign.dir/link.txt --verbose=1
/Users/buildslave/jenkins/workspace/lnt-ctmark-aarch64-O3-flto/lnt-sandbox/build/tools/timeit --summary pairlocalalign.link.time /Users/buildslave/jenkins/workspace/lnt-ctmark-aarch64-O3-flto/compiler/bin/clang   -B /Applications/Xcode.app/Contents/Developer/Toolchains/XcodeDefault.xctoolchain/usr/bin    -O3 -flto -arch arm64 -isysroot /Applications/Xcode.app/Contents/Developer/Platforms/iPhoneOS.platform/Developer/SDKs/iPhoneOS12.2.sdk -Wl,-search_paths_first -Wl,-headerpad_max_install_names   -B /Applications/Xcode.app/Contents/Developer/Toolchains/XcodeDefault.xctoolchain/usr/bin   CMakeFiles/pairlocalalign.dir/Calignm1.c.o CMakeFiles/pairlocalalign.dir/constants.c.o CMakeFiles/pairlocalalign.dir/defs.c.o CMakeFiles/pairlocalalign.dir/Falign.c.o CMakeFiles/pairlocalalign.dir/fft.c.o CMakeFiles/pairlocalalign.dir/fftFunctions.c.o CMakeFiles/pairlocalalign.dir/Galign11.c.o CMakeFiles/pairlocalalign.dir/genalign11.c.o CMakeFiles/pairlocalalign.dir/genGalign11.c.o CMakeFiles/pairlocalalign.dir/Halignmm.c.o CMakeFiles/pairlocalalign.dir/io.c.o CMakeFiles/pairlocalalign.dir/Lalign11.c.o CMakeFiles/pairlocalalign.dir/Lalignmm.c.o CMakeFiles/pairlocalalign.dir/mltaln9.c.o CMakeFiles/pairlocalalign.dir/MSalign11.c.o CMakeFiles/pairlocalalign.dir/MSalignmm.c.o CMakeFiles/pairlocalalign.dir/mtxutl.c.o CMakeFiles/pairlocalalign.dir/pairlocalalign.c.o CMakeFiles/pairlocalalign.dir/partQalignmm.c.o CMakeFiles/pairlocalalign.dir/partSalignmm.c.o CMakeFiles/pairlocalalign.dir/Qalignmm.c.o CMakeFiles/pairlocalalign.dir/Ralignmm.c.o CMakeFiles/pairlocalalign.dir/rna.c.o CMakeFiles/pairlocalalign.dir/SAalignmm.c.o CMakeFiles/pairlocalalign.dir/Salignmm.c.o CMakeFiles/pairlocalalign.dir/suboptalign11.c.o CMakeFiles/pairlocalalign.dir/tddis.c.o  -o pairlocalalign -lm 
cd /Users/buildslave/jenkins/workspace/lnt-ctmark-aarch64-O3-flto/lnt-sandbox/build/CTMark/mafft && /usr/local/Cellar/cmake/3.13.1/bin/cmake -E create_symlink /Users/buildslave/jenkins/workspace/lnt-ctmark-aarch64-O3-flto/test-suite/CTMark/mafft/pairlocalalign.reference_output /Users/buildslave/jenkins/workspace/lnt-ctmark-aarch64-O3-flto/lnt-sandbox/build/CTMark/mafft/pairlocalalign.reference_output
cd /Users/buildslave/jenkins/workspace/lnt-ctmark-aarch64-O3-flto/lnt-sandbox/build/CTMark/mafft && /usr/local/Cellar/cmake/3.13.1/bin/cmake -E create_symlink /Users/buildslave/jenkins/workspace/lnt-ctmark-aarch64-O3-flto/test-suite/CTMark/mafft/pyruvate_decarboxylase.fasta /Users/buildslave/jenkins/workspace/lnt-ctmark-aarch64-O3-flto/lnt-sandbox/build/CTMark/mafft/pyruvate_decarboxylase.fasta
[ 99%] Built target pairlocalalign
make[1]: Target `all' not remade because of errors.
make: *** [all] Error 2
2020-03-02 09:29:44 INFO: Testing...
2020-03-02 09:29:44 INFO: Execute: /Users/buildslave/jenkins/workspace/lnt-ctmark-aarch64-O3-flto/venv/bin/lit -v -j 1 /Users/buildslave/jenkins/workspace/lnt-ctmark-aarch64-O3-flto/lnt-sandbox/build -o /Users/buildslave/jenkins/workspace/lnt-ctmark-aarch64-O3-flto/lnt-sandbox/build/outputtsR7lk.json
-- Testing: 10 tests, 1 workers --
PASS: test-suite :: CTMark/7zip/7zip-benchmark.test (1 of 10)
********** TEST 'test-suite :: CTMark/7zip/7zip-benchmark.test' RESULTS **********
compile_time: 70.0168 
hash: "151ec3fba5603c84b82c159c9e69d22d" 
link_time: 30.9876 
size: 1313060 
size.__bss: 26288 
size.__const: 33920 
size.__cstring: 5669 
size.__data: 2320 
size.__eh_frame: 104 
size.__gcc_except_tab: 37120 
size.__got: 536 
size.__la_symbol_ptr: 824 
size.__mod_init_func: 112 
size.__stub_helper: 1212 
size.__stubs: 1236 
size.__text: 944584 
size.__unwind_info: 11496 
**********
PASS: test-suite :: CTMark/Bullet/bullet.test (2 of 10)
********** TEST 'test-suite :: CTMark/Bullet/bullet.test' RESULTS **********
compile_time: 49.0524 
hash: "103ee86a7823d634e48f9897cb833b76" 
link_time: 6.5956 
size: 784668 
size.__bss: 43176 
size.__const: 9440 
size.__cstring: 887 
size.__data: 402736 
size.__gcc_except_tab: 2388 
size.__got: 120 
size.__la_symbol_ptr: 200 
size.__mod_init_func: 56 
size.__stub_helper: 300 
size.__stubs: 300 
size.__text: 240804 
size.__unwind_info: 2488 
**********
PASS: test-suite :: CTMark/ClamAV/clamscan.test (3 of 10)
********** TEST 'test-suite :: CTMark/ClamAV/clamscan.test' RESULTS **********
compile_time: 21.3125 
hash: "8168e745530b47d0108a89e1e0406145" 
link_time: 16.7843 
size: 758016 
size.__bss: 4693 
size.__const: 14440 
size.__cstring: 91389 
size.__data: 49304 
size.__eh_frame: 76 
size.__got: 56 
size.__la_symbol_ptr: 1056 
size.__stub_helper: 1608 
size.__stubs: 1584 
size.__text: 533712 
size.__unwind_info: 880 
**********
PASS: test-suite :: CTMark/SPASS/SPASS.test (4 of 10)
********** TEST 'test-suite :: CTMark/SPASS/SPASS.test' RESULTS **********
compile_time: 19.6405 
hash: "1576f0b97f8627a08b734426fd9861c5" 
link_time: 13.2913 
size: 548436 
size.__bss: 330372 
size.__const: 1976 
size.__cstring: 14525 
size.__data: 8 
size.__got: 56 
size.__la_symbol_ptr: 376 
size.__stub_helper: 588 
size.__stubs: 564 
size.__text: 427040 
size.__unwind_info: 1036 
**********
PASS: test-suite :: CTMark/consumer-typeset/consumer-typeset.test (5 of 10)
********** TEST 'test-suite :: CTMark/consumer-typeset/consumer-typeset.test' RESULTS **********
compile_time: 14.9935 
hash: "62eac35a86252bbc615b7a017d132a2e" 
link_time: 12.1734 
size: 624680 
size.__bss: 64985 
size.__const: 5568 
size.__cstring: 42147 
size.__data: 720 
size.__got: 56 
size.__la_symbol_ptr: 408 
size.__stub_helper: 636 
size.__stubs: 612 
size.__text: 515008 
size.__unwind_info: 672 
**********
PASS: test-suite :: CTMark/kimwitu++/kc.test (6 of 10)
********** TEST 'test-suite :: CTMark/kimwitu++/kc.test' RESULTS **********
compile_time: 27.8833 
hash: "26417e799dd128980a1d6daaf4cef9ca" 
link_time: 10.5709 
size: 1051360 
size.__bss: 11270 
size.__const: 65200 
size.__cstring: 138255 
size.__data: 1816 
size.__gcc_except_tab: 5752 
size.__got: 152 
size.__la_symbol_ptr: 664 
size.__mod_init_func: 48 
size.__stub_helper: 972 
size.__stubs: 996 
size.__text: 477440 
size.__unwind_info: 4796 
**********
PASS: test-suite :: CTMark/lencod/lencod.test (7 of 10)
********** TEST 'test-suite :: CTMark/lencod/lencod.test' RESULTS **********
compile_time: 25.3891 
hash: "88e696797ecde4c2f21d39727d66e6c9" 
link_time: 24.7373 
size: 820896 
size.__bss: 90626 
size.__common: 16152 
size.__const: 13008 
size.__cstring: 31578 
size.__data: 1160 
size.__eh_frame: 524 
size.__got: 48 
size.__la_symbol_ptr: 400 
size.__stub_helper: 624 
size.__stubs: 600 
size.__text: 666236 
size.__unwind_info: 780 
**********
PASS: test-suite :: CTMark/mafft/pairlocalalign.test (8 of 10)
********** TEST 'test-suite :: CTMark/mafft/pairlocalalign.test' RESULTS **********
compile_time: 11.7800 
hash: "7296d44507d5b823af7541ca36f8f177" 
link_time: 5.5994 
size: 227864 
size.__bss: 14514072 
size.__const: 14640 
size.__cstring: 4917 
size.__data: 2176 
size.__got: 56 
size.__la_symbol_ptr: 336 
size.__stub_helper: 528 
size.__stubs: 504 
size.__text: 153724 
size.__unwind_info: 240 
**********
PASS: test-suite :: CTMark/sqlite3/sqlite3.test (9 of 10)
********** TEST 'test-suite :: CTMark/sqlite3/sqlite3.test' RESULTS **********
compile_time: 15.6940 
hash: "acf23624ce6e885b73a1730be0dedaaf" 
link_time: 19.1271 
size: 755544 
size.__bss: 552 
size.__const: 2592 
size.__cstring: 17202 
size.__data: 2107 
size.__got: 56 
size.__la_symbol_ptr: 448 
size.__stub_helper: 696 
size.__stubs: 672 
size.__text: 659288 
size.__unwind_info: 1124 
**********
NOEXE: test-suite :: CTMark/tramp3d-v4/tramp3d-v4.test (10 of 10)
******************** TEST 'test-suite :: CTMark/tramp3d-v4/tramp3d-v4.test' FAILED ********************
Executable '/Users/buildslave/jenkins/workspace/lnt-ctmark-aarch64-O3-flto/lnt-sandbox/build/CTMark/tramp3d-v4/tramp3d-v4' is missing
********************
Testing Time: 0.14s
  Expected Passes    : 9

Hide Details

TEST_SUITE_EXTRA_EXE_LINKER_FLAGS:STRING=

Hide Details

// Semicolon separated list of extra lit modules in use TEST_SUITE_EXTRA_LIT_MODULES:STRING=

Hide Details

// C compiler targetting the host TEST_SUITE_HOST_CC:STRING=cc

Hide Details

// Path to a program. TEST_SUITE_LIT:FILEPATH=/Users/buildslave/jenkins/workspace/lnt-ctmark-aarch64-O3-flto/venv/bin/lit

Hide Details

// Flags used when running lit TEST_SUITE_LIT_FLAGS:STRING=-sv

Hide Details

// Path to a program. TEST_SUITE_LLVM_SIZE:FILEPATH=/Users/buildslave/jenkins/workspace/lnt-ctmark-aarch64-O3-flto/compiler/bin/llvm-size

Hide Details

// Enable lit profile generate mode TEST_SUITE_PROFILE_GENERATE:BOOL=OFF

Hide Details

// Add apropriate -fprofile-instr-use to CFLAGS/CXXFLAGS for each benchmark TEST_SUITE_PROFILE_USE:BOOL=OFF

Hide Details

// Remote execution client TEST_SUITE_REMOTE_CLIENT:STRING=ssh

Hide Details

// Remote execution host TEST_SUITE_REMOTE_HOST:STRING=

Hide Details

// Actually run the benchmarks in lit TEST_SUITE_RUN_BENCHMARKS:BOOL=Off

Hide Details

// Type of benchmark inputs (may be test,train or ref) TEST_SUITE_RUN_TYPE:STRING=train

Hide Details

// RunSafely.sh run-under (-u) parameter TEST_SUITE_RUN_UNDER:STRING=

Hide Details

// Semicolon separated list of directories with CMakeLists.txt to include TEST_SUITE_SUBDIRS:STRING=CTMark

Hide Details

// Suppress all warnings TEST_SUITE_SUPPRESS_WARNINGS:BOOL=ON

Hide Details

// RUN_UNDER is used to run tests under emulation. TEST_SUITE_USER_MODE_EMULATION:BOOL=NO

Hide Details

// Use IR PGO instrumentation (requires TEST_SUITE_PROFILE_GENERATE) TEST_SUITE_USE_IR_PGO:BOOL=OFF

Hide Details

// Use perf (timeit.sh) instead of timeit.c TEST_SUITE_USE_PERF:BOOL=OFF

Hide Details

// Path to a file. TK_INCLUDE_PATH:PATH=TK_INCLUDE_PATH-NOTFOUND

Hide Details

// Path to a library. TK_LIBRARY:FILEPATH=/usr/lib/libtk.dylib

Hide Details

// Path to a program. TK_WISH:FILEPATH=/usr/bin/wish

Hide Details

Import succeeded.

Hide Details

++ echo @@@@@@ @@@@@@ + . /Users/buildslave/jenkins/workspace/lnt-ctmark-aarch64-O3-flto/config/tasks/utils/lnt_submit.sh ++ echo '@@@ LNT Submit @@@'
LNT Submit

Hide Details

@@@ LNT Submit @@@ ++ '[' -n http://104.154.54.203/db_default/v4/nts/submitRun -a -n lnt-ctmark-aarch64-O3-flto ']' +++ lnt submit http://104.154.54.203/db_default/v4/nts/submitRun /Users/buildslave/jenkins/workspace/lnt-ctmark-aarch64-O3-flto/lnt-sandbox/report.json Resuming build at Wed Mar 04 05:40:39 PST 2020 after Jenkins restart Waiting to resume part of lnt-ctmark-aarch64-O3-flto clang-d344131-g9c4afce7024-t7319-b7319.tar.gz: Finished waiting Waiting to resume part of lnt-ctmark-aarch64-O3-flto clang-d344131-g9c4afce7024-t7319-b7319.tar.gz: Jenkins is about to shut down Waiting to resume part of lnt-ctmark-aarch64-O3-flto clang-d344131-g9c4afce7024-t7319-b7319.tar.gz: Jenkins is about to shut down Waiting to resume part of lnt-ctmark-aarch64-O3-flto clang-d344131-g9c4afce7024-t7319-b7319.tar.gz: Jenkins is about to shut down Waiting to resume part of lnt-ctmark-aarch64-O3-flto clang-d344131-g9c4afce7024-t7319-b7319.tar.gz: Jenkins is about to shut down Waiting to resume part of lnt-ctmark-aarch64-O3-flto clang-d344131-g9c4afce7024-t7319-b7319.tar.gz: Jenkins is about to shut down Waiting to resume part of lnt-ctmark-aarch64-O3-flto clang-d344131-g9c4afce7024-t7319-b7319.tar.gz: Jenkins is about to shut down Waiting to resume part of lnt-ctmark-aarch64-O3-flto clang-d344131-g9c4afce7024-t7319-b7319.tar.gz: Jenkins is about to shut down Waiting to resume part of lnt-ctmark-aarch64-O3-flto clang-d344131-g9c4afce7024-t7319-b7319.tar.gz: Jenkins is about to shut down Waiting to resume part of lnt-ctmark-aarch64-O3-flto clang-d344131-g9c4afce7024-t7319-b7319.tar.gz: Jenkins is about to shut down Waiting to resume part of lnt-ctmark-aarch64-O3-flto clang-d344131-g9c4afce7024-t7319-b7319.tar.gz: Jenkins is about to shut down Waiting to resume part of lnt-ctmark-aarch64-O3-flto clang-d344131-g9c4afce7024-t7319-b7319.tar.gz: Jenkins is about to shut down Waiting to resume part of lnt-ctmark-aarch64-O3-flto clang-d344131-g9c4afce7024-t7319-b7319.tar.gz: Jenkins is about to shut down Waiting to resume part of lnt-ctmark-aarch64-O3-flto clang-d344131-g9c4afce7024-t7319-b7319.tar.gz: Jenkins is about to shut down Resuming build at Wed Mar 04 05:48:53 PST 2020 after Jenkins restart Waiting to resume part of lnt-ctmark-aarch64-O3-flto clang-d344131-g9c4afce7024-t7319-b7319.tar.gz: Finished waiting Waiting to resume part of lnt-ctmark-aarch64-O3-flto clang-d344131-g9c4afce7024-t7319-b7319.tar.gz: Jenkins is about to shut down Waiting to resume part of lnt-ctmark-aarch64-O3-flto clang-d344131-g9c4afce7024-t7319-b7319.tar.gz: Jenkins is about to shut down Waiting to resume part of lnt-ctmark-aarch64-O3-flto clang-d344131-g9c4afce7024-t7319-b7319.tar.gz: Jenkins is about to shut down Waiting to resume part of lnt-ctmark-aarch64-O3-flto clang-d344131-g9c4afce7024-t7319-b7319.tar.gz: Jenkins is about to shut down Waiting to resume part of lnt-ctmark-aarch64-O3-flto clang-d344131-g9c4afce7024-t7319-b7319.tar.gz: Jenkins is about to shut down Waiting to resume part of lnt-ctmark-aarch64-O3-flto clang-d344131-g9c4afce7024-t7319-b7319.tar.gz: Waiting for next available executor on ‘green-dragon-04’ Waiting to resume part of lnt-ctmark-aarch64-O3-flto clang-d344131-g9c4afce7024-t7319-b7319.tar.gz: Waiting for next available executor on ‘green-dragon-04’ Waiting to resume part of lnt-ctmark-aarch64-O3-flto clang-d344131-g9c4afce7024-t7319-b7319.tar.gz: Waiting for next available executor on ‘green-dragon-04’ Waiting to resume part of lnt-ctmark-aarch64-O3-flto clang-d344131-g9c4afce7024-t7319-b7319.tar.gz: Waiting for next available executor on ‘green-dragon-04’ Waiting to resume part of lnt-ctmark-aarch64-O3-flto clang-d344131-g9c4afce7024-t7319-b7319.tar.gz: Waiting for next available executor on ‘green-dragon-04’ Waiting to resume part of lnt-ctmark-aarch64-O3-flto clang-d344131-g9c4afce7024-t7319-b7319.tar.gz: Waiting for next available executor on ‘green-dragon-04’ Waiting to resume part of lnt-ctmark-aarch64-O3-flto clang-d344131-g9c4afce7024-t7319-b7319.tar.gz: Waiting for next available executor on ‘green-dragon-04’ Waiting to resume part of lnt-ctmark-aarch64-O3-flto clang-d344131-g9c4afce7024-t7319-b7319.tar.gz: Waiting for next available executor on ‘green-dragon-04’ Waiting to resume part of lnt-ctmark-aarch64-O3-flto clang-d344131-g9c4afce7024-t7319-b7319.tar.gz: Waiting for next available executor on ‘green-dragon-04’ Waiting to resume part of lnt-ctmark-aarch64-O3-flto clang-d344131-g9c4afce7024-t7319-b7319.tar.gz: Waiting for next available executor on ‘green-dragon-04’ Waiting to resume part of lnt-ctmark-aarch64-O3-flto clang-d344131-g9c4afce7024-t7319-b7319.tar.gz: Waiting for next available executor on ‘green-dragon-04’ Waiting to resume part of lnt-ctmark-aarch64-O3-flto clang-d344131-g9c4afce7024-t7319-b7319.tar.gz: Waiting for next available executor on ‘green-dragon-04’ Waiting to resume part of lnt-ctmark-aarch64-O3-flto clang-d344131-g9c4afce7024-t7319-b7319.tar.gz: Waiting for next available executor on ‘green-dragon-04’ Waiting to resume part of lnt-ctmark-aarch64-O3-flto clang-d344131-g9c4afce7024-t7319-b7319.tar.gz: Waiting for next available executor on ‘green-dragon-04’ Waiting to resume part of lnt-ctmark-aarch64-O3-flto clang-d344131-g9c4afce7024-t7319-b7319.tar.gz: Waiting for next available executor on ‘green-dragon-04’ Waiting to resume part of lnt-ctmark-aarch64-O3-flto clang-d344131-g9c4afce7024-t7319-b7319.tar.gz: Waiting for next available executor on ‘green-dragon-04’ Waiting to resume part of lnt-ctmark-aarch64-O3-flto clang-d344131-g9c4afce7024-t7319-b7319.tar.gz: Waiting for next available executor on ‘green-dragon-04’ Waiting to resume part of lnt-ctmark-aarch64-O3-flto clang-d344131-g9c4afce7024-t7319-b7319.tar.gz: Waiting for next available executor on ‘green-dragon-04’ Waiting to resume part of lnt-ctmark-aarch64-O3-flto clang-d344131-g9c4afce7024-t7319-b7319.tar.gz: Waiting for next available executor on ‘green-dragon-04’ Waiting to resume part of lnt-ctmark-aarch64-O3-flto clang-d344131-g9c4afce7024-t7319-b7319.tar.gz: Waiting for next available executor on ‘green-dragon-04’ Waiting to resume part of lnt-ctmark-aarch64-O3-flto clang-d344131-g9c4afce7024-t7319-b7319.tar.gz: Waiting for next available executor on ‘green-dragon-04’ Waiting to resume part of lnt-ctmark-aarch64-O3-flto clang-d344131-g9c4afce7024-t7319-b7319.tar.gz: Waiting for next available executor on ‘green-dragon-04’ Waiting to resume part of lnt-ctmark-aarch64-O3-flto clang-d344131-g9c4afce7024-t7319-b7319.tar.gz: Waiting for next available executor on ‘green-dragon-04’ Waiting to resume part of lnt-ctmark-aarch64-O3-flto clang-d344131-g9c4afce7024-t7319-b7319.tar.gz: Waiting for next available executor on ‘green-dragon-04’ Waiting to resume part of lnt-ctmark-aarch64-O3-flto clang-d344131-g9c4afce7024-t7319-b7319.tar.gz: Waiting for next available executor on ‘green-dragon-04’ Waiting to resume part of lnt-ctmark-aarch64-O3-flto clang-d344131-g9c4afce7024-t7319-b7319.tar.gz: Waiting for next available executor on ‘green-dragon-04’ Waiting to resume part of lnt-ctmark-aarch64-O3-flto clang-d344131-g9c4afce7024-t7319-b7319.tar.gz: Waiting for next available executor on ‘green-dragon-04’ Waiting to resume part of lnt-ctmark-aarch64-O3-flto clang-d344131-g9c4afce7024-t7319-b7319.tar.gz: Waiting for next available executor on ‘green-dragon-04’ Waiting to resume part of lnt-ctmark-aarch64-O3-flto clang-d344131-g9c4afce7024-t7319-b7319.tar.gz: Waiting for next available executor on ‘green-dragon-04’ Waiting to resume part of lnt-ctmark-aarch64-O3-flto clang-d344131-g9c4afce7024-t7319-b7319.tar.gz: Waiting for next available executor on ‘green-dragon-04’ Resuming build at Sat Mar 14 15:04:29 PDT 2020 after Jenkins restart Waiting to resume part of lnt-ctmark-aarch64-O3-flto clang-d344131-g9c4afce7024-t7319-b7319.tar.gz: In the quiet period. Expires in 0 ms Waiting to resume part of lnt-ctmark-aarch64-O3-flto clang-d344131-g9c4afce7024-t7319-b7319.tar.gz: Jenkins is about to shut down Waiting to resume part of lnt-ctmark-aarch64-O3-flto clang-d344131-g9c4afce7024-t7319-b7319.tar.gz: Jenkins is about to shut down Waiting to resume part of lnt-ctmark-aarch64-O3-flto clang-d344131-g9c4afce7024-t7319-b7319.tar.gz: Jenkins is about to shut down Waiting to resume part of lnt-ctmark-aarch64-O3-flto clang-d344131-g9c4afce7024-t7319-b7319.tar.gz: Jenkins is about to shut down Waiting to resume part of lnt-ctmark-aarch64-O3-flto clang-d344131-g9c4afce7024-t7319-b7319.tar.gz: Jenkins is about to shut down Waiting to resume part of lnt-ctmark-aarch64-O3-flto clang-d344131-g9c4afce7024-t7319-b7319.tar.gz: Waiting for next available executor on ‘green-dragon-04’ Waiting to resume part of lnt-ctmark-aarch64-O3-flto clang-d344131-g9c4afce7024-t7319-b7319.tar.gz: Waiting for next available executor on ‘green-dragon-04’ Waiting to resume part of lnt-ctmark-aarch64-O3-flto clang-d344131-g9c4afce7024-t7319-b7319.tar.gz: Waiting for next available executor on ‘green-dragon-04’ Waiting to resume part of lnt-ctmark-aarch64-O3-flto clang-d344131-g9c4afce7024-t7319-b7319.tar.gz: Waiting for next available executor on ‘green-dragon-04’ Waiting to resume part of lnt-ctmark-aarch64-O3-flto clang-d344131-g9c4afce7024-t7319-b7319.tar.gz: Waiting for next available executor on ‘green-dragon-04’ Waiting to resume part of lnt-ctmark-aarch64-O3-flto clang-d344131-g9c4afce7024-t7319-b7319.tar.gz: Waiting for next available executor on ‘green-dragon-04’ Waiting to resume part of lnt-ctmark-aarch64-O3-flto clang-d344131-g9c4afce7024-t7319-b7319.tar.gz: Waiting for next available executor on ‘green-dragon-04’ Waiting to resume part of lnt-ctmark-aarch64-O3-flto clang-d344131-g9c4afce7024-t7319-b7319.tar.gz: Waiting for next available executor on ‘green-dragon-04’ Waiting to resume part of lnt-ctmark-aarch64-O3-flto clang-d344131-g9c4afce7024-t7319-b7319.tar.gz: Waiting for next available executor on ‘green-dragon-04’ Waiting to resume part of lnt-ctmark-aarch64-O3-flto clang-d344131-g9c4afce7024-t7319-b7319.tar.gz: Waiting for next available executor on ‘green-dragon-04’ Waiting to resume part of lnt-ctmark-aarch64-O3-flto clang-d344131-g9c4afce7024-t7319-b7319.tar.gz: Waiting for next available executor on ‘green-dragon-04’ Waiting to resume part of lnt-ctmark-aarch64-O3-flto clang-d344131-g9c4afce7024-t7319-b7319.tar.gz: Waiting for next available executor on ‘green-dragon-04’ Waiting to resume part of lnt-ctmark-aarch64-O3-flto clang-d344131-g9c4afce7024-t7319-b7319.tar.gz: Waiting for next available executor on ‘green-dragon-04’ Waiting to resume part of lnt-ctmark-aarch64-O3-flto clang-d344131-g9c4afce7024-t7319-b7319.tar.gz: Waiting for next available executor on ‘green-dragon-04’ Waiting to resume part of lnt-ctmark-aarch64-O3-flto clang-d344131-g9c4afce7024-t7319-b7319.tar.gz: Waiting for next available executor on ‘green-dragon-04’ Waiting to resume part of lnt-ctmark-aarch64-O3-flto clang-d344131-g9c4afce7024-t7319-b7319.tar.gz: Waiting for next available executor on ‘green-dragon-04’ Waiting to resume part of lnt-ctmark-aarch64-O3-flto clang-d344131-g9c4afce7024-t7319-b7319.tar.gz: Waiting for next available executor on ‘green-dragon-04’ Waiting to resume part of lnt-ctmark-aarch64-O3-flto clang-d344131-g9c4afce7024-t7319-b7319.tar.gz: Waiting for next available executor on ‘green-dragon-04’ Waiting to resume part of lnt-ctmark-aarch64-O3-flto clang-d344131-g9c4afce7024-t7319-b7319.tar.gz: Waiting for next available executor on ‘green-dragon-04’ Waiting to resume part of lnt-ctmark-aarch64-O3-flto clang-d344131-g9c4afce7024-t7319-b7319.tar.gz: Waiting for next available executor on ‘green-dragon-04’ Waiting to resume part of lnt-ctmark-aarch64-O3-flto clang-d344131-g9c4afce7024-t7319-b7319.tar.gz: Waiting for next available executor on ‘green-dragon-04’ Waiting to resume part of lnt-ctmark-aarch64-O3-flto clang-d344131-g9c4afce7024-t7319-b7319.tar.gz: Waiting for next available executor on ‘green-dragon-04’ Waiting to resume part of lnt-ctmark-aarch64-O3-flto clang-d344131-g9c4afce7024-t7319-b7319.tar.gz: Waiting for next available executor on ‘green-dragon-04’ Waiting to resume part of lnt-ctmark-aarch64-O3-flto clang-d344131-g9c4afce7024-t7319-b7319.tar.gz: Waiting for next available executor on ‘green-dragon-04’ Waiting to resume part of lnt-ctmark-aarch64-O3-flto clang-d344131-g9c4afce7024-t7319-b7319.tar.gz: Waiting for next available executor on ‘green-dragon-04’ Waiting to resume part of lnt-ctmark-aarch64-O3-flto clang-d344131-g9c4afce7024-t7319-b7319.tar.gz: Waiting for next available executor on ‘green-dragon-04’ Waiting to resume part of lnt-ctmark-aarch64-O3-flto clang-d344131-g9c4afce7024-t7319-b7319.tar.gz: Waiting for next available executor on ‘green-dragon-04’ Resuming build at Wed Mar 18 08:51:10 PDT 2020 after Jenkins restart Waiting to resume part of lnt-ctmark-aarch64-O3-flto clang-d344131-g9c4afce7024-t7319-b7319.tar.gz: Finished waiting Waiting to resume part of lnt-ctmark-aarch64-O3-flto clang-d344131-g9c4afce7024-t7319-b7319.tar.gz: Jenkins is about to shut down Waiting to resume part of lnt-ctmark-aarch64-O3-flto clang-d344131-g9c4afce7024-t7319-b7319.tar.gz: Jenkins is about to shut down Waiting to resume part of lnt-ctmark-aarch64-O3-flto clang-d344131-g9c4afce7024-t7319-b7319.tar.gz: Jenkins is about to shut down Waiting to resume part of lnt-ctmark-aarch64-O3-flto clang-d344131-g9c4afce7024-t7319-b7319.tar.gz: Jenkins is about to shut down Waiting to resume part of lnt-ctmark-aarch64-O3-flto clang-d344131-g9c4afce7024-t7319-b7319.tar.gz: Jenkins is about to shut down Waiting to resume part of lnt-ctmark-aarch64-O3-flto clang-d344131-g9c4afce7024-t7319-b7319.tar.gz: Jenkins is about to shut down Waiting to resume part of lnt-ctmark-aarch64-O3-flto clang-d344131-g9c4afce7024-t7319-b7319.tar.gz: Jenkins is about to shut down Waiting to resume part of lnt-ctmark-aarch64-O3-flto clang-d344131-g9c4afce7024-t7319-b7319.tar.gz: Jenkins is about to shut down Waiting to resume part of lnt-ctmark-aarch64-O3-flto clang-d344131-g9c4afce7024-t7319-b7319.tar.gz: Jenkins is about to shut down Waiting to resume part of lnt-ctmark-aarch64-O3-flto clang-d344131-g9c4afce7024-t7319-b7319.tar.gz: Jenkins is about to shut down Waiting to resume part of lnt-ctmark-aarch64-O3-flto clang-d344131-g9c4afce7024-t7319-b7319.tar.gz: Jenkins is about to shut down Waiting to resume part of lnt-ctmark-aarch64-O3-flto clang-d344131-g9c4afce7024-t7319-b7319.tar.gz: Jenkins is about to shut down Waiting to resume part of lnt-ctmark-aarch64-O3-flto clang-d344131-g9c4afce7024-t7319-b7319.tar.gz: Jenkins is about to shut down Waiting to resume part of lnt-ctmark-aarch64-O3-flto clang-d344131-g9c4afce7024-t7319-b7319.tar.gz: Jenkins is about to shut down Waiting to resume part of lnt-ctmark-aarch64-O3-flto clang-d344131-g9c4afce7024-t7319-b7319.tar.gz: Jenkins is about to shut down Waiting to resume part of lnt-ctmark-aarch64-O3-flto clang-d344131-g9c4afce7024-t7319-b7319.tar.gz: Jenkins is about to shut down Waiting to resume part of lnt-ctmark-aarch64-O3-flto clang-d344131-g9c4afce7024-t7319-b7319.tar.gz: Jenkins is about to shut down Waiting to resume part of lnt-ctmark-aarch64-O3-flto clang-d344131-g9c4afce7024-t7319-b7319.tar.gz: Jenkins is about to shut down Waiting to resume part of lnt-ctmark-aarch64-O3-flto clang-d344131-g9c4afce7024-t7319-b7319.tar.gz: Jenkins is about to shut down Waiting to resume part of lnt-ctmark-aarch64-O3-flto clang-d344131-g9c4afce7024-t7319-b7319.tar.gz: Jenkins is about to shut down Waiting to resume part of lnt-ctmark-aarch64-O3-flto clang-d344131-g9c4afce7024-t7319-b7319.tar.gz: Jenkins is about to shut down Waiting to resume part of lnt-ctmark-aarch64-O3-flto clang-d344131-g9c4afce7024-t7319-b7319.tar.gz: Jenkins is about to shut down Waiting to resume part of lnt-ctmark-aarch64-O3-flto clang-d344131-g9c4afce7024-t7319-b7319.tar.gz: Waiting for next available executor on ‘green-dragon-04’ Waiting to resume part of lnt-ctmark-aarch64-O3-flto clang-d344131-g9c4afce7024-t7319-b7319.tar.gz: Waiting for next available executor on ‘green-dragon-04’ Waiting to resume part of lnt-ctmark-aarch64-O3-flto clang-d344131-g9c4afce7024-t7319-b7319.tar.gz: Waiting for next available executor on ‘green-dragon-04’ Waiting to resume part of lnt-ctmark-aarch64-O3-flto clang-d344131-g9c4afce7024-t7319-b7319.tar.gz: Waiting for next available executor on ‘green-dragon-04’ Waiting to resume part of lnt-ctmark-aarch64-O3-flto clang-d344131-g9c4afce7024-t7319-b7319.tar.gz: Waiting for next available executor on ‘green-dragon-04’ Waiting to resume part of lnt-ctmark-aarch64-O3-flto clang-d344131-g9c4afce7024-t7319-b7319.tar.gz: Waiting for next available executor on ‘green-dragon-04’ Waiting to resume part of lnt-ctmark-aarch64-O3-flto clang-d344131-g9c4afce7024-t7319-b7319.tar.gz: Waiting for next available executor on ‘green-dragon-04’ Waiting to resume part of lnt-ctmark-aarch64-O3-flto clang-d344131-g9c4afce7024-t7319-b7319.tar.gz: Waiting for next available executor on ‘green-dragon-04’ Waiting to resume part of lnt-ctmark-aarch64-O3-flto clang-d344131-g9c4afce7024-t7319-b7319.tar.gz: Waiting for next available executor on ‘green-dragon-04’ Waiting to resume part of lnt-ctmark-aarch64-O3-flto clang-d344131-g9c4afce7024-t7319-b7319.tar.gz: Waiting for next available executor on ‘green-dragon-04’ Waiting to resume part of lnt-ctmark-aarch64-O3-flto clang-d344131-g9c4afce7024-t7319-b7319.tar.gz: Waiting for next available executor on ‘green-dragon-04’ Aborted by Chris Matthews [Pipeline] // node [Pipeline] End of Pipeline java.util.concurrent.CancellationException: Task was cancelled. at com.google.common.util.concurrent.AbstractFuture$Sync.getValue(AbstractFuture.java:295) at com.google.common.util.concurrent.AbstractFuture$Sync.get(AbstractFuture.java:276) at com.google.common.util.concurrent.AbstractFuture.get(AbstractFuture.java:111) at org.jenkinsci.plugins.workflow.support.concurrent.ChainingListenableFuture.get(ChainingListenableFuture.java:82) at com.google.common.util.concurrent.Uninterruptibles.getUninterruptibly(Uninterruptibles.java:132) at org.jenkinsci.plugins.workflow.support.concurrent.Futures$1.run(Futures.java:149) at com.google.common.util.concurrent.MoreExecutors$SameThreadExecutorService.execute(MoreExecutors.java:253) at com.google.common.util.concurrent.ExecutionList$RunnableExecutorPair.execute(ExecutionList.java:149) at com.google.common.util.concurrent.ExecutionList.execute(ExecutionList.java:134) at com.google.common.util.concurrent.AbstractFuture.cancel(AbstractFuture.java:129) at org.jenkinsci.plugins.workflow.support.concurrent.ChainingListenableFuture.cancel(ChainingListenableFuture.java:140) at org.jenkinsci.plugins.workflow.support.concurrent.ChainingListenableFuture.run(ChainingListenableFuture.java:168) at com.google.common.util.concurrent.MoreExecutors$SameThreadExecutorService.execute(MoreExecutors.java:253) at com.google.common.util.concurrent.ExecutionList$RunnableExecutorPair.execute(ExecutionList.java:149) at com.google.common.util.concurrent.ExecutionList.execute(ExecutionList.java:134) at com.google.common.util.concurrent.AbstractFuture.cancel(AbstractFuture.java:129) at org.jenkinsci.plugins.workflow.support.concurrent.ChainingListenableFuture.cancel(ChainingListenableFuture.java:140) at org.jenkinsci.plugins.workflow.support.concurrent.ChainingListenableFuture.run(ChainingListenableFuture.java:168) at com.google.common.util.concurrent.MoreExecutors$SameThreadExecutorService.execute(MoreExecutors.java:253) at com.google.common.util.concurrent.ExecutionList$RunnableExecutorPair.execute(ExecutionList.java:149) at com.google.common.util.concurrent.ExecutionList.execute(ExecutionList.java:134) at com.google.common.util.concurrent.AbstractFuture.cancel(AbstractFuture.java:129) at org.jenkinsci.plugins.workflow.support.concurrent.ListFuture.setOneValue(ListFuture.java:137) at org.jenkinsci.plugins.workflow.support.concurrent.ListFuture.access$000(ListFuture.java:40) at org.jenkinsci.plugins.workflow.support.concurrent.ListFuture$2.run(ListFuture.java:107) at com.google.common.util.concurrent.MoreExecutors$SameThreadExecutorService.execute(MoreExecutors.java:253) at com.google.common.util.concurrent.ExecutionList$RunnableExecutorPair.execute(ExecutionList.java:149) at com.google.common.util.concurrent.ExecutionList.execute(ExecutionList.java:134) at com.google.common.util.concurrent.AbstractFuture.cancel(AbstractFuture.java:129) at org.jenkinsci.plugins.workflow.support.concurrent.ChainingListenableFuture.cancel(ChainingListenableFuture.java:140) at org.jenkinsci.plugins.workflow.support.concurrent.ChainingListenableFuture.run(ChainingListenableFuture.java:168) at com.google.common.util.concurrent.MoreExecutors$SameThreadExecutorService.execute(MoreExecutors.java:253) at com.google.common.util.concurrent.ExecutionList$RunnableExecutorPair.execute(ExecutionList.java:149) at com.google.common.util.concurrent.ExecutionList.execute(ExecutionList.java:134) at com.google.common.util.concurrent.AbstractFuture.cancel(AbstractFuture.java:129) at org.jenkinsci.plugins.workflow.support.pickles.TryRepeatedly.cancel(TryRepeatedly.java:127) at org.jenkinsci.plugins.workflow.support.pickles.ExecutorPickle$1.cancel(ExecutorPickle.java:184) at org.jenkinsci.plugins.workflow.cps.CpsFlowExecution.interrupt(CpsFlowExecution.java:1171) at org.jenkinsci.plugins.workflow.job.WorkflowRun$2.lambda$interrupt$0(WorkflowRun.java:367) at jenkins.security.ImpersonatingScheduledExecutorService$1.run(ImpersonatingScheduledExecutorService.java:58) at java.util.concurrent.Executors$RunnableAdapter.call(Executors.java:511) at java.util.concurrent.FutureTask.run(FutureTask.java:266) at java.util.concurrent.ScheduledThreadPoolExecutor$ScheduledFutureTask.access$201(ScheduledThreadPoolExecutor.java:180) at java.util.concurrent.ScheduledThreadPoolExecutor$ScheduledFutureTask.run(ScheduledThreadPoolExecutor.java:293) Caused: java.io.IOException: Failed to load build state at org.jenkinsci.plugins.workflow.cps.CpsFlowExecution$3.onSuccess(CpsFlowExecution.java:855) at org.jenkinsci.plugins.workflow.cps.CpsFlowExecution$3.onSuccess(CpsFlowExecution.java:853) at org.jenkinsci.plugins.workflow.cps.CpsFlowExecution$4$1.run(CpsFlowExecution.java:907) at org.jenkinsci.plugins.workflow.cps.CpsVmExecutorService$1.run(CpsVmExecutorService.java:38) at java.util.concurrent.Executors$RunnableAdapter.call(Executors.java:511) at java.util.concurrent.FutureTask.run(FutureTask.java:266) at hudson.remoting.SingleLaneExecutorService$1.run(SingleLaneExecutorService.java:131) at jenkins.util.ContextResettingExecutorService$1.run(ContextResettingExecutorService.java:28) at jenkins.security.ImpersonatingExecutorService$1.run(ImpersonatingExecutorService.java:59) at java.util.concurrent.Executors$RunnableAdapter.call(Executors.java:511) at java.util.concurrent.FutureTask.run(FutureTask.java:266) at java.util.concurrent.ThreadPoolExecutor.runWorker(ThreadPoolExecutor.java:1149) at java.util.concurrent.ThreadPoolExecutor$Worker.run(ThreadPoolExecutor.java:624) at java.lang.Thread.run(Thread.java:748) Finished: ABORTED