Started 12 days ago
Took 2 hr 42 min

Failed Build clang-d365409-gf4835b94f2c-t14313-b14313.tar.gz (Sep 7, 2020 1:52:21 AM)

Issues

Found 3 issues:
Ninja target: AArch64_halide_runtime.bc.o
[3466/11531] /Users/buildslave/jenkins/workspace/test-suite-verify-machineinstrs-aarch64-O0-g/test-suite-build/tools/timeit --summary Bitcode/simd_ops/CMakeFiles/simd_ops_test_op_cmeq_398.dir/AArch64_scalar_tests/scalar_test_op_cmeq_398.bc.o.time /Users/buildslave/jenkins/workspace/test-suite-verify-machineinstrs-aarch64-O0-g/compiler/bin/clang++  -DNDEBUG  -B /Applications/Xcode.app/Contents/Developer/Toolchains/XcodeDefault.xctoolchain/usr/bin    -Wno-unused-command-line-argument -mllvm -verify-machineinstrs -O0 -g -arch arm64 -isysroot /Applications/Xcode.app/Contents/Developer/Platforms/iPhoneOS.platform/Developer/SDKs/iPhoneOS13.5.sdk   -w -Werror=date-time -MD -MT Bitcode/simd_ops/CMakeFiles/simd_ops_test_op_cmeq_398.dir/AArch64_scalar_tests/scalar_test_op_cmeq_398.bc.o -MF Bitcode/simd_ops/CMakeFiles/simd_ops_test_op_cmeq_398.dir/AArch64_scalar_tests/scalar_test_op_cmeq_398.bc.o.d -o Bitcode/simd_ops/CMakeFiles/simd_ops_test_op_cmeq_398.dir/AArch64_scalar_tests/scalar_test_op_cmeq_398.bc.o -c /Users/buildslave/jenkins/workspace/test-suite-verify-machineinstrs-aarch64-O0-g/test-suite/Bitcode/simd_ops/AArch64_scalar_tests/scalar_test_op_cmeq_398.bc
[3467/11531] /Users/buildslave/jenkins/workspace/test-suite-verify-machineinstrs-aarch64-O0-g/test-suite-build/tools/timeit --summary Bitcode/simd_ops/CMakeFiles/simd_ops_test_op_saba_662.dir/AArch64_tests/test_op_saba_662.bc.o.time /Users/buildslave/jenkins/workspace/test-suite-verify-machineinstrs-aarch64-O0-g/compiler/bin/clang++  -DNDEBUG  -B /Applications/Xcode.app/Contents/Developer/Toolchains/XcodeDefault.xctoolchain/usr/bin    -Wno-unused-command-line-argument -mllvm -verify-machineinstrs -O0 -g -arch arm64 -isysroot /Applications/Xcode.app/Contents/Developer/Platforms/iPhoneOS.platform/Developer/SDKs/iPhoneOS13.5.sdk   -w -Werror=date-time -MD -MT Bitcode/simd_ops/CMakeFiles/simd_ops_test_op_saba_662.dir/AArch64_tests/test_op_saba_662.bc.o -MF Bitcode/simd_ops/CMakeFiles/simd_ops_test_op_saba_662.dir/AArch64_tests/test_op_saba_662.bc.o.d -o Bitcode/simd_ops/CMakeFiles/simd_ops_test_op_saba_662.dir/AArch64_tests/test_op_saba_662.bc.o -c /Users/buildslave/jenkins/workspace/test-suite-verify-machineinstrs-aarch64-O0-g/test-suite/Bitcode/simd_ops/AArch64_tests/test_op_saba_662.bc
[3468/11531] /Users/buildslave/jenkins/workspace/test-suite-verify-machineinstrs-aarch64-O0-g/test-suite-build/tools/timeit --summary Bitcode/simd_ops/CMakeFiles/simd_ops_test_op_shrn_1274.dir/AArch64_halide_runtime.bc.o.time /Users/buildslave/jenkins/workspace/test-suite-verify-machineinstrs-aarch64-O0-g/compiler/bin/clang++  -DNDEBUG  -B /Applications/Xcode.app/Contents/Developer/Toolchains/XcodeDefault.xctoolchain/usr/bin    -Wno-unused-command-line-argument -mllvm -verify-machineinstrs -O0 -g -arch arm64 -isysroot /Applications/Xcode.app/Contents/Developer/Platforms/iPhoneOS.platform/Developer/SDKs/iPhoneOS13.5.sdk   -w -Werror=date-time -MD -MT Bitcode/simd_ops/CMakeFiles/simd_ops_test_op_shrn_1274.dir/AArch64_halide_runtime.bc.o -MF Bitcode/simd_ops/CMakeFiles/simd_ops_test_op_shrn_1274.dir/AArch64_halide_runtime.bc.o.d -o Bitcode/simd_ops/CMakeFiles/simd_ops_test_op_shrn_1274.dir/AArch64_halide_runtime.bc.o -c /Users/buildslave/jenkins/workspace/test-suite-verify-machineinstrs-aarch64-O0-g/test-suite/Bitcode/simd_ops/AArch64_halide_runtime.bc
[3469/11531] /Users/buildslave/jenkins/workspace/test-suite-verify-machineinstrs-aarch64-O0-g/test-suite-build/tools/timeit --summary Bitcode/simd_ops/CMakeFiles/simd_ops_test_op_saba_662.dir/AArch64_scalar_tests/scalar_test_op_saba_662.bc.o.time /Users/buildslave/jenkins/workspace/test-suite-verify-machineinstrs-aarch64-O0-g/compiler/bin/clang++  -DNDEBUG  -B /Applications/Xcode.app/Contents/Developer/Toolchains/XcodeDefault.xctoolchain/usr/bin    -Wno-unused-command-line-argument -mllvm -verify-machineinstrs -O0 -g -arch arm64 -isysroot /Applications/Xcode.app/Contents/Developer/Platforms/iPhoneOS.platform/Developer/SDKs/iPhoneOS13.5.sdk   -w -Werror=date-time -MD -MT Bitcode/simd_ops/CMakeFiles/simd_ops_test_op_saba_662.dir/AArch64_scalar_tests/scalar_test_op_saba_662.bc.o -MF Bitcode/simd_ops/CMakeFiles/simd_ops_test_op_saba_662.dir/AArch64_scalar_tests/scalar_test_op_saba_662.bc.o.d -o Bitcode/simd_ops/CMakeFiles/simd_ops_test_op_saba_662.dir/AArch64_scalar_tests/scalar_test_op_saba_662.bc.o -c /Users/buildslave/jenkins/workspace/test-suite-verify-machineinstrs-aarch64-O0-g/test-suite/Bitcode/simd_ops/AArch64_scalar_tests/scalar_test_op_saba_662.bc
[3470/11531] /Users/buildslave/jenkins/workspace/test-suite-verify-machineinstrs-aarch64-O0-g/test-suite-build/tools/timeit --summary Bitcode/simd_ops/CMakeFiles/simd_ops_test_op_ldr_1098.dir/AArch64_halide_runtime.bc.o.time /Users/buildslave/jenkins/workspace/test-suite-verify-machineinstrs-aarch64-O0-g/compiler/bin/clang++  -DNDEBUG  -B /Applications/Xcode.app/Contents/Developer/Toolchains/XcodeDefault.xctoolchain/usr/bin    -Wno-unused-command-line-argument -mllvm -verify-machineinstrs -O0 -g -arch arm64 -isysroot /Applications/Xcode.app/Contents/Developer/Platforms/iPhoneOS.platform/Developer/SDKs/iPhoneOS13.5.sdk   -w -Werror=date-time -MD -MT Bitcode/simd_ops/CMakeFiles/simd_ops_test_op_ldr_1098.dir/AArch64_halide_runtime.bc.o -MF Bitcode/simd_ops/CMakeFiles/simd_ops_test_op_ldr_1098.dir/AArch64_halide_runtime.bc.o.d -o Bitcode/simd_ops/CMakeFiles/simd_ops_test_op_ldr_1098.dir/AArch64_halide_runtime.bc.o -c /Users/buildslave/jenkins/workspace/test-suite-verify-machineinstrs-aarch64-O0-g/test-suite/Bitcode/simd_ops/AArch64_halide_runtime.bc
FAILED: Bitcode/simd_ops/CMakeFiles/simd_ops_test_op_ldr_1098.dir/AArch64_halide_runtime.bc.o 
/Users/buildslave/jenkins/workspace/test-suite-verify-machineinstrs-aarch64-O0-g/test-suite-build/tools/timeit --summary Bitcode/simd_ops/CMakeFiles/simd_ops_test_op_ldr_1098.dir/AArch64_halide_runtime.bc.o.time /Users/buildslave/jenkins/workspace/test-suite-verify-machineinstrs-aarch64-O0-g/compiler/bin/clang++  -DNDEBUG  -B /Applications/Xcode.app/Contents/Developer/Toolchains/XcodeDefault.xctoolchain/usr/bin    -Wno-unused-command-line-argument -mllvm -verify-machineinstrs -O0 -g -arch arm64 -isysroot /Applications/Xcode.app/Contents/Developer/Platforms/iPhoneOS.platform/Developer/SDKs/iPhoneOS13.5.sdk   -w -Werror=date-time -MD -MT Bitcode/simd_ops/CMakeFiles/simd_ops_test_op_ldr_1098.dir/AArch64_halide_runtime.bc.o -MF Bitcode/simd_ops/CMakeFiles/simd_ops_test_op_ldr_1098.dir/AArch64_halide_runtime.bc.o.d -o Bitcode/simd_ops/CMakeFiles/simd_ops_test_op_ldr_1098.dir/AArch64_halide_runtime.bc.o -c /Users/buildslave/jenkins/workspace/test-suite-verify-machineinstrs-aarch64-O0-g/test-suite/Bitcode/simd_ops/AArch64_halide_runtime.bc
Assertion failed: (RegBank && "Register bank not set"), function verify, file /Users/buildslave/jenkins/workspace/clang-stage1-RA/llvm-project/llvm/lib/CodeGen/GlobalISel/RegisterBankInfo.cpp, line 520.
assertion: RegBank && "Register bank not set"
[3468/11531] /Users/buildslave/jenkins/workspace/test-suite-verify-machineinstrs-aarch64-O0-g/test-suite-build/tools/timeit --summary Bitcode/simd_ops/CMakeFiles/simd_ops_test_op_shrn_1274.dir/AArch64_halide_runtime.bc.o.time /Users/buildslave/jenkins/workspace/test-suite-verify-machineinstrs-aarch64-O0-g/compiler/bin/clang++  -DNDEBUG  -B /Applications/Xcode.app/Contents/Developer/Toolchains/XcodeDefault.xctoolchain/usr/bin    -Wno-unused-command-line-argument -mllvm -verify-machineinstrs -O0 -g -arch arm64 -isysroot /Applications/Xcode.app/Contents/Developer/Platforms/iPhoneOS.platform/Developer/SDKs/iPhoneOS13.5.sdk   -w -Werror=date-time -MD -MT Bitcode/simd_ops/CMakeFiles/simd_ops_test_op_shrn_1274.dir/AArch64_halide_runtime.bc.o -MF Bitcode/simd_ops/CMakeFiles/simd_ops_test_op_shrn_1274.dir/AArch64_halide_runtime.bc.o.d -o Bitcode/simd_ops/CMakeFiles/simd_ops_test_op_shrn_1274.dir/AArch64_halide_runtime.bc.o -c /Users/buildslave/jenkins/workspace/test-suite-verify-machineinstrs-aarch64-O0-g/test-suite/Bitcode/simd_ops/AArch64_halide_runtime.bc
[3469/11531] /Users/buildslave/jenkins/workspace/test-suite-verify-machineinstrs-aarch64-O0-g/test-suite-build/tools/timeit --summary Bitcode/simd_ops/CMakeFiles/simd_ops_test_op_saba_662.dir/AArch64_scalar_tests/scalar_test_op_saba_662.bc.o.time /Users/buildslave/jenkins/workspace/test-suite-verify-machineinstrs-aarch64-O0-g/compiler/bin/clang++  -DNDEBUG  -B /Applications/Xcode.app/Contents/Developer/Toolchains/XcodeDefault.xctoolchain/usr/bin    -Wno-unused-command-line-argument -mllvm -verify-machineinstrs -O0 -g -arch arm64 -isysroot /Applications/Xcode.app/Contents/Developer/Platforms/iPhoneOS.platform/Developer/SDKs/iPhoneOS13.5.sdk   -w -Werror=date-time -MD -MT Bitcode/simd_ops/CMakeFiles/simd_ops_test_op_saba_662.dir/AArch64_scalar_tests/scalar_test_op_saba_662.bc.o -MF Bitcode/simd_ops/CMakeFiles/simd_ops_test_op_saba_662.dir/AArch64_scalar_tests/scalar_test_op_saba_662.bc.o.d -o Bitcode/simd_ops/CMakeFiles/simd_ops_test_op_saba_662.dir/AArch64_scalar_tests/scalar_test_op_saba_662.bc.o -c /Users/buildslave/jenkins/workspace/test-suite-verify-machineinstrs-aarch64-O0-g/test-suite/Bitcode/simd_ops/AArch64_scalar_tests/scalar_test_op_saba_662.bc
[3470/11531] /Users/buildslave/jenkins/workspace/test-suite-verify-machineinstrs-aarch64-O0-g/test-suite-build/tools/timeit --summary Bitcode/simd_ops/CMakeFiles/simd_ops_test_op_ldr_1098.dir/AArch64_halide_runtime.bc.o.time /Users/buildslave/jenkins/workspace/test-suite-verify-machineinstrs-aarch64-O0-g/compiler/bin/clang++  -DNDEBUG  -B /Applications/Xcode.app/Contents/Developer/Toolchains/XcodeDefault.xctoolchain/usr/bin    -Wno-unused-command-line-argument -mllvm -verify-machineinstrs -O0 -g -arch arm64 -isysroot /Applications/Xcode.app/Contents/Developer/Platforms/iPhoneOS.platform/Developer/SDKs/iPhoneOS13.5.sdk   -w -Werror=date-time -MD -MT Bitcode/simd_ops/CMakeFiles/simd_ops_test_op_ldr_1098.dir/AArch64_halide_runtime.bc.o -MF Bitcode/simd_ops/CMakeFiles/simd_ops_test_op_ldr_1098.dir/AArch64_halide_runtime.bc.o.d -o Bitcode/simd_ops/CMakeFiles/simd_ops_test_op_ldr_1098.dir/AArch64_halide_runtime.bc.o -c /Users/buildslave/jenkins/workspace/test-suite-verify-machineinstrs-aarch64-O0-g/test-suite/Bitcode/simd_ops/AArch64_halide_runtime.bc
FAILED: Bitcode/simd_ops/CMakeFiles/simd_ops_test_op_ldr_1098.dir/AArch64_halide_runtime.bc.o 
/Users/buildslave/jenkins/workspace/test-suite-verify-machineinstrs-aarch64-O0-g/test-suite-build/tools/timeit --summary Bitcode/simd_ops/CMakeFiles/simd_ops_test_op_ldr_1098.dir/AArch64_halide_runtime.bc.o.time /Users/buildslave/jenkins/workspace/test-suite-verify-machineinstrs-aarch64-O0-g/compiler/bin/clang++  -DNDEBUG  -B /Applications/Xcode.app/Contents/Developer/Toolchains/XcodeDefault.xctoolchain/usr/bin    -Wno-unused-command-line-argument -mllvm -verify-machineinstrs -O0 -g -arch arm64 -isysroot /Applications/Xcode.app/Contents/Developer/Platforms/iPhoneOS.platform/Developer/SDKs/iPhoneOS13.5.sdk   -w -Werror=date-time -MD -MT Bitcode/simd_ops/CMakeFiles/simd_ops_test_op_ldr_1098.dir/AArch64_halide_runtime.bc.o -MF Bitcode/simd_ops/CMakeFiles/simd_ops_test_op_ldr_1098.dir/AArch64_halide_runtime.bc.o.d -o Bitcode/simd_ops/CMakeFiles/simd_ops_test_op_ldr_1098.dir/AArch64_halide_runtime.bc.o -c /Users/buildslave/jenkins/workspace/test-suite-verify-machineinstrs-aarch64-O0-g/test-suite/Bitcode/simd_ops/AArch64_halide_runtime.bc
Assertion failed: (RegBank && "Register bank not set"), function verify, file /Users/buildslave/jenkins/workspace/clang-stage1-RA/llvm-project/llvm/lib/CodeGen/GlobalISel/RegisterBankInfo.cpp, line 520.
PLEASE submit a bug report to https://bugs.llvm.org/ and include the crash backtrace, preprocessed source, and associated run script.
Stack dump:
Error: clang frontend command failed due to signal (use -v to see invocation)
30 clang++                  0x0000000110e9acfd clang::driver::Compilation::ExecuteJobs(clang::driver::JobList const&, llvm::SmallVectorImpl<std::__1::pair<int, clang::driver::Command const*> >&) const + 125
31 clang++                  0x0000000110eaf3ac clang::driver::Driver::ExecuteCompilation(clang::driver::Compilation&, llvm::SmallVectorImpl<std::__1::pair<int, clang::driver::Command const*> >&) + 204
32 clang++                  0x000000010e994bc5 main + 10389
33 libdyld.dylib            0x00007fff6eb25cc9 start + 1
34 libdyld.dylib            0x0000000000000018 start + 18446603338658980688
clang-12: error: clang frontend command failed due to signal (use -v to see invocation)
clang version 12.0.0 (https://github.com/llvm/llvm-project.git f4835b94f2cfc89e430263d1807b118e0e937f4d)
Target: aarch64-apple-darwin19.5.0

Build Log

Changes
  1. Removed redundant code. (details / githubweb)
Changes
  1. Extend PyConcreteType to support intermediate base classes. (details)
  2. [Sparc] Select the UltraSPARC instruction set with the external assembler (details)
  3. [scan-view] Explicitly use utf-8 in send_string (details)
  4. [CMake][TableGen] Simplify code by using list(TRANSFORM) (details)
  5. [CMake][Polly] Remove dead CMake code (details)
  6. [CMake][OpenMP] Remove old dead CMake code (details)
  7. [CMake][TableGen] Remove dead CMake version checks (details)

Started by upstream project relay-test-suite-verify-machineinstrs build number 8891
originally caused by:

This run spent:

  • 2 hr 18 min waiting;
  • 2 hr 42 min build duration;
  • 2 hr 42 min total from scheduled to completion.
Revision: 45ff0650596cd570c2de0e04e7884fd541344471
  • refs/remotes/origin/master
Revision: f4835b94f2cfc89e430263d1807b118e0e937f4d
  • detached
Revision: 61eaf8a9eccf4edbef18f55593d1095254ed3ff5
  • refs/remotes/origin/master
Revision: 9771b578de06f96603e20ee6e0f76ee1f0b59d2f
  • refs/remotes/origin/master

Identified problems

Assertion failure

This build failed because of an assertion failure. Below is a list of all errors in the build log:
Indication 1

Ninja target failed

Below is a link to the first failed ninja target.
Indication 2

Compile Error

This build failed because of a compile error. Below is a list of all errors in the build log:
Indication 3