FailedConsole Output

Skipping 14,678 KB.. Full Log
PASS: LLVM-Unit :: Support/./SupportTests/AllocationTests/MappedMemoryTest.EnabledWrite/1 (41451 of 43032)
PASS: LLVM-Unit :: Support/./SupportTests/AllocationTests/MappedMemoryTest.EnabledWrite/3 (41452 of 43032)
PASS: LLVM-Unit :: Support/./SupportTests/AllocationTests/MappedMemoryTest.EnabledWrite/4 (41453 of 43032)
PASS: LLVM-Unit :: Support/./SupportTests/AllocationTests/MappedMemoryTest.MultipleAllocAndRelease/0 (41454 of 43032)
PASS: LLVM-Unit :: Support/./SupportTests/AllocationTests/MappedMemoryTest.MultipleAllocAndRelease/1 (41455 of 43032)
PASS: LLVM-Unit :: Support/./SupportTests/AllocationTests/MappedMemoryTest.EnabledWrite/5 (41456 of 43032)
PASS: LLVM-Unit :: Support/./SupportTests/AllocationTests/MappedMemoryTest.MultipleAllocAndRelease/2 (41457 of 43032)
PASS: LLVM-Unit :: Support/./SupportTests/AllocationTests/MappedMemoryTest.MultipleAllocAndRelease/3 (41458 of 43032)
PASS: LLVM-Unit :: Support/./SupportTests/AllocationTests/MappedMemoryTest.MultipleAllocAndRelease/5 (41459 of 43032)
PASS: LLVM-Unit :: Support/./SupportTests/AllocationTests/MappedMemoryTest.MultipleAllocAndRelease/4 (41460 of 43032)
PASS: LLVM-Unit :: Support/./SupportTests/AllocationTests/MappedMemoryTest.MultipleWrite/0 (41461 of 43032)
PASS: LLVM-Unit :: Support/./SupportTests/AllocationTests/MappedMemoryTest.MultipleWrite/1 (41462 of 43032)
PASS: LLVM-Unit :: Support/./SupportTests/AllocationTests/MappedMemoryTest.MultipleWrite/3 (41463 of 43032)
PASS: LLVM-Unit :: Support/./SupportTests/AllocationTests/MappedMemoryTest.MultipleWrite/4 (41464 of 43032)
PASS: LLVM-Unit :: Support/./SupportTests/AllocationTests/MappedMemoryTest.MultipleWrite/2 (41465 of 43032)
PASS: LLVM-Unit :: Support/./SupportTests/AllocationTests/MappedMemoryTest.MultipleWrite/5 (41466 of 43032)
PASS: LLVM-Unit :: Support/./SupportTests/AllocationTests/MappedMemoryTest.SuccessiveNear/0 (41467 of 43032)
PASS: LLVM-Unit :: Support/./SupportTests/AllocationTests/MappedMemoryTest.SuccessiveNear/2 (41468 of 43032)
PASS: LLVM-Unit :: Support/./SupportTests/AllocationTests/MappedMemoryTest.SuccessiveNear/1 (41469 of 43032)
PASS: LLVM-Unit :: Support/./SupportTests/AllocationTests/MappedMemoryTest.SuccessiveNear/3 (41470 of 43032)
PASS: LLVM-Unit :: Support/./SupportTests/AllocationTests/MappedMemoryTest.SuccessiveNear/4 (41471 of 43032)
PASS: LLVM-Unit :: Support/./SupportTests/AllocationTests/MappedMemoryTest.SuccessiveNear/5 (41472 of 43032)
PASS: LLVM-Unit :: Support/./SupportTests/AllocationTests/MappedMemoryTest.UnalignedNear/0 (41473 of 43032)
PASS: LLVM-Unit :: Support/./SupportTests/AllocationTests/MappedMemoryTest.UnalignedNear/1 (41474 of 43032)
PASS: LLVM-Unit :: Support/./SupportTests/AllocationTests/MappedMemoryTest.UnalignedNear/2 (41475 of 43032)
PASS: LLVM-Unit :: Support/./SupportTests/AllocationTests/MappedMemoryTest.UnalignedNear/4 (41476 of 43032)
PASS: LLVM-Unit :: Support/./SupportTests/AllocationTests/MappedMemoryTest.UnalignedNear/3 (41477 of 43032)
PASS: LLVM-Unit :: Support/./SupportTests/AllocationTests/MappedMemoryTest.UnalignedNear/5 (41478 of 43032)
PASS: LLVM-Unit :: Support/./SupportTests/AllocationTests/MappedMemoryTest.ZeroNear/0 (41479 of 43032)
PASS: LLVM-Unit :: Support/./SupportTests/AllocationTests/MappedMemoryTest.ZeroNear/1 (41480 of 43032)
PASS: LLVM-Unit :: Support/./SupportTests/AllocationTests/MappedMemoryTest.ZeroNear/2 (41481 of 43032)
PASS: LLVM-Unit :: Support/./SupportTests/AllocationTests/MappedMemoryTest.ZeroNear/3 (41482 of 43032)
PASS: LLVM-Unit :: Support/./SupportTests/AllocationTests/MappedMemoryTest.ZeroNear/4 (41483 of 43032)
PASS: LLVM-Unit :: Support/./SupportTests/AllocationTests/MappedMemoryTest.ZeroSizeNear/0 (41484 of 43032)
PASS: LLVM-Unit :: Support/./SupportTests/AllocationTests/MappedMemoryTest.ZeroNear/5 (41485 of 43032)
PASS: LLVM-Unit :: Support/./SupportTests/AllocationTests/MappedMemoryTest.ZeroSizeNear/1 (41486 of 43032)
PASS: LLVM-Unit :: Support/./SupportTests/AllocationTests/MappedMemoryTest.ZeroSizeNear/3 (41487 of 43032)
PASS: LLVM-Unit :: Support/./SupportTests/AllocationTests/MappedMemoryTest.ZeroSizeNear/2 (41488 of 43032)
PASS: LLVM-Unit :: Support/./SupportTests/AllocationTests/MappedMemoryTest.ZeroSizeNear/4 (41489 of 43032)
PASS: LLVM-Unit :: Support/./SupportTests/AllocationTests/MappedMemoryTest.ZeroSizeNear/5 (41490 of 43032)
PASS: LLVM-Unit :: Support/./SupportTests/AllocatorTest.Basics (41491 of 43032)
PASS: LLVM-Unit :: Support/./SupportTests/AllocatorTest.TestAlignment (41492 of 43032)
PASS: LLVM-Unit :: Support/./SupportTests/AllocatorTest.TestBigAlignment (41493 of 43032)
PASS: LLVM-Unit :: Support/./SupportTests/AllocatorTest.TestAlignmentPastSlab (41494 of 43032)
PASS: LLVM-Unit :: Support/./SupportTests/AllocatorTest.TestFasterSlabGrowthDelay (41495 of 43032)
PASS: LLVM-Unit :: Support/./SupportTests/AllocatorTest.TestReset (41496 of 43032)
PASS: LLVM-Unit :: Support/./SupportTests/AllocatorTest.TestOverflow (41497 of 43032)
PASS: LLVM-Unit :: Support/./SupportTests/AllocatorTest.TestSlowerSlabGrowthDelay (41498 of 43032)
PASS: LLVM-Unit :: Support/./SupportTests/AllocatorTest.TestSmallSlabSize (41499 of 43032)
PASS: LLVM-Unit :: Support/./SupportTests/AllocatorTest.ThreeSlabs (41500 of 43032)
PASS: LLVM-Unit :: Support/./SupportTests/AnnotationsTest.Errors (41501 of 43032)
PASS: LLVM-Unit :: Support/./SupportTests/AnnotationsTest.CleanedCode (41502 of 43032)
PASS: LLVM-Unit :: Support/./SupportTests/AnnotationsTest.Named (41503 of 43032)
PASS: LLVM-Unit :: Support/./SupportTests/AnnotationsTest.Nested (41504 of 43032)
PASS: LLVM-Unit :: Support/./SupportTests/AnnotationsTest.Points (41505 of 43032)
PASS: LLVM-Unit :: Support/./SupportTests/AnnotationsTest.Ranges (41506 of 43032)
PASS: LLVM-Unit :: Support/./SupportTests/ArrayRecyclerTest.Basics (41507 of 43032)
PASS: LLVM-Unit :: Support/./SupportTests/AttributeHeaderParser.InvalidAttributeSize (41508 of 43032)
PASS: LLVM-Unit :: Support/./SupportTests/AttributeHeaderParser.InvalidSectionLength (41509 of 43032)
PASS: LLVM-Unit :: Support/./SupportTests/ArrayRecyclerTest.Capacity (41510 of 43032)
PASS: LLVM-Unit :: Support/./SupportTests/AttributeHeaderParser.UnrecognizedFormatVersion (41511 of 43032)
PASS: LLVM-Unit :: Support/./SupportTests/AttributeHeaderParser.UnrecognizedTag (41512 of 43032)
PASS: LLVM-Unit :: Support/./SupportTests/Base64Test.Base64 (41513 of 43032)
PASS: LLVM-Unit :: Support/./SupportTests/AttributeHeaderParser.UnrecognizedVendorName (41514 of 43032)
PASS: LLVM-Unit :: Support/./SupportTests/BinaryStreamTest.AppendingStream (41515 of 43032)
PASS: LLVM-Unit :: Support/./SupportTests/BinaryStreamTest.BinaryByteStreamBounds (41516 of 43032)
PASS: LLVM-Unit :: Support/./SupportTests/BinaryStreamTest.DropOperations (41517 of 43032)
PASS: LLVM-Unit :: Support/./SupportTests/BinaryStreamTest.BinaryItemStream (41518 of 43032)
PASS: LLVM-Unit :: Support/./SupportTests/BinaryStreamTest.FixedStreamArray (41519 of 43032)
PASS: LLVM-Unit :: Support/./SupportTests/BinaryStreamTest.FixedStreamArrayIteratorArrow (41520 of 43032)
PASS: LLVM-Unit :: Support/./SupportTests/BinaryStreamTest.StreamReaderBounds (41521 of 43032)
PASS: LLVM-Unit :: Support/./SupportTests/BinaryStreamTest.MutableBinaryByteStreamBounds (41522 of 43032)
PASS: LLVM-Unit :: Support/./SupportTests/BinaryStreamTest.StreamReaderEnum (41523 of 43032)
PASS: LLVM-Unit :: Support/./SupportTests/BinaryStreamTest.StreamReaderIntegerArray (41524 of 43032)
PASS: LLVM-Unit :: Support/./SupportTests/BinaryStreamTest.StreamReaderIntegers (41525 of 43032)
PASS: LLVM-Unit :: Support/./SupportTests/BinaryStreamTest.StreamReaderObject (41526 of 43032)
PASS: LLVM-Unit :: Support/./SupportTests/BinaryStreamTest.StreamReaderSLEB128 (41527 of 43032)
PASS: LLVM-Unit :: Support/./SupportTests/BinaryStreamTest.StreamRefBounds (41528 of 43032)
PASS: LLVM-Unit :: Support/./SupportTests/BinaryStreamTest.StreamReaderStrings (41529 of 43032)
PASS: LLVM-Unit :: Support/./SupportTests/BinaryStreamTest.StreamReaderULEB128 (41530 of 43032)
PASS: LLVM-Unit :: Support/./SupportTests/BinaryStreamTest.StreamRefDynamicSize (41531 of 43032)
PASS: LLVM-Unit :: Support/./SupportTests/BinaryStreamTest.StreamWriterAppend (41532 of 43032)
PASS: LLVM-Unit :: Support/./SupportTests/BinaryStreamTest.StreamWriterBounds (41533 of 43032)
PASS: LLVM-Unit :: Support/./SupportTests/BinaryStreamTest.StreamWriterIntegerArrays (41534 of 43032)
PASS: LLVM-Unit :: Support/./SupportTests/BinaryStreamTest.StringWriterStrings (41535 of 43032)
PASS: LLVM-Unit :: Support/./SupportTests/BinaryStreamTest.VarStreamArray (41536 of 43032)
PASS: LLVM-Unit :: Support/./SupportTests/BlockFrequency.Divide (41537 of 43032)
PASS: LLVM-Unit :: Support/./SupportTests/BlockFrequencyTest.BigToBig (41538 of 43032)
PASS: LLVM-Unit :: Support/./SupportTests/BlockFrequencyTest.MaxToHalfMax (41539 of 43032)
PASS: LLVM-Unit :: Support/./SupportTests/BlockFrequencyTest.MaxToMax (41540 of 43032)
PASS: LLVM-Unit :: Support/./SupportTests/BlockFrequencyTest.OneToZero (41541 of 43032)
PASS: LLVM-Unit :: Support/./SupportTests/BlockFrequencyTest.OneToOne (41542 of 43032)
PASS: LLVM-Unit :: Support/./SupportTests/BlockFrequencyTest.Saturate (41543 of 43032)
PASS: LLVM-Unit :: Support/./SupportTests/BlockFrequencyTest.SaturatingRightShift (41544 of 43032)
PASS: LLVM-Unit :: Support/./SupportTests/BlockFrequencyTest.Subtract (41545 of 43032)
PASS: LLVM-Unit :: Support/./SupportTests/BlockFrequencyTest.ThreeToOne (41546 of 43032)
PASS: LLVM-Unit :: Support/./SupportTests/BranchProbabilityTest.Accessors (41547 of 43032)
PASS: LLVM-Unit :: Support/./SupportTests/BranchProbabilityTest.ArithmeticOperators (41548 of 43032)
PASS: LLVM-Unit :: Support/./SupportTests/BranchProbabilityTest.MoreOperators (41549 of 43032)
PASS: LLVM-Unit :: Support/./SupportTests/BranchProbabilityTest.NormalizeProbabilities (41550 of 43032)
PASS: LLVM-Unit :: Support/./SupportTests/BranchProbabilityTest.Operators (41551 of 43032)
PASS: LLVM-Unit :: Support/./SupportTests/BranchProbabilityTest.getCompl (41552 of 43032)
PASS: LLVM-Unit :: Support/./SupportTests/BranchProbabilityTest.scale (41553 of 43032)
PASS: LLVM-Unit :: Support/./SupportTests/BranchProbabilityTest.scaleBruteForce (41554 of 43032)
PASS: LLVM-Unit :: Support/./SupportTests/BranchProbabilityTest.scaleByInverse (41555 of 43032)
PASS: LLVM-Unit :: Support/./SupportTests/ByteSwap.Swap_32 (41556 of 43032)
PASS: LLVM-Unit :: Support/./SupportTests/ByteSwap.Swap_64 (41557 of 43032)
PASS: LLVM-Unit :: Support/./SupportTests/CPUAlignBuildAttr.testBuildAttr (41558 of 43032)
PASS: LLVM-Unit :: Support/./SupportTests/CPUArchBuildAttr.testBuildAttr (41559 of 43032)
PASS: LLVM-Unit :: Support/./SupportTests/CPUArchProfileBuildAttr.testBuildAttr (41560 of 43032)
PASS: LLVM-Unit :: Support/./SupportTests/CRCTest.CRC32 (41561 of 43032)
PASS: LLVM-Unit :: Support/./SupportTests/CachePruningPolicyParser.Errors (41562 of 43032)
PASS: LLVM-Unit :: Support/./SupportTests/CachePruningPolicyParser.Expiration (41563 of 43032)
PASS: LLVM-Unit :: Support/./SupportTests/CachePruningPolicyParser.Empty (41564 of 43032)
PASS: LLVM-Unit :: Support/./SupportTests/CachePruningPolicyParser.Interval (41565 of 43032)
PASS: LLVM-Unit :: Support/./SupportTests/CachePruningPolicyParser.MaxSizeBytes (41566 of 43032)
PASS: LLVM-Unit :: Support/./SupportTests/CachePruningPolicyParser.MaxSizePercentageOfAvailableSpace (41567 of 43032)
PASS: LLVM-Unit :: Support/./SupportTests/CachePruningPolicyParser.Multiple (41568 of 43032)
PASS: LLVM-Unit :: Support/./SupportTests/CastingTest.InferredUpcastTakesPrecedence (41569 of 43032)
PASS: LLVM-Unit :: Support/./SupportTests/CastingTest.cast (41570 of 43032)
PASS: LLVM-Unit :: Support/./SupportTests/CastingTest.UpcastIsInferred (41571 of 43032)
PASS: LLVM-Unit :: Support/./SupportTests/CastingTest.cast_or_null (41572 of 43032)
PASS: LLVM-Unit :: Support/./SupportTests/CastingTest.dyn_cast (41573 of 43032)
PASS: LLVM-Unit :: Support/./SupportTests/CastingTest.isa (41574 of 43032)
PASS: LLVM-Unit :: Support/./SupportTests/CastingTest.dyn_cast_or_null (41575 of 43032)
PASS: LLVM-Unit :: Support/./SupportTests/CastingTest.isa_and_nonnull (41576 of 43032)
PASS: LLVM-Unit :: Support/./SupportTests/CastingTest.smart_cast (41577 of 43032)
PASS: LLVM-Unit :: Support/./SupportTests/CastingTest.smart_cast_or_null (41578 of 43032)
PASS: LLVM-Unit :: Support/./SupportTests/CastingTest.smart_dyn_cast (41579 of 43032)
PASS: LLVM-Unit :: Support/./SupportTests/CastingTest.smart_dyn_cast_or_null (41580 of 43032)
PASS: LLVM-Unit :: Support/./SupportTests/CastingTest.smart_isa (41581 of 43032)
PASS: LLVM-Unit :: Support/./SupportTests/CheckedArithmetic.CheckedAdd (41582 of 43032)
PASS: LLVM-Unit :: Support/./SupportTests/CastingTest.unique_dyn_cast (41583 of 43032)
PASS: LLVM-Unit :: Support/./SupportTests/CheckedArithmetic.CheckedAddSmall (41584 of 43032)
PASS: LLVM-Unit :: Support/./SupportTests/CheckedArithmetic.CheckedAddUnsigned (41585 of 43032)
PASS: LLVM-Unit :: Support/./SupportTests/CheckedArithmetic.CheckedMul (41586 of 43032)
PASS: LLVM-Unit :: Support/./SupportTests/CheckedArithmetic.CheckedMulAdd (41587 of 43032)
PASS: LLVM-Unit :: Support/./SupportTests/CheckedArithmetic.CheckedMulAddSmall (41588 of 43032)
PASS: LLVM-Unit :: Support/./SupportTests/CheckedArithmetic.CheckedMulAddUnsigned (41589 of 43032)
PASS: LLVM-Unit :: Support/./SupportTests/CheckedArithmetic.CheckedMulUnsigned (41590 of 43032)
PASS: LLVM-Unit :: Support/./SupportTests/CheckedArithmetic.CheckedMulSmall (41591 of 43032)
PASS: LLVM-Unit :: Support/./SupportTests/Chrono.DurationFormat (41592 of 43032)
PASS: LLVM-Unit :: Support/./SupportTests/Chrono.ImplicitConversions (41593 of 43032)
PASS: LLVM-Unit :: Support/./SupportTests/Chrono.TimePointFormat (41594 of 43032)
PASS: LLVM-Unit :: Support/./SupportTests/Chrono.TimeTConversion (41595 of 43032)
PASS: LLVM-Unit :: Support/./SupportTests/CommandLineTest.AliasRequired (41596 of 43032)
PASS: LLVM-Unit :: Support/./SupportTests/CommandLineTest.AddToAllSubCommands (41597 of 43032)
PASS: LLVM-Unit :: Support/./SupportTests/CommandLineTest.AliasesWithArguments (41598 of 43032)
PASS: LLVM-Unit :: Support/./SupportTests/CommandLineTest.ArgumentLimit (41599 of 43032)
PASS: LLVM-Unit :: Support/./SupportTests/CommandLineTest.Callback (41600 of 43032)
PASS: LLVM-Unit :: Support/./SupportTests/CommandLineTest.ConsumeAfterOnePositional (41601 of 43032)
PASS: LLVM-Unit :: Support/./SupportTests/CommandLineTest.ConsumeAfterTwoPositionals (41602 of 43032)
PASS: LLVM-Unit :: Support/./SupportTests/CommandLineTest.DefaultOptions (41603 of 43032)
PASS: LLVM-Unit :: Support/./SupportTests/CommandLineTest.GetRegisteredSubcommands (41604 of 43032)
PASS: LLVM-Unit :: Support/./SupportTests/CommandLineTest.GroupingAndPrefix (41605 of 43032)
PASS: LLVM-Unit :: Support/./SupportTests/CommandLineTest.HideUnrelatedOptions (41606 of 43032)
PASS: LLVM-Unit :: Support/./SupportTests/CommandLineTest.GroupingWithValue (41607 of 43032)
PASS: LLVM-Unit :: Support/./SupportTests/CommandLineTest.HideUnrelatedOptionsMulti (41608 of 43032)
PASS: LLVM-Unit :: Support/./SupportTests/CommandLineTest.LongOptions (41609 of 43032)
PASS: LLVM-Unit :: Support/./SupportTests/CommandLineTest.LookupFailsInWrongSubCommand (41610 of 43032)
PASS: LLVM-Unit :: Support/./SupportTests/CommandLineTest.OptionErrorMessageSuggest (41611 of 43032)
PASS: LLVM-Unit :: Support/./SupportTests/CommandLineTest.OptionErrorMessageSuggestNoHidden (41612 of 43032)
PASS: LLVM-Unit :: Support/./SupportTests/CommandLineTest.ModifyExisitingOption (41613 of 43032)
PASS: LLVM-Unit :: Support/./SupportTests/CommandLineTest.OptionErrorMessage (41614 of 43032)
PASS: LLVM-Unit :: Support/./SupportTests/CommandLineTest.PositionalEatArgsError (41615 of 43032)
PASS: LLVM-Unit :: Support/./SupportTests/CommandLineTest.PrefixOptions (41616 of 43032)
PASS: LLVM-Unit :: Support/./SupportTests/CommandLineTest.ReadConfigFile (41617 of 43032)
PASS: LLVM-Unit :: Support/./SupportTests/CommandLineTest.RecursiveResponseFiles (41618 of 43032)
PASS: LLVM-Unit :: Support/./SupportTests/CommandLineTest.RemoveFromAllSubCommands (41619 of 43032)
PASS: LLVM-Unit :: Support/./SupportTests/CommandLineTest.RemoveFromRegularSubCommand (41620 of 43032)
PASS: LLVM-Unit :: Support/./SupportTests/CommandLineTest.RemoveFromTopLevelSubCommand (41621 of 43032)
PASS: LLVM-Unit :: Support/./SupportTests/CommandLineTest.ReparseCommandLineOptions (41622 of 43032)
PASS: LLVM-Unit :: Support/./SupportTests/CommandLineTest.ResponseFileRelativePath (41623 of 43032)
PASS: LLVM-Unit :: Support/./SupportTests/CommandLineTest.ResponseFileEOLs (41624 of 43032)
PASS: LLVM-Unit :: Support/./SupportTests/CommandLineTest.ResponseFileWindows (41625 of 43032)
PASS: LLVM-Unit :: Support/./SupportTests/CommandLineTest.ResponseFiles (41626 of 43032)
PASS: LLVM-Unit :: Support/./SupportTests/CommandLineTest.ResponseFilesAtArguments (41627 of 43032)
PASS: LLVM-Unit :: Support/./SupportTests/CommandLineTest.SetDefautValue (41628 of 43032)
PASS: LLVM-Unit :: Support/./SupportTests/CommandLineTest.SetValueInSubcategories (41629 of 43032)
PASS: LLVM-Unit :: Support/./SupportTests/CommandLineTest.TokenizeAndMarkEOLs (41630 of 43032)
PASS: LLVM-Unit :: Support/./SupportTests/CommandLineTest.TokenizeConfigFile1 (41631 of 43032)
PASS: LLVM-Unit :: Support/./SupportTests/CommandLineTest.TokenizeConfigFile11 (41632 of 43032)
PASS: LLVM-Unit :: Support/./SupportTests/CommandLineTest.TokenizeConfigFile10 (41633 of 43032)
PASS: LLVM-Unit :: Support/./SupportTests/CommandLineTest.TokenizeConfigFile2 (41634 of 43032)
PASS: LLVM-Unit :: Support/./SupportTests/CommandLineTest.TokenizeConfigFile3 (41635 of 43032)
PASS: LLVM-Unit :: Support/./SupportTests/CommandLineTest.TokenizeConfigFile4 (41636 of 43032)
PASS: LLVM-Unit :: Support/./SupportTests/CommandLineTest.TokenizeConfigFile6 (41637 of 43032)
PASS: LLVM-Unit :: Support/./SupportTests/CommandLineTest.TokenizeConfigFile7 (41638 of 43032)
PASS: LLVM-Unit :: Support/./SupportTests/CommandLineTest.TokenizeConfigFile8 (41639 of 43032)
PASS: LLVM-Unit :: Support/./SupportTests/CommandLineTest.TokenizeConfigFile5 (41640 of 43032)
PASS: LLVM-Unit :: Support/./SupportTests/CommandLineTest.TokenizeConfigFile9 (41641 of 43032)
PASS: LLVM-Unit :: Support/./SupportTests/CommandLineTest.TokenizeGNUCommandLine (41642 of 43032)
PASS: LLVM-Unit :: Support/./SupportTests/CommandLineTest.TokenizeWindowsCommandLine1 (41643 of 43032)
PASS: LLVM-Unit :: Support/./SupportTests/CommandLineTest.TokenizeWindowsCommandLine2 (41644 of 43032)
PASS: LLVM-Unit :: Support/./SupportTests/CommandLineTest.TokenizeWindowsCommandLineQuotedLastArgument (41645 of 43032)
PASS: LLVM-Unit :: Support/./SupportTests/CommandLineTest.UseMultipleCategories (41646 of 43032)
PASS: LLVM-Unit :: Support/./SupportTests/CompressionTest.Zlib (41647 of 43032)
PASS: LLVM-Unit :: Support/./SupportTests/ConvertUTFTest.ConvertUTF16BigEndianToUTF8String (41648 of 43032)
PASS: LLVM-Unit :: Support/./SupportTests/CommandLineTest.UseOptionCategory (41649 of 43032)
PASS: LLVM-Unit :: Support/./SupportTests/ConvertUTFTest.ConvertUTF16LittleEndianToUTF8String (41650 of 43032)
PASS: LLVM-Unit :: Support/./SupportTests/CompressionTest.ZlibCRC32 (41651 of 43032)
PASS: LLVM-Unit :: Support/./SupportTests/ConvertUTFTest.ConvertUTF8ToUTF16String (41652 of 43032)
PASS: LLVM-Unit :: Support/./SupportTests/ConvertUTFTest.Empty (41653 of 43032)
PASS: LLVM-Unit :: Support/./SupportTests/ConvertUTFTest.ConvertUTF8toWide (41654 of 43032)
PASS: LLVM-Unit :: Support/./SupportTests/ConvertUTFTest.HasUTF16BOM (41655 of 43032)
PASS: LLVM-Unit :: Support/./SupportTests/ConvertUTFTest.OddLengthInput (41656 of 43032)
PASS: LLVM-Unit :: Support/./SupportTests/ConvertUTFTest.UTF16WrappersForConvertUTF16ToUTF8String (41657 of 43032)
PASS: LLVM-Unit :: Support/./SupportTests/ConvertUTFTest.UTF8ToUTF32Lenient (41658 of 43032)
PASS: LLVM-Unit :: Support/./SupportTests/ConvertUTFTest.UTF8ToUTF32PartialLenient (41659 of 43032)
PASS: LLVM-Unit :: Support/./SupportTests/ConvertUTFTest.convertWideToUTF8 (41660 of 43032)
PASS: LLVM-Unit :: Support/./SupportTests/CostTest.DefaultCtor (41661 of 43032)
PASS: LLVM-Unit :: Support/./SupportTests/CostTest.Operators (41662 of 43032)
PASS: LLVM-Unit :: Support/./SupportTests/CrashRecoveryTest.Cleanup (41663 of 43032)
PASS: LLVM-Unit :: Support/./SupportTests/CrashRecoveryTest.Basic (41664 of 43032)
PASS: LLVM-Unit :: Support/./SupportTests/CrashRecoveryTest.LimitedStackTrace (41665 of 43032)
PASS: LLVM-Unit :: Support/./SupportTests/CrashRecoveryTest.DumpStackCleanup (41666 of 43032)
PASS: LLVM-Unit :: Support/./SupportTests/DJBTest.caseFolding (41667 of 43032)
PASS: LLVM-Unit :: Support/./SupportTests/CrashRecoveryTest.UnixCRCReturnCode (41668 of 43032)
PASS: LLVM-Unit :: Support/./SupportTests/DJBTest.knownValuesLowerCase (41669 of 43032)
PASS: LLVM-Unit :: Support/./SupportTests/DJBTest.knownValuesUnicode (41670 of 43032)
PASS: LLVM-Unit :: Support/./SupportTests/DataExtractorTest.Cursor_chaining (41671 of 43032)
PASS: LLVM-Unit :: Support/./SupportTests/DataExtractorTest.Cursor_takeError (41672 of 43032)
PASS: LLVM-Unit :: Support/./SupportTests/DataExtractorTest.Cursor_tell (41673 of 43032)
PASS: LLVM-Unit :: Support/./SupportTests/DataExtractorTest.FixedLengthString (41674 of 43032)
PASS: LLVM-Unit :: Support/./SupportTests/DataExtractorTest.GetBytes (41675 of 43032)
PASS: LLVM-Unit :: Support/./SupportTests/DataExtractorTest.LEB128 (41676 of 43032)
PASS: LLVM-Unit :: Support/./SupportTests/DataExtractorTest.LEB128_error (41677 of 43032)
PASS: LLVM-Unit :: Support/./SupportTests/DataExtractorTest.OffsetOverflow (41678 of 43032)
PASS: LLVM-Unit :: Support/./SupportTests/DataExtractorTest.SignedNumbers (41679 of 43032)
PASS: LLVM-Unit :: Support/./SupportTests/DataExtractorTest.Strings (41680 of 43032)
PASS: LLVM-Unit :: Support/./SupportTests/DataExtractorTest.UnsignedNumbers (41681 of 43032)
PASS: LLVM-Unit :: Support/./SupportTests/DataExtractorTest.eof (41682 of 43032)
PASS: LLVM-Unit :: Support/./SupportTests/DataExtractorTest.getU24 (41683 of 43032)
PASS: LLVM-Unit :: Support/./SupportTests/DataExtractorTest.getU8_vector (41684 of 43032)
PASS: LLVM-Unit :: Support/./SupportTests/DataExtractorTest.size (41685 of 43032)
PASS: LLVM-Unit :: Support/./SupportTests/DataExtractorTest.skip (41686 of 43032)
PASS: LLVM-Unit :: Support/./SupportTests/DivBuildAttr.testBuildAttr (41687 of 43032)
PASS: LLVM-Unit :: Support/./SupportTests/Endian.PackedEndianSpecificIntegral (41688 of 43032)
PASS: LLVM-Unit :: Support/./SupportTests/Endian.PacketEndianSpecificIntegralAsEnum (41689 of 43032)
PASS: LLVM-Unit :: Support/./SupportTests/Endian.Read (41690 of 43032)
PASS: LLVM-Unit :: Support/./SupportTests/Endian.Write (41691 of 43032)
PASS: LLVM-Unit :: Support/./SupportTests/Endian.ReadBitAligned (41692 of 43032)
PASS: LLVM-Unit :: Support/./SupportTests/Endian.WriteBitAligned (41693 of 43032)
PASS: LLVM-Unit :: Support/./SupportTests/EndianStream.WriteArrayLE (41694 of 43032)
PASS: LLVM-Unit :: Support/./SupportTests/EndianStream.WriteDoubleBE (41695 of 43032)
PASS: LLVM-Unit :: Support/./SupportTests/EndianStream.WriteFloatArrayLE (41696 of 43032)
PASS: LLVM-Unit :: Support/./SupportTests/EndianStream.WriteDoubleLE (41697 of 43032)
PASS: LLVM-Unit :: Support/./SupportTests/EndianStream.WriteFloatBE (41698 of 43032)
PASS: LLVM-Unit :: Support/./SupportTests/EndianStream.WriteFloatLE (41699 of 43032)
PASS: LLVM-Unit :: Support/./SupportTests/EndianStream.WriteInt32BE (41700 of 43032)
PASS: LLVM-Unit :: Support/./SupportTests/EndianStream.WriteInt32LE (41701 of 43032)
PASS: LLVM-Unit :: Support/./SupportTests/EndianStream.WriteInt64BE (41702 of 43032)
PASS: LLVM-Unit :: Support/./SupportTests/EndianStream.WriteInt64LE (41703 of 43032)
PASS: LLVM-Unit :: Support/./SupportTests/EndianStream.WriteVectorLE (41704 of 43032)
PASS: LLVM-Unit :: Support/./SupportTests/EnumSizeBuildAttr.testBuildAttr (41705 of 43032)
PASS: LLVM-Unit :: Support/./SupportTests/ErrnoTest.RetryAfterSignal (41706 of 43032)
PASS: LLVM-Unit :: Support/./SupportTests/Error.C_API (41707 of 43032)
PASS: LLVM-Unit :: Support/./SupportTests/Error.CantFailSuccess (41708 of 43032)
PASS: LLVM-Unit :: Support/./SupportTests/Error.CatchErrorFromHandler (41709 of 43032)
PASS: LLVM-Unit :: Support/./SupportTests/Error.CheckJoinErrors (41710 of 43032)
PASS: LLVM-Unit :: Support/./SupportTests/Error.CheckedExpectedInSuccessMode (41711 of 43032)
PASS: LLVM-Unit :: Support/./SupportTests/Error.CheckedSuccess (41712 of 43032)
PASS: LLVM-Unit :: Support/./SupportTests/Error.ConsumeError (41713 of 43032)
PASS: LLVM-Unit :: Support/./SupportTests/Error.ErrorAsOutParameterChecked (41714 of 43032)
PASS: LLVM-Unit :: Support/./SupportTests/Error.ConsumeSuccess (41715 of 43032)
PASS: LLVM-Unit :: Support/./SupportTests/Error.ErrorCodeConversions (41716 of 43032)
PASS: LLVM-Unit :: Support/./SupportTests/Error.ErrorMessage (41717 of 43032)
PASS: LLVM-Unit :: Support/./SupportTests/Error.ExpectedCovariance (41718 of 43032)
PASS: LLVM-Unit :: Support/./SupportTests/Error.ExpectedInFailureMode (41719 of 43032)
PASS: LLVM-Unit :: Support/./SupportTests/Error.ExpectedWithReferenceType (41720 of 43032)
PASS: LLVM-Unit :: Support/./SupportTests/Error.FailedMatcher (41721 of 43032)
PASS: LLVM-Unit :: Support/./SupportTests/Error.FileErrorTest (41722 of 43032)
PASS: LLVM-Unit :: Support/./SupportTests/Error.FirstHandlerOnly (41723 of 43032)
PASS: LLVM-Unit :: Support/./SupportTests/Error.FailedWithMessageMatcher (41724 of 43032)
PASS: LLVM-Unit :: Support/./SupportTests/Error.HandleCustomError (41725 of 43032)
PASS: LLVM-Unit :: Support/./SupportTests/Error.HandleCustomErrorWithCustomBaseClass (41726 of 43032)
PASS: LLVM-Unit :: Support/./SupportTests/Error.HandleExpectedHandledError (41727 of 43032)
PASS: LLVM-Unit :: Support/./SupportTests/Error.HandleExpectedSuccess (41728 of 43032)
PASS: LLVM-Unit :: Support/./SupportTests/Error.ExitOnError (41729 of 43032)
PASS: LLVM-Unit :: Support/./SupportTests/Error.HandleExpectedUnhandledError (41730 of 43032)
PASS: LLVM-Unit :: Support/./SupportTests/Error.HandlerShadowing (41731 of 43032)
PASS: LLVM-Unit :: Support/./SupportTests/Error.HandlerTypeDeduction (41732 of 43032)
PASS: LLVM-Unit :: Support/./SupportTests/Error.HasValueMatcher (41733 of 43032)
PASS: LLVM-Unit :: Support/./SupportTests/Error.IsAHandling (41734 of 43032)
PASS: LLVM-Unit :: Support/./SupportTests/Error.Stream (41735 of 43032)
PASS: LLVM-Unit :: Support/./SupportTests/Error.StringError (41736 of 43032)
PASS: LLVM-Unit :: Support/./SupportTests/Error.SucceededMatcher (41737 of 43032)
PASS: LLVM-Unit :: Support/./SupportTests/Error.SubtypeStringErrorTest (41738 of 43032)
PASS: LLVM-Unit :: Support/./SupportTests/Error.createStringError (41739 of 43032)
PASS: LLVM-Unit :: Support/./SupportTests/ErrorOr.Comparison (41740 of 43032)
PASS: LLVM-Unit :: Support/./SupportTests/ErrorOr.Covariant (41741 of 43032)
PASS: LLVM-Unit :: Support/./SupportTests/ErrorOr.ImplicitConversionCausesMove (41742 of 43032)
PASS: LLVM-Unit :: Support/./SupportTests/ErrorOr.ImplicitConversion (41743 of 43032)
PASS: LLVM-Unit :: Support/./SupportTests/ErrorOr.ImplicitConversionNoAmbiguity (41744 of 43032)
PASS: LLVM-Unit :: Support/./SupportTests/ErrorOr.Types (41745 of 43032)
PASS: LLVM-Unit :: Support/./SupportTests/ErrorOr.SimpleValue (41746 of 43032)
PASS: LLVM-Unit :: Support/./SupportTests/ExtensibleRTTI.cast (41747 of 43032)
PASS: LLVM-Unit :: Support/./SupportTests/ExtensibleRTTI.dyn_cast (41748 of 43032)
PASS: LLVM-Unit :: Support/./SupportTests/ExtensibleRTTI.isa (41749 of 43032)
PASS: LLVM-Unit :: Support/./SupportTests/FP16BuildAttr.testBuildAttr (41750 of 43032)
PASS: LLVM-Unit :: Support/./SupportTests/FPArchBuildAttr.testBuildAttr (41751 of 43032)
PASS: LLVM-Unit :: Support/./SupportTests/FPDenormalBuildAttr.testBuildAttr (41752 of 43032)
PASS: LLVM-Unit :: Support/./SupportTests/FPExceptionsBuildAttr.testBuildAttr (41753 of 43032)
PASS: LLVM-Unit :: Support/./SupportTests/FPHPBuildAttr.testBuildAttr (41754 of 43032)
PASS: LLVM-Unit :: Support/./SupportTests/FPNumberModelBuildAttr.testBuildAttr (41755 of 43032)
PASS: LLVM-Unit :: Support/./SupportTests/FPRoundingBuildAttr.testBuildAttr (41756 of 43032)
PASS: LLVM-Unit :: Support/./SupportTests/FPUserExceptionsBuildAttr.testBuildAttr (41757 of 43032)
PASS: LLVM-Unit :: Support/./SupportTests/FSUniqueIDTest.construct (41758 of 43032)
PASS: LLVM-Unit :: Support/./SupportTests/FSUniqueIDTest.equals (41759 of 43032)
PASS: LLVM-Unit :: Support/./SupportTests/FSUniqueIDTest.less (41760 of 43032)
PASS: LLVM-Unit :: Support/./SupportTests/FileCollectorTest.Symlinks (41761 of 43032)
PASS: LLVM-Unit :: Support/./SupportTests/FileCollectorTest.addDirectory (41762 of 43032)
PASS: LLVM-Unit :: Support/./SupportTests/FileCollectorTest.addFile (41763 of 43032)
PASS: LLVM-Unit :: Support/./SupportTests/FileCollectorTest.copyFiles (41764 of 43032)
PASS: LLVM-Unit :: Support/./SupportTests/FileCollectorTest.recordAndConstructDirectory (41765 of 43032)
PASS: LLVM-Unit :: Support/./SupportTests/FileCollectorTest.recordVFSAccesses (41766 of 43032)
PASS: LLVM-Unit :: Support/./SupportTests/FileCollectorTest.recordVFSSymlinkAccesses (41767 of 43032)
PASS: LLVM-Unit :: Support/./SupportTests/FileOutputBuffer.Test (41768 of 43032)
PASS: LLVM-Unit :: Support/./SupportTests/FileSystemTest.AppendSetsCorrectFileOffset (41769 of 43032)
PASS: LLVM-Unit :: Support/./SupportTests/FileSystemTest.CreateDir (41770 of 43032)
PASS: LLVM-Unit :: Support/./SupportTests/FileSystemTest.CreateAlways (41771 of 43032)
PASS: LLVM-Unit :: Support/./SupportTests/FileSystemTest.BrokenSymlinkDirectoryIteration (41772 of 43032)
PASS: LLVM-Unit :: Support/./SupportTests/FileSystemTest.CreateNew (41773 of 43032)
PASS: LLVM-Unit :: Support/./SupportTests/FileSystemTest.DirectoryIteration (41774 of 43032)
PASS: LLVM-Unit :: Support/./SupportTests/FileSystemTest.DirectoryNotExecutable (41775 of 43032)
PASS: LLVM-Unit :: Support/./SupportTests/FileSystemTest.FileMapping (41776 of 43032)
PASS: LLVM-Unit :: Support/./SupportTests/FileSystemTest.ExpandTilde (41777 of 43032)
PASS: LLVM-Unit :: Support/./SupportTests/FileSystemTest.MD5 (41778 of 43032)
PASS: LLVM-Unit :: Support/./SupportTests/FileSystemTest.OpenAlways (41779 of 43032)
PASS: LLVM-Unit :: Support/./SupportTests/FileSystemTest.OpenExisting (41780 of 43032)
PASS: LLVM-Unit :: Support/./SupportTests/FileSystemTest.ReadOnlyFileCantWrite (41781 of 43032)
PASS: LLVM-Unit :: Support/./SupportTests/FileSystemTest.ReadWriteFileCanReadOrWrite (41782 of 43032)
PASS: LLVM-Unit :: Support/./SupportTests/FileSystemTest.OpenFileForRead (41783 of 43032)
PASS: LLVM-Unit :: Support/./SupportTests/FileSystemTest.RealPath (41784 of 43032)
PASS: LLVM-Unit :: Support/./SupportTests/FileSystemTest.RealPathNoReadPerm (41785 of 43032)
PASS: LLVM-Unit :: Support/./SupportTests/FileSystemTest.Remove (41786 of 43032)
PASS: LLVM-Unit :: Support/./SupportTests/FileSystemTest.Resize (41787 of 43032)
PASS: LLVM-Unit :: Support/./SupportTests/FileSystemTest.RespectUmask (41788 of 43032)
PASS: LLVM-Unit :: Support/./SupportTests/FileSystemTest.TempFileCollisions (41789 of 43032)
PASS: LLVM-Unit :: Support/./SupportTests/FileSystemTest.TempFileKeepDiscard (41790 of 43032)
PASS: LLVM-Unit :: Support/./SupportTests/FileSystemTest.TempFileDiscardDiscard (41791 of 43032)
PASS: LLVM-Unit :: Support/./SupportTests/FileSystemTest.Unique (41792 of 43032)
PASS: LLVM-Unit :: Support/./SupportTests/FileSystemTest.TempFiles (41793 of 43032)
PASS: LLVM-Unit :: Support/./SupportTests/FileSystemTest.WriteOnlyFileCantRead (41794 of 43032)
PASS: LLVM-Unit :: Support/./SupportTests/FileSystemTest.getUmask (41795 of 43032)
PASS: LLVM-Unit :: Support/./SupportTests/FileSystemTest.is_local (41796 of 43032)
PASS: LLVM-Unit :: Support/./SupportTests/FileSystemTest.permissions (41797 of 43032)
PASS: LLVM-Unit :: Support/./SupportTests/FileSystemTest.readNativeFileSlice (41798 of 43032)
PASS: LLVM-Unit :: Support/./SupportTests/FileSystemTest.readNativeFile (41799 of 43032)
PASS: LLVM-Unit :: Support/./SupportTests/FileSystemTest.set_current_path (41800 of 43032)
PASS: LLVM-Unit :: Support/./SupportTests/FormatVariadicTest.Adapter (41801 of 43032)
PASS: LLVM-Unit :: Support/./SupportTests/FormatVariadicTest.BigTest (41802 of 43032)
PASS: LLVM-Unit :: Support/./SupportTests/FormatVariadicTest.BoolTest (41803 of 43032)
PASS: LLVM-Unit :: Support/./SupportTests/FormatVariadicTest.CopiesAndMoves (41804 of 43032)
PASS: LLVM-Unit :: Support/./SupportTests/FormatVariadicTest.CharFormatting (41805 of 43032)
PASS: LLVM-Unit :: Support/./SupportTests/FormatVariadicTest.CustomPaddingCharacter (41806 of 43032)
PASS: LLVM-Unit :: Support/./SupportTests/FormatVariadicTest.DefaultReplacementValues (41807 of 43032)
PASS: LLVM-Unit :: Support/./SupportTests/FormatVariadicTest.DoubleFormatting (41808 of 43032)
PASS: LLVM-Unit :: Support/./SupportTests/FormatVariadicTest.EscapedBrace (41809 of 43032)
PASS: LLVM-Unit :: Support/./SupportTests/FormatVariadicTest.EmptyFormatString (41810 of 43032)
PASS: LLVM-Unit :: Support/./SupportTests/FormatVariadicTest.FormatAdapter (41811 of 43032)
PASS: LLVM-Unit :: Support/./SupportTests/FormatVariadicTest.FormatError (41812 of 43032)
PASS: LLVM-Unit :: Support/./SupportTests/FormatVariadicTest.FormatBasicTypesOneReplacement (41813 of 43032)
PASS: LLVM-Unit :: Support/./SupportTests/FormatVariadicTest.FormatFormatvObject (41814 of 43032)
PASS: LLVM-Unit :: Support/./SupportTests/FormatVariadicTest.FormatNoReplacements (41815 of 43032)
PASS: LLVM-Unit :: Support/./SupportTests/FormatVariadicTest.FormatStreamable (41816 of 43032)
PASS: LLVM-Unit :: Support/./SupportTests/FormatVariadicTest.IntegralHexFormatting (41817 of 43032)
PASS: LLVM-Unit :: Support/./SupportTests/FormatVariadicTest.ImplicitConversions (41818 of 43032)
PASS: LLVM-Unit :: Support/./SupportTests/FormatVariadicTest.IntegralNumberFormatting (41819 of 43032)
PASS: LLVM-Unit :: Support/./SupportTests/FormatVariadicTest.NoReplacements (41820 of 43032)
PASS: LLVM-Unit :: Support/./SupportTests/FormatVariadicTest.Range (41821 of 43032)
PASS: LLVM-Unit :: Support/./SupportTests/FormatVariadicTest.MoveConstructor (41822 of 43032)
PASS: LLVM-Unit :: Support/./SupportTests/FormatVariadicTest.MultipleReplacements (41823 of 43032)
PASS: LLVM-Unit :: Support/./SupportTests/FormatVariadicTest.PointerFormatting (41824 of 43032)
PASS: LLVM-Unit :: Support/./SupportTests/FormatVariadicTest.StringFormatting (41825 of 43032)
PASS: LLVM-Unit :: Support/./SupportTests/FormatVariadicTest.ValidReplacementSequence (41826 of 43032)
PASS: LLVM-Unit :: Support/./SupportTests/GetOptionWidthTest.GetOptionWidthArgNameLonger (41827 of 43032)
PASS: LLVM-Unit :: Support/./SupportTests/GetOptionWidthTest.GetOptionWidthEmptyOptionNameLonger (41828 of 43032)
PASS: LLVM-Unit :: Support/./SupportTests/GetOptionWidthTest.GetOptionWidthSecondOptionNameLonger (41829 of 43032)
PASS: LLVM-Unit :: Support/./SupportTests/GetOptionWidthTest.GetOptionWidthFirstOptionNameLonger (41830 of 43032)
PASS: LLVM-Unit :: Support/./SupportTests/GetOptionWidthTest.GetOptionWidthValueOptionalEmptyOptionWithNoDescription (41831 of 43032)
PASS: LLVM-Unit :: Support/./SupportTests/GetOptionWidthTest.GetOptionWidthValueRequiredEmptyOptionWithNoDescription (41832 of 43032)
PASS: LLVM-Unit :: Support/./SupportTests/GlobPatternTest.BasicCharacterClass (41833 of 43032)
PASS: LLVM-Unit :: Support/./SupportTests/GlobPatternTest.Empty (41834 of 43032)
PASS: LLVM-Unit :: Support/./SupportTests/GlobPatternTest.BracketFrontOfCharacterClass (41835 of 43032)
PASS: LLVM-Unit :: Support/./SupportTests/GlobPatternTest.Escape (41836 of 43032)
PASS: LLVM-Unit :: Support/./SupportTests/GlobPatternTest.ExtSym (41837 of 43032)
PASS: LLVM-Unit :: Support/./SupportTests/GlobPatternTest.Glob (41838 of 43032)
PASS: LLVM-Unit :: Support/./SupportTests/GlobPatternTest.Invalid (41839 of 43032)
PASS: LLVM-Unit :: Support/./SupportTests/GlobPatternTest.Wildcard (41840 of 43032)
PASS: LLVM-Unit :: Support/./SupportTests/GlobPatternTest.IsTrivialMatchAll (41841 of 43032)
PASS: LLVM-Unit :: Support/./SupportTests/GlobPatternTest.SpecialCharsInCharacterClass (41842 of 43032)
PASS: LLVM-Unit :: Support/./SupportTests/GlobPatternTest.NegatedCharacterClass (41843 of 43032)
PASS: LLVM-Unit :: Support/./SupportTests/HardFPBuildAttr.testBuildAttr (41844 of 43032)
PASS: LLVM-Unit :: Support/./SupportTests/HostTest.DummyRunAndGetCommandOutputUse (41845 of 43032)
PASS: LLVM-Unit :: Support/./SupportTests/HostTest.NumPhysicalCores (41846 of 43032)
PASS: LLVM-Unit :: Support/./SupportTests/HostTest.getMacOSHostVersion (41847 of 43032)
PASS: LLVM-Unit :: Support/./SupportTests/InMemoryFileSystemTest.AddDirectoryThenAddChild (41848 of 43032)
PASS: LLVM-Unit :: Support/./SupportTests/InMemoryFileSystemTest.AddFileInPlaceOfAHardLinkWithSameContent (41849 of 43032)
PASS: LLVM-Unit :: Support/./SupportTests/InMemoryFileSystemTest.AddFileWithGroup (41850 of 43032)
PASS: LLVM-Unit :: Support/./SupportTests/InMemoryFileSystemTest.AddFileWithFileType (41851 of 43032)
PASS: LLVM-Unit :: Support/./SupportTests/InMemoryFileSystemTest.AddFileInPlaceOfAHardLinkWithDifferentContent (41852 of 43032)
PASS: LLVM-Unit :: Support/./SupportTests/InMemoryFileSystemTest.AddFileWithPerms (41853 of 43032)
PASS: LLVM-Unit :: Support/./SupportTests/InMemoryFileSystemTest.AddHardLinkFromADirectory (41854 of 43032)
PASS: LLVM-Unit :: Support/./SupportTests/InMemoryFileSystemTest.AddFileWithUser (41855 of 43032)
PASS: LLVM-Unit :: Support/./SupportTests/InMemoryFileSystemTest.AddHardLinkFromAFileThatWasAddedBefore (41856 of 43032)
PASS: LLVM-Unit :: Support/./SupportTests/InMemoryFileSystemTest.AddHardLinkInChainPattern (41857 of 43032)
PASS: LLVM-Unit :: Support/./SupportTests/InMemoryFileSystemTest.AddHardLinkToADirectory (41858 of 43032)
PASS: LLVM-Unit :: Support/./SupportTests/InMemoryFileSystemTest.AddHardLinkToFile (41859 of 43032)
PASS: LLVM-Unit :: Support/./SupportTests/InMemoryFileSystemTest.AddHardLinkToAFileThatWasNotAddedBefore (41860 of 43032)
PASS: LLVM-Unit :: Support/./SupportTests/InMemoryFileSystemTest.AddHardLinkUnderAFile (41861 of 43032)
PASS: LLVM-Unit :: Support/./SupportTests/InMemoryFileSystemTest.AddSameHardLinkMoreThanOnce (41862 of 43032)
PASS: LLVM-Unit :: Support/./SupportTests/InMemoryFileSystemTest.DirectoryIteration (41863 of 43032)
PASS: LLVM-Unit :: Support/./SupportTests/InMemoryFileSystemTest.DuplicatedFile (41864 of 43032)
PASS: LLVM-Unit :: Support/./SupportTests/InMemoryFileSystemTest.GetRealPath (41865 of 43032)
PASS: LLVM-Unit :: Support/./SupportTests/InMemoryFileSystemTest.IsLocal (41866 of 43032)
PASS: LLVM-Unit :: Support/./SupportTests/InMemoryFileSystemTest.OpenFileForRead (41867 of 43032)
PASS: LLVM-Unit :: Support/./SupportTests/InMemoryFileSystemTest.IsEmpty (41868 of 43032)
PASS: LLVM-Unit :: Support/./SupportTests/InMemoryFileSystemTest.OverlayFile (41869 of 43032)
PASS: LLVM-Unit :: Support/./SupportTests/InMemoryFileSystemTest.OverlayFileNoOwn (41870 of 43032)
PASS: LLVM-Unit :: Support/./SupportTests/InMemoryFileSystemTest.RecursiveIterationWithHardLink (41871 of 43032)
PASS: LLVM-Unit :: Support/./SupportTests/InMemoryFileSystemTest.StatusName (41872 of 43032)
PASS: LLVM-Unit :: Support/./SupportTests/InMemoryFileSystemTest.WindowsPath (41873 of 43032)
PASS: LLVM-Unit :: Support/./SupportTests/InMemoryFileSystemTest.WorkingDirectory (41874 of 43032)
PASS: LLVM-Unit :: Support/./SupportTests/Initialize.MultipleThreads (41875 of 43032)
PASS: LLVM-Unit :: Support/./SupportTests/ItaniumManglingCanonicalizerTest.TestCanonicalize (41876 of 43032)
PASS: LLVM-Unit :: Support/./SupportTests/ItaniumManglingCanonicalizerTest.TestBadEquivalenceOrder (41877 of 43032)
PASS: LLVM-Unit :: Support/./SupportTests/ItaniumManglingCanonicalizerTest.TestInvalidManglings (41878 of 43032)
PASS: LLVM-Unit :: Support/./SupportTests/ItaniumManglingCanonicalizerTest.TestForwardTemplateReference (41879 of 43032)
PASS: LLVM-Unit :: Support/./SupportTests/ItaniumManglingCanonicalizerTest.TestLookup (41880 of 43032)
PASS: LLVM-Unit :: Support/./SupportTests/JSONTest.Array (41881 of 43032)
PASS: LLVM-Unit :: Support/./SupportTests/JSONTest.Constructors (41882 of 43032)
PASS: LLVM-Unit :: Support/./SupportTests/JSONTest.CanonicalOutput (41883 of 43032)
PASS: LLVM-Unit :: Support/./SupportTests/JSONTest.Deserialize (41884 of 43032)
PASS: LLVM-Unit :: Support/./SupportTests/JSONTest.Escaping (41885 of 43032)
PASS: LLVM-Unit :: Support/./SupportTests/JSONTest.Integers (41886 of 43032)
PASS: LLVM-Unit :: Support/./SupportTests/JSONTest.Inspection (41887 of 43032)
PASS: LLVM-Unit :: Support/./SupportTests/JSONTest.Object (41888 of 43032)
PASS: LLVM-Unit :: Support/./SupportTests/JSONTest.Parse (41889 of 43032)
PASS: LLVM-Unit :: Support/./SupportTests/JSONTest.ParseDeserialize (41890 of 43032)
PASS: LLVM-Unit :: Support/./SupportTests/JSONTest.ParseErrors (41891 of 43032)
PASS: LLVM-Unit :: Support/./SupportTests/JSONTest.Stream (41892 of 43032)
PASS: LLVM-Unit :: Support/./SupportTests/JSONTest.Path (41893 of 43032)
PASS: LLVM-Unit :: Support/./SupportTests/JSONTest.PrettyPrinting (41894 of 43032)
PASS: LLVM-Unit :: Support/./SupportTests/JSONTest.StringOwnership (41895 of 43032)
PASS: LLVM-Unit :: Support/./SupportTests/JSONTest.Types (41896 of 43032)
PASS: LLVM-Unit :: Support/./SupportTests/JSONTest.UTF8 (41897 of 43032)
PASS: LLVM-Unit :: Support/./SupportTests/KnownBitsTest.AddCarryExhaustive (41898 of 43032)
PASS: LLVM-Unit :: Support/./SupportTests/KnownBitsTest.GetMinMaxVal (41899 of 43032)
PASS: LLVM-Unit :: Support/./SupportTests/KnownBitsTest.SExtInReg (41900 of 43032)
PASS: LLVM-Unit :: Support/./SupportTests/KnownBitsTest.GetSignedMinMaxVal (41901 of 43032)
PASS: LLVM-Unit :: Support/./SupportTests/KnownBitsTest.AddSubExhaustive (41902 of 43032)
PASS: LLVM-Unit :: Support/./SupportTests/KnownBitsTest.ICmpExhaustive (41903 of 43032)
PASS: LLVM-Unit :: Support/./SupportTests/KnownBitsTest.SExtOrTrunc (41904 of 43032)
PASS: LLVM-Unit :: Support/./SupportTests/KnownBitsTest.BinaryExhaustive (41905 of 43032)
PASS: LLVM-Unit :: Support/./SupportTests/KnownBitsTest.UnaryExhaustive (41906 of 43032)
PASS: LLVM-Unit :: Support/./SupportTests/LEB128Test.DecodeInvalidSLEB128 (41907 of 43032)
PASS: LLVM-Unit :: Support/./SupportTests/LEB128Test.DecodeSLEB128 (41908 of 43032)
PASS: LLVM-Unit :: Support/./SupportTests/LEB128Test.EncodeSLEB128 (41909 of 43032)
PASS: LLVM-Unit :: Support/./SupportTests/LEB128Test.DecodeInvalidULEB128 (41910 of 43032)
PASS: LLVM-Unit :: Support/./SupportTests/LEB128Test.DecodeULEB128 (41911 of 43032)
PASS: LLVM-Unit :: Support/./SupportTests/LEB128Test.EncodeULEB128 (41912 of 43032)
PASS: LLVM-Unit :: Support/./SupportTests/LEB128Test.SLEB128Size (41913 of 43032)
PASS: LLVM-Unit :: Support/./SupportTests/LEB128Test.ULEB128Size (41914 of 43032)
PASS: LLVM-Unit :: Support/./SupportTests/LineIteratorTest.Basic (41915 of 43032)
PASS: LLVM-Unit :: Support/./SupportTests/LineIteratorTest.BlankKeeping (41916 of 43032)
PASS: LLVM-Unit :: Support/./SupportTests/LineIteratorTest.BlankSkipping (41917 of 43032)
PASS: LLVM-Unit :: Support/./SupportTests/LineIteratorTest.CommentAndBlankSkipping (41918 of 43032)
PASS: LLVM-Unit :: Support/./SupportTests/LineIteratorTest.EmptyBuffers (41919 of 43032)
PASS: LLVM-Unit :: Support/./SupportTests/LineIteratorTest.CommentSkippingKeepBlanks (41920 of 43032)
PASS: LLVM-Unit :: Support/./SupportTests/LineIteratorTest.Ref (41921 of 43032)
PASS: LLVM-Unit :: Support/./SupportTests/LinearPolyBase.Poly3D_Add (41922 of 43032)
PASS: LLVM-Unit :: Support/./SupportTests/LinearPolyBase.Poly3D_Equality (41923 of 43032)
PASS: LLVM-Unit :: Support/./SupportTests/LinearPolyBase.Poly3D_Invert (41924 of 43032)
PASS: LLVM-Unit :: Support/./SupportTests/LinearPolyBase.Poly3D_GetValue (41925 of 43032)
PASS: LLVM-Unit :: Support/./SupportTests/LinearPolyBase.Poly3D_Scale (41926 of 43032)
PASS: LLVM-Unit :: Support/./SupportTests/LinearPolyBase.Poly3D_Sub (41927 of 43032)
PASS: LLVM-Unit :: Support/./SupportTests/LinearPolyBase.Poly3D_isZero (41928 of 43032)
PASS: LLVM-Unit :: Support/./SupportTests/LockFileManagerTest.Basic (41929 of 43032)
PASS: LLVM-Unit :: Support/./SupportTests/LockFileManagerTest.LinkLockExists (41930 of 43032)
PASS: LLVM-Unit :: Support/./SupportTests/LockFileManagerTest.RelativePath (41931 of 43032)
PASS: LLVM-Unit :: Support/./SupportTests/MPBuildAttr.testBuildAttr (41932 of 43032)
PASS: LLVM-Unit :: Support/./SupportTests/MD5HashTest.MD5 (41933 of 43032)
PASS: LLVM-Unit :: Support/./SupportTests/MD5Test.MD5 (41934 of 43032)
PASS: LLVM-Unit :: Support/./SupportTests/MVEBuildAttr.testBuildAttr (41935 of 43032)
PASS: LLVM-Unit :: Support/./SupportTests/ManagedStaticTest.CustomCreatorDeletor (41936 of 43032)
PASS: LLVM-Unit :: Support/./SupportTests/MatchersTest.Optional (41937 of 43032)
PASS: LLVM-Unit :: Support/./SupportTests/ManagedStaticTest.NestedStatics (41938 of 43032)
PASS: LLVM-Unit :: Support/./SupportTests/MathExtras.CTLog2 (41939 of 43032)
PASS: LLVM-Unit :: Support/./SupportTests/MathExtras.DoubleBits (41940 of 43032)
PASS: LLVM-Unit :: Support/./SupportTests/MathExtras.FloatBits (41941 of 43032)
PASS: LLVM-Unit :: Support/./SupportTests/MathExtras.IsShiftedInt (41942 of 43032)
PASS: LLVM-Unit :: Support/./SupportTests/MathExtras.IsShiftedUInt (41943 of 43032)
PASS: LLVM-Unit :: Support/./SupportTests/MathExtras.MinAlign (41944 of 43032)
PASS: LLVM-Unit :: Support/./SupportTests/MathExtras.PowerOf2Ceil (41945 of 43032)
PASS: LLVM-Unit :: Support/./SupportTests/MathExtras.PowerOf2Floor (41946 of 43032)
PASS: LLVM-Unit :: Support/./SupportTests/MathExtras.NextPowerOf2 (41947 of 43032)
PASS: LLVM-Unit :: Support/./SupportTests/MathExtras.SaturatingAdd (41948 of 43032)
PASS: LLVM-Unit :: Support/./SupportTests/MathExtras.SaturatingMultiply (41949 of 43032)
PASS: LLVM-Unit :: Support/./SupportTests/MathExtras.SaturatingMultiplyAdd (41950 of 43032)
PASS: LLVM-Unit :: Support/./SupportTests/MathExtras.countLeadingOnes (41951 of 43032)
PASS: LLVM-Unit :: Support/./SupportTests/MathExtras.alignTo (41952 of 43032)
PASS: LLVM-Unit :: Support/./SupportTests/MathExtras.countLeadingZeros (41953 of 43032)
PASS: LLVM-Unit :: Support/./SupportTests/MathExtras.countTrailingZeros (41954 of 43032)
PASS: LLVM-Unit :: Support/./SupportTests/MathExtras.findFirstSet (41955 of 43032)
PASS: LLVM-Unit :: Support/./SupportTests/MathExtras.findLastSet (41956 of 43032)
PASS: LLVM-Unit :: Support/./SupportTests/MathExtras.isIntN (41957 of 43032)
PASS: LLVM-Unit :: Support/./SupportTests/MathExtras.isPowerOf2_32 (41958 of 43032)
PASS: LLVM-Unit :: Support/./SupportTests/MathExtras.isPowerOf2_64 (41959 of 43032)
PASS: LLVM-Unit :: Support/./SupportTests/MathExtras.isUIntN (41960 of 43032)
PASS: LLVM-Unit :: Support/./SupportTests/MathExtras.maxIntN (41961 of 43032)
PASS: LLVM-Unit :: Support/./SupportTests/MathExtras.maxUIntN (41962 of 43032)
PASS: LLVM-Unit :: Support/./SupportTests/MathExtras.minIntN (41963 of 43032)
PASS: LLVM-Unit :: Support/./SupportTests/MathExtras.onesMask (41964 of 43032)
PASS: LLVM-Unit :: Support/./SupportTests/MathExtras.reverseBits (41965 of 43032)
PASS: LLVM-Unit :: Support/./SupportTests/MemoryBufferRefTest.compareEquals (41966 of 43032)
PASS: LLVM-Unit :: Support/./SupportTests/MemoryBufferTest.NullTerminator4K (41967 of 43032)
PASS: LLVM-Unit :: Support/./SupportTests/MemoryBufferRefTest.construct (41968 of 43032)
PASS: LLVM-Unit :: Support/./SupportTests/MemoryBufferTest.copy (41969 of 43032)
PASS: LLVM-Unit :: Support/./SupportTests/MemoryBufferTest.get (41970 of 43032)
PASS: LLVM-Unit :: Support/./SupportTests/MemoryBufferTest.createFromPipe (41971 of 43032)
PASS: LLVM-Unit :: Support/./SupportTests/MemoryBufferTest.getOpenFile (41972 of 43032)
PASS: LLVM-Unit :: Support/./SupportTests/MemoryBufferTest.getOpenFileReopened (41973 of 43032)
PASS: LLVM-Unit :: Support/./SupportTests/MemoryBufferTest.mmapVolatileNoNull (41974 of 43032)
PASS: LLVM-Unit :: Support/./SupportTests/MemoryBufferTest.make_new (41975 of 43032)
PASS: LLVM-Unit :: Support/./SupportTests/MemoryBufferTest.slice (41976 of 43032)
PASS: LLVM-Unit :: Support/./SupportTests/MemoryBufferTest.writableSlice (41977 of 43032)
PASS: LLVM-Unit :: Support/./SupportTests/MemoryBufferTest.getOpenFileNoReopen (41978 of 43032)
PASS: LLVM-Unit :: Support/./SupportTests/MemoryBufferTest.writeThroughFile (41979 of 43032)
PASS: LLVM-Unit :: Support/./SupportTests/NativeFormatTest.BasicFloatingPointTests (41980 of 43032)
PASS: LLVM-Unit :: Support/./SupportTests/NativeFormatTest.BasicIntegerTests (41981 of 43032)
PASS: LLVM-Unit :: Support/./SupportTests/NativeFormatTest.BoundaryTests (41982 of 43032)
PASS: LLVM-Unit :: Support/./SupportTests/NativeFormatTest.CommaTests (41983 of 43032)
PASS: LLVM-Unit :: Support/./SupportTests/NativeFormatTest.HexTests (41984 of 43032)
PASS: LLVM-Unit :: Support/./SupportTests/OptimizedStructLayoutTest.Basic (41985 of 43032)
PASS: LLVM-Unit :: Support/./SupportTests/NativeFormatTest.IntegerTests (41986 of 43032)
PASS: LLVM-Unit :: Support/./SupportTests/OptimizedStructLayoutTest.Gaps (41987 of 43032)
PASS: LLVM-Unit :: Support/./SupportTests/OptimizedStructLayoutTest.GardenPath (41988 of 43032)
PASS: LLVM-Unit :: Support/./SupportTests/OptimizedStructLayoutTest.Greed (41989 of 43032)
PASS: LLVM-Unit :: Support/./SupportTests/OptimizedStructLayoutTest.Jagged (41990 of 43032)
PASS: LLVM-Unit :: Support/./SupportTests/OptimizedStructLayoutTest.OddSize (41991 of 43032)
PASS: LLVM-Unit :: Support/./SupportTests/OverflowTest/0.AddOverflowToMax (41992 of 43032)
PASS: LLVM-Unit :: Support/./SupportTests/OverflowTest/0.AddOverflowToMin (41993 of 43032)
PASS: LLVM-Unit :: Support/./SupportTests/OverflowTest/0.AddNoOverflow (41994 of 43032)
PASS: LLVM-Unit :: Support/./SupportTests/OverflowTest/0.AddOverflowToNegative (41995 of 43032)
PASS: LLVM-Unit :: Support/./SupportTests/OverflowTest/0.AddOverflowToZero (41996 of 43032)
PASS: LLVM-Unit :: Support/./SupportTests/OverflowTest/0.MulNoOverflowToMax (41997 of 43032)
PASS: LLVM-Unit :: Support/./SupportTests/OverflowTest/0.MulNoOverflow (41998 of 43032)
PASS: LLVM-Unit :: Support/./SupportTests/OverflowTest/0.MulOverflowMax (41999 of 43032)
PASS: LLVM-Unit :: Support/./SupportTests/OverflowTest/0.MulOverflowToMin (42000 of 43032)
PASS: LLVM-Unit :: Support/./SupportTests/OverflowTest/0.SubNoOverflow (42001 of 43032)
PASS: LLVM-Unit :: Support/./SupportTests/OverflowTest/0.MulResultZero (42002 of 43032)
PASS: LLVM-Unit :: Support/./SupportTests/OverflowTest/0.SubOverflowToMax (42003 of 43032)
PASS: LLVM-Unit :: Support/./SupportTests/OverflowTest/0.SubOverflowToMin (42004 of 43032)
PASS: LLVM-Unit :: Support/./SupportTests/OverflowTest/0.SubOverflowToNegative (42005 of 43032)
PASS: LLVM-Unit :: Support/./SupportTests/OverflowTest/0.SubOverflowToPositive (42006 of 43032)
PASS: LLVM-Unit :: Support/./SupportTests/OverflowTest/1.AddNoOverflow (42007 of 43032)
PASS: LLVM-Unit :: Support/./SupportTests/OverflowTest/1.AddOverflowToNegative (42008 of 43032)
PASS: LLVM-Unit :: Support/./SupportTests/OverflowTest/1.AddOverflowToMax (42009 of 43032)
PASS: LLVM-Unit :: Support/./SupportTests/OverflowTest/1.AddOverflowToMin (42010 of 43032)
PASS: LLVM-Unit :: Support/./SupportTests/OverflowTest/1.AddOverflowToZero (42011 of 43032)
PASS: LLVM-Unit :: Support/./SupportTests/OverflowTest/1.MulNoOverflow (42012 of 43032)
PASS: LLVM-Unit :: Support/./SupportTests/OverflowTest/1.MulNoOverflowToMax (42013 of 43032)
PASS: LLVM-Unit :: Support/./SupportTests/OverflowTest/1.MulOverflowMax (42014 of 43032)
PASS: LLVM-Unit :: Support/./SupportTests/OverflowTest/1.MulResultZero (42015 of 43032)
PASS: LLVM-Unit :: Support/./SupportTests/OverflowTest/1.MulOverflowToMin (42016 of 43032)
PASS: LLVM-Unit :: Support/./SupportTests/OverflowTest/1.SubNoOverflow (42017 of 43032)
PASS: LLVM-Unit :: Support/./SupportTests/OverflowTest/1.SubOverflowToMax (42018 of 43032)
PASS: LLVM-Unit :: Support/./SupportTests/OverflowTest/1.SubOverflowToNegative (42019 of 43032)
PASS: LLVM-Unit :: Support/./SupportTests/OverflowTest/1.SubOverflowToMin (42020 of 43032)
PASS: LLVM-Unit :: Support/./SupportTests/OverflowTest/1.SubOverflowToPositive (42021 of 43032)
PASS: LLVM-Unit :: Support/./SupportTests/OverflowTest/2.AddNoOverflow (42022 of 43032)
PASS: LLVM-Unit :: Support/./SupportTests/OverflowTest/2.AddOverflowToMin (42023 of 43032)
PASS: LLVM-Unit :: Support/./SupportTests/OverflowTest/2.AddOverflowToNegative (42024 of 43032)
PASS: LLVM-Unit :: Support/./SupportTests/OverflowTest/2.AddOverflowToMax (42025 of 43032)
PASS: LLVM-Unit :: Support/./SupportTests/OverflowTest/2.MulNoOverflowToMax (42026 of 43032)
PASS: LLVM-Unit :: Support/./SupportTests/OverflowTest/2.AddOverflowToZero (42027 of 43032)
PASS: LLVM-Unit :: Support/./SupportTests/OverflowTest/2.MulOverflowMax (42028 of 43032)
PASS: LLVM-Unit :: Support/./SupportTests/OverflowTest/2.MulNoOverflow (42029 of 43032)
PASS: LLVM-Unit :: Support/./SupportTests/OverflowTest/2.MulOverflowToMin (42030 of 43032)
PASS: LLVM-Unit :: Support/./SupportTests/OverflowTest/2.MulResultZero (42031 of 43032)
PASS: LLVM-Unit :: Support/./SupportTests/OverflowTest/2.SubNoOverflow (42032 of 43032)
PASS: LLVM-Unit :: Support/./SupportTests/OverflowTest/2.SubOverflowToMax (42033 of 43032)
PASS: LLVM-Unit :: Support/./SupportTests/OverflowTest/2.SubOverflowToMin (42034 of 43032)
PASS: LLVM-Unit :: Support/./SupportTests/OverflowTest/2.SubOverflowToNegative (42035 of 43032)
PASS: LLVM-Unit :: Support/./SupportTests/OverflowTest/2.SubOverflowToPositive (42036 of 43032)
PASS: LLVM-Unit :: Support/./SupportTests/OverflowTest/3.AddOverflowToMax (42037 of 43032)
PASS: LLVM-Unit :: Support/./SupportTests/OverflowTest/3.AddNoOverflow (42038 of 43032)
PASS: LLVM-Unit :: Support/./SupportTests/OverflowTest/3.AddOverflowToMin (42039 of 43032)
PASS: LLVM-Unit :: Support/./SupportTests/OverflowTest/3.AddOverflowToNegative (42040 of 43032)
PASS: LLVM-Unit :: Support/./SupportTests/OverflowTest/3.AddOverflowToZero (42041 of 43032)
PASS: LLVM-Unit :: Support/./SupportTests/OverflowTest/3.MulNoOverflowToMax (42042 of 43032)
PASS: LLVM-Unit :: Support/./SupportTests/OverflowTest/3.MulNoOverflow (42043 of 43032)
PASS: LLVM-Unit :: Support/./SupportTests/OverflowTest/3.MulOverflowMax (42044 of 43032)
PASS: LLVM-Unit :: Support/./SupportTests/OverflowTest/3.MulOverflowToMin (42045 of 43032)
PASS: LLVM-Unit :: Support/./SupportTests/OverflowTest/3.MulResultZero (42046 of 43032)
PASS: LLVM-Unit :: Support/./SupportTests/OverflowTest/3.SubNoOverflow (42047 of 43032)
PASS: LLVM-Unit :: Support/./SupportTests/OverflowTest/3.SubOverflowToMax (42048 of 43032)
PASS: LLVM-Unit :: Support/./SupportTests/OverflowTest/3.SubOverflowToMin (42049 of 43032)
PASS: LLVM-Unit :: Support/./SupportTests/OverflowTest/3.SubOverflowToPositive (42050 of 43032)
PASS: LLVM-Unit :: Support/./SupportTests/OverflowTest/3.SubOverflowToNegative (42051 of 43032)
PASS: LLVM-Unit :: Support/./SupportTests/OverflowTest/4.AddNoOverflow (42052 of 43032)
PASS: LLVM-Unit :: Support/./SupportTests/OverflowTest/4.AddOverflowToMin (42053 of 43032)
PASS: LLVM-Unit :: Support/./SupportTests/OverflowTest/4.AddOverflowToMax (42054 of 43032)
PASS: LLVM-Unit :: Support/./SupportTests/OverflowTest/4.AddOverflowToNegative (42055 of 43032)
PASS: LLVM-Unit :: Support/./SupportTests/OverflowTest/4.MulNoOverflow (42056 of 43032)
PASS: LLVM-Unit :: Support/./SupportTests/OverflowTest/4.AddOverflowToZero (42057 of 43032)
PASS: LLVM-Unit :: Support/./SupportTests/OverflowTest/4.MulNoOverflowToMax (42058 of 43032)
PASS: LLVM-Unit :: Support/./SupportTests/OverflowTest/4.MulOverflowMax (42059 of 43032)
PASS: LLVM-Unit :: Support/./SupportTests/OverflowTest/4.MulOverflowToMin (42060 of 43032)
PASS: LLVM-Unit :: Support/./SupportTests/OverflowTest/4.MulResultZero (42061 of 43032)
PASS: LLVM-Unit :: Support/./SupportTests/OverflowTest/4.SubNoOverflow (42062 of 43032)
PASS: LLVM-Unit :: Support/./SupportTests/OverflowTest/4.SubOverflowToMax (42063 of 43032)
PASS: LLVM-Unit :: Support/./SupportTests/OverflowTest/4.SubOverflowToNegative (42064 of 43032)
PASS: LLVM-Unit :: Support/./SupportTests/OverflowTest/4.SubOverflowToMin (42065 of 43032)
PASS: LLVM-Unit :: Support/./SupportTests/OverflowTest/4.SubOverflowToPositive (42066 of 43032)
PASS: LLVM-Unit :: Support/./SupportTests/PCS_ConfigBuildAttr.testBuildAttr (42067 of 43032)
PASS: LLVM-Unit :: Support/./SupportTests/PCS_GOTBuildAttr.testBuildAttr (42068 of 43032)
PASS: LLVM-Unit :: Support/./SupportTests/PCS_RWBuildAttr.testBuildAttr (42069 of 43032)
PASS: LLVM-Unit :: Support/./SupportTests/PCS_R9BuildAttr.testBuildAttr (42070 of 43032)
PASS: LLVM-Unit :: Support/./SupportTests/PCS_ROBuildAttr.testBuildAttr (42071 of 43032)
PASS: LLVM-Unit :: Support/./SupportTests/PCS_WCharBuildAttr.testBuildAttr (42072 of 43032)
PASS: LLVM-Unit :: Support/./SupportTests/Parallel.ForEachError (42073 of 43032)
PASS: LLVM-Unit :: Support/./SupportTests/PageSizeTest.PageSize (42074 of 43032)
PASS: LLVM-Unit :: Support/./SupportTests/Parallel.TransformReduce (42075 of 43032)
PASS: LLVM-Unit :: Support/./SupportTests/Parallel.parallel_for (42076 of 43032)
PASS: LLVM-Unit :: Support/./SupportTests/PrintOptionInfoTest.PrintOptionInfoMultilineValueDescription (42077 of 43032)
PASS: LLVM-Unit :: Support/./SupportTests/PrintOptionInfoTest.PrintOptionInfoEmptyValueDescription (42078 of 43032)
PASS: LLVM-Unit :: Support/./SupportTests/Parallel.sort (42079 of 43032)
PASS: LLVM-Unit :: Support/./SupportTests/PrintOptionInfoTest.PrintOptionInfoValueOptionalWithSentinel (42080 of 43032)
PASS: LLVM-Unit :: Support/./SupportTests/PrintOptionInfoTest.PrintOptionInfoValueOptionalWithoutSentinel (42081 of 43032)
PASS: LLVM-Unit :: Support/./SupportTests/PrintOptionInfoTest.PrintOptionInfoValueOptionalWithSentinelWithHelp (42082 of 43032)
PASS: LLVM-Unit :: Support/./SupportTests/PrintOptionInfoTest.PrintOptionInfoValueRequiredWithEmptyValueName (42083 of 43032)
PASS: LLVM-Unit :: Support/./SupportTests/ProcessTest.GetProcessIdTest (42084 of 43032)
PASS: LLVM-Unit :: Support/./SupportTests/ProcessTest.GetRandomNumberTest (42085 of 43032)
PASS: LLVM-Unit :: Support/./SupportTests/ProgramTest.TestExecuteNegative (42086 of 43032)
PASS: LLVM-Unit :: Support/./SupportTests/ProgramTest.TestWriteWithSystemEncoding (42087 of 43032)
PASS: LLVM-Unit :: Support/./SupportTests/ProgramEnvTest.CreateProcessTrailingSlash (42088 of 43032)
PASS: LLVM-Unit :: Support/./SupportTests/ProxyFileSystemTest.Basic (42089 of 43032)
PASS: LLVM-Unit :: Support/./SupportTests/ProgramEnvTest.TestExecuteAndWaitStatistics (42090 of 43032)
PASS: LLVM-Unit :: Support/./SupportTests/ProgramEnvTest.TestLockFile (42091 of 43032)
PASS: LLVM-Unit :: Support/./SupportTests/RegexTest.Backreferences (42092 of 43032)
PASS: LLVM-Unit :: Support/./SupportTests/RegexTest.Basics (42093 of 43032)
PASS: LLVM-Unit :: Support/./SupportTests/RegexTest.Escape (42094 of 43032)
PASS: LLVM-Unit :: Support/./SupportTests/RegexTest.IsLiteralERE (42095 of 43032)
PASS: LLVM-Unit :: Support/./SupportTests/RegexTest.IsValid (42096 of 43032)
PASS: LLVM-Unit :: Support/./SupportTests/RegexTest.MatchInvalid (42097 of 43032)
PASS: LLVM-Unit :: Support/./SupportTests/ProgramEnvTest.TestExecuteAndWaitTimeout (42098 of 43032)
PASS: LLVM-Unit :: Support/./SupportTests/RegexTest.MoveAssign (42099 of 43032)
PASS: LLVM-Unit :: Support/./SupportTests/RegexTest.MoveConstruct (42100 of 43032)
PASS: LLVM-Unit :: Support/./SupportTests/RegexTest.NoArgConstructor (42101 of 43032)
PASS: LLVM-Unit :: Support/./SupportTests/RegexTest.OssFuzz3727Regression (42102 of 43032)
PASS: LLVM-Unit :: Support/./SupportTests/RegexTest.Substitution (42103 of 43032)
PASS: LLVM-Unit :: Support/./SupportTests/ReverseIterationTest.DenseMapTest1 (42104 of 43032)
PASS: LLVM-Unit :: Support/./SupportTests/SHA256Test.SHA256 (42105 of 43032)
PASS: LLVM-Unit :: Support/./SupportTests/ReverseIterationTest.DenseMapTest2 (42106 of 43032)
PASS: LLVM-Unit :: Support/./SupportTests/SIMDBuildAttr.testBuildAttr (42107 of 43032)
PASS: LLVM-Unit :: Support/./SupportTests/ScaledNumberHelpersTest.arithmeticOperators (42108 of 43032)
PASS: LLVM-Unit :: Support/./SupportTests/ScaledNumberHelpersTest.compare (42109 of 43032)
PASS: LLVM-Unit :: Support/./SupportTests/ScaledNumberHelpersTest.getAdjusted (42110 of 43032)
PASS: LLVM-Unit :: Support/./SupportTests/ScaledNumberHelpersTest.getLg (42111 of 43032)
PASS: LLVM-Unit :: Support/./SupportTests/ScaledNumberHelpersTest.getDifference (42112 of 43032)
PASS: LLVM-Unit :: Support/./SupportTests/ScaledNumberHelpersTest.getLgCeiling (42113 of 43032)
PASS: LLVM-Unit :: Support/./SupportTests/ScaledNumberHelpersTest.getLgFloor (42114 of 43032)
PASS: LLVM-Unit :: Support/./SupportTests/ScaledNumberHelpersTest.getProduct (42115 of 43032)
PASS: LLVM-Unit :: Support/./SupportTests/ScaledNumberHelpersTest.getQuotient (42116 of 43032)
PASS: LLVM-Unit :: Support/./SupportTests/ScaledNumberHelpersTest.getRounded (42117 of 43032)
PASS: LLVM-Unit :: Support/./SupportTests/ScaledNumberHelpersTest.getSum (42118 of 43032)
PASS: LLVM-Unit :: Support/./SupportTests/SourceMgrTest.BasicError (42119 of 43032)
PASS: LLVM-Unit :: Support/./SupportTests/ScaledNumberHelpersTest.toIntBug (42120 of 43032)
PASS: LLVM-Unit :: Support/./SupportTests/SourceMgrTest.BasicFixit (42121 of 43032)
PASS: LLVM-Unit :: Support/./SupportTests/ScaledNumberHelpersTest.matchScales (42122 of 43032)
PASS: LLVM-Unit :: Support/./SupportTests/SourceMgrTest.BasicNote (42123 of 43032)
PASS: LLVM-Unit :: Support/./SupportTests/SourceMgrTest.BasicRange (42124 of 43032)
PASS: LLVM-Unit :: Support/./SupportTests/SourceMgrTest.BasicRemark (42125 of 43032)
PASS: LLVM-Unit :: Support/./SupportTests/ProgramEnvTest.TestExecuteNoWait (42126 of 43032)
PASS: LLVM-Unit :: Support/./SupportTests/SourceMgrTest.FixitForTab (42127 of 43032)
PASS: LLVM-Unit :: Support/./SupportTests/SourceMgrTest.LocationAtEmptyBuffer (42128 of 43032)
PASS: LLVM-Unit :: Support/./SupportTests/SourceMgrTest.BasicWarning (42129 of 43032)
PASS: LLVM-Unit :: Support/./SupportTests/SourceMgrTest.LocationAtEndOf255ByteBuffer (42130 of 43032)
PASS: LLVM-Unit :: Support/./SupportTests/SourceMgrTest.LocationAtEndOf255ByteBufferEndingInNewline (42131 of 43032)
PASS: LLVM-Unit :: Support/./SupportTests/SourceMgrTest.LocationAtEndOf256ByteBuffer (42132 of 43032)
PASS: LLVM-Unit :: Support/./SupportTests/SourceMgrTest.LocationAtEndOf256ByteBufferEndingInNewline (42133 of 43032)
PASS: LLVM-Unit :: Support/./SupportTests/SourceMgrTest.LocationAtEndOf257ByteBuffer (42134 of 43032)
PASS: LLVM-Unit :: Support/./SupportTests/SourceMgrTest.LocationBeforeEndOf255ByteBufferEndingInNewline (42135 of 43032)
PASS: LLVM-Unit :: Support/./SupportTests/SourceMgrTest.LocationAtEndOf257ByteBufferEndingInNewline (42136 of 43032)
PASS: LLVM-Unit :: Support/./SupportTests/SourceMgrTest.LocationBeforeEndOf255ByteBuffer (42137 of 43032)
PASS: LLVM-Unit :: Support/./SupportTests/SourceMgrTest.LocationBeforeEndOf256ByteBuffer (42138 of 43032)
PASS: LLVM-Unit :: Support/./SupportTests/SourceMgrTest.LocationAtEndOfLine (42139 of 43032)
PASS: LLVM-Unit :: Support/./SupportTests/SourceMgrTest.LocationAtNewline (42140 of 43032)
PASS: LLVM-Unit :: Support/./SupportTests/SourceMgrTest.LocationBeforeEndOf256ByteBufferEndingInNewline (42141 of 43032)
PASS: LLVM-Unit :: Support/./SupportTests/SourceMgrTest.LocationBeforeEndOf257ByteBuffer (42142 of 43032)
PASS: LLVM-Unit :: Support/./SupportTests/SourceMgrTest.LocationBeforeEndOf257ByteBufferEndingInNewline (42143 of 43032)
PASS: LLVM-Unit :: Support/./SupportTests/SourceMgrTest.LocationJustAfterNonNewline (42144 of 43032)
PASS: LLVM-Unit :: Support/./SupportTests/SourceMgrTest.LocationJustAfterSoleNewline (42145 of 43032)
PASS: LLVM-Unit :: Support/./SupportTests/SourceMgrTest.LocationOnEOLOfFirstLineOfMultiline (42146 of 43032)
PASS: LLVM-Unit :: Support/./SupportTests/SourceMgrTest.LocationJustOnSoleNewline (42147 of 43032)
PASS: LLVM-Unit :: Support/./SupportTests/SourceMgrTest.LocationOnEOLOfSecondSecondLineOfMultiline (42148 of 43032)
PASS: LLVM-Unit :: Support/./SupportTests/SourceMgrTest.LocationOnFirstLineOfMultiline (42149 of 43032)
PASS: LLVM-Unit :: Support/./SupportTests/SourceMgrTest.LocationOnSecondLineOfMultiline (42150 of 43032)
PASS: LLVM-Unit :: Support/./SupportTests/SourceMgrTest.LocationOnSecondLineOfMultilineNoSecondEOL (42151 of 43032)
PASS: LLVM-Unit :: Support/./SupportTests/SourceMgrTest.LocationPastEndOf255ByteBuffer (42152 of 43032)
PASS: LLVM-Unit :: Support/./SupportTests/SourceMgrTest.LocationPastEndOf255ByteBufferEndingInNewline (42153 of 43032)
PASS: LLVM-Unit :: Support/./SupportTests/SourceMgrTest.LocationPastEndOf256ByteBuffer (42154 of 43032)
PASS: LLVM-Unit :: Support/./SupportTests/SourceMgrTest.LocationPastEndOf256ByteBufferEndingInNewline (42155 of 43032)
PASS: LLVM-Unit :: Support/./SupportTests/SourceMgrTest.LocationPastEndOf257ByteBuffer (42156 of 43032)
PASS: LLVM-Unit :: Support/./SupportTests/SourceMgrTest.LocationPastEndOf257ByteBufferEndingInNewline (42157 of 43032)
PASS: LLVM-Unit :: Support/./SupportTests/SourceMgrTest.MultiLineRange (42158 of 43032)
PASS: LLVM-Unit :: Support/./SupportTests/SourceMgrTest.MultipleRanges (42159 of 43032)
PASS: LLVM-Unit :: Support/./SupportTests/SourceMgrTest.OverlappingRanges (42160 of 43032)
PASS: LLVM-Unit :: Support/./SupportTests/SourceMgrTest.RangeWithTab (42161 of 43032)
PASS: LLVM-Unit :: Support/./SupportTests/SpecialCaseListTest.Basic (42162 of 43032)
PASS: LLVM-Unit :: Support/./SupportTests/SpecialCaseListTest.EmptySpecialCaseList (42163 of 43032)
PASS: LLVM-Unit :: Support/./SupportTests/SpecialCaseListTest.CorrectErrorLineNumberWithBlankLine (42164 of 43032)
PASS: LLVM-Unit :: Support/./SupportTests/SpecialCaseListTest.EscapedSymbols (42165 of 43032)
PASS: LLVM-Unit :: Support/./SupportTests/SpecialCaseListTest.GlobalInit (42166 of 43032)
PASS: LLVM-Unit :: Support/./SupportTests/SpecialCaseListTest.InvalidSpecialCaseList (42167 of 43032)
PASS: LLVM-Unit :: Support/./SupportTests/SpecialCaseListTest.MultipleExclusions (42168 of 43032)
PASS: LLVM-Unit :: Support/./SupportTests/SpecialCaseListTest.NoTrigramsInRules (42169 of 43032)
PASS: LLVM-Unit :: Support/./SupportTests/SpecialCaseListTest.NoTrigramsInARule (42170 of 43032)
PASS: LLVM-Unit :: Support/./SupportTests/SpecialCaseListTest.PopularTrigram (42171 of 43032)
PASS: LLVM-Unit :: Support/./SupportTests/SpecialCaseListTest.RepetitiveRule (42172 of 43032)
PASS: LLVM-Unit :: Support/./SupportTests/SpecialCaseListTest.Section (42173 of 43032)
PASS: LLVM-Unit :: Support/./SupportTests/SpecialCaseListTest.SectionRegexErrorHandling (42174 of 43032)
PASS: LLVM-Unit :: Support/./SupportTests/SpecialCaseListTest.SpecialSymbolRule (42175 of 43032)
PASS: LLVM-Unit :: Support/./SupportTests/SpecialCaseListTest.Substring (42176 of 43032)
PASS: LLVM-Unit :: Support/./SupportTests/SuffixTreeTest.TestExclusion (42177 of 43032)
PASS: LLVM-Unit :: Support/./SupportTests/StackAlign.testAttribute (42178 of 43032)
PASS: LLVM-Unit :: Support/./SupportTests/SuffixTreeTest.TestLongerRepetition (42179 of 43032)
PASS: LLVM-Unit :: Support/./SupportTests/SuffixTreeTest.TestSingleCharacterRepeat (42180 of 43032)
PASS: LLVM-Unit :: Support/./SupportTests/SuffixTreeTest.TestSingleRepetition (42181 of 43032)
PASS: LLVM-Unit :: Support/./SupportTests/SuffixTreeTest.TestTandemRepeat (42182 of 43032)
PASS: LLVM-Unit :: Support/./SupportTests/Support.AbsolutePathIteratorEnd (42183 of 43032)
PASS: LLVM-Unit :: Support/./SupportTests/Support.ConfigDirectory (42184 of 43032)
PASS: LLVM-Unit :: Support/./SupportTests/Support.FilenameParent (42185 of 43032)
PASS: LLVM-Unit :: Support/./SupportTests/Support.HomeDirectory (42186 of 43032)
PASS: LLVM-Unit :: Support/./SupportTests/Support.Path (42187 of 43032)
PASS: LLVM-Unit :: Support/./SupportTests/Support.NormalizePath (42188 of 43032)
PASS: LLVM-Unit :: Support/./SupportTests/Support.PathRoot (42189 of 43032)
PASS: LLVM-Unit :: Support/./SupportTests/Support.PathIterator (42190 of 43032)
PASS: LLVM-Unit :: Support/./SupportTests/Support.RemoveDots (42191 of 43032)
PASS: LLVM-Unit :: Support/./SupportTests/Support.RemoveLeadingDotSlash (42192 of 43032)
PASS: LLVM-Unit :: Support/./SupportTests/Support.ReplacePathPrefix (42193 of 43032)
PASS: LLVM-Unit :: Support/./SupportTests/Support.TempDirectory (42194 of 43032)
PASS: LLVM-Unit :: Support/./SupportTests/SymbolRemappingReaderTest.DemanglingErrors (42195 of 43032)
PASS: LLVM-Unit :: Support/./SupportTests/SymbolRemappingReaderTest.BadMappingOrder (42196 of 43032)
PASS: LLVM-Unit :: Support/./SupportTests/SymbolRemappingReaderTest.ParseErrors (42197 of 43032)
PASS: LLVM-Unit :: Support/./SupportTests/T2EEBuildAttr.testBuildAttr (42198 of 43032)
PASS: LLVM-Unit :: Support/./SupportTests/SymbolRemappingReaderTest.RemappingsAdded (42199 of 43032)
PASS: LLVM-Unit :: Support/./SupportTests/TarWriterTest.Basics (42200 of 43032)
PASS: LLVM-Unit :: Support/./SupportTests/TarWriterTest.Duplicate (42201 of 43032)
PASS: LLVM-Unit :: Support/./SupportTests/TarWriterTest.LongFilename (42202 of 43032)
PASS: LLVM-Unit :: Support/./SupportTests/TarWriterTest.NoDuplicate (42203 of 43032)
PASS: LLVM-Unit :: Support/./SupportTests/TarWriterTest.Pax (42204 of 43032)
PASS: LLVM-Unit :: Support/./SupportTests/TarWriterTest.SingleFile (42205 of 43032)
PASS: LLVM-Unit :: Support/./SupportTests/TargetParserTest.AArch64ArchFeatures (42206 of 43032)
PASS: LLVM-Unit :: Support/./SupportTests/TargetParserTest.AArch64ArchExtFeature (42207 of 43032)
PASS: LLVM-Unit :: Support/./SupportTests/TargetParserTest.AArch64ExtensionFeatures (42208 of 43032)
PASS: LLVM-Unit :: Support/./SupportTests/TargetParserTest.ARMArchExtFeature (42209 of 43032)
PASS: LLVM-Unit :: Support/./SupportTests/TargetParserTest.ARMArchExtDependencies (42210 of 43032)
PASS: LLVM-Unit :: Support/./SupportTests/TargetParserTest.ARMExtensionFeatures (42211 of 43032)
PASS: LLVM-Unit :: Support/./SupportTests/TargetParserTest.ARMFPUFeatures (42212 of 43032)
PASS: LLVM-Unit :: Support/./SupportTests/TargetParserTest.ARMFPUNeonSupportLevel (42213 of 43032)
PASS: LLVM-Unit :: Support/./SupportTests/TargetParserTest.ARMFPUVersion (42214 of 43032)
PASS: LLVM-Unit :: Support/./SupportTests/TargetParserTest.ARMFPURestriction (42215 of 43032)
PASS: LLVM-Unit :: Support/./SupportTests/TargetParserTest.ARMparseArchEndianAndISA (42216 of 43032)
PASS: LLVM-Unit :: Support/./SupportTests/TargetParserTest.ARMparseArchVersion (42217 of 43032)
PASS: LLVM-Unit :: Support/./SupportTests/TargetParserTest.ARMparseArchProfile (42218 of 43032)
PASS: LLVM-Unit :: Support/./SupportTests/TargetParserTest.ARMparseHWDiv (42219 of 43032)
PASS: LLVM-Unit :: Support/./SupportTests/TargetParserTest.testAArch64Arch (42220 of 43032)
PASS: LLVM-Unit :: Support/./SupportTests/TargetParserTest.testAArch64CPUArchList (42221 of 43032)
PASS: LLVM-Unit :: Support/./SupportTests/TargetParserTest.testARMArch (42222 of 43032)
PASS: LLVM-Unit :: Support/./SupportTests/TargetParserTest.testARMCPUArchList (42223 of 43032)
PASS: LLVM-Unit :: Support/./SupportTests/TargetParserTest.testAArch64Extension (42224 of 43032)
PASS: LLVM-Unit :: Support/./SupportTests/TargetParserTest.testARMExtension (42225 of 43032)
PASS: LLVM-Unit :: Support/./SupportTests/TargetParserTest.testInvalidARMArch (42226 of 43032)
PASS: LLVM-Unit :: Support/./SupportTests/TaskQueueTest.FutureWithReturnValue (42227 of 43032)
PASS: LLVM-Unit :: Support/./SupportTests/TaskQueueTest.UnOrderedFutures (42228 of 43032)
PASS: LLVM-Unit :: Support/./SupportTests/TaskQueueTest.OrderedFutures (42229 of 43032)
PASS: LLVM-Unit :: Support/./SupportTests/ThreadPoolTest.AffinityMask (42230 of 43032)
PASS: LLVM-Unit :: Support/./SupportTests/ThreadLocalTest.Basics (42231 of 43032)
PASS: LLVM-Unit :: Support/./SupportTests/ThreadPoolTest.AllThreads_OneThreadPerCore (42232 of 43032)
PASS: LLVM-Unit :: Support/./SupportTests/ThreadPoolTest.AllThreads_UseAllRessources (42233 of 43032)
PASS: LLVM-Unit :: Support/./SupportTests/ThreadPoolTest.Async (42234 of 43032)
PASS: LLVM-Unit :: Support/./SupportTests/ThreadPoolTest.AsyncBarrier (42235 of 43032)
PASS: LLVM-Unit :: Support/./SupportTests/ThreadPoolTest.AsyncBarrierArgs (42236 of 43032)
PASS: LLVM-Unit :: Support/./SupportTests/ThreadPoolTest.GetFuture (42237 of 43032)
PASS: LLVM-Unit :: Support/./SupportTests/Threading.PhysicalConcurrency (42238 of 43032)
PASS: LLVM-Unit :: Support/./SupportTests/Threading.RunOnThreadSync (42239 of 43032)
PASS: LLVM-Unit :: Support/./SupportTests/ThreadPoolTest.PoolDestruction (42240 of 43032)
PASS: LLVM-Unit :: Support/./SupportTests/Threading.RunOnThreadSyncAsync (42241 of 43032)
PASS: LLVM-Unit :: Support/./SupportTests/ThumbISABuildAttr.testBuildAttr (42242 of 43032)
PASS: LLVM-Unit :: Support/./SupportTests/Timer.Additivity (42243 of 43032)
PASS: LLVM-Unit :: Support/./SupportTests/Timer.CheckIfTriggered (42244 of 43032)
PASS: LLVM-Unit :: Support/./SupportTests/ToolOutputFileTest.DashOpensOuts (42245 of 43032)
PASS: LLVM-Unit :: Support/./SupportTests/TrailingObjects.OneArg (42246 of 43032)
PASS: LLVM-Unit :: Support/./SupportTests/TrailingObjects.ThreeArg (42247 of 43032)
PASS: LLVM-Unit :: Support/./SupportTests/TrailingObjects.Realignment (42248 of 43032)
PASS: LLVM-Unit :: Support/./SupportTests/TrailingObjects.TwoArg (42249 of 43032)
PASS: LLVM-Unit :: Support/./SupportTests/TrigramIndexTest.Backreference1 (42250 of 43032)
PASS: LLVM-Unit :: Support/./SupportTests/TrigramIndexTest.Basic (42251 of 43032)
PASS: LLVM-Unit :: Support/./SupportTests/TrigramIndexTest.Backreference2 (42252 of 43032)
PASS: LLVM-Unit :: Support/./SupportTests/TrigramIndexTest.Empty (42253 of 43032)
PASS: LLVM-Unit :: Support/./SupportTests/TrigramIndexTest.NoTrigramsInRules (42254 of 43032)
PASS: LLVM-Unit :: Support/./SupportTests/TrigramIndexTest.EscapedSymbols (42255 of 43032)
PASS: LLVM-Unit :: Support/./SupportTests/TrigramIndexTest.PopularTrigram2 (42256 of 43032)
PASS: LLVM-Unit :: Support/./SupportTests/TrigramIndexTest.NoTrigramsInARule (42257 of 43032)
PASS: LLVM-Unit :: Support/./SupportTests/TrigramIndexTest.PopularTrigram (42258 of 43032)
PASS: LLVM-Unit :: Support/./SupportTests/TrigramIndexTest.RepetitiveRule (42259 of 43032)
PASS: LLVM-Unit :: Support/./SupportTests/TrigramIndexTest.Sequence (42260 of 43032)
PASS: LLVM-Unit :: Support/./SupportTests/TrigramIndexTest.TooComplicatedRegex (42261 of 43032)
PASS: LLVM-Unit :: Support/./SupportTests/Triviality.ADT (42262 of 43032)
PASS: LLVM-Unit :: Support/./SupportTests/TrigramIndexTest.TooComplicatedRegex2 (42263 of 43032)
PASS: LLVM-Unit :: Support/./SupportTests/Triviality.Tester (42264 of 43032)
PASS: LLVM-Unit :: Support/./SupportTests/UnalignedAccess.testAttribute (42265 of 43032)
PASS: LLVM-Unit :: Support/./SupportTests/TypeNameTest.Names (42266 of 43032)
PASS: LLVM-Unit :: Support/./SupportTests/Unicode.columnWidthUTF8 (42267 of 43032)
PASS: LLVM-Unit :: Support/./SupportTests/Unicode.isPrintable (42268 of 43032)
PASS: LLVM-Unit :: Support/./SupportTests/UnivariateLinearPolyBase.Univariate3D_Add (42269 of 43032)
PASS: LLVM-Unit :: Support/./SupportTests/UnivariateLinearPolyBase.Univariate3D_Equality (42270 of 43032)
PASS: LLVM-Unit :: Support/./SupportTests/UnivariateLinearPolyBase.Univariate3D_GetValue (42271 of 43032)
PASS: LLVM-Unit :: Support/./SupportTests/UnivariateLinearPolyBase.Univariate3D_Invert (42272 of 43032)
PASS: LLVM-Unit :: Support/./SupportTests/UnivariateLinearPolyBase.Univariate3D_Scale (42273 of 43032)
PASS: LLVM-Unit :: Support/./SupportTests/UnivariateLinearPolyBase.Univariate3D_Sub (42274 of 43032)
PASS: LLVM-Unit :: Support/./SupportTests/UnivariateLinearPolyBase.Univariate3D_isZero (42275 of 43032)
PASS: LLVM-Unit :: Support/./SupportTests/VFPArgsBuildAttr.testBuildAttr (42276 of 43032)
PASS: LLVM-Unit :: Support/./SupportTests/VFSFromRemappedFilesTest.Basic (42277 of 43032)
PASS: LLVM-Unit :: Support/./SupportTests/VFSFromRemappedFilesTest.LastMappingWins (42278 of 43032)
PASS: LLVM-Unit :: Support/./SupportTests/VFSFromRemappedFilesTest.UseExternalNames (42279 of 43032)
PASS: LLVM-Unit :: Support/./SupportTests/VFSFromYAMLTest.BasicVFSFromYAML (42280 of 43032)
PASS: LLVM-Unit :: Support/./SupportTests/VFSFromYAMLTest.CaseInsensitive (42281 of 43032)
PASS: LLVM-Unit :: Support/./SupportTests/VFSFromYAMLTest.CaseSensitive (42282 of 43032)
PASS: LLVM-Unit :: Support/./SupportTests/VFSFromYAMLTest.DirectoryIteration (42283 of 43032)
PASS: LLVM-Unit :: Support/./SupportTests/VFSFromYAMLTest.DirectoryIterationErrorInVFSLayer (42284 of 43032)
PASS: LLVM-Unit :: Support/./SupportTests/VFSFromYAMLTest.DirectoryIterationSameDirMultipleEntries (42285 of 43032)
PASS: LLVM-Unit :: Support/./SupportTests/VFSFromYAMLTest.DirectoryIterationWithDuplicates (42286 of 43032)
PASS: LLVM-Unit :: Support/./SupportTests/VFSFromYAMLTest.GetRealPath (42287 of 43032)
PASS: LLVM-Unit :: Support/./SupportTests/VFSFromYAMLTest.IllegalVFSFile (42288 of 43032)
PASS: LLVM-Unit :: Support/./SupportTests/VFSFromYAMLTest.MappedFiles (42289 of 43032)
PASS: LLVM-Unit :: Support/./SupportTests/VFSFromYAMLTest.MappedRoot (42290 of 43032)
PASS: LLVM-Unit :: Support/./SupportTests/VFSFromYAMLTest.MultiComponentPath (42291 of 43032)
PASS: LLVM-Unit :: Support/./SupportTests/VFSFromYAMLTest.NonFallthroughDirectoryIteration (42292 of 43032)
PASS: LLVM-Unit :: Support/./SupportTests/VFSFromYAMLTest.RecursiveDirectoryIterationLevel (42293 of 43032)
PASS: LLVM-Unit :: Support/./SupportTests/VFSFromYAMLTest.RelativePaths (42294 of 43032)
PASS: LLVM-Unit :: Support/./SupportTests/VFSFromYAMLTest.RemappedDirectoryOverlay (42295 of 43032)
PASS: LLVM-Unit :: Support/./SupportTests/VFSFromYAMLTest.RemappedDirectoryOverlayNoExternalNames (42296 of 43032)
PASS: LLVM-Unit :: Support/./SupportTests/VFSFromYAMLTest.RemappedDirectoryOverlayNoFallthrough (42297 of 43032)
PASS: LLVM-Unit :: Support/./SupportTests/VFSFromYAMLTest.UseExternalName (42298 of 43032)
PASS: LLVM-Unit :: Support/./SupportTests/VFSFromYAMLTest.TrailingSlashes (42299 of 43032)
PASS: LLVM-Unit :: Support/./SupportTests/VFSFromYAMLTest.VirtualWorkingDirectory (42300 of 43032)
PASS: LLVM-Unit :: Support/./SupportTests/VFSFromYAMLTest.WorkingDirectory (42301 of 43032)
PASS: LLVM-Unit :: Support/./SupportTests/VFSFromYAMLTest.WorkingDirectoryFallthrough (42302 of 43032)
PASS: LLVM-Unit :: Support/./SupportTests/VFSFromYAMLTest.WorkingDirectoryFallthroughInvalid (42303 of 43032)
PASS: LLVM-Unit :: Support/./SupportTests/VFSFromYAMLTest.YAMLVFSWriterTest (42304 of 43032)
PASS: LLVM-Unit :: Support/./SupportTests/VFSFromYAMLTest.YAMLVFSWriterTest2 (42305 of 43032)
PASS: LLVM-Unit :: Support/./SupportTests/VFSFromYAMLTest.YAMLVFSWriterTest3 (42306 of 43032)
PASS: LLVM-Unit :: Support/./SupportTests/VFSFromYAMLTest.YAMLVFSWriterTestHandleDirs (42307 of 43032)
PASS: LLVM-Unit :: Support/./SupportTests/VersionTuple.getAsString (42308 of 43032)
PASS: LLVM-Unit :: Support/./SupportTests/VersionTuple.tryParse (42309 of 43032)
PASS: LLVM-Unit :: Support/./SupportTests/VirtualFileSystemTest.BasicRealFSIteration (42310 of 43032)
PASS: LLVM-Unit :: Support/./SupportTests/VirtualFileSystemTest.BaseOnlyOverlay (42311 of 43032)
PASS: LLVM-Unit :: Support/./SupportTests/VirtualFileSystemTest.BasicRealFSRecursiveIteration (42312 of 43032)
PASS: LLVM-Unit :: Support/./SupportTests/VirtualFileSystemTest.BasicRealFSRecursiveIterationNoPush (42313 of 43032)
PASS: LLVM-Unit :: Support/./SupportTests/VirtualFileSystemTest.BrokenSymlinkRealFSIteration (42314 of 43032)
PASS: LLVM-Unit :: Support/./SupportTests/VirtualFileSystemTest.BrokenSymlinkRealFSRecursiveIteration (42315 of 43032)
PASS: LLVM-Unit :: Support/./SupportTests/VirtualFileSystemTest.GetRealPathInOverlay (42316 of 43032)
PASS: LLVM-Unit :: Support/./SupportTests/VirtualFileSystemTest.HiddenInIteration (42317 of 43032)
PASS: LLVM-Unit :: Support/./SupportTests/VirtualFileSystemTest.MergedDirPermissions (42318 of 43032)
PASS: LLVM-Unit :: Support/./SupportTests/VirtualFileSystemTest.MultipleWorkingDirs (42319 of 43032)
PASS: LLVM-Unit :: Support/./SupportTests/VirtualFileSystemTest.OverlayDirsNonMerged (42320 of 43032)
PASS: LLVM-Unit :: Support/./SupportTests/VirtualFileSystemTest.OverlayFiles (42321 of 43032)
PASS: LLVM-Unit :: Support/./SupportTests/VirtualFileSystemTest.OverlayIteration (42322 of 43032)
PASS: LLVM-Unit :: Support/./SupportTests/VirtualFileSystemTest.OverlayIterator (42323 of 43032)
PASS: LLVM-Unit :: Support/./SupportTests/VirtualFileSystemTest.StatusQueries (42324 of 43032)
PASS: LLVM-Unit :: Support/./SupportTests/VirtualFileSystemTest.ThreeLevelIteration (42325 of 43032)
PASS: LLVM-Unit :: Support/./SupportTests/VirtualFileSystemTest.OverlayRecursiveIteration (42326 of 43032)
PASS: LLVM-Unit :: Support/./SupportTests/WMMXArgsBuildAttr.testBuildAttr (42327 of 43032)
PASS: LLVM-Unit :: Support/./SupportTests/VirtualizationBuildAttr.testBuildAttr (42328 of 43032)
PASS: LLVM-Unit :: Support/./SupportTests/WMMXBuildAttr.testBuildAttr (42329 of 43032)
PASS: LLVM-Unit :: Support/./SupportTests/WithColorTest.ColorMode (42330 of 43032)
PASS: LLVM-Unit :: Support/./SupportTests/YAMLIO.MultilineStrings (42331 of 43032)
PASS: LLVM-Unit :: Support/./SupportTests/YAMLIO.Numeric (42332 of 43032)
PASS: LLVM-Unit :: Support/./SupportTests/YAMLIO.TestAnchorMapError (42333 of 43032)
PASS: LLVM-Unit :: Support/./SupportTests/YAMLIO.NoQuotesForTab (42334 of 43032)
PASS: LLVM-Unit :: Support/./SupportTests/YAMLIO.SequenceElideTest (42335 of 43032)
PASS: LLVM-Unit :: Support/./SupportTests/YAMLIO.TestColorsReadError (42336 of 43032)
PASS: LLVM-Unit :: Support/./SupportTests/YAMLIO.TestContainerSequenceMapRead (42337 of 43032)
PASS: LLVM-Unit :: Support/./SupportTests/YAMLIO.TestCustomMapping (42338 of 43032)
PASS: LLVM-Unit :: Support/./SupportTests/YAMLIO.TestCustomMappingStruct (42339 of 43032)
PASS: LLVM-Unit :: Support/./SupportTests/YAMLIO.TestDirectiveMappingNoValue (42340 of 43032)
PASS: LLVM-Unit :: Support/./SupportTests/YAMLIO.TestDocRead (42341 of 43032)
PASS: LLVM-Unit :: Support/./SupportTests/YAMLIO.TestEmptyAnchor (42342 of 43032)
PASS: LLVM-Unit :: Support/./SupportTests/YAMLIO.TestEmptySequenceWrite (42343 of 43032)
PASS: LLVM-Unit :: Support/./SupportTests/YAMLIO.TestEmptyAlias (42344 of 43032)
PASS: LLVM-Unit :: Support/./SupportTests/YAMLIO.TestEmptyMapWrite (42345 of 43032)
PASS: LLVM-Unit :: Support/./SupportTests/YAMLIO.TestEmptyStringFailsForMapWithRequiredFields (42346 of 43032)
PASS: LLVM-Unit :: Support/./SupportTests/YAMLIO.TestEmptyStringSucceedsForMapWithOptionalFields (42347 of 43032)
PASS: LLVM-Unit :: Support/./SupportTests/YAMLIO.TestEmptyStringSucceedsForSequence (42348 of 43032)
PASS: LLVM-Unit :: Support/./SupportTests/YAMLIO.TestEnumRead (42349 of 43032)
PASS: LLVM-Unit :: Support/./SupportTests/YAMLIO.TestEscaped (42350 of 43032)
PASS: LLVM-Unit :: Support/./SupportTests/YAMLIO.TestFlagsReadError (42351 of 43032)
PASS: LLVM-Unit :: Support/./SupportTests/YAMLIO.TestFlowSequenceTokenErrors (42352 of 43032)
PASS: LLVM-Unit :: Support/./SupportTests/YAMLIO.TestFlagsRead (42353 of 43032)
PASS: LLVM-Unit :: Support/./SupportTests/YAMLIO.TestGivenFilename (42354 of 43032)
PASS: LLVM-Unit :: Support/./SupportTests/YAMLIO.TestMalformedContainerSequenceMapRead (42355 of 43032)
PASS: LLVM-Unit :: Support/./SupportTests/YAMLIO.TestMalformedMapFailsGracefully (42356 of 43032)
PASS: LLVM-Unit :: Support/./SupportTests/YAMLIO.TestMalformedMapRead (42357 of 43032)
PASS: LLVM-Unit :: Support/./SupportTests/YAMLIO.TestMapRead (42358 of 43032)
PASS: LLVM-Unit :: Support/./SupportTests/YAMLIO.TestReadBuiltInTypesDoubleError (42359 of 43032)
PASS: LLVM-Unit :: Support/./SupportTests/YAMLIO.TestReadBuiltInTypes (42360 of 43032)
PASS: LLVM-Unit :: Support/./SupportTests/YAMLIO.TestMapWithContext (42361 of 43032)
PASS: LLVM-Unit :: Support/./SupportTests/YAMLIO.TestReadBuiltInTypesFloatError (42362 of 43032)
PASS: LLVM-Unit :: Support/./SupportTests/YAMLIO.TestReadBuiltInTypesHex16Error (42363 of 43032)
PASS: LLVM-Unit :: Support/./SupportTests/YAMLIO.TestReadBuiltInTypesHex32Error (42364 of 43032)
PASS: LLVM-Unit :: Support/./SupportTests/YAMLIO.TestReadBuiltInTypesHex64Error (42365 of 43032)
PASS: LLVM-Unit :: Support/./SupportTests/YAMLIO.TestReadBuiltInTypesUint16Error (42366 of 43032)
PASS: LLVM-Unit :: Support/./SupportTests/YAMLIO.TestReadBuiltInTypesUint8Error (42367 of 43032)
PASS: LLVM-Unit :: Support/./SupportTests/YAMLIO.TestReadBuiltInTypesHex8Error (42368 of 43032)
PASS: LLVM-Unit :: Support/./SupportTests/YAMLIO.TestReadBuiltInTypesUint64Error (42369 of 43032)
PASS: LLVM-Unit :: Support/./SupportTests/YAMLIO.TestReadBuiltInTypesint16OverError (42370 of 43032)
PASS: LLVM-Unit :: Support/./SupportTests/YAMLIO.TestReadBuiltInTypesUint32Error (42371 of 43032)
PASS: LLVM-Unit :: Support/./SupportTests/YAMLIO.TestReadBuiltInTypesint32OverError (42372 of 43032)
PASS: LLVM-Unit :: Support/./SupportTests/YAMLIO.TestReadBuiltInTypesint16UnderError (42373 of 43032)
PASS: LLVM-Unit :: Support/./SupportTests/YAMLIO.TestReadBuiltInTypesint8UnderError (42374 of 43032)
PASS: LLVM-Unit :: Support/./SupportTests/YAMLIO.TestReadBuiltInTypesint8OverError (42375 of 43032)
PASS: LLVM-Unit :: Support/./SupportTests/YAMLIO.TestReadBuiltInTypesint32UnderError (42376 of 43032)
PASS: LLVM-Unit :: Support/./SupportTests/YAMLIO.TestReadBuiltInTypesint64UnderError (42377 of 43032)
PASS: LLVM-Unit :: Support/./SupportTests/YAMLIO.TestReadBuiltInTypesint64OverError (42378 of 43032)
PASS: LLVM-Unit :: Support/./SupportTests/YAMLIO.TestReadKindAndFlagsSequence (42379 of 43032)
PASS: LLVM-Unit :: Support/./SupportTests/YAMLIO.TestReadEndianEnums (42380 of 43032)
PASS: LLVM-Unit :: Support/./SupportTests/YAMLIO.TestReadEndianTypes (42381 of 43032)
PASS: LLVM-Unit :: Support/./SupportTests/YAMLIO.TestReadMySecondsSequence (42382 of 43032)
PASS: LLVM-Unit :: Support/./SupportTests/YAMLIO.TestReadWriteBlockScalarDocuments (42383 of 43032)
PASS: LLVM-Unit :: Support/./SupportTests/YAMLIO.TestReadWriteEndianEnums (42384 of 43032)
PASS: LLVM-Unit :: Support/./SupportTests/YAMLIO.TestReadWriteBuiltInTypes (42385 of 43032)
PASS: LLVM-Unit :: Support/./SupportTests/YAMLIO.TestReadWriteBlockScalarValue (42386 of 43032)
PASS: LLVM-Unit :: Support/./SupportTests/YAMLIO.TestReadWriteEndianTypes (42387 of 43032)
PASS: LLVM-Unit :: Support/./SupportTests/YAMLIO.TestReadWriteFlags (42388 of 43032)
PASS: LLVM-Unit :: Support/./SupportTests/YAMLIO.TestReadWriteKindAndFlagsSequence (42389 of 43032)
PASS: LLVM-Unit :: Support/./SupportTests/YAMLIO.TestReadWriteMultilineStringType (42390 of 43032)
PASS: LLVM-Unit :: Support/./SupportTests/YAMLIO.TestReadWriteMyCustomType (42391 of 43032)
PASS: LLVM-Unit :: Support/./SupportTests/YAMLIO.TestReadWriteMyFlowSequence (42392 of 43032)
PASS: LLVM-Unit :: Support/./SupportTests/YAMLIO.TestReadWriteMyFlowMapping (42393 of 43032)
PASS: LLVM-Unit :: Support/./SupportTests/YAMLIO.TestReadWriteMySecondsSequence (42394 of 43032)
PASS: LLVM-Unit :: Support/./SupportTests/YAMLIO.TestReadWritePolymorphicScalar (42395 of 43032)
PASS: LLVM-Unit :: Support/./SupportTests/YAMLIO.TestReadWritePolymorphicMap (42396 of 43032)
PASS: LLVM-Unit :: Support/./SupportTests/YAMLIO.TestReadWritePolymorphicSeq (42397 of 43032)
PASS: LLVM-Unit :: Support/./SupportTests/YAMLIO.TestReadWriteSequenceOfMyFlowSequence (42398 of 43032)
PASS: LLVM-Unit :: Support/./SupportTests/YAMLIO.TestReadWriteStringTypes (42399 of 43032)
PASS: LLVM-Unit :: Support/./SupportTests/YAMLIO.TestScannerNoNullDecodeInvalidUTF8 (42400 of 43032)
PASS: LLVM-Unit :: Support/./SupportTests/YAMLIO.TestScannerNoNullEmptyAlias (42401 of 43032)
PASS: LLVM-Unit :: Support/./SupportTests/YAMLIO.TestScannerNoNullEmpty (42402 of 43032)
PASS: LLVM-Unit :: Support/./SupportTests/YAMLIO.TestScannerNoNullEmptyAnchor (42403 of 43032)
PASS: LLVM-Unit :: Support/./SupportTests/YAMLIO.TestScannerNoNullEmptyMap (42404 of 43032)
PASS: LLVM-Unit :: Support/./SupportTests/YAMLIO.TestScannerNoNullEmptySequence (42405 of 43032)
PASS: LLVM-Unit :: Support/./SupportTests/YAMLIO.TestScannerNoNullScalarUnbalancedDoubleQuote (42406 of 43032)
PASS: LLVM-Unit :: Support/./SupportTests/YAMLIO.TestScannerNoNullScalarUnbalancedSingleQuote (42407 of 43032)
PASS: LLVM-Unit :: Support/./SupportTests/YAMLIO.TestScannerNoNullSimpleSequence (42408 of 43032)
PASS: LLVM-Unit :: Support/./SupportTests/YAMLIO.TestScannerNoNullScanPlainScalarInFlow (42409 of 43032)
PASS: LLVM-Unit :: Support/./SupportTests/YAMLIO.TestScannerNoNullSequenceOfNull (42410 of 43032)
PASS: LLVM-Unit :: Support/./SupportTests/YAMLIO.TestScannerNoNullUnbalancedMap (42411 of 43032)
PASS: LLVM-Unit :: Support/./SupportTests/YAMLIO.TestScannerUnexpectedCharacter (42412 of 43032)
PASS: LLVM-Unit :: Support/./SupportTests/YAMLIO.TestScannerNoNullUnbalancedSequence (42413 of 43032)
PASS: LLVM-Unit :: Support/./SupportTests/YAMLIO.TestSequenceDocListWriteAndRead (42414 of 43032)
PASS: LLVM-Unit :: Support/./SupportTests/YAMLIO.TestSequenceMapWriteAndRead (42415 of 43032)
PASS: LLVM-Unit :: Support/./SupportTests/YAMLIO.TestTaggedDocuments (42416 of 43032)
PASS: LLVM-Unit :: Support/./SupportTests/YAMLIO.TestSequenceMapRead (42417 of 43032)
PASS: LLVM-Unit :: Support/./SupportTests/YAMLIO.TestTaggedDocumentsWriteAndRead (42418 of 43032)
PASS: LLVM-Unit :: Support/./SupportTests/YAMLIO.TestUnescapeInfiniteLoop (42419 of 43032)
PASS: LLVM-Unit :: Support/./SupportTests/YAMLIO.TestValidatingInput (42420 of 43032)
PASS: LLVM-Unit :: Support/./SupportTests/YAMLIO.TestUnknownDirective (42421 of 43032)
PASS: LLVM-Unit :: Support/./SupportTests/YAMLIO.TestWrapFlow (42422 of 43032)
PASS: LLVM-Unit :: Support/./SupportTests/YAMLParser.DifferentNodesIteratorOperatorEquals (42423 of 43032)
PASS: LLVM-Unit :: Support/./SupportTests/YAMLParser.DefaultDiagnosticFilename (42424 of 43032)
PASS: LLVM-Unit :: Support/./SupportTests/YAMLParser.DiagnosticFilenameFromBufferID (42425 of 43032)
PASS: LLVM-Unit :: Support/./SupportTests/YAMLParser.DifferentNodesIteratorOperatorNotEquals (42426 of 43032)
PASS: LLVM-Unit :: Support/./SupportTests/YAMLParser.FailsIfMissingColon (42427 of 43032)
PASS: LLVM-Unit :: Support/./SupportTests/YAMLParser.FailsIfNotClosingArray (42428 of 43032)
PASS: LLVM-Unit :: Support/./SupportTests/YAMLParser.FailsIfNotClosingObject (42429 of 43032)
PASS: LLVM-Unit :: Support/./SupportTests/YAMLParser.FailsOnMissingComma (42430 of 43032)
PASS: LLVM-Unit :: Support/./SupportTests/YAMLParser.FailsOnMissingQuote (42431 of 43032)
PASS: LLVM-Unit :: Support/./SupportTests/YAMLParser.FlowSequenceTokensOutsideFlowSequence (42432 of 43032)
PASS: LLVM-Unit :: Support/./SupportTests/YAMLParser.HandlesNullValuesInKeyValueNodesGracefully (42433 of 43032)
PASS: LLVM-Unit :: Support/./SupportTests/YAMLParser.HandlesEndOfFileGracefully (42434 of 43032)
PASS: LLVM-Unit :: Support/./SupportTests/YAMLParser.ParsesBlockLiteralScalars (42435 of 43032)
PASS: LLVM-Unit :: Support/./SupportTests/YAMLParser.NullTerminatedBlockScalars (42436 of 43032)
PASS: LLVM-Unit :: Support/./SupportTests/YAMLParser.ParsesArrayOfArrays (42437 of 43032)
PASS: LLVM-Unit :: Support/./SupportTests/YAMLParser.ParsesBools (42438 of 43032)
PASS: LLVM-Unit :: Support/./SupportTests/YAMLParser.ParsesEmptyArray (42439 of 43032)
PASS: LLVM-Unit :: Support/./SupportTests/YAMLParser.ParsesEmptyArrayWithWhitespace (42440 of 43032)
PASS: LLVM-Unit :: Support/./SupportTests/YAMLParser.ParsesEmptyObject (42441 of 43032)
PASS: LLVM-Unit :: Support/./SupportTests/YAMLParser.ParsesEscapedQuotes (42442 of 43032)
PASS: LLVM-Unit :: Support/./SupportTests/YAMLParser.ParsesEmptyString (42443 of 43032)
PASS: LLVM-Unit :: Support/./SupportTests/YAMLParser.ParsesMultipleKeyValuePairsInObject (42444 of 43032)
PASS: LLVM-Unit :: Support/./SupportTests/YAMLParser.ParsesMultipleObjects (42445 of 43032)
PASS: LLVM-Unit :: Support/./SupportTests/YAMLParser.ParsesObject (42446 of 43032)
PASS: LLVM-Unit :: Support/./SupportTests/YAMLParser.ParsesSpacesInBetweenTokens (42447 of 43032)
PASS: LLVM-Unit :: Support/./SupportTests/YAMLParser.SameNodeIteratorOperatorEquals (42448 of 43032)
PASS: LLVM-Unit :: Support/./SupportTests/YAMLParser.ParsesStrings (42449 of 43032)
PASS: LLVM-Unit :: Support/./SupportTests/YAMLParser.SameNodeIteratorOperatorNotEquals (42450 of 43032)
PASS: LLVM-Unit :: Support/./SupportTests/YAMLParser.WorksWithIteratorAlgorithms (42451 of 43032)
PASS: LLVM-Unit :: Support/./SupportTests/formatted_raw_ostreamTest.Test_Tell (42452 of 43032)
PASS: LLVM-Unit :: Support/./SupportTests/formatted_raw_ostreamTest.Test_LineColumn (42453 of 43032)
PASS: LLVM-Unit :: Support/./SupportTests/formatted_raw_ostreamTest.Test_Flush (42454 of 43032)
PASS: LLVM-Unit :: Support/./SupportTests/formatted_raw_ostreamTest.Test_UTF8 (42455 of 43032)
PASS: LLVM-Unit :: Support/./SupportTests/formatted_raw_ostreamTest.Test_UTF8Buffered (42456 of 43032)
PASS: LLVM-Unit :: Support/./SupportTests/formatted_raw_ostreamTest.Test_UTF8TinyBuffer (42457 of 43032)
PASS: LLVM-Unit :: Support/./SupportTests/getLinuxHostCPUName.AArch64 (42458 of 43032)
PASS: LLVM-Unit :: Support/./SupportTests/getSwappedBytes.SignedRoundTrip (42459 of 43032)
PASS: LLVM-Unit :: Support/./SupportTests/getLinuxHostCPUName.ARM (42460 of 43032)
PASS: LLVM-Unit :: Support/./SupportTests/getSwappedBytes.double (42461 of 43032)
PASS: LLVM-Unit :: Support/./SupportTests/getSwappedBytes.UnsignedRoundTrip (42462 of 43032)
PASS: LLVM-Unit :: Support/./SupportTests/getSwappedBytes.float (42463 of 43032)
PASS: LLVM-Unit :: Support/./SupportTests/getSwappedBytes.int16_t (42464 of 43032)
PASS: LLVM-Unit :: Support/./SupportTests/getSwappedBytes.int32_t (42465 of 43032)
PASS: LLVM-Unit :: Support/./SupportTests/getSwappedBytes.int64_t (42466 of 43032)
PASS: LLVM-Unit :: Support/./SupportTests/getSwappedBytes.int8_t (42467 of 43032)
PASS: LLVM-Unit :: Support/./SupportTests/getSwappedBytes.uint8_t (42468 of 43032)
PASS: LLVM-Unit :: Support/./SupportTests/getSwappedBytes.uint16_t (42469 of 43032)
PASS: LLVM-Unit :: Support/./SupportTests/getSwappedBytes.uint64_t (42470 of 43032)
PASS: LLVM-Unit :: Support/./SupportTests/getSwappedBytes.uint32_t (42471 of 43032)
PASS: LLVM-Unit :: Support/./SupportTests/is_separator.Works (42472 of 43032)
PASS: LLVM-Unit :: Support/./SupportTests/is_absolute_gnu.Works (42473 of 43032)
PASS: LLVM-Unit :: Support/./SupportTests/raw_fd_streamTest.DynCast (42474 of 43032)
PASS: LLVM-Unit :: Support/./SupportTests/raw_fd_ostreamTest.multiple_raw_fd_ostream_to_stdout (42475 of 43032)
PASS: LLVM-Unit :: Support/./SupportTests/raw_ostreamTest.Colors (42476 of 43032)
PASS: LLVM-Unit :: Support/./SupportTests/raw_fd_streamTest.ReadAfterWrite (42477 of 43032)
PASS: LLVM-Unit :: Support/./SupportTests/raw_ostreamTest.FormatDecimal (42478 of 43032)
PASS: LLVM-Unit :: Support/./SupportTests/raw_ostreamTest.BufferEdge (42479 of 43032)
PASS: LLVM-Unit :: Support/./SupportTests/raw_ostreamTest.FormattedHexBytes (42480 of 43032)
PASS: LLVM-Unit :: Support/./SupportTests/raw_ostreamTest.FormatHex (42481 of 43032)
PASS: LLVM-Unit :: Support/./SupportTests/raw_ostreamTest.Justify (42482 of 43032)
PASS: LLVM-Unit :: Support/./SupportTests/raw_ostreamTest.WriteEscaped (42483 of 43032)
PASS: LLVM-Unit :: Support/./SupportTests/raw_ostreamTest.TinyBuffer (42484 of 43032)
PASS: LLVM-Unit :: Support/./SupportTests/raw_ostreamTest.Types_Unbuffered (42485 of 43032)
PASS: LLVM-Unit :: Support/./SupportTests/raw_ostreamTest.Types_Buffered (42486 of 43032)
PASS: LLVM-Unit :: Support/./SupportTests/raw_ostreamTest.writeToDevNull (42487 of 43032)
PASS: LLVM-Unit :: Support/./SupportTests/raw_ostreamTest.flush_tied_to_stream_on_write (42488 of 43032)
PASS: LLVM-Unit :: Support/./SupportTests/raw_ostreamTest.reserve_stream (42489 of 43032)
PASS: LLVM-Unit :: Support/./SupportTests/raw_ostreamTest.writeToNonexistingPath (42490 of 43032)
PASS: LLVM-Unit :: Support/./SupportTests/raw_ostreamTest.writeToOutputFile (42491 of 43032)
PASS: LLVM-Unit :: Support/./SupportTests/raw_ostreamTest.writeToStdOut (42492 of 43032)
PASS: LLVM-Unit :: Support/./SupportTests/raw_sha1_ostreamTest.Intermediate (42493 of 43032)
PASS: LLVM-Unit :: Support/./SupportTests/raw_pwrite_ostreamTest.TestDevNull (42494 of 43032)
PASS: LLVM-Unit :: Support/./SupportTests/raw_pwrite_ostreamTest.TestSVector (42495 of 43032)
PASS: LLVM-Unit :: Support/./SupportTests/raw_pwrite_ostreamTest.TestFD (42496 of 43032)
PASS: LLVM-Unit :: Support/./SupportTests/raw_sha1_ostreamTest.Basic (42497 of 43032)
PASS: LLVM-Unit :: Support/./SupportTests/raw_sha1_ostreamTest.Reset (42498 of 43032)
PASS: LLVM-Unit :: Support/./SupportTests/rename.ExistingTemp (42499 of 43032)
PASS: LLVM-Unit :: Support/./SupportTests/rename.FileOpenedForReadingCanBeReplaced (42500 of 43032)
PASS: LLVM-Unit :: Support/./SupportTests/sha1_hash_test.Basic (42501 of 43032)
PASS: LLVM-Unit :: Support/./SupportTests/sha1_hash_test.Update (42502 of 43032)
PASS: LLVM-Unit :: Support/./SupportTests/swapByteOrder.int16_t (42503 of 43032)
PASS: LLVM-Unit :: Support/./SupportTests/swapByteOrder.float (42504 of 43032)
PASS: LLVM-Unit :: Support/./SupportTests/swapByteOrder.double (42505 of 43032)
PASS: LLVM-Unit :: Support/./SupportTests/swapByteOrder.int32_t (42506 of 43032)
PASS: LLVM-Unit :: Support/./SupportTests/swapByteOrder.int64_t (42507 of 43032)
PASS: LLVM-Unit :: Support/./SupportTests/swapByteOrder.int8_t (42508 of 43032)
PASS: LLVM-Unit :: Support/./SupportTests/swapByteOrder.uint16_t (42509 of 43032)
PASS: LLVM-Unit :: Support/./SupportTests/swapByteOrder.uint32_t (42510 of 43032)
PASS: LLVM-Unit :: Support/./SupportTests/swapByteOrder.uint64_t (42511 of 43032)
PASS: LLVM-Unit :: Support/./SupportTests/swapByteOrder.uint8_t (42512 of 43032)
PASS: LLVM-Unit :: Support/./SupportTests/writeFileAtomicallyTest.Test (42513 of 43032)
PASS: LLVM-Unit :: Support/./SupportTests/xxhashTest.Basic (42514 of 43032)
PASS: LLVM-Unit :: TableGen/./TableGenTests/Automata.BinPackerAutomatonAccepts (42515 of 43032)
PASS: LLVM-Unit :: Support/DynamicLibrary/./DynamicLibraryTests/DynamicLibrary.Overload (42516 of 43032)
PASS: LLVM-Unit :: Support/DynamicLibrary/./DynamicLibraryTests/DynamicLibrary.Shutdown (42517 of 43032)
PASS: LLVM-Unit :: TableGen/./TableGenTests/Automata.BinPackerAutomatonExplains (42518 of 43032)
PASS: LLVM-Unit :: TableGen/./TableGenTests/Automata.NfaAutomatonAccepts (42519 of 43032)
PASS: LLVM-Unit :: TableGen/./TableGenTests/Automata.SimpleAutomatonAcceptsFromInitialState (42520 of 43032)
PASS: LLVM-Unit :: TableGen/./TableGenTests/Automata.TupleAutomatonAccepts (42521 of 43032)
PASS: LLVM-Unit :: TableGen/./TableGenTests/Automata.SimpleAutomatonAcceptsSequences (42522 of 43032)
PASS: LLVM-Unit :: TableGen/./TableGenTests/CodeExpander.EscapedExpansion (42523 of 43032)
PASS: LLVM-Unit :: TableGen/./TableGenTests/CodeExpander.Escape (42524 of 43032)
PASS: LLVM-Unit :: TableGen/./TableGenTests/CodeExpander.EscapedUnterminatedExpansion (42525 of 43032)
PASS: LLVM-Unit :: TableGen/./TableGenTests/CodeExpander.EscapedNotAnExpansion (42526 of 43032)
PASS: LLVM-Unit :: TableGen/./TableGenTests/CodeExpander.NoExpansions (42527 of 43032)
PASS: LLVM-Unit :: TableGen/./TableGenTests/CodeExpander.NotAnExpansion (42528 of 43032)
PASS: LLVM-Unit :: TableGen/./TableGenTests/CodeExpander.UndefinedExpansion (42529 of 43032)
PASS: LLVM-Unit :: TableGen/./TableGenTests/CodeExpander.Indentation (42530 of 43032)
PASS: LLVM-Unit :: TableGen/./TableGenTests/CodeExpander.UnterminatedExpansion (42531 of 43032)
PASS: LLVM-Unit :: Target/AArch64/./AArch64Tests/StackOffset.decomposeStackOffsetForFrameOffsets (42532 of 43032)
PASS: LLVM-Unit :: Target/AArch64/./AArch64Tests/InstSizes.STACKMAP (42533 of 43032)
PASS: LLVM-Unit :: Target/AArch64/./AArch64Tests/InstSizes.PATCHPOINT (42534 of 43032)
PASS: LLVM-Unit :: Target/AArch64/./AArch64Tests/InstSizes.TLSDESC_CALLSEQ (42535 of 43032)
PASS: LLVM-Unit :: Target/AArch64/./AArch64Tests/InstSizes.Authenticated (42536 of 43032)
PASS: LLVM-Unit :: Target/AMDGPU/./AMDGPUTests/AMDGPUDwarfRegMappingTests.TestWave64DwarfRegMapping (42537 of 43032)
PASS: LLVM-Unit :: Target/AMDGPU/./AMDGPUTests/AMDGPUDwarfRegMappingTests.TestWave32DwarfRegMapping (42538 of 43032)
PASS: LLVM-Unit :: Target/AMDGPU/./AMDGPUTests/AMDGPUExecMayBeModifiedBeforeAnyUse.TheTest (42539 of 43032)
PASS: LLVM-Unit :: Target/ARM/./ARMTests/MachineInstructionDoubleWidthResult.IsCorrect (42540 of 43032)
PASS: LLVM-Unit :: Target/ARM/./ARMTests/MachineInstr.HasSideEffects (42541 of 43032)
PASS: LLVM-Unit :: Target/ARM/./ARMTests/MachineInstrValidTailPredication.IsCorrect (42542 of 43032)
PASS: LLVM-Unit :: Target/ARM/./ARMTests/MachineInstructionHorizontalReduction.IsCorrect (42543 of 43032)
PASS: LLVM-Unit :: Target/ARM/./ARMTests/MachineInstructionRetainsPreviousHalfElement.IsCorrect (42544 of 43032)
PASS: LLVM-Unit :: Target/PowerPC/./PowerPCTests/AIXRelocModelTest.DefalutToPIC (42545 of 43032)
PASS: LLVM-Unit :: TextAPI/./TextAPITests/TBDv1.MalformedFile1 (42546 of 43032)
PASS: LLVM-Unit :: Target/X86/./X86Tests/MachineSizeOptsTest.Test (42547 of 43032)
PASS: LLVM-Unit :: TextAPI/./TextAPITests/TBDv1.MalformedFile2 (42548 of 43032)
PASS: LLVM-Unit :: Target/WebAssembly/./WebAssemblyTests/WebAssemblyExceptionInfoTest.TEST0 (42549 of 43032)
PASS: LLVM-Unit :: Target/WebAssembly/./WebAssemblyTests/WebAssemblyExceptionInfoTest.TEST1 (42550 of 43032)
PASS: LLVM-Unit :: TextAPI/./TextAPITests/TBDv1.Platform_bridgeOS (42551 of 43032)
PASS: LLVM-Unit :: TextAPI/./TextAPITests/TBDv1.Platform_iOS (42552 of 43032)
PASS: LLVM-Unit :: TextAPI/./TextAPITests/TBDv1.Platform_macOS (42553 of 43032)
PASS: LLVM-Unit :: TextAPI/./TextAPITests/TBDv1.Platform_watchOS (42554 of 43032)
PASS: LLVM-Unit :: TextAPI/./TextAPITests/TBDv1.ReadFile (42555 of 43032)
PASS: LLVM-Unit :: TextAPI/./TextAPITests/TBDv1.Platform_tvOS (42556 of 43032)
PASS: LLVM-Unit :: TextAPI/./TextAPITests/TBDv1.Swift_1_1 (42557 of 43032)
PASS: LLVM-Unit :: TextAPI/./TextAPITests/TBDv1.Swift_1_0 (42558 of 43032)
PASS: LLVM-Unit :: TextAPI/./TextAPITests/TBDv1.Swift_2_0 (42559 of 43032)
PASS: LLVM-Unit :: TextAPI/./TextAPITests/TBDv1.ReadFile2 (42560 of 43032)
PASS: LLVM-Unit :: TextAPI/./TextAPITests/TBDv1.Swift_3_0 (42561 of 43032)
PASS: LLVM-Unit :: TextAPI/./TextAPITests/TBDv1.Swift_4_0 (42562 of 43032)
PASS: LLVM-Unit :: TextAPI/./TextAPITests/TBDv1.Swift_5 (42563 of 43032)
PASS: LLVM-Unit :: TextAPI/./TextAPITests/TBDv1.Swift_99 (42564 of 43032)
PASS: LLVM-Unit :: TextAPI/./TextAPITests/TBDv1.UnknownPlatform (42565 of 43032)
PASS: LLVM-Unit :: TextAPI/./TextAPITests/TBDv1.UnknownArchitecture (42566 of 43032)
PASS: LLVM-Unit :: TextAPI/./TextAPITests/TBDv2.InvalidPlatform (42567 of 43032)
PASS: LLVM-Unit :: TextAPI/./TextAPITests/TBDv1.WriteFile (42568 of 43032)
PASS: LLVM-Unit :: TextAPI/./TextAPITests/TBDv2.MalformedFile1 (42569 of 43032)
PASS: LLVM-Unit :: TextAPI/./TextAPITests/TBDv2.MalformedFile2 (42570 of 43032)
PASS: LLVM-Unit :: TextAPI/./TextAPITests/TBDv2.Platform_tvOS (42571 of 43032)
PASS: LLVM-Unit :: TextAPI/./TextAPITests/TBDv2.Platform_bridgeOS (42572 of 43032)
PASS: LLVM-Unit :: TextAPI/./TextAPITests/TBDv2.Platform_macOS (42573 of 43032)
PASS: LLVM-Unit :: TextAPI/./TextAPITests/TBDv2.Platform_iOS (42574 of 43032)
PASS: LLVM-Unit :: TextAPI/./TextAPITests/TBDv2.Platform_watchOS (42575 of 43032)
PASS: LLVM-Unit :: TextAPI/./TextAPITests/TBDv2.ReadFile (42576 of 43032)
PASS: LLVM-Unit :: TextAPI/./TextAPITests/TBDv2.ReadFile2 (42577 of 43032)
PASS: LLVM-Unit :: TextAPI/./TextAPITests/TBDv2.Swift_1_0 (42578 of 43032)
PASS: LLVM-Unit :: TextAPI/./TextAPITests/TBDv2.Swift_1_1 (42579 of 43032)
PASS: LLVM-Unit :: TextAPI/./TextAPITests/TBDv2.Swift_4_0 (42580 of 43032)
PASS: LLVM-Unit :: TextAPI/./TextAPITests/TBDv2.Swift_3_0 (42581 of 43032)
PASS: LLVM-Unit :: TextAPI/./TextAPITests/TBDv2.Swift_2_0 (42582 of 43032)
PASS: LLVM-Unit :: TextAPI/./TextAPITests/TBDv2.Swift_5 (42583 of 43032)
PASS: LLVM-Unit :: TextAPI/./TextAPITests/TBDv2.Swift_99 (42584 of 43032)
PASS: LLVM-Unit :: TextAPI/./TextAPITests/TBDv2.UnknownArchitecture (42585 of 43032)
PASS: LLVM-Unit :: TextAPI/./TextAPITests/TBDv2.UnknownPlatform (42586 of 43032)
PASS: LLVM-Unit :: TextAPI/./TextAPITests/TBDv2.WriteFile (42587 of 43032)
PASS: LLVM-Unit :: TextAPI/./TextAPITests/TBDv3.InterfaceInequality (42588 of 43032)
PASS: LLVM-Unit :: TextAPI/./TextAPITests/TBDv3.InterfaceEquality (42589 of 43032)
PASS: LLVM-Unit :: TextAPI/./TextAPITests/TBDv3.MalformedFile1 (42590 of 43032)
PASS: LLVM-Unit :: TextAPI/./TextAPITests/TBDv3.Arch_arm64e (42591 of 43032)
PASS: LLVM-Unit :: TextAPI/./TextAPITests/TBDv3.MalformedFile2 (42592 of 43032)
PASS: LLVM-Unit :: TextAPI/./TextAPITests/TBDv3.Platform_bridgeOS (42593 of 43032)
PASS: LLVM-Unit :: TextAPI/./TextAPITests/TBDv3.Platform_iOS (42594 of 43032)
PASS: LLVM-Unit :: TextAPI/./TextAPITests/TBDv3.Platform_iOSSim (42595 of 43032)
PASS: LLVM-Unit :: TextAPI/./TextAPITests/TBDv3.Platform_macOS (42596 of 43032)
PASS: LLVM-Unit :: TextAPI/./TextAPITests/TBDv3.Platform_macCatalyst (42597 of 43032)
PASS: LLVM-Unit :: TextAPI/./TextAPITests/TBDv3.Platform_tvOSSim (42598 of 43032)
PASS: LLVM-Unit :: TextAPI/./TextAPITests/TBDv3.Platform_tvOS (42599 of 43032)
PASS: LLVM-Unit :: TextAPI/./TextAPITests/TBDv3.Platform_watchOS (42600 of 43032)
PASS: LLVM-Unit :: TextAPI/./TextAPITests/TBDv3.Platform_watchOSSim (42601 of 43032)
PASS: LLVM-Unit :: TextAPI/./TextAPITests/TBDv3.Platform_zippered (42602 of 43032)
PASS: LLVM-Unit :: TextAPI/./TextAPITests/TBDv3.ReadFile (42603 of 43032)
PASS: LLVM-Unit :: TextAPI/./TextAPITests/TBDv3.ReadMultipleDocuments (42604 of 43032)
PASS: LLVM-Unit :: TextAPI/./TextAPITests/TBDv3.Swift_1_0 (42605 of 43032)
PASS: LLVM-Unit :: TextAPI/./TextAPITests/TBDv3.Swift_1_1 (42606 of 43032)
PASS: LLVM-Unit :: TextAPI/./TextAPITests/TBDv3.Swift_2_0 (42607 of 43032)
PASS: LLVM-Unit :: TextAPI/./TextAPITests/TBDv3.Swift_3_0 (42608 of 43032)
PASS: LLVM-Unit :: TextAPI/./TextAPITests/TBDv3.Swift_4_0 (42609 of 43032)
PASS: LLVM-Unit :: TextAPI/./TextAPITests/TBDv3.Swift_5 (42610 of 43032)
PASS: LLVM-Unit :: TextAPI/./TextAPITests/TBDv3.Swift_99 (42611 of 43032)
PASS: LLVM-Unit :: TextAPI/./TextAPITests/TBDv3.UnknownArchitecture (42612 of 43032)
PASS: LLVM-Unit :: TextAPI/./TextAPITests/TBDv3.UnknownPlatform (42613 of 43032)
PASS: LLVM-Unit :: TextAPI/./TextAPITests/TBDv3.WriteFile (42614 of 43032)
PASS: LLVM-Unit :: TextAPI/./TextAPITests/TBDv4.InterfaceDiffVersionsEquality (42615 of 43032)
PASS: LLVM-Unit :: TextAPI/./TextAPITests/TBDv3.WriteMultipleDocuments (42616 of 43032)
PASS: LLVM-Unit :: TextAPI/./TextAPITests/TBDv4.InterfaceEquality (42617 of 43032)
PASS: LLVM-Unit :: TextAPI/./TextAPITests/TBDv4.InterfaceInequality (42618 of 43032)
PASS: LLVM-Unit :: TextAPI/./TextAPITests/TBDv4.InvalidArchitecture (42619 of 43032)
PASS: LLVM-Unit :: TextAPI/./TextAPITests/TBDv4.InvalidPlatform (42620 of 43032)
PASS: LLVM-Unit :: TextAPI/./TextAPITests/TBDv4.MalformedFile1 (42621 of 43032)
PASS: LLVM-Unit :: TextAPI/./TextAPITests/TBDv4.MalformedFile2 (42622 of 43032)
PASS: LLVM-Unit :: TextAPI/./TextAPITests/TBDv4.MultipleTargets (42623 of 43032)
PASS: LLVM-Unit :: TextAPI/./TextAPITests/TBDv4.MalformedFile3 (42624 of 43032)
PASS: LLVM-Unit :: TextAPI/./TextAPITests/TBDv4.MultipleTargetsSameArch (42625 of 43032)
PASS: LLVM-Unit :: TextAPI/./TextAPITests/TBDv4.MultipleTargetsSamePlatform (42626 of 43032)
PASS: LLVM-Unit :: TextAPI/./TextAPITests/TBDv4.ReadFile (42627 of 43032)
PASS: LLVM-Unit :: TextAPI/./TextAPITests/TBDv4.ReadMultipleDocuments (42628 of 43032)
PASS: LLVM-Unit :: TextAPI/./TextAPITests/TBDv4.Swift_1 (42629 of 43032)
PASS: LLVM-Unit :: TextAPI/./TextAPITests/TBDv4.Swift_5 (42630 of 43032)
PASS: LLVM-Unit :: TextAPI/./TextAPITests/TBDv4.Target_arm_bridgeOS (42631 of 43032)
PASS: LLVM-Unit :: TextAPI/./TextAPITests/TBDv4.Swift_2 (42632 of 43032)
PASS: LLVM-Unit :: TextAPI/./TextAPITests/TBDv4.Swift_99 (42633 of 43032)
PASS: LLVM-Unit :: TextAPI/./TextAPITests/TBDv4.Target_arm_iOS (42634 of 43032)
PASS: LLVM-Unit :: TextAPI/./TextAPITests/TBDv4.Target_i386_driverkit (42635 of 43032)
PASS: LLVM-Unit :: TextAPI/./TextAPITests/TBDv4.Target_i386_watchos_simulator (42636 of 43032)
PASS: LLVM-Unit :: TextAPI/./TextAPITests/TBDv4.Target_maccatalyst (42637 of 43032)
PASS: LLVM-Unit :: TextAPI/./TextAPITests/TBDv4.Target_x86_ios (42638 of 43032)
PASS: LLVM-Unit :: TextAPI/./TextAPITests/TBDv4.Target_x86_macos (42639 of 43032)
PASS: LLVM-Unit :: TextAPI/./TextAPITests/TBDv4.Target_x86_ios_simulator (42640 of 43032)
PASS: LLVM-Unit :: TextAPI/./TextAPITests/TBDv4.WriteFile (42641 of 43032)
PASS: LLVM-Unit :: TextAPI/./TextAPITests/TBDv4.WriteMultipleDocuments (42642 of 43032)
PASS: LLVM-Unit :: TextAPI/./TextAPITests/TBDv4.Target_x86_tvos_simulator (42643 of 43032)
PASS: LLVM-Unit :: Transforms/IPO/./IPOTests/AttributorTestBase.IRPPositionCallBaseContext (42644 of 43032)
PASS: LLVM-Unit :: Transforms/IPO/./IPOTests/AttributorTestBase.TestCast (42645 of 43032)
PASS: LLVM-Unit :: Transforms/IPO/./IPOTests/LowerTypeTests.BitSetBuilder (42646 of 43032)
PASS: LLVM-Unit :: Transforms/IPO/./IPOTests/LowerTypeTests.GlobalLayoutBuilder (42647 of 43032)
PASS: LLVM-Unit :: Transforms/IPO/./IPOTests/LowerTypeTests.ByteArrayBuilder (42648 of 43032)
PASS: LLVM-Unit :: Transforms/IPO/./IPOTests/WholeProgramDevirt.findLowestOffset (42649 of 43032)
PASS: LLVM-Unit :: Transforms/IPO/./IPOTests/WholeProgramDevirt.setReturnValues (42650 of 43032)
PASS: LLVM-Unit :: Transforms/Scalar/./ScalarTests/LICMTest.TestSCEVInvalidationOnHoisting (42651 of 43032)
PASS: LLVM-Unit :: Transforms/Scalar/./ScalarTests/LoopPassManagerTest.Basic (42652 of 43032)
PASS: LLVM-Unit :: Transforms/Scalar/./ScalarTests/LoopPassManagerTest.FunctionPassInvalidationOfLoopAnalyses (42653 of 43032)
PASS: LLVM-Unit :: Transforms/Scalar/./ScalarTests/LoopPassManagerTest.HandleLoopNestPass (42654 of 43032)
PASS: LLVM-Unit :: Transforms/Scalar/./ScalarTests/LoopPassManagerTest.IndirectInvalidation (42655 of 43032)
PASS: LLVM-Unit :: Transforms/Scalar/./ScalarTests/LoopPassManagerTest.IndirectOuterPassInvalidation (42656 of 43032)
PASS: LLVM-Unit :: Transforms/Scalar/./ScalarTests/LoopPassManagerTest.InvalidationOfBundledAnalyses (42657 of 43032)
PASS: LLVM-Unit :: Transforms/Scalar/./ScalarTests/LoopPassManagerTest.LoopDeletion (42658 of 43032)
PASS: LLVM-Unit :: Transforms/Scalar/./ScalarTests/LoopPassManagerTest.LoopChildInsertion (42659 of 43032)
PASS: LLVM-Unit :: Transforms/Scalar/./ScalarTests/LoopPassManagerTest.LoopPeerInsertion (42660 of 43032)
PASS: LLVM-Unit :: Transforms/Scalar/./ScalarTests/LoopPassManagerTest.ModulePassInvalidationOfLoopAnalyses (42661 of 43032)
PASS: LLVM-Unit :: Transforms/Utils/./UtilsTests/ASanStackFrameLayout.Test (42662 of 43032)
PASS: LLVM-Unit :: Transforms/Utils/./UtilsTests/BasicBlockUtils.EliminateUnreachableBlocks (42663 of 43032)
PASS: LLVM-Unit :: Transforms/Utils/./UtilsTests/BasicBlockUtils.SplitCriticalEdge (42664 of 43032)
PASS: LLVM-Unit :: Transforms/Utils/./UtilsTests/BasicBlockUtils.SplitBlockPredecessors (42665 of 43032)
PASS: LLVM-Unit :: Transforms/Utils/./UtilsTests/BasicBlockUtils.NoUnreachableBlocksToEliminate (42666 of 43032)
PASS: LLVM-Unit :: Transforms/Utils/./UtilsTests/BasicBlockUtils.SetEdgeProbability (42667 of 43032)
PASS: LLVM-Unit :: Transforms/Utils/./UtilsTests/BasicBlockUtils.SplitEdge_ex1 (42668 of 43032)
PASS: LLVM-Unit :: Transforms/Utils/./UtilsTests/BasicBlockUtils.SplitEdge_ex2 (42669 of 43032)
PASS: LLVM-Unit :: Transforms/Utils/./UtilsTests/BasicBlockUtils.SplitEdge_ex3 (42670 of 43032)
PASS: LLVM-Unit :: Transforms/Utils/./UtilsTests/BasicBlockUtils.SplitIndirectBrCriticalEdge (42671 of 43032)
PASS: LLVM-Unit :: Transforms/Utils/./UtilsTests/BasicBlockUtils.splitBasicBlockBefore_ex1 (42672 of 43032)
PASS: LLVM-Unit :: Transforms/Utils/./UtilsTests/CallPromotionUtilsTest.TryPromoteCall (42673 of 43032)
PASS: LLVM-Unit :: Transforms/Utils/./UtilsTests/CallPromotionUtilsTest.TryPromoteCall_EmptyVTable (42674 of 43032)
PASS: LLVM-Unit :: Transforms/Utils/./UtilsTests/CallPromotionUtilsTest.TryPromoteCall_Legality (42675 of 43032)
PASS: LLVM-Unit :: Transforms/Utils/./UtilsTests/CallPromotionUtilsTest.TryPromoteCall_MemberFunctionCalls (42676 of 43032)
PASS: LLVM-Unit :: Transforms/Utils/./UtilsTests/CallPromotionUtilsTest.TryPromoteCall_NoFPLoad (42677 of 43032)
PASS: LLVM-Unit :: Transforms/Utils/./UtilsTests/CallPromotionUtilsTest.TryPromoteCall_NoVTableInitFound (42678 of 43032)
PASS: LLVM-Unit :: Transforms/Utils/./UtilsTests/CallPromotionUtilsTest.TryPromoteCall_NoVTablePtrLoad (42679 of 43032)
PASS: LLVM-Unit :: Transforms/Utils/./UtilsTests/CallPromotionUtilsTest.TryPromoteCall_NullFP (42680 of 43032)
PASS: LLVM-Unit :: Transforms/Utils/./UtilsTests/CloneFunc.DebugIntrinsics (42681 of 43032)
PASS: LLVM-Unit :: Transforms/Utils/./UtilsTests/CloneFunc.Subprogram (42682 of 43032)
PASS: LLVM-Unit :: Transforms/Utils/./UtilsTests/CloneFunc.InstructionOwnership (42683 of 43032)
PASS: LLVM-Unit :: Transforms/Utils/./UtilsTests/CloneFunc.NewFunctionCreated (42684 of 43032)
PASS: LLVM-Unit :: Transforms/Utils/./UtilsTests/CloneFunction.CloneEmptyFunction (42685 of 43032)
PASS: LLVM-Unit :: Transforms/Utils/./UtilsTests/CloneFunction.CloneFunctionWithInalloca (42686 of 43032)
PASS: LLVM-Unit :: Transforms/Utils/./UtilsTests/CloneFunction.CloneFunctionToDifferentModule (42687 of 43032)
PASS: LLVM-Unit :: Transforms/Utils/./UtilsTests/CloneFunction.CloneFunctionWithSubprograms (42688 of 43032)
PASS: LLVM-Unit :: Transforms/Utils/./UtilsTests/CloneInstruction.CallingConvention (42689 of 43032)
PASS: LLVM-Unit :: Transforms/Utils/./UtilsTests/CloneInstruction.Attributes (42690 of 43032)
PASS: LLVM-Unit :: Transforms/Utils/./UtilsTests/CloneInstruction.DuplicateInstructionsToSplit (42691 of 43032)
PASS: LLVM-Unit :: Transforms/Utils/./UtilsTests/CloneInstruction.DuplicateInstructionsToSplitBlocksEq1 (42692 of 43032)
PASS: LLVM-Unit :: Transforms/Utils/./UtilsTests/CloneInstruction.Inbounds (42693 of 43032)
PASS: LLVM-Unit :: Transforms/Utils/./UtilsTests/CloneInstruction.DuplicateInstructionsToSplitBlocksEq2 (42694 of 43032)
PASS: LLVM-Unit :: Transforms/Utils/./UtilsTests/CloneInstruction.Exact (42695 of 43032)
PASS: LLVM-Unit :: Transforms/Utils/./UtilsTests/CloneInstruction.OverflowBits (42696 of 43032)
PASS: LLVM-Unit :: Transforms/Utils/./UtilsTests/CloneLoop.CloneLoopNest (42697 of 43032)
PASS: LLVM-Unit :: Transforms/Utils/./UtilsTests/CloneModule.Comdat (42698 of 43032)
PASS: LLVM-Unit :: Transforms/Utils/./UtilsTests/CloneModule.GlobalDebugInfo (42699 of 43032)
PASS: LLVM-Unit :: Transforms/Utils/./UtilsTests/CloneModule.CompileUnit (42700 of 43032)
PASS: LLVM-Unit :: Transforms/Utils/./UtilsTests/CloneModule.OldModuleUnchanged (42701 of 43032)
PASS: LLVM-Unit :: Transforms/Utils/./UtilsTests/CloneModule.GlobalMetadata (42702 of 43032)
PASS: LLVM-Unit :: Transforms/Utils/./UtilsTests/CloneModule.Subprogram (42703 of 43032)
PASS: LLVM-Unit :: Transforms/Utils/./UtilsTests/CloneModule.Verify (42704 of 43032)
PASS: LLVM-Unit :: Transforms/Utils/./UtilsTests/CodeExtractor.ExitPHIOnePredFromRegion (42705 of 43032)
PASS: LLVM-Unit :: Transforms/Utils/./UtilsTests/CodeExtractor.ExitStub (42706 of 43032)
PASS: LLVM-Unit :: Transforms/Utils/./UtilsTests/CodeExtractor.RemoveBitcastUsesFromOuterLifetimeMarkers (42707 of 43032)
PASS: LLVM-Unit :: Transforms/Utils/./UtilsTests/CodeExtractor.ExtractAndInvalidateAssumptionCache (42708 of 43032)
PASS: LLVM-Unit :: Transforms/Utils/./UtilsTests/CodeMoverUtils.IsControlFlowEquivalentCondNestTest (42709 of 43032)
PASS: LLVM-Unit :: Transforms/Utils/./UtilsTests/CodeExtractor.StoreOutputInvokeResultInExitStub (42710 of 43032)
PASS: LLVM-Unit :: Transforms/Utils/./UtilsTests/CodeExtractor.StoreOutputInvokeResultAfterEHPad (42711 of 43032)
PASS: LLVM-Unit :: Transforms/Utils/./UtilsTests/CodeMoverUtils.IsControlFlowEquivalentImbalanceTest (42712 of 43032)
PASS: LLVM-Unit :: Transforms/Utils/./UtilsTests/CodeMoverUtils.IsControlFlowEquivalentNotPostdomTest (42713 of 43032)
PASS: LLVM-Unit :: Transforms/Utils/./UtilsTests/CodeMoverUtils.IsControlFlowEquivalentOppositeCondTest (42714 of 43032)
PASS: LLVM-Unit :: Transforms/Utils/./UtilsTests/CodeMoverUtils.IsControlFlowEquivalentPointerTest (42715 of 43032)
PASS: LLVM-Unit :: Transforms/Utils/./UtilsTests/CodeMoverUtils.IsControlFlowEquivalentSimpleTest (42716 of 43032)
PASS: LLVM-Unit :: Transforms/Utils/./UtilsTests/CodeMoverUtils.IsSafeToMoveTest2 (42717 of 43032)
PASS: LLVM-Unit :: Transforms/Utils/./UtilsTests/CodeMoverUtils.IsSafeToMoveTest1 (42718 of 43032)
PASS: LLVM-Unit :: Transforms/Utils/./UtilsTests/CodeMoverUtils.IsSafeToMoveTest3 (42719 of 43032)
PASS: LLVM-Unit :: Transforms/Utils/./UtilsTests/CodeMoverUtils.IsSafeToMoveTest4 (42720 of 43032)
PASS: LLVM-Unit :: Transforms/Utils/./UtilsTests/CodeMoverUtils.IsSafeToMoveTest5 (42721 of 43032)
PASS: LLVM-Unit :: Transforms/Utils/./UtilsTests/CodeMoverUtils.IsSafeToMoveTest6 (42722 of 43032)
PASS: LLVM-Unit :: Transforms/Utils/./UtilsTests/DebugInfoDrop.DropOriginalDebugInfo (42723 of 43032)
PASS: LLVM-Unit :: Transforms/Utils/./UtilsTests/DebugInfoDummyAnalysis.PreserveOriginalDebugInfo (42724 of 43032)
PASS: LLVM-Unit :: Transforms/Utils/./UtilsTests/FunctionComparatorTest.TestAPI (42725 of 43032)
PASS: LLVM-Unit :: Transforms/Utils/./UtilsTests/IntegerDivision.SDiv64 (42726 of 43032)
PASS: LLVM-Unit :: Transforms/Utils/./UtilsTests/IntegerDivision.SDiv (42727 of 43032)
PASS: LLVM-Unit :: Transforms/Utils/./UtilsTests/IntegerDivision.SRem (42728 of 43032)
PASS: LLVM-Unit :: Transforms/Utils/./UtilsTests/IntegerDivision.SRem64 (42729 of 43032)
PASS: LLVM-Unit :: Transforms/Utils/./UtilsTests/IntegerDivision.UDiv (42730 of 43032)
PASS: LLVM-Unit :: Transforms/Utils/./UtilsTests/IntegerDivision.UDiv64 (42731 of 43032)
PASS: LLVM-Unit :: Transforms/Utils/./UtilsTests/IntegerDivision.URem (42732 of 43032)
PASS: LLVM-Unit :: Transforms/Utils/./UtilsTests/Local.ChangeToUnreachable (42733 of 43032)
PASS: LLVM-Unit :: Transforms/Utils/./UtilsTests/Local.CanReplaceOperandWithVariable (42734 of 43032)
PASS: LLVM-Unit :: Transforms/Utils/./UtilsTests/IntegerDivision.URem64 (42735 of 43032)
PASS: LLVM-Unit :: Transforms/Utils/./UtilsTests/Local.ConstantFoldTerminator (42736 of 43032)
PASS: LLVM-Unit :: Transforms/Utils/./UtilsTests/Local.MergeBasicBlockIntoOnlyPred (42737 of 43032)
PASS: LLVM-Unit :: Transforms/Utils/./UtilsTests/Local.RecursivelyDeleteDeadPHINodes (42738 of 43032)
PASS: LLVM-Unit :: Transforms/Utils/./UtilsTests/Local.RemoveDuplicatePHINodes (42739 of 43032)
PASS: LLVM-Unit :: Transforms/Utils/./UtilsTests/Local.RemoveUnreachableBlocks (42740 of 43032)
PASS: LLVM-Unit :: Transforms/Utils/./UtilsTests/Local.ReplaceAllDbgUsesWith (42741 of 43032)
PASS: LLVM-Unit :: Transforms/Utils/./UtilsTests/Local.SimplifyCFGWithNullAC (42742 of 43032)
PASS: LLVM-Unit :: Transforms/Utils/./UtilsTests/Local.ReplaceDbgDeclare (42743 of 43032)
PASS: LLVM-Unit :: Transforms/Utils/./UtilsTests/LoopRotate.MultiDeoptExit (42744 of 43032)
PASS: LLVM-Unit :: Transforms/Utils/./UtilsTests/LoopRotate.MultiDeoptExit_Nondup (42745 of 43032)
PASS: LLVM-Unit :: Transforms/Utils/./UtilsTests/LoopUnrollRuntime.Latch (42746 of 43032)
PASS: LLVM-Unit :: Transforms/Utils/./UtilsTests/LoopUtils.DeleteDeadLoopNest (42747 of 43032)
PASS: LLVM-Unit :: Transforms/Utils/./UtilsTests/SSAUpdaterBulk.Irreducible (42748 of 43032)
PASS: LLVM-Unit :: Transforms/Utils/./UtilsTests/SSAUpdaterBulk.SimpleMerge (42749 of 43032)
PASS: LLVM-Unit :: Transforms/Utils/./UtilsTests/SalvageDebugInfoTest.RecursiveBlockSimplification (42750 of 43032)
PASS: LLVM-Unit :: Transforms/Utils/./UtilsTests/SalvageDebugInfoTest.RecursiveInstDeletion (42751 of 43032)
PASS: LLVM-Unit :: Transforms/Utils/./UtilsTests/ScalarEvolutionExpanderTest.ExpandNonIntegralPtrWithNullBase (42752 of 43032)
PASS: LLVM-Unit :: Transforms/Utils/./UtilsTests/ScalarEvolutionExpanderTest.SCEVCacheNSW (42753 of 43032)
PASS: LLVM-Unit :: Transforms/Utils/./UtilsTests/ScalarEvolutionExpanderTest.ExpandPtrTypeSCEV (42754 of 43032)
PASS: LLVM-Unit :: Transforms/Utils/./UtilsTests/ScalarEvolutionExpanderTest.SCEVCacheNUW (42755 of 43032)
PASS: LLVM-Unit :: Transforms/Utils/./UtilsTests/ScalarEvolutionExpanderTest.SCEVExpandInsertCanonicalIV (42756 of 43032)
PASS: LLVM-Unit :: Transforms/Utils/./UtilsTests/ScalarEvolutionExpanderTest.SCEVExpanderNSW (42757 of 43032)
PASS: LLVM-Unit :: Transforms/Utils/./UtilsTests/ScalarEvolutionExpanderTest.SCEVExpanderIsSafeToExpandAt (42758 of 43032)
PASS: LLVM-Unit :: Transforms/Utils/./UtilsTests/ScalarEvolutionExpanderTest.SCEVExpandNonAffineAddRec (42759 of 43032)
PASS: LLVM-Unit :: Transforms/Utils/./UtilsTests/ScalarEvolutionExpanderTest.SCEVExpanderNUW (42760 of 43032)
PASS: LLVM-Unit :: Transforms/Utils/./UtilsTests/ScalarEvolutionExpanderTest.SCEVExpanderShlNSW (42761 of 43032)
PASS: LLVM-Unit :: Transforms/Utils/./UtilsTests/SizeOptsTest.Test (42762 of 43032)
PASS: LLVM-Unit :: Transforms/Utils/./UtilsTests/ScalarEvolutionExpanderTest.SCEVZeroExtendExprNonIntegral (42763 of 43032)
PASS: LLVM-Unit :: Transforms/Utils/./UtilsTests/VFABIAttrTest.Write (42764 of 43032)
PASS: LLVM-Unit :: Transforms/Utils/./UtilsTests/ValueMapperTest.mapMDNodeCycle (42765 of 43032)
PASS: LLVM-Unit :: Transforms/Utils/./UtilsTests/ValueMapperTest.mapMDNode (42766 of 43032)
PASS: LLVM-Unit :: Transforms/Utils/./UtilsTests/ValueMapperTest.mapMDNodeDistinctOperands (42767 of 43032)
PASS: LLVM-Unit :: Transforms/Utils/./UtilsTests/ValueMapperTest.mapMDNodeDistinct (42768 of 43032)
PASS: LLVM-Unit :: Transforms/Utils/./UtilsTests/ValueMapperTest.mapMDNodeSeededWithNull (42769 of 43032)
PASS: LLVM-Unit :: Transforms/Utils/./UtilsTests/ValueMapperTest.mapMDNodeSeeded (42770 of 43032)
PASS: LLVM-Unit :: Transforms/Utils/./UtilsTests/ValueMapperTest.mapMDNodeDuplicatedCycle (42771 of 43032)
PASS: LLVM-Unit :: Transforms/Utils/./UtilsTests/ValueMapperTest.mapMDNodeUnresolved (42772 of 43032)
PASS: LLVM-Unit :: Transforms/Utils/./UtilsTests/ValueMapperTest.mapMetadataGetMappedMD (42773 of 43032)
PASS: LLVM-Unit :: Transforms/Utils/./UtilsTests/ValueMapperTest.mapMetadataConstantAsMetadata (42774 of 43032)
PASS: LLVM-Unit :: Transforms/Utils/./UtilsTests/ValueMapperTest.mapMetadataMDString (42775 of 43032)
PASS: LLVM-Unit :: Transforms/Utils/./UtilsTests/ValueMapperTest.mapMetadataNoModuleLevelChanges (42776 of 43032)
PASS: LLVM-Unit :: Transforms/Utils/./UtilsTests/ValueMapperTest.mapValueLocalAsMetadata (42777 of 43032)
PASS: LLVM-Unit :: Transforms/Utils/./UtilsTests/ValueMapperTest.mapValueLocalAsMetadataToConstant (42778 of 43032)
PASS: LLVM-Unit :: Transforms/Utils/./UtilsTests/ValueMapperTest.mapMetadataNullMapGlobalWithIgnoreMissingLocals (42779 of 43032)
PASS: LLVM-Unit :: Transforms/Vectorize/./VectorizeTests/VPBasicBlockTest.getPlan (42780 of 43032)
PASS: LLVM-Unit :: Transforms/Vectorize/./VectorizeTests/VPInstructionTest.moveAfter (42781 of 43032)
PASS: LLVM-Unit :: Transforms/Vectorize/./VectorizeTests/VPDoubleValueDefTest.traverseUseLists (42782 of 43032)
PASS: LLVM-Unit :: Transforms/Vectorize/./VectorizeTests/VPInstructionTest.eraseFromParent (42783 of 43032)
PASS: LLVM-Unit :: Transforms/Vectorize/./VectorizeTests/VPInstructionTest.insertBefore (42784 of 43032)
PASS: LLVM-Unit :: Transforms/Vectorize/./VectorizeTests/VPInstructionTest.moveBefore (42785 of 43032)
PASS: LLVM-Unit :: Transforms/Vectorize/./VectorizeTests/VPInstructionTest.replaceAllUsesWith (42786 of 43032)
PASS: LLVM-Unit :: Transforms/Vectorize/./VectorizeTests/VPInstructionTest.releaseOperandsAtDeletion (42787 of 43032)
PASS: LLVM-Unit :: Transforms/Vectorize/./VectorizeTests/VPInstructionTest.setOperand (42788 of 43032)
PASS: LLVM-Unit :: Transforms/Vectorize/./VectorizeTests/VPRecipeTest.CastVPBlendRecipeToVPUser (42789 of 43032)
PASS: LLVM-Unit :: Transforms/Vectorize/./VectorizeTests/VPRecipeTest.CastVPBranchOnMaskRecipeToVPUser (42790 of 43032)
PASS: LLVM-Unit :: Transforms/Vectorize/./VectorizeTests/VPRecipeTest.CastVPInstructionToVPUser (42791 of 43032)
PASS: LLVM-Unit :: Transforms/Vectorize/./VectorizeTests/VPRecipeTest.CastVPInterleaveRecipeToVPUser (42792 of 43032)
PASS: LLVM-Unit :: Transforms/Vectorize/./VectorizeTests/VPRecipeTest.CastVPReplicateRecipeToVPUser (42793 of 43032)
PASS: LLVM-Unit :: Transforms/Vectorize/./VectorizeTests/VPRecipeTest.CastVPReductionRecipeToVPUser (42794 of 43032)
PASS: LLVM-Unit :: Transforms/Vectorize/./VectorizeTests/VPRecipeTest.CastVPWidenCallRecipeToVPUserAndVPDef (42795 of 43032)
PASS: LLVM-Unit :: Transforms/Vectorize/./VectorizeTests/VPRecipeTest.CastVPWidenGEPRecipeToVPUserAndVPDef (42796 of 43032)
PASS: LLVM-Unit :: Transforms/Vectorize/./VectorizeTests/VPRecipeTest.CastVPWidenMemoryInstructionRecipeToVPUserAndVPDef (42797 of 43032)
PASS: LLVM-Unit :: Transforms/Vectorize/./VectorizeTests/VPRecipeTest.CastVPWidenRecipeToVPUser (42798 of 43032)
PASS: LLVM-Unit :: Transforms/Vectorize/./VectorizeTests/VPRecipeTest.CastVPWidenSelectRecipeToVPUserAndVPDef (42799 of 43032)
PASS: LLVM-Unit :: Transforms/Vectorize/./VectorizeTests/VPlanDominatorTreeTest.BasicVPBBDomination (42800 of 43032)
PASS: LLVM-Unit :: Transforms/Vectorize/./VectorizeTests/VPlanHCFGTest.testBuildHCFGInnerLoop (42801 of 43032)
PASS: LLVM-Unit :: Transforms/Vectorize/./VectorizeTests/VPlanHCFGTest.testVPInstructionToVPRecipesInner (42802 of 43032)
PASS: LLVM-Unit :: Transforms/Vectorize/./VectorizeTests/VPlanLoopInfo.BasicLoopInfoTest (42803 of 43032)
PASS: LLVM-Unit :: Transforms/Vectorize/./VectorizeTests/VPlanPredicatorTest.BasicPredicatorTest (42804 of 43032)
PASS: LLVM-Unit :: Transforms/Vectorize/./VectorizeTests/VPlanPredicatorTest.PredicatorNegOrTest (42805 of 43032)
PASS: LLVM-Unit :: Transforms/Vectorize/./VectorizeTests/VPlanSlpTest.testInstrsInDifferentBBs (42806 of 43032)
PASS: LLVM-Unit :: Transforms/Vectorize/./VectorizeTests/VPlanSlpTest.testSlpAtomicLoad (42807 of 43032)
PASS: LLVM-Unit :: Transforms/Vectorize/./VectorizeTests/VPlanSlpTest.testInstrsInDifferentBBs2 (42808 of 43032)
PASS: LLVM-Unit :: Transforms/Vectorize/./VectorizeTests/VPlanSlpTest.testSlpAtomicStore (42809 of 43032)
PASS: LLVM-Unit :: Transforms/Vectorize/./VectorizeTests/VPlanSlpTest.testSlpReorder_1 (42810 of 43032)
PASS: LLVM-Unit :: Transforms/Vectorize/./VectorizeTests/VPlanSlpTest.testSlpReorder_2 (42811 of 43032)
PASS: LLVM-Unit :: Transforms/Vectorize/./VectorizeTests/VPlanSlpTest.testSlpReorder_3 (42812 of 43032)
PASS: LLVM-Unit :: Transforms/Vectorize/./VectorizeTests/VPlanSlpTest.testSlpReorder_4 (42813 of 43032)
PASS: LLVM-Unit :: Transforms/Vectorize/./VectorizeTests/VPlanSlpTest.testSlpReuse_1 (42814 of 43032)
PASS: LLVM-Unit :: Transforms/Vectorize/./VectorizeTests/VPlanSlpTest.testSlpReuse_2 (42815 of 43032)
PASS: LLVM-Unit :: Transforms/Vectorize/./VectorizeTests/VPlanSlpTest.testSlpSimple_3 (42816 of 43032)
PASS: LLVM-Unit :: Transforms/Vectorize/./VectorizeTests/VPlanSlpTest.testSlpSimple_2 (42817 of 43032)
PASS: LLVM-Unit :: XRay/./XRayTests/FDRBlockIndexerTest.IndexBlocksV3 (42818 of 43032)
PASS: LLVM-Unit :: XRay/./XRayTests/FDRBlockVerifierTest.MalformedV2 (42819 of 43032)
PASS: LLVM-Unit :: XRay/./XRayTests/FDRBlockVerifierTest.IgnoreRecordsAfterEOB (42820 of 43032)
PASS: LLVM-Unit :: XRay/./XRayTests/FDRBlockVerifierTest.MissingBufferExtents (42821 of 43032)
PASS: LLVM-Unit :: XRay/./XRayTests/FDRBlockVerifierTest.MissingPIDRecord (42822 of 43032)
PASS: LLVM-Unit :: XRay/./XRayTests/FDRRecordPrinterTest.WriteFunctionRecordEnter (42823 of 43032)
PASS: LLVM-Unit :: XRay/./XRayTests/FDRBlockVerifierTest.ValidBlocksV3 (42824 of 43032)
PASS: LLVM-Unit :: XRay/./XRayTests/FDRRecordPrinterTest.WriteFunctionRecordEnterArg (42825 of 43032)
PASS: LLVM-Unit :: XRay/./XRayTests/FDRRecordPrinterTest.WriteFunctionRecordExit (42826 of 43032)
PASS: LLVM-Unit :: XRay/./XRayTests/FDRRecordPrinterTest.WriteFunctionRecordTailExit (42827 of 43032)
PASS: LLVM-Unit :: XRay/./XRayTests/FDRTraceWriterTest.WriteToStringBufferVersion1 (42828 of 43032)
PASS: LLVM-Unit :: XRay/./XRayTests/FDRTraceWriterTest.WriteToStringBufferVersion2 (42829 of 43032)
PASS: LLVM-Unit :: XRay/./XRayTests/FDRTraceWriterTest.WriteToStringBufferVersion3 (42830 of 43032)
PASS: LLVM-Unit :: XRay/./XRayTests/GraphTest.TestConstruction (42831 of 43032)
PASS: LLVM-Unit :: XRay/./XRayTests/GraphTest.TestEdgeAccessOperator (42832 of 43032)
PASS: LLVM-Unit :: XRay/./XRayTests/GraphTest.TestiVertexAccessOperator (42833 of 43032)
PASS: LLVM-Unit :: XRay/./XRayTests/GraphTest/0.TestCopyAssign (42834 of 43032)
PASS: LLVM-Unit :: XRay/./XRayTests/GraphTest/0.TestCopyConstructor (42835 of 43032)
PASS: LLVM-Unit :: XRay/./XRayTests/GraphTest/0.TestGraphEdge (42836 of 43032)
PASS: LLVM-Unit :: XRay/./XRayTests/GraphTest/0.TestGraphVertex (42837 of 43032)
PASS: LLVM-Unit :: XRay/./XRayTests/GraphTest/0.TestMoveConstructor (42838 of 43032)
PASS: LLVM-Unit :: XRay/./XRayTests/GraphTest/1.TestGraphEdge (42839 of 43032)
PASS: LLVM-Unit :: XRay/./XRayTests/GraphTest/1.TestCopyAssign (42840 of 43032)
PASS: LLVM-Unit :: XRay/./XRayTests/GraphTest/1.TestCopyConstructor (42841 of 43032)
PASS: LLVM-Unit :: XRay/./XRayTests/GraphTest/1.TestGraphVertex (42842 of 43032)
PASS: LLVM-Unit :: XRay/./XRayTests/GraphTest/1.TestMoveConstructor (42843 of 43032)
PASS: LLVM-Unit :: XRay/./XRayTests/ProfileTest.AddBlocks (42844 of 43032)
PASS: LLVM-Unit :: XRay/./XRayTests/ProfileTest.CopyProfile (42845 of 43032)
PASS: LLVM-Unit :: XRay/./XRayTests/ProfileTest.CreateProfile (42846 of 43032)
PASS: LLVM-Unit :: XRay/./XRayTests/ProfileTest.ExpandPath (42847 of 43032)
PASS: LLVM-Unit :: XRay/./XRayTests/ProfileTest.InternPath (42848 of 43032)
PASS: LLVM-Unit :: XRay/./XRayTests/ProfileTest.MergeProfilesByStack (42849 of 43032)
PASS: LLVM-Unit :: XRay/./XRayTests/ProfileTest.MergeProfilesByStackAccumulate (42850 of 43032)
PASS: LLVM-Unit :: XRay/./XRayTests/ProfileTest.MergeProfilesByThread (42851 of 43032)
PASS: LLVM-Unit :: XRay/./XRayTests/ProfileTest.MergeProfilesByThreadAccumulate (42852 of 43032)
PASS: LLVM-Unit :: XRay/./XRayTests/Records/PrinterTest/0.PrintsRecord (42853 of 43032)
PASS: LLVM-Unit :: XRay/./XRayTests/ProfileTest.MoveProfile (42854 of 43032)
PASS: LLVM-Unit :: XRay/./XRayTests/Records/PrinterTest/1.PrintsRecord (42855 of 43032)
PASS: LLVM-Unit :: XRay/./XRayTests/Records/PrinterTest/2.PrintsRecord (42856 of 43032)
PASS: LLVM-Unit :: XRay/./XRayTests/Records/PrinterTest/3.PrintsRecord (42857 of 43032)
PASS: LLVM-Unit :: XRay/./XRayTests/Records/PrinterTest/4.PrintsRecord (42858 of 43032)
PASS: LLVM-Unit :: XRay/./XRayTests/Records/PrinterTest/5.PrintsRecord (42859 of 43032)
PASS: LLVM-Unit :: XRay/./XRayTests/Records/PrinterTest/6.PrintsRecord (42860 of 43032)
PASS: LLVM-Unit :: XRay/./XRayTests/Records/PrinterTest/8.PrintsRecord (42861 of 43032)
PASS: LLVM-Unit :: XRay/./XRayTests/Records/PrinterTest/7.PrintsRecord (42862 of 43032)
PASS: LLVM-Unit :: XRay/./XRayTests/Records/PrinterTest/9.PrintsRecord (42863 of 43032)
PASS: LLVM-Unit :: XRay/./XRayTests/Records/RoundTripTest/0.RoundTripsSingleValue (42864 of 43032)
PASS: LLVM-Unit :: XRay/./XRayTests/Records/RoundTripTest/1.RoundTripsSingleValue (42865 of 43032)
PASS: LLVM-Unit :: XRay/./XRayTests/Records/RoundTripTest/2.RoundTripsSingleValue (42866 of 43032)
PASS: LLVM-Unit :: XRay/./XRayTests/Records/RoundTripTest/3.RoundTripsSingleValue (42867 of 43032)
PASS: LLVM-Unit :: XRay/./XRayTests/Records/RoundTripTest/4.RoundTripsSingleValue (42868 of 43032)
PASS: LLVM-Unit :: XRay/./XRayTests/Records/RoundTripTest/6.RoundTripsSingleValue (42869 of 43032)
PASS: LLVM-Unit :: XRay/./XRayTests/Records/RoundTripTest/5.RoundTripsSingleValue (42870 of 43032)
PASS: LLVM-Unit :: XRay/./XRayTests/Records/RoundTripTest/7.RoundTripsSingleValue (42871 of 43032)
PASS: LLVM-Unit :: XRay/./XRayTests/Records/RoundTripTestV5/0.RoundTripsSingleValue (42872 of 43032)
PASS: LLVM-Unit :: XRay/./XRayTests/Records/RoundTripTestV5/1.RoundTripsSingleValue (42873 of 43032)
PASS: LLVM-Unit :: XRay/./XRayTests/Records/RoundTripTestV5/2.RoundTripsSingleValue (42874 of 43032)
PASS: LLVM-Unit :: XRay/./XRayTests/Records/RoundTripTestV5/3.RoundTripsSingleValue (42875 of 43032)
PASS: LLVM-Unit :: XRay/./XRayTests/Records/RoundTripTestV5/4.RoundTripsSingleValue (42876 of 43032)
PASS: LLVM-Unit :: XRay/./XRayTests/Records/RoundTripTestV5/6.RoundTripsSingleValue (42877 of 43032)
PASS: LLVM-Unit :: XRay/./XRayTests/Records/RoundTripTestV5/5.RoundTripsSingleValue (42878 of 43032)
PASS: LLVM-Unit :: XRay/./XRayTests/Records/RoundTripTestV5/7.RoundTripsSingleValue (42879 of 43032)
PASS: LLVM-Unit :: XRay/./XRayTests/Records/RoundTripTestV5/8.RoundTripsSingleValue (42880 of 43032)
PASS: LLVM-Unit :: XRay/./XRayTests/XRayFDRTest.BuilderAndBlockIndexer (42881 of 43032)
PASS: LLVM-Unit :: XRay/./XRayTests/XRayFDRTest.IndexAndVerifyBlocks (42882 of 43032)
PASS: LLVM-Unit :: XRay/./XRayTests/XRayFDRTest.BuilderAndBlockVerifier (42883 of 43032)
PASS: LLVM-Unit :: tools/llvm-cfi-verify/./CFIVerifyTests/BasicAArch64FileAnalysisTest.AArch64BasicProtected (42884 of 43032)
PASS: LLVM-Unit :: tools/llvm-cfi-verify/./CFIVerifyTests/BasicAArch64FileAnalysisTest.AArch64BasicUnprotected (42885 of 43032)
PASS: LLVM-Unit :: tools/llvm-cfi-verify/./CFIVerifyTests/BasicAArch64FileAnalysisTest.AArch64ClobberBasic (42886 of 43032)
PASS: LLVM-Unit :: tools/llvm-cfi-verify/./CFIVerifyTests/BasicAArch64FileAnalysisTest.AArch64ClobberLoadAddBad (42887 of 43032)
PASS: LLVM-Unit :: tools/llvm-cfi-verify/./CFIVerifyTests/BasicAArch64FileAnalysisTest.AArch64ClobberLoadAddBad2 (42888 of 43032)
PASS: LLVM-Unit :: tools/llvm-cfi-verify/./CFIVerifyTests/BasicAArch64FileAnalysisTest.AArch64ClobberLoadAddGood (42889 of 43032)
PASS: LLVM-Unit :: tools/llvm-cfi-verify/./CFIVerifyTests/BasicAArch64FileAnalysisTest.AArch64ClobberTwoLoads (42890 of 43032)
PASS: LLVM-Unit :: tools/llvm-cfi-verify/./CFIVerifyTests/BasicAArch64FileAnalysisTest.AArch64ClobberOneLoad (42891 of 43032)
PASS: LLVM-Unit :: tools/llvm-cfi-verify/./CFIVerifyTests/BasicAArch64FileAnalysisTest.AArch64ClobberUnrelatedLoads (42892 of 43032)
PASS: LLVM-Unit :: tools/llvm-cfi-verify/./CFIVerifyTests/BasicAArch64FileAnalysisTest.AArch64ClobberUnrelatedSecondLoad (42893 of 43032)
PASS: LLVM-Unit :: tools/llvm-cfi-verify/./CFIVerifyTests/BasicAArch64FileAnalysisTest.AArch64TwoPaths (42894 of 43032)
PASS: LLVM-Unit :: tools/llvm-cfi-verify/./CFIVerifyTests/BasicAArch64FileAnalysisTest.AArch64GoodAndBadPaths (42895 of 43032)
PASS: LLVM-Unit :: tools/llvm-cfi-verify/./CFIVerifyTests/BasicAArch64FileAnalysisTest.AArch64TwoPathsBadLoad1 (42896 of 43032)
PASS: LLVM-Unit :: tools/llvm-cfi-verify/./CFIVerifyTests/BasicAArch64FileAnalysisTest.AArch64TwoPathsBadLoad2 (42897 of 43032)
PASS: LLVM-Unit :: tools/llvm-cfi-verify/./CFIVerifyTests/BasicGraphBuilderTest.BuildFlowGraphConditionalInfiniteLoop (42898 of 43032)
PASS: LLVM-Unit :: tools/llvm-cfi-verify/./CFIVerifyTests/BasicGraphBuilderTest.BuildFlowGraphComplexExample (42899 of 43032)
PASS: LLVM-Unit :: tools/llvm-cfi-verify/./CFIVerifyTests/BasicGraphBuilderTest.BuildFlowGraphFailures (42900 of 43032)
PASS: LLVM-Unit :: tools/llvm-cfi-verify/./CFIVerifyTests/BasicGraphBuilderTest.BuildFlowGraphLengthExceededDownwards (42901 of 43032)
PASS: LLVM-Unit :: tools/llvm-cfi-verify/./CFIVerifyTests/BasicGraphBuilderTest.BuildFlowGraphNoXrefs (42902 of 43032)
PASS: LLVM-Unit :: tools/llvm-cfi-verify/./CFIVerifyTests/BasicGraphBuilderTest.BuildFlowGraphLengthExceededUpwards (42903 of 43032)
PASS: LLVM-Unit :: tools/llvm-cfi-verify/./CFIVerifyTests/BasicGraphBuilderTest.BuildFlowGraphNoFlowsToIndirection (42904 of 43032)
PASS: LLVM-Unit :: tools/llvm-cfi-verify/./CFIVerifyTests/BasicGraphBuilderTest.BuildFlowGraphTestDualPathDualUd2 (42905 of 43032)
PASS: LLVM-Unit :: tools/llvm-cfi-verify/./CFIVerifyTests/BasicGraphBuilderTest.BuildFlowGraphTestDualPathSingleUd2 (42906 of 43032)
PASS: LLVM-Unit :: tools/llvm-cfi-verify/./CFIVerifyTests/BasicGraphBuilderTest.BuildFlowGraphTestSinglePathFallthroughUd2 (42907 of 43032)
PASS: LLVM-Unit :: tools/llvm-cfi-verify/./CFIVerifyTests/BasicGraphBuilderTest.BuildFlowGraphTestSinglePathJumpUd2 (42908 of 43032)
PASS: LLVM-Unit :: tools/llvm-cfi-verify/./CFIVerifyTests/BasicGraphBuilderTest.BuildFlowGraphUnconditionalInfiniteLoop (42909 of 43032)
PASS: LLVM-Unit :: tools/llvm-cfi-verify/./CFIVerifyTests/BasicGraphBuilderTest.BuildFlowGraphWithRepeatedWork (42910 of 43032)
PASS: LLVM-Unit :: tools/llvm-cfi-verify/./CFIVerifyTests/BasicX86FileAnalysisTest.CFIProtectionBasicJumpToUd2 (42911 of 43032)
PASS: LLVM-Unit :: tools/llvm-cfi-verify/./CFIVerifyTests/BasicX86FileAnalysisTest.BasicDisassemblyTraversalTest (42912 of 43032)
PASS: LLVM-Unit :: tools/llvm-cfi-verify/./CFIVerifyTests/BasicX86FileAnalysisTest.CFIProtectionBasicFallthroughToUd2 (42913 of 43032)
PASS: LLVM-Unit :: tools/llvm-cfi-verify/./CFIVerifyTests/BasicX86FileAnalysisTest.CFIProtectionClobberDualPathImplicit (42914 of 43032)
PASS: LLVM-Unit :: tools/llvm-cfi-verify/./CFIVerifyTests/BasicX86FileAnalysisTest.CFIProtectionClobberSinglePathExplicit (42915 of 43032)
PASS: LLVM-Unit :: tools/llvm-cfi-verify/./CFIVerifyTests/BasicX86FileAnalysisTest.CFIProtectionClobberSinglePathExplicit2 (42916 of 43032)
PASS: LLVM-Unit :: tools/llvm-cfi-verify/./CFIVerifyTests/BasicX86FileAnalysisTest.CFIProtectionClobberSinglePathImplicit (42917 of 43032)
PASS: LLVM-Unit :: tools/llvm-cfi-verify/./CFIVerifyTests/BasicX86FileAnalysisTest.CFIProtectionComplexExample (42918 of 43032)
PASS: LLVM-Unit :: tools/llvm-cfi-verify/./CFIVerifyTests/BasicX86FileAnalysisTest.CFIProtectionDualFailLimitDownwards (42919 of 43032)
PASS: LLVM-Unit :: tools/llvm-cfi-verify/./CFIVerifyTests/BasicX86FileAnalysisTest.CFIProtectionDualFailLimitUpwards (42920 of 43032)
PASS: LLVM-Unit :: tools/llvm-cfi-verify/./CFIVerifyTests/BasicX86FileAnalysisTest.CFIProtectionGoodAndBadPaths (42921 of 43032)
PASS: LLVM-Unit :: tools/llvm-cfi-verify/./CFIVerifyTests/BasicX86FileAnalysisTest.CFIProtectionDualPathSingleUd2 (42922 of 43032)
PASS: LLVM-Unit :: tools/llvm-cfi-verify/./CFIVerifyTests/BasicX86FileAnalysisTest.CFIProtectionDualPathUd2 (42923 of 43032)
PASS: LLVM-Unit :: tools/llvm-cfi-verify/./CFIVerifyTests/BasicX86FileAnalysisTest.CFIProtectionInvalidTargets (42924 of 43032)
PASS: LLVM-Unit :: tools/llvm-cfi-verify/./CFIVerifyTests/BasicX86FileAnalysisTest.CFIProtectionWithUnconditionalJumpInFallthrough (42925 of 43032)
PASS: LLVM-Unit :: tools/llvm-cfi-verify/./CFIVerifyTests/BasicX86FileAnalysisTest.CFITrapTest (42926 of 43032)
PASS: LLVM-Unit :: tools/llvm-cfi-verify/./CFIVerifyTests/BasicX86FileAnalysisTest.DefiniteNextInstructionTest (42927 of 43032)
PASS: LLVM-Unit :: tools/llvm-cfi-verify/./CFIVerifyTests/BasicX86FileAnalysisTest.ControlFlowXRefsTest (42928 of 43032)
PASS: LLVM-Unit :: tools/llvm-cfi-verify/./CFIVerifyTests/BasicX86FileAnalysisTest.FallThroughTest (42929 of 43032)
PASS: LLVM-Unit :: tools/llvm-cfi-verify/./CFIVerifyTests/BasicX86FileAnalysisTest.PrevAndNextFromBadInst (42930 of 43032)
PASS: LLVM-Unit :: tools/llvm-cfi-verify/./CFIVerifyTests/BasicX86FileAnalysisTest.UndefSearchLengthOneTestFarAway (42931 of 43032)
PASS: LLVM-Unit :: tools/llvm-cfi-verify/./CFIVerifyTests/BasicX86FileAnalysisTest.UndefSearchLengthOneTest (42932 of 43032)
PASS: LLVM-Unit :: tools/llvm-exegesis/./LLVMExegesisTests/ClusteringTest.Clusters3D_InvalidOrder (42933 of 43032)
PASS: LLVM-Unit :: tools/llvm-exegesis/./LLVMExegesisTests/ClusteringTest.Clusters3D (42934 of 43032)
PASS: LLVM-Unit :: tools/llvm-exegesis/./LLVMExegesisTests/ClusteringTest.Clusters3D_InvalidSize (42935 of 43032)
PASS: LLVM-Unit :: tools/llvm-exegesis/./LLVMExegesisTests/ClusteringTest.Ordering (42936 of 43032)
PASS: LLVM-Unit :: tools/llvm-exegesis/./LLVMExegesisTests/ClusteringTest.Ordering1 (42937 of 43032)
PASS: LLVM-Unit :: tools/llvm-exegesis/./LLVMExegesisTests/ClusteringTest.Ordering2 (42938 of 43032)
PASS: LLVM-Unit :: tools/llvm-exegesis/./LLVMExegesisTests/CombinationGenerator.Column (42939 of 43032)
PASS: LLVM-Unit :: tools/llvm-exegesis/./LLVMExegesisTests/CombinationGenerator.RightColumn (42940 of 43032)
PASS: LLVM-Unit :: tools/llvm-exegesis/./LLVMExegesisTests/CombinationGenerator.LeftColumn (42941 of 43032)
PASS: LLVM-Unit :: tools/llvm-exegesis/./LLVMExegesisTests/CombinationGenerator.MiddleColumn (42942 of 43032)
PASS: LLVM-Unit :: tools/llvm-exegesis/./LLVMExegesisTests/CombinationGenerator.Row (42943 of 43032)
PASS: LLVM-Unit :: tools/llvm-exegesis/./LLVMExegesisTests/PerfHelperTest.FunctionalTest (42944 of 43032)
PASS: LLVM-Unit :: tools/llvm-exegesis/./LLVMExegesisTests/CombinationGenerator.Singleton (42945 of 43032)
PASS: LLVM-Unit :: tools/llvm-exegesis/./LLVMExegesisTests/CombinationGenerator.Square (42946 of 43032)
PASS: LLVM-Unit :: tools/llvm-exegesis/./LLVMExegesisTests/CombinationGenerator.SideColumns (42947 of 43032)
PASS: LLVM-Unit :: tools/llvm-exegesis/./LLVMExegesisTests/RegisterValueTest.Half (42948 of 43032)
PASS: LLVM-Unit :: tools/llvm-exegesis/./LLVMExegesisTests/RegisterValueTest.Double (42949 of 43032)
PASS: LLVM-Unit :: tools/llvm-exegesis/./LLVMExegesisTests/RegisterValueTest.Single (42950 of 43032)
PASS: LLVM-Unit :: tools/llvm-exegesis/./LLVMExegesisTests/ScratchSpaceTest.Works (42951 of 43032)
PASS: LLVM-Unit :: tools/llvm-exegesis/AArch64/./LLVMExegesisAArch64Tests/AArch64TargetTest.DefaultPfmCounters (42952 of 43032)
PASS: LLVM-Unit :: tools/llvm-exegesis/AArch64/./LLVMExegesisAArch64Tests/AArch64TargetTest.SetRegToConstant (42953 of 43032)
PASS: LLVM-Unit :: tools/llvm-exegesis/Mips/./LLVMExegesisMipsTests/BenchmarkResultTest.PerInstructionStats (42954 of 43032)
PASS: LLVM-Unit :: tools/llvm-exegesis/Mips/./LLVMExegesisMipsTests/MipsTargetTest.SetGPR64RegTo16BitValue (42955 of 43032)
PASS: LLVM-Unit :: tools/llvm-exegesis/Mips/./LLVMExegesisMipsTests/MipsTargetTest.DefaultPfmCounters (42956 of 43032)
PASS: LLVM-Unit :: tools/llvm-exegesis/Mips/./LLVMExegesisMipsTests/MipsTargetTest.SetGPR32RegTo16BitValue (42957 of 43032)
PASS: LLVM-Unit :: tools/llvm-exegesis/Mips/./LLVMExegesisMipsTests/MipsTargetTest.SetGPR32RegTo32BitValue (42958 of 43032)
PASS: LLVM-Unit :: tools/llvm-exegesis/Mips/./LLVMExegesisMipsTests/BenchmarkResultTest.WriteToAndReadFromDisk (42959 of 43032)
PASS: LLVM-Unit :: tools/llvm-exegesis/Mips/./LLVMExegesisMipsTests/ParallelSnippetGeneratorTest.MemoryUse (42960 of 43032)
PASS: LLVM-Unit :: tools/llvm-exegesis/Mips/./LLVMExegesisMipsTests/MipsTargetTest.SetGPR64RegTo32BitValue (42961 of 43032)
PASS: LLVM-Unit :: tools/llvm-exegesis/Mips/./LLVMExegesisMipsTests/RegisterAliasingTest.TrackRegisterClass (42962 of 43032)
PASS: LLVM-Unit :: tools/llvm-exegesis/Mips/./LLVMExegesisMipsTests/RegisterAliasingTest.TrackRegisterClassCache (42963 of 43032)
PASS: LLVM-Unit :: tools/llvm-exegesis/Mips/./LLVMExegesisMipsTests/RegisterAliasingTest.TrackSimpleRegister (42964 of 43032)
PASS: LLVM-Unit :: tools/llvm-exegesis/Mips/./LLVMExegesisMipsTests/SerialSnippetGeneratorTest.ImplicitSelfDependencyThroughExplicitRegs (42965 of 43032)
PASS: LLVM-Unit :: tools/llvm-exegesis/Mips/./LLVMExegesisMipsTests/SerialSnippetGeneratorTest.ImplicitSelfDependencyThroughExplicitRegsForbidAll (42966 of 43032)
PASS: LLVM-Unit :: tools/llvm-exegesis/PowerPC/./LLVMExegesisPowerPCTests/AnalysisTest.ComputeIdealizedProcResPressure_1ALU1IPAGEN (42967 of 43032)
PASS: LLVM-Unit :: tools/llvm-exegesis/PowerPC/./LLVMExegesisPowerPCTests/AnalysisTest.ComputeIdealizedProcResPressure_1ALUE (42968 of 43032)
PASS: LLVM-Unit :: tools/llvm-exegesis/PowerPC/./LLVMExegesisPowerPCTests/AnalysisTest.ComputeIdealizedProcResPressure_2ALU (42969 of 43032)
PASS: LLVM-Unit :: tools/llvm-exegesis/PowerPC/./LLVMExegesisPowerPCTests/ParallelSnippetGeneratorTest.MemoryUse (42970 of 43032)
PASS: LLVM-Unit :: tools/llvm-exegesis/PowerPC/./LLVMExegesisPowerPCTests/PowerPCTargetTest.DefaultPfmCounters (42971 of 43032)
PASS: LLVM-Unit :: tools/llvm-exegesis/PowerPC/./LLVMExegesisPowerPCTests/PowerPCTargetTest.SetRegToConstant (42972 of 43032)
PASS: LLVM-Unit :: tools/llvm-exegesis/PowerPC/./LLVMExegesisPowerPCTests/SerialSnippetGeneratorTest.ImplicitSelfDependencyThroughTiedRegs (42973 of 43032)
PASS: LLVM-Unit :: tools/llvm-exegesis/PowerPC/./LLVMExegesisPowerPCTests/SerialSnippetGeneratorTest.ImplicitSelfDependencyThroughExplicitRegs (42974 of 43032)
PASS: LLVM-Unit :: tools/llvm-exegesis/X86/./LLVMExegesisX86Tests/BenchmarkResultTest.PerInstructionStats (42975 of 43032)
PASS: LLVM-Unit :: tools/llvm-exegesis/X86/./LLVMExegesisX86Tests/Core2Avx512TargetTest.SetRegToVR512Value (42976 of 43032)
PASS: LLVM-Unit :: tools/llvm-exegesis/X86/./LLVMExegesisX86Tests/Core2Avx512TargetTest.SetRegToVR256Value_Use_VMOVDQU32Z256rm (42977 of 43032)
PASS: LLVM-Unit :: tools/llvm-exegesis/X86/./LLVMExegesisX86Tests/Core2AvxTargetTest.SetRegToVR128Value_Use_VMOVDQUrm (42978 of 43032)
PASS: LLVM-Unit :: tools/llvm-exegesis/X86/./LLVMExegesisX86Tests/Core2Avx512TargetTest.FillMemoryOperands_ADD64rm (42979 of 43032)
PASS: LLVM-Unit :: tools/llvm-exegesis/X86/./LLVMExegesisX86Tests/Core2Avx512TargetTest.FillMemoryOperands_VGATHERDPSZ128rm (42980 of 43032)
PASS: LLVM-Unit :: tools/llvm-exegesis/X86/./LLVMExegesisX86Tests/Core2Avx512TargetTest.SetRegToVR128Value_Use_VMOVDQU32Z128rm (42981 of 43032)
PASS: LLVM-Unit :: tools/llvm-exegesis/X86/./LLVMExegesisX86Tests/BenchmarkResultTest.WriteToAndReadFromDisk (42982 of 43032)
PASS: LLVM-Unit :: tools/llvm-exegesis/X86/./LLVMExegesisX86Tests/Core2AvxTargetTest.SetRegToVR256Value_Use_VMOVDQUYrm (42983 of 43032)
PASS: LLVM-Unit :: tools/llvm-exegesis/X86/./LLVMExegesisX86Tests/Core2TargetTest.AllowAsBackToBack (42984 of 43032)
PASS: LLVM-Unit :: tools/llvm-exegesis/X86/./LLVMExegesisX86Tests/Core2TargetTest.SetRegToGR16Value (42985 of 43032)
PASS: LLVM-Unit :: tools/llvm-exegesis/X86/./LLVMExegesisX86Tests/Core2TargetTest.NoHighByteRegs (42986 of 43032)
PASS: LLVM-Unit :: tools/llvm-exegesis/X86/./LLVMExegesisX86Tests/Core2TargetTest.SetRegToFP0_80Bits (42987 of 43032)
PASS: LLVM-Unit :: tools/llvm-exegesis/X86/./LLVMExegesisX86Tests/Core2TargetTest.SetRegToFP1_4Bits (42988 of 43032)
PASS: LLVM-Unit :: tools/llvm-exegesis/X86/./LLVMExegesisX86Tests/Core2TargetTest.SetFlags (42989 of 43032)
PASS: LLVM-Unit :: tools/llvm-exegesis/X86/./LLVMExegesisX86Tests/Core2TargetTest.SetRegToFP1_32Bits (42990 of 43032)
PASS: LLVM-Unit :: tools/llvm-exegesis/X86/./LLVMExegesisX86Tests/Core2TargetTest.SetRegToGR32Value (42991 of 43032)
PASS: LLVM-Unit :: tools/llvm-exegesis/X86/./LLVMExegesisX86Tests/Core2TargetTest.SetRegToGR64Value (42992 of 43032)
PASS: LLVM-Unit :: tools/llvm-exegesis/X86/./LLVMExegesisX86Tests/Core2TargetTest.SetRegToGR8Value (42993 of 43032)
PASS: LLVM-Unit :: tools/llvm-exegesis/X86/./LLVMExegesisX86Tests/Core2TargetTest.SetRegToST0_32Bits (42994 of 43032)
PASS: LLVM-Unit :: tools/llvm-exegesis/X86/./LLVMExegesisX86Tests/Core2TargetTest.SetRegToST1_32Bits (42995 of 43032)
PASS: LLVM-Unit :: tools/llvm-exegesis/X86/./LLVMExegesisX86Tests/Core2TargetTest.SetRegToST0_80Bits (42996 of 43032)
PASS: LLVM-Unit :: tools/llvm-exegesis/X86/./LLVMExegesisX86Tests/Core2TargetTest.SetRegToVR128Value_Use_MOVDQUrm (42997 of 43032)
PASS: LLVM-Unit :: tools/llvm-exegesis/X86/./LLVMExegesisX86Tests/Core2TargetTest.SetRegToST0_64Bits (42998 of 43032)
PASS: LLVM-Unit :: tools/llvm-exegesis/X86/./LLVMExegesisX86Tests/Core2TargetTest.SetRegToVR64Value (42999 of 43032)
PASS: LLVM-Unit :: tools/llvm-exegesis/X86/./LLVMExegesisX86Tests/FakeSnippetGeneratorTest.ComputeRegisterInitialValuesAdd16ri (43000 of 43032)
PASS: LLVM-Unit :: tools/llvm-exegesis/X86/./LLVMExegesisX86Tests/FakeSnippetGeneratorTest.ComputeRegisterInitialValuesAdd64rr (43001 of 43032)
PASS: LLVM-Unit :: tools/llvm-exegesis/X86/./LLVMExegesisX86Tests/FakeSnippetGeneratorTest.MemoryUse_Movsb (43002 of 43032)
PASS: LLVM-Unit :: tools/llvm-exegesis/X86/./LLVMExegesisX86Tests/ParallelSnippetGeneratorTest.MemoryUse (43003 of 43032)
PASS: LLVM-Unit :: tools/llvm-exegesis/X86/./LLVMExegesisX86Tests/ParallelSnippetGeneratorTest.MOV16ms (43004 of 43032)
PASS: LLVM-Unit :: tools/llvm-exegesis/X86/./LLVMExegesisX86Tests/ParallelSnippetGeneratorTest.NoTiedVariables (43005 of 43032)
PASS: LLVM-Unit :: tools/llvm-exegesis/X86/./LLVMExegesisX86Tests/ParallelSnippetGeneratorTest.ParallelInstruction (43006 of 43032)
PASS: LLVM-Unit :: tools/llvm-exegesis/X86/./LLVMExegesisX86Tests/ParallelSnippetGeneratorTest.SerialInstruction (43007 of 43032)
PASS: LLVM-Unit :: tools/llvm-exegesis/X86/./LLVMExegesisX86Tests/ParallelSnippetGeneratorTest.StaticRenaming (43008 of 43032)
PASS: LLVM-Unit :: tools/llvm-exegesis/X86/./LLVMExegesisX86Tests/RegisterAliasingTest.TrackRegisterClass (43009 of 43032)
PASS: LLVM-Unit :: tools/llvm-exegesis/X86/./LLVMExegesisX86Tests/RegisterAliasingTest.TrackRegisterClassCache (43010 of 43032)
PASS: LLVM-Unit :: tools/llvm-exegesis/X86/./LLVMExegesisX86Tests/RegisterAliasingTest.TrackSimpleRegister (43011 of 43032)
PASS: LLVM-Unit :: tools/llvm-exegesis/X86/./LLVMExegesisX86Tests/SchedClassResolutionTest.ComputeIdealizedProcResPressure_1P1_1P05_2P0156 (43012 of 43032)
PASS: LLVM-Unit :: tools/llvm-exegesis/X86/./LLVMExegesisX86Tests/SchedClassResolutionTest.ComputeIdealizedProcResPressure_2P0 (43013 of 43032)
PASS: LLVM-Unit :: tools/llvm-exegesis/X86/./LLVMExegesisX86Tests/SchedClassResolutionTest.ComputeIdealizedProcResPressure_2P05_2P0156 (43014 of 43032)
PASS: LLVM-Unit :: tools/llvm-exegesis/X86/./LLVMExegesisX86Tests/SchedClassResolutionTest.ComputeIdealizedProcResPressure_2P05 (43015 of 43032)
PASS: LLVM-Unit :: tools/llvm-exegesis/X86/./LLVMExegesisX86Tests/SerialSnippetGeneratorTest.DependencyThroughOtherOpcode (43016 of 43032)
PASS: LLVM-Unit :: tools/llvm-exegesis/X86/./LLVMExegesisX86Tests/SerialSnippetGeneratorTest.ImplicitSelfDependencyThroughExplicitRegs (43017 of 43032)
PASS: LLVM-Unit :: tools/llvm-exegesis/X86/./LLVMExegesisX86Tests/SerialSnippetGeneratorTest.ImplicitSelfDependencyThroughExplicitRegsForbidAll (43018 of 43032)
PASS: LLVM-Unit :: tools/llvm-exegesis/X86/./LLVMExegesisX86Tests/SerialSnippetGeneratorTest.ImplicitSelfDependencyThroughImplicitReg (43019 of 43032)
PASS: LLVM-Unit :: tools/llvm-exegesis/X86/./LLVMExegesisX86Tests/X86SnippetFileTest.MissingParam (43020 of 43032)
PASS: LLVM-Unit :: tools/llvm-exegesis/X86/./LLVMExegesisX86Tests/X86SnippetFileTest.BadDefregParam (43021 of 43032)
PASS: LLVM-Unit :: tools/llvm-exegesis/X86/./LLVMExegesisX86Tests/X86SnippetFileTest.NoAsmStreamer (43022 of 43032)
PASS: LLVM-Unit :: tools/llvm-exegesis/X86/./LLVMExegesisX86Tests/SerialSnippetGeneratorTest.ImplicitSelfDependencyThroughTiedRegs (43023 of 43032)
PASS: LLVM-Unit :: tools/llvm-exegesis/X86/./LLVMExegesisX86Tests/SerialSnippetGeneratorTest.VCVTUSI642SDZrrb_Int (43024 of 43032)
PASS: LLVM-Unit :: tools/llvm-exegesis/X86/./LLVMExegesisX86Tests/SerialSnippetGeneratorTest.LAHF (43025 of 43032)
PASS: LLVM-Unit :: tools/llvm-exegesis/X86/./LLVMExegesisX86Tests/X86SnippetFileTest.NoDefregValue (43026 of 43032)
PASS: LLVM-Unit :: tools/llvm-exegesis/X86/./LLVMExegesisX86Tests/X86SnippetRepetitorTest.Duplicate (43027 of 43032)
PASS: LLVM-Unit :: tools/llvm-exegesis/X86/./LLVMExegesisX86Tests/X86SnippetFileTest.Works (43028 of 43032)
PASS: LLVM-Unit :: tools/llvm-exegesis/X86/./LLVMExegesisX86Tests/X86SnippetRepetitorTest.Loop (43029 of 43032)
PASS: LLVM-Unit :: tools/llvm-profgen/./LLVMProfgenTests/TestCompression.TestMaxDedupSize (43030 of 43032)
PASS: LLVM-Unit :: tools/llvm-profgen/./LLVMProfgenTests/TestCompression.TestNoSizeLimit2 (43031 of 43032)
PASS: LLVM-Unit :: tools/llvm-profgen/./LLVMProfgenTests/TestCompression.TestNoSizeLimit1 (43032 of 43032)
********************
Failed Tests (1):
  LLVM-Unit :: IR/./IRTests/DIBuilder.CreateSetType

Hide Details

Hide Details

Testing Time: 12548.27s Unsupported : 1505 Passed : 41376 Expectedly Failed: 150 Failed : 1 FAILED: test/CMakeFiles/check-llvm cd /Users/buildslave/jenkins/workspace/clang-stage2-cmake-RgSan/clang-build/test && /Users/buildslave/jenkins/workspace/clang-stage2-cmake-RgSan/venv/bin/python3 /Users/buildslave/jenkins/workspace/clang-stage2-cmake-RgSan/clang-build/./bin/llvm-lit --xunit-xml-output=testresults.xunit.xml -v -vv --timeout=1800 /Users/buildslave/jenkins/workspace/clang-stage2-cmake-RgSan/clang-build/test ninja: build stopped: cannot make progress due to previous errors. Command failed: Command '['/usr/local/bin/ninja', '-v', '-k', '0', 'check-llvm', 'check-clang']' returned non-zero exit status 1 Command: ['/usr/local/bin/ninja', '-v', '-k', '0', 'check-llvm', 'check-clang'] Build step 'Execute shell' marked build as failure [WARNINGS] Skipping publisher since build result is FAILURE Recording test results [Checks API] No suitable checks publisher found. Extended Email Publisher is currently disabled in project settings Finished: FAILURE