collapse
0%
WDescription%
Build stability: All recent builds failed.0
Build History
x
 

Issues

Found 3 issues:
Error: Command errored out with exit status 1: @@@ Install VirtualEnv LNT @@@ ++ . /Users/buildslave/jenkins/workspace/lnt-ctmark-aarch64-O3-flto/config/tasks/utils/pip_install.sh lnt/ +++ pip install lnt/ DEPRECATION: Python 2.7 reached the end of its life on January 1st, 2020. Please upgrade your Python as Python 2.7 is no longer maintained. pip 21.0 will drop support for Python 2.7 in January 2021. More details about Python 2 support in pip, can be found at https://pip.pypa.io/en/latest/development/release-process/#python-2-support Processing ./lnt ERROR: Command errored out with exit status 1: command: /Users/buildslave/jenkins/workspace/lnt-ctmark-aarch64-O3-flto/venv/bin/python2.7 -c 'import sys, setuptools, tokenize; sys.argv[0] = '"'"'/private/var/folders/09/r4vw4v8n5kb67jl66zvlbljw0000gn/T/pip-req-build-LLG5dE/setup.py'"'"'; __file__='"'"'/private/var/folders/09/r4vw4v8n5kb67jl66zvlbljw0000gn/T/pip-req-build-LLG5dE/setup.py'"'"';f=getattr(tokenize, '"'"'open'"'"', open)(__file__);code=f.read().replace('"'"'\r\n'"'"', '"'"'\n'"'"');f.close();exec(compile(code, __file__, '"'"'exec'"'"'))' egg_info --egg-base /private/var/folders/09/r4vw4v8n5kb67jl66zvlbljw0000gn/T/pip-pip-egg-info-tpGdFw cwd: /private/var/folders/09/r4vw4v8n5kb67jl66zvlbljw0000gn/T/pip-req-build-LLG5dE/ AttributeError: 'ParsedRequirement' object has no attribute 'req' Complete output (5 lines): Traceback (most recent call last): File "<string>", line 1, in <module> File "/private/var/folders/09/r4vw4v8n5kb67jl66zvlbljw0000gn/T/pip-req-build-LLG5dE/setup.py", line 43, in <module> reqs = [str(ir.req) for ir in install_reqs] AttributeError: 'ParsedRequirement' object has no attribute 'req' ---------------------------------------- ERROR: Command errored out with exit status 1: python setup.py egg_info Check the logs for full command output. Error: Command errored out with exit status 1: python setup.py egg_info Check the logs for full command output. File "<string>", line 1, in <module> File "/private/var/folders/09/r4vw4v8n5kb67jl66zvlbljw0000gn/T/pip-req-build-LLG5dE/setup.py", line 43, in <module> reqs = [str(ir.req) for ir in install_reqs] AttributeError: 'ParsedRequirement' object has no attribute 'req' ---------------------------------------- ERROR: Command errored out with exit status 1: python setup.py egg_info Check the logs for full command output. *Build failed!* (return code 1) [Pipeline] }

Build Log

 

Issues

Found 3 issues:
Error: Command errored out with exit status 1: @@@ Install VirtualEnv LNT @@@ ++ . /Users/buildslave/jenkins/workspace/lnt-ctmark-aarch64-O3-flto/config/tasks/utils/pip_install.sh lnt/ +++ pip install lnt/ DEPRECATION: Python 2.7 reached the end of its life on January 1st, 2020. Please upgrade your Python as Python 2.7 is no longer maintained. pip 21.0 will drop support for Python 2.7 in January 2021. More details about Python 2 support in pip, can be found at https://pip.pypa.io/en/latest/development/release-process/#python-2-support Processing ./lnt ERROR: Command errored out with exit status 1: command: /Users/buildslave/jenkins/workspace/lnt-ctmark-aarch64-O3-flto/venv/bin/python2.7 -c 'import sys, setuptools, tokenize; sys.argv[0] = '"'"'/private/var/folders/09/r4vw4v8n5kb67jl66zvlbljw0000gn/T/pip-req-build-OrgGl_/setup.py'"'"'; __file__='"'"'/private/var/folders/09/r4vw4v8n5kb67jl66zvlbljw0000gn/T/pip-req-build-OrgGl_/setup.py'"'"';f=getattr(tokenize, '"'"'open'"'"', open)(__file__);code=f.read().replace('"'"'\r\n'"'"', '"'"'\n'"'"');f.close();exec(compile(code, __file__, '"'"'exec'"'"'))' egg_info --egg-base /private/var/folders/09/r4vw4v8n5kb67jl66zvlbljw0000gn/T/pip-pip-egg-info-jn0MAN cwd: /private/var/folders/09/r4vw4v8n5kb67jl66zvlbljw0000gn/T/pip-req-build-OrgGl_/ AttributeError: 'ParsedRequirement' object has no attribute 'req' Complete output (5 lines): Traceback (most recent call last): File "<string>", line 1, in <module> File "/private/var/folders/09/r4vw4v8n5kb67jl66zvlbljw0000gn/T/pip-req-build-OrgGl_/setup.py", line 43, in <module> reqs = [str(ir.req) for ir in install_reqs] AttributeError: 'ParsedRequirement' object has no attribute 'req' ---------------------------------------- ERROR: Command errored out with exit status 1: python setup.py egg_info Check the logs for full command output. Error: Command errored out with exit status 1: python setup.py egg_info Check the logs for full command output. File "<string>", line 1, in <module> File "/private/var/folders/09/r4vw4v8n5kb67jl66zvlbljw0000gn/T/pip-req-build-OrgGl_/setup.py", line 43, in <module> reqs = [str(ir.req) for ir in install_reqs] AttributeError: 'ParsedRequirement' object has no attribute 'req' ---------------------------------------- ERROR: Command errored out with exit status 1: python setup.py egg_info Check the logs for full command output. *Build failed!* (return code 1) [Pipeline] }

Build Log

 Identified problems

Issues

Found 23 issues:
Aborted Waiting to resume part of lnt-ctmark-aarch64-O3-flto clang-d352300-g37d417bb0ad-t9261-b9261.tar.gz: Jenkins is about to shut down Waiting to resume part of lnt-ctmark-aarch64-O3-flto clang-d352300-g37d417bb0ad-t9261-b9261.tar.gz: Jenkins is about to shut down Waiting to resume part of lnt-ctmark-aarch64-O3-flto clang-d352300-g37d417bb0ad-t9261-b9261.tar.gz: Jenkins is about to shut down Waiting to resume part of lnt-ctmark-aarch64-O3-flto clang-d352300-g37d417bb0ad-t9261-b9261.tar.gz: Jenkins is about to shut down Ready to run at Mon May 11 05:57:47 PDT 2020 Aborted by Azharuddin Mohammed Sending interrupt signal to process Aborted by Azharuddin Mohammed Aborted Waiting to resume part of lnt-ctmark-aarch64-O3-flto clang-d352300-g37d417bb0ad-t9261-b9261.tar.gz: Jenkins is about to shut down Waiting to resume part of lnt-ctmark-aarch64-O3-flto clang-d352300-g37d417bb0ad-t9261-b9261.tar.gz: Jenkins is about to shut down Ready to run at Mon May 11 05:57:47 PDT 2020 Aborted by Azharuddin Mohammed Sending interrupt signal to process Aborted by Azharuddin Mohammed Sending interrupt signal to process Aborted by Azharuddin Mohammed Aborted Ready to run at Mon May 11 05:57:47 PDT 2020 Aborted by Azharuddin Mohammed Sending interrupt signal to process Aborted by Azharuddin Mohammed Sending interrupt signal to process Aborted by Azharuddin Mohammed Sending interrupt signal to process Click here to forcibly terminate running steps tramp3d-v4.cpp error: non-const lvalue reference to type 'std::ostream' (aka 'basic_ostream<char>') cannot bind to a value of unrelated type 'std::ostringstream' (aka 'basic_ostringstream<char>') Dependee "/Users/buildslave/jenkins/workspace/lnt-ctmark-aarch64-O3-flto/lnt-sandbox/build/CTMark/tramp3d-v4/CMakeFiles/CMakeDirectoryInformation.cmake" is newer than depender "/Users/buildslave/jenkins/workspace/lnt-ctmark-aarch64-O3-flto/lnt-sandbox/build/CTMark/tramp3d-v4/CMakeFiles/tramp3d-v4.dir/depend.internal". Scanning dependencies of target tramp3d-v4 /Applications/Xcode.app/Contents/Developer/usr/bin/make -f CTMark/tramp3d-v4/CMakeFiles/tramp3d-v4.dir/build.make CTMark/tramp3d-v4/CMakeFiles/tramp3d-v4.dir/build [ 52%] Building CXX object CTMark/tramp3d-v4/CMakeFiles/tramp3d-v4.dir/tramp3d-v4.cpp.o cd /Users/buildslave/jenkins/workspace/lnt-ctmark-aarch64-O3-flto/lnt-sandbox/build/CTMark/tramp3d-v4 && /Users/buildslave/jenkins/workspace/lnt-ctmark-aarch64-O3-flto/lnt-sandbox/build/tools/timeit --summary CMakeFiles/tramp3d-v4.dir/tramp3d-v4.cpp.o.time /Users/buildslave/jenkins/workspace/lnt-ctmark-aarch64-O3-flto/compiler/bin/clang++ -DNDEBUG -B /Applications/Xcode.app/Contents/Developer/Toolchains/XcodeDefault.xctoolchain/usr/bin -O3 -flto -arch arm64 -isysroot /Applications/Xcode.app/Contents/Developer/Platforms/iPhoneOS.platform/Developer/SDKs/iPhoneOS12.2.sdk -w -Werror=date-time -fno-exceptions -o CMakeFiles/tramp3d-v4.dir/tramp3d-v4.cpp.o -c /Users/buildslave/jenkins/workspace/lnt-ctmark-aarch64-O3-flto/test-suite/CTMark/tramp3d-v4/tramp3d-v4.cpp /Users/buildslave/jenkins/workspace/lnt-ctmark-aarch64-O3-flto/test-suite/CTMark/tramp3d-v4/tramp3d-v4.cpp:241:35: error: non-const lvalue reference to type 'std::ostream' (aka 'basic_ostream<char>') cannot bind to a value of unrelated type 'std::ostringstream' (aka 'basic_ostringstream<char>') std::ostream& stream() { return *message_m; } ^~~~~~~~~~ tramp3d-v4.cpp error: implicit instantiation of undefined template 'std::__1::basic_ostringstream<char, std::__1::char_traits<char>, std::__1::allocator<char>>' [ 52%] Building CXX object CTMark/tramp3d-v4/CMakeFiles/tramp3d-v4.dir/tramp3d-v4.cpp.o cd /Users/buildslave/jenkins/workspace/lnt-ctmark-aarch64-O3-flto/lnt-sandbox/build/CTMark/tramp3d-v4 && /Users/buildslave/jenkins/workspace/lnt-ctmark-aarch64-O3-flto/lnt-sandbox/build/tools/timeit --summary CMakeFiles/tramp3d-v4.dir/tramp3d-v4.cpp.o.time /Users/buildslave/jenkins/workspace/lnt-ctmark-aarch64-O3-flto/compiler/bin/clang++ -DNDEBUG -B /Applications/Xcode.app/Contents/Developer/Toolchains/XcodeDefault.xctoolchain/usr/bin -O3 -flto -arch arm64 -isysroot /Applications/Xcode.app/Contents/Developer/Platforms/iPhoneOS.platform/Developer/SDKs/iPhoneOS12.2.sdk -w -Werror=date-time -fno-exceptions -o CMakeFiles/tramp3d-v4.dir/tramp3d-v4.cpp.o -c /Users/buildslave/jenkins/workspace/lnt-ctmark-aarch64-O3-flto/test-suite/CTMark/tramp3d-v4/tramp3d-v4.cpp /Users/buildslave/jenkins/workspace/lnt-ctmark-aarch64-O3-flto/test-suite/CTMark/tramp3d-v4/tramp3d-v4.cpp:241:35: error: non-const lvalue reference to type 'std::ostream' (aka 'basic_ostream<char>') cannot bind to a value of unrelated type 'std::ostringstream' (aka 'basic_ostringstream<char>') std::ostream& stream() { return *message_m; } ^~~~~~~~~~ /Users/buildslave/jenkins/workspace/lnt-ctmark-aarch64-O3-flto/test-suite/CTMark/tramp3d-v4/tramp3d-v4.cpp:244:23: error: implicit instantiation of undefined template 'std::__1::basic_ostringstream<char, std::__1::char_traits<char>, std::__1::allocator<char>>' { return message_m->setf(setbits,field);} ^ tramp3d-v4.cpp error: implicit instantiation of undefined template 'std::__1::basic_ostringstream<char, std::__1::char_traits<char>, std::__1::allocator<char>>' { return message_m->setf(setbits,field);} ^ /Users/buildslave/jenkins/workspace/lnt-ctmark-aarch64-O3-flto/compiler/bin/../include/c++/v1/iosfwd:136:32: note: template is declared here class _LIBCPP_TEMPLATE_VIS basic_ostringstream; ^ /Users/buildslave/jenkins/workspace/lnt-ctmark-aarch64-O3-flto/test-suite/CTMark/tramp3d-v4/tramp3d-v4.cpp:246:42: error: implicit instantiation of undefined template 'std::__1::basic_ostringstream<char, std::__1::char_traits<char>, std::__1::allocator<char>>' setf(FmtFlags_t f) { return message_m->setf(f); } ^ tramp3d-v4.cpp error: implicit instantiation of undefined template 'std::__1::basic_ostringstream<char, std::__1::char_traits<char>, std::__1::allocator<char>>' setf(FmtFlags_t f) { return message_m->setf(f); } ^ /Users/buildslave/jenkins/workspace/lnt-ctmark-aarch64-O3-flto/compiler/bin/../include/c++/v1/iosfwd:136:32: note: template is declared here class _LIBCPP_TEMPLATE_VIS basic_ostringstream; ^ /Users/buildslave/jenkins/workspace/lnt-ctmark-aarch64-O3-flto/test-suite/CTMark/tramp3d-v4/tramp3d-v4.cpp:247:40: error: implicit instantiation of undefined template 'std::__1::basic_ostringstream<char, std::__1::char_traits<char>, std::__1::allocator<char>>' void unsetf(FmtFlags_t f) { message_m->unsetf(f); } ^ tramp3d-v4.cpp error: implicit instantiation of undefined template 'std::__1::basic_ostringstream<char, std::__1::char_traits<char>, std::__1::allocator<char>>' void unsetf(FmtFlags_t f) { message_m->unsetf(f); } ^ /Users/buildslave/jenkins/workspace/lnt-ctmark-aarch64-O3-flto/compiler/bin/../include/c++/v1/iosfwd:136:32: note: template is declared here class _LIBCPP_TEMPLATE_VIS basic_ostringstream; ^ /Users/buildslave/jenkins/workspace/lnt-ctmark-aarch64-O3-flto/test-suite/CTMark/tramp3d-v4/tramp3d-v4.cpp:248:40: error: implicit instantiation of undefined template 'std::__1::basic_ostringstream<char, std::__1::char_traits<char>, std::__1::allocator<char>>' long flags() const { return message_m->flags(); } ^ tramp3d-v4.cpp error: implicit instantiation of undefined template 'std::__1::basic_ostringstream<char, std::__1::char_traits<char>, std::__1::allocator<char>>' long flags() const { return message_m->flags(); } ^ /Users/buildslave/jenkins/workspace/lnt-ctmark-aarch64-O3-flto/compiler/bin/../include/c++/v1/iosfwd:136:32: note: template is declared here class _LIBCPP_TEMPLATE_VIS basic_ostringstream; ^ /Users/buildslave/jenkins/workspace/lnt-ctmark-aarch64-O3-flto/test-suite/CTMark/tramp3d-v4/tramp3d-v4.cpp:249:46: error: implicit instantiation of undefined template 'std::__1::basic_ostringstream<char, std::__1::char_traits<char>, std::__1::allocator<char>>' long flags(FmtFlags_t f) { return message_m->flags(f); } ^ tramp3d-v4.cpp error: implicit instantiation of undefined template 'std::__1::basic_ostringstream<char, std::__1::char_traits<char>, std::__1::allocator<char>>' long flags(FmtFlags_t f) { return message_m->flags(f); } ^ /Users/buildslave/jenkins/workspace/lnt-ctmark-aarch64-O3-flto/compiler/bin/../include/c++/v1/iosfwd:136:32: note: template is declared here class _LIBCPP_TEMPLATE_VIS basic_ostringstream; ^ /Users/buildslave/jenkins/workspace/lnt-ctmark-aarch64-O3-flto/test-suite/CTMark/tramp3d-v4/tramp3d-v4.cpp:250:39: error: implicit instantiation of undefined template 'std::__1::basic_ostringstream<char, std::__1::char_traits<char>, std::__1::allocator<char>>' int width() const { return message_m->width(); } ^ tramp3d-v4.cpp error: implicit instantiation of undefined template 'std::__1::basic_ostringstream<char, std::__1::char_traits<char>, std::__1::allocator<char>>' int width() const { return message_m->width(); } ^ /Users/buildslave/jenkins/workspace/lnt-ctmark-aarch64-O3-flto/compiler/bin/../include/c++/v1/iosfwd:136:32: note: template is declared here class _LIBCPP_TEMPLATE_VIS basic_ostringstream; ^ /Users/buildslave/jenkins/workspace/lnt-ctmark-aarch64-O3-flto/test-suite/CTMark/tramp3d-v4/tramp3d-v4.cpp:251:38: error: implicit instantiation of undefined template 'std::__1::basic_ostringstream<char, std::__1::char_traits<char>, std::__1::allocator<char>>' int width(int w) { return message_m->width(w); } ^ tramp3d-v4.cpp error: implicit instantiation of undefined template 'std::__1::basic_ostringstream<char, std::__1::char_traits<char>, std::__1::allocator<char>>' int width(int w) { return message_m->width(w); } ^ /Users/buildslave/jenkins/workspace/lnt-ctmark-aarch64-O3-flto/compiler/bin/../include/c++/v1/iosfwd:136:32: note: template is declared here class _LIBCPP_TEMPLATE_VIS basic_ostringstream; ^ /Users/buildslave/jenkins/workspace/lnt-ctmark-aarch64-O3-flto/test-suite/CTMark/tramp3d-v4/tramp3d-v4.cpp:252:39: error: implicit instantiation of undefined template 'std::__1::basic_ostringstream<char, std::__1::char_traits<char>, std::__1::allocator<char>>' char fill() const { return message_m->fill(); } ^ ... (limited to first 12 issues)

Build Log

 Identified problems

Issues

Found 22 issues:
Aborted Waiting to resume part of lnt-ctmark-aarch64-O3-flto clang-d347621-g2a6eedbb51f-t8493-b8493.tar.gz: Jenkins is about to shut down Waiting to resume part of lnt-ctmark-aarch64-O3-flto clang-d347621-g2a6eedbb51f-t8493-b8493.tar.gz: Jenkins is about to shut down Waiting to resume part of lnt-ctmark-aarch64-O3-flto clang-d347621-g2a6eedbb51f-t8493-b8493.tar.gz: Jenkins is about to shut down Waiting to resume part of lnt-ctmark-aarch64-O3-flto clang-d347621-g2a6eedbb51f-t8493-b8493.tar.gz: Jenkins is about to shut down Ready to run at Wed Apr 22 14:49:30 PDT 2020 Aborted by Azharuddin Mohammed Sending interrupt signal to process Aborted by Azharuddin Mohammed Aborted Waiting to resume part of lnt-ctmark-aarch64-O3-flto clang-d347621-g2a6eedbb51f-t8493-b8493.tar.gz: Jenkins is about to shut down Waiting to resume part of lnt-ctmark-aarch64-O3-flto clang-d347621-g2a6eedbb51f-t8493-b8493.tar.gz: Jenkins is about to shut down Ready to run at Wed Apr 22 14:49:30 PDT 2020 Aborted by Azharuddin Mohammed Sending interrupt signal to process Aborted by Azharuddin Mohammed Sending interrupt signal to process ++ LNT_RESULT_URL= tramp3d-v4.cpp error: non-const lvalue reference to type 'std::ostream' (aka 'basic_ostream<char>') cannot bind to a value of unrelated type 'std::ostringstream' (aka 'basic_ostringstream<char>') Dependee "/Users/buildslave/jenkins/workspace/lnt-ctmark-aarch64-O3-flto/lnt-sandbox/build/CTMark/tramp3d-v4/CMakeFiles/CMakeDirectoryInformation.cmake" is newer than depender "/Users/buildslave/jenkins/workspace/lnt-ctmark-aarch64-O3-flto/lnt-sandbox/build/CTMark/tramp3d-v4/CMakeFiles/tramp3d-v4.dir/depend.internal". Scanning dependencies of target tramp3d-v4 /Applications/Xcode.app/Contents/Developer/usr/bin/make -f CTMark/tramp3d-v4/CMakeFiles/tramp3d-v4.dir/build.make CTMark/tramp3d-v4/CMakeFiles/tramp3d-v4.dir/build [ 52%] Building CXX object CTMark/tramp3d-v4/CMakeFiles/tramp3d-v4.dir/tramp3d-v4.cpp.o cd /Users/buildslave/jenkins/workspace/lnt-ctmark-aarch64-O3-flto/lnt-sandbox/build/CTMark/tramp3d-v4 && /Users/buildslave/jenkins/workspace/lnt-ctmark-aarch64-O3-flto/lnt-sandbox/build/tools/timeit --summary CMakeFiles/tramp3d-v4.dir/tramp3d-v4.cpp.o.time /Users/buildslave/jenkins/workspace/lnt-ctmark-aarch64-O3-flto/compiler/bin/clang++ -DNDEBUG -B /Applications/Xcode.app/Contents/Developer/Toolchains/XcodeDefault.xctoolchain/usr/bin -O3 -flto -arch arm64 -isysroot /Applications/Xcode.app/Contents/Developer/Platforms/iPhoneOS.platform/Developer/SDKs/iPhoneOS12.2.sdk -w -Werror=date-time -fno-exceptions -o CMakeFiles/tramp3d-v4.dir/tramp3d-v4.cpp.o -c /Users/buildslave/jenkins/workspace/lnt-ctmark-aarch64-O3-flto/test-suite/CTMark/tramp3d-v4/tramp3d-v4.cpp /Users/buildslave/jenkins/workspace/lnt-ctmark-aarch64-O3-flto/test-suite/CTMark/tramp3d-v4/tramp3d-v4.cpp:241:35: error: non-const lvalue reference to type 'std::ostream' (aka 'basic_ostream<char>') cannot bind to a value of unrelated type 'std::ostringstream' (aka 'basic_ostringstream<char>') std::ostream& stream() { return *message_m; } ^~~~~~~~~~ tramp3d-v4.cpp error: implicit instantiation of undefined template 'std::__1::basic_ostringstream<char, std::__1::char_traits<char>, std::__1::allocator<char>>' [ 52%] Building CXX object CTMark/tramp3d-v4/CMakeFiles/tramp3d-v4.dir/tramp3d-v4.cpp.o cd /Users/buildslave/jenkins/workspace/lnt-ctmark-aarch64-O3-flto/lnt-sandbox/build/CTMark/tramp3d-v4 && /Users/buildslave/jenkins/workspace/lnt-ctmark-aarch64-O3-flto/lnt-sandbox/build/tools/timeit --summary CMakeFiles/tramp3d-v4.dir/tramp3d-v4.cpp.o.time /Users/buildslave/jenkins/workspace/lnt-ctmark-aarch64-O3-flto/compiler/bin/clang++ -DNDEBUG -B /Applications/Xcode.app/Contents/Developer/Toolchains/XcodeDefault.xctoolchain/usr/bin -O3 -flto -arch arm64 -isysroot /Applications/Xcode.app/Contents/Developer/Platforms/iPhoneOS.platform/Developer/SDKs/iPhoneOS12.2.sdk -w -Werror=date-time -fno-exceptions -o CMakeFiles/tramp3d-v4.dir/tramp3d-v4.cpp.o -c /Users/buildslave/jenkins/workspace/lnt-ctmark-aarch64-O3-flto/test-suite/CTMark/tramp3d-v4/tramp3d-v4.cpp /Users/buildslave/jenkins/workspace/lnt-ctmark-aarch64-O3-flto/test-suite/CTMark/tramp3d-v4/tramp3d-v4.cpp:241:35: error: non-const lvalue reference to type 'std::ostream' (aka 'basic_ostream<char>') cannot bind to a value of unrelated type 'std::ostringstream' (aka 'basic_ostringstream<char>') std::ostream& stream() { return *message_m; } ^~~~~~~~~~ /Users/buildslave/jenkins/workspace/lnt-ctmark-aarch64-O3-flto/test-suite/CTMark/tramp3d-v4/tramp3d-v4.cpp:244:23: error: implicit instantiation of undefined template 'std::__1::basic_ostringstream<char, std::__1::char_traits<char>, std::__1::allocator<char>>' { return message_m->setf(setbits,field);} ^ tramp3d-v4.cpp error: implicit instantiation of undefined template 'std::__1::basic_ostringstream<char, std::__1::char_traits<char>, std::__1::allocator<char>>' { return message_m->setf(setbits,field);} ^ /Users/buildslave/jenkins/workspace/lnt-ctmark-aarch64-O3-flto/compiler/bin/../include/c++/v1/iosfwd:136:32: note: template is declared here class _LIBCPP_TEMPLATE_VIS basic_ostringstream; ^ /Users/buildslave/jenkins/workspace/lnt-ctmark-aarch64-O3-flto/test-suite/CTMark/tramp3d-v4/tramp3d-v4.cpp:246:42: error: implicit instantiation of undefined template 'std::__1::basic_ostringstream<char, std::__1::char_traits<char>, std::__1::allocator<char>>' setf(FmtFlags_t f) { return message_m->setf(f); } ^ tramp3d-v4.cpp error: implicit instantiation of undefined template 'std::__1::basic_ostringstream<char, std::__1::char_traits<char>, std::__1::allocator<char>>' setf(FmtFlags_t f) { return message_m->setf(f); } ^ /Users/buildslave/jenkins/workspace/lnt-ctmark-aarch64-O3-flto/compiler/bin/../include/c++/v1/iosfwd:136:32: note: template is declared here class _LIBCPP_TEMPLATE_VIS basic_ostringstream; ^ /Users/buildslave/jenkins/workspace/lnt-ctmark-aarch64-O3-flto/test-suite/CTMark/tramp3d-v4/tramp3d-v4.cpp:247:40: error: implicit instantiation of undefined template 'std::__1::basic_ostringstream<char, std::__1::char_traits<char>, std::__1::allocator<char>>' void unsetf(FmtFlags_t f) { message_m->unsetf(f); } ^ tramp3d-v4.cpp error: implicit instantiation of undefined template 'std::__1::basic_ostringstream<char, std::__1::char_traits<char>, std::__1::allocator<char>>' void unsetf(FmtFlags_t f) { message_m->unsetf(f); } ^ /Users/buildslave/jenkins/workspace/lnt-ctmark-aarch64-O3-flto/compiler/bin/../include/c++/v1/iosfwd:136:32: note: template is declared here class _LIBCPP_TEMPLATE_VIS basic_ostringstream; ^ /Users/buildslave/jenkins/workspace/lnt-ctmark-aarch64-O3-flto/test-suite/CTMark/tramp3d-v4/tramp3d-v4.cpp:248:40: error: implicit instantiation of undefined template 'std::__1::basic_ostringstream<char, std::__1::char_traits<char>, std::__1::allocator<char>>' long flags() const { return message_m->flags(); } ^ tramp3d-v4.cpp error: implicit instantiation of undefined template 'std::__1::basic_ostringstream<char, std::__1::char_traits<char>, std::__1::allocator<char>>' long flags() const { return message_m->flags(); } ^ /Users/buildslave/jenkins/workspace/lnt-ctmark-aarch64-O3-flto/compiler/bin/../include/c++/v1/iosfwd:136:32: note: template is declared here class _LIBCPP_TEMPLATE_VIS basic_ostringstream; ^ /Users/buildslave/jenkins/workspace/lnt-ctmark-aarch64-O3-flto/test-suite/CTMark/tramp3d-v4/tramp3d-v4.cpp:249:46: error: implicit instantiation of undefined template 'std::__1::basic_ostringstream<char, std::__1::char_traits<char>, std::__1::allocator<char>>' long flags(FmtFlags_t f) { return message_m->flags(f); } ^ tramp3d-v4.cpp error: implicit instantiation of undefined template 'std::__1::basic_ostringstream<char, std::__1::char_traits<char>, std::__1::allocator<char>>' long flags(FmtFlags_t f) { return message_m->flags(f); } ^ /Users/buildslave/jenkins/workspace/lnt-ctmark-aarch64-O3-flto/compiler/bin/../include/c++/v1/iosfwd:136:32: note: template is declared here class _LIBCPP_TEMPLATE_VIS basic_ostringstream; ^ /Users/buildslave/jenkins/workspace/lnt-ctmark-aarch64-O3-flto/test-suite/CTMark/tramp3d-v4/tramp3d-v4.cpp:250:39: error: implicit instantiation of undefined template 'std::__1::basic_ostringstream<char, std::__1::char_traits<char>, std::__1::allocator<char>>' int width() const { return message_m->width(); } ^ tramp3d-v4.cpp error: implicit instantiation of undefined template 'std::__1::basic_ostringstream<char, std::__1::char_traits<char>, std::__1::allocator<char>>' int width() const { return message_m->width(); } ^ /Users/buildslave/jenkins/workspace/lnt-ctmark-aarch64-O3-flto/compiler/bin/../include/c++/v1/iosfwd:136:32: note: template is declared here class _LIBCPP_TEMPLATE_VIS basic_ostringstream; ^ /Users/buildslave/jenkins/workspace/lnt-ctmark-aarch64-O3-flto/test-suite/CTMark/tramp3d-v4/tramp3d-v4.cpp:251:38: error: implicit instantiation of undefined template 'std::__1::basic_ostringstream<char, std::__1::char_traits<char>, std::__1::allocator<char>>' int width(int w) { return message_m->width(w); } ^ tramp3d-v4.cpp error: implicit instantiation of undefined template 'std::__1::basic_ostringstream<char, std::__1::char_traits<char>, std::__1::allocator<char>>' int width(int w) { return message_m->width(w); } ^ /Users/buildslave/jenkins/workspace/lnt-ctmark-aarch64-O3-flto/compiler/bin/../include/c++/v1/iosfwd:136:32: note: template is declared here class _LIBCPP_TEMPLATE_VIS basic_ostringstream; ^ /Users/buildslave/jenkins/workspace/lnt-ctmark-aarch64-O3-flto/test-suite/CTMark/tramp3d-v4/tramp3d-v4.cpp:252:39: error: implicit instantiation of undefined template 'std::__1::basic_ostringstream<char, std::__1::char_traits<char>, std::__1::allocator<char>>' char fill() const { return message_m->fill(); } ^ tramp3d-v4.cpp error: implicit instantiation of undefined template 'std::__1::basic_ostringstream<char, std::__1::char_traits<char>, std::__1::allocator<char>>' char fill() const { return message_m->fill(); } ^ /Users/buildslave/jenkins/workspace/lnt-ctmark-aarch64-O3-flto/compiler/bin/../include/c++/v1/iosfwd:136:32: note: template is declared here class _LIBCPP_TEMPLATE_VIS basic_ostringstream; ^ /Users/buildslave/jenkins/workspace/lnt-ctmark-aarch64-O3-flto/test-suite/CTMark/tramp3d-v4/tramp3d-v4.cpp:253:39: error: implicit instantiation of undefined template 'std::__1::basic_ostringstream<char, std::__1::char_traits<char>, std::__1::allocator<char>>' char fill(char c) { return message_m->fill(c); } ^ ... (limited to first 12 issues)

Build Log

 
 x

Issues

Found 1 issues:
Aborted Cloning repository http://labmaster3.local/git/llvm-project.git > git init /Users/buildslave/jenkins/workspace/lnt-ctmark-aarch64-O3-flto@2/pseudo-checkout-llvm-project # timeout=10 Fetching upstream changes from http://labmaster3.local/git/llvm-project.git > git --version # timeout=10 > git fetch --tags --force --progress -- http://labmaster3.local/git/llvm-project.git +refs/heads/*:refs/remotes/origin/* # timeout=10 Aborted by Chris Matthews [Pipeline] } [Pipeline] // dir

Build Log

 

Issues

Found 1 issues:
Aborted Cloning repository http://labmaster3.local/git/llvm-project.git > git init /Users/buildslave/jenkins/workspace/lnt-ctmark-aarch64-O3-flto@2/pseudo-checkout-llvm-project # timeout=10 Fetching upstream changes from http://labmaster3.local/git/llvm-project.git > git --version # timeout=10 > git fetch --tags --force --progress -- http://labmaster3.local/git/llvm-project.git +refs/heads/*:refs/remotes/origin/* # timeout=10 Aborted by Chris Matthews [Pipeline] } [Pipeline] // dir

Build Log

 xIdentified problems
 

Issues

No known issues detected

Build Log

 
 x

Issues

Found 1 issues:
Aborted Waiting to resume part of lnt-ctmark-aarch64-O3-flto clang-d342694-g1a93285c686-t6722-b6722.tar.gz: Jenkins is about to shut down Waiting to resume part of lnt-ctmark-aarch64-O3-flto clang-d342694-g1a93285c686-t6722-b6722.tar.gz: Jenkins is about to shut down Waiting to resume part of lnt-ctmark-aarch64-O3-flto clang-d342694-g1a93285c686-t6722-b6722.tar.gz: Jenkins is about to shut down Waiting to resume part of lnt-ctmark-aarch64-O3-flto clang-d342694-g1a93285c686-t6722-b6722.tar.gz: Jenkins is about to shut down Ready to run at Tue Feb 25 09:56:19 PST 2020 Aborted by Chris Matthews Sending interrupt signal to process ++ LNT_RESULT_URL=

Build Log

 
 
 
 
 
 

Issues

No known issues detected

Build Log

 Identified problems

Issues

No known issues detected

Build Log

 Identified problems

Issues

No known issues detected

Build Log

 Identified problems

Issues

No known issues detected

Build Log

 

Issues

Found 1 issues:
Error: lnt server: internal server error + . /Users/buildslave/jenkins/workspace/lnt-ctmark-aarch64-O3-flto/config/tasks/utils/lnt_submit.sh ++ echo '@@@ LNT Submit @@@' @@@ LNT Submit @@@ ++ '[' -n http://104.154.54.203/db_default/v4/nts/submitRun -a -n lnt-ctmark-aarch64-O3-flto ']' +++ lnt submit http://104.154.54.203/db_default/v4/nts/submitRun /Users/buildslave/jenkins/workspace/lnt-ctmark-aarch64-O3-flto/lnt-sandbox/report.json error: lnt server: internal server error OperationalError('(_mysql_exceptions.OperationalError) (2003, "Can\'t connect to MySQL server on \'104.197.211.174\' (110)")',) ++ LNT_RESULT_URL=

Build Log

 

Issues

Found 1 issues:
Error: lnt server: internal server error + . /Users/buildslave/jenkins/workspace/lnt-ctmark-aarch64-O3-flto/config/tasks/utils/lnt_submit.sh ++ echo '@@@ LNT Submit @@@' @@@ LNT Submit @@@ ++ '[' -n http://104.154.54.203/db_default/v4/nts/submitRun -a -n lnt-ctmark-aarch64-O3-flto ']' +++ lnt submit http://104.154.54.203/db_default/v4/nts/submitRun /Users/buildslave/jenkins/workspace/lnt-ctmark-aarch64-O3-flto/lnt-sandbox/report.json error: lnt server: internal server error OperationalError('(_mysql_exceptions.OperationalError) (2003, "Can\'t connect to MySQL server on \'104.197.211.174\' (110)")',) ++ LNT_RESULT_URL=

Build Log

 

Issues

Found 1 issues:
Error: lnt server: internal server error + . /Users/buildslave/jenkins/workspace/lnt-ctmark-aarch64-O3-flto/config/tasks/utils/lnt_submit.sh ++ echo '@@@ LNT Submit @@@' @@@ LNT Submit @@@ ++ '[' -n http://104.154.54.203/db_default/v4/nts/submitRun -a -n lnt-ctmark-aarch64-O3-flto ']' +++ lnt submit http://104.154.54.203/db_default/v4/nts/submitRun /Users/buildslave/jenkins/workspace/lnt-ctmark-aarch64-O3-flto/lnt-sandbox/report.json error: lnt server: internal server error OperationalError('(_mysql_exceptions.OperationalError) (2003, "Can\'t connect to MySQL server on \'104.197.211.174\' (110)")',) ++ LNT_RESULT_URL=

Build Log

 

Issues

Found 1 issues:
Error: lnt server: internal server error + . /Users/buildslave/jenkins/workspace/lnt-ctmark-aarch64-O3-flto/config/tasks/utils/lnt_submit.sh ++ echo '@@@ LNT Submit @@@' @@@ LNT Submit @@@ ++ '[' -n http://104.154.54.203/db_default/v4/nts/submitRun -a -n lnt-ctmark-aarch64-O3-flto ']' +++ lnt submit http://104.154.54.203/db_default/v4/nts/submitRun /Users/buildslave/jenkins/workspace/lnt-ctmark-aarch64-O3-flto/lnt-sandbox/report.json error: lnt server: internal server error OperationalError('(_mysql_exceptions.OperationalError) (2003, "Can\'t connect to MySQL server on \'104.197.211.174\' (110)")',) ++ LNT_RESULT_URL=

Build Log

 

Issues

Found 1 issues:
Error: lnt server: internal server error + . /Users/buildslave/jenkins/workspace/lnt-ctmark-aarch64-O3-flto/config/tasks/utils/lnt_submit.sh ++ echo '@@@ LNT Submit @@@' @@@ LNT Submit @@@ ++ '[' -n http://104.154.54.203/db_default/v4/nts/submitRun -a -n lnt-ctmark-aarch64-O3-flto ']' +++ lnt submit http://104.154.54.203/db_default/v4/nts/submitRun /Users/buildslave/jenkins/workspace/lnt-ctmark-aarch64-O3-flto/lnt-sandbox/report.json error: lnt server: internal server error OperationalError('(_mysql_exceptions.OperationalError) (2003, "Can\'t connect to MySQL server on \'104.197.211.174\' (110)")',) ++ LNT_RESULT_URL=

Build Log

 

Issues

Found 1 issues:
Error: lnt server: internal server error + . /Users/buildslave/jenkins/workspace/lnt-ctmark-aarch64-O3-flto/config/tasks/utils/lnt_submit.sh ++ echo '@@@ LNT Submit @@@' @@@ LNT Submit @@@ ++ '[' -n http://104.154.54.203/db_default/v4/nts/submitRun -a -n lnt-ctmark-aarch64-O3-flto ']' +++ lnt submit http://104.154.54.203/db_default/v4/nts/submitRun /Users/buildslave/jenkins/workspace/lnt-ctmark-aarch64-O3-flto/lnt-sandbox/report.json error: lnt server: internal server error OperationalError('(_mysql_exceptions.OperationalError) (2003, "Can\'t connect to MySQL server on \'104.197.211.174\' (110)")',) ++ LNT_RESULT_URL=

Build Log

 

Issues

Found 1 issues:
Error: lnt server: internal server error + . /Users/buildslave/jenkins/workspace/lnt-ctmark-aarch64-O3-flto/config/tasks/utils/lnt_submit.sh ++ echo '@@@ LNT Submit @@@' @@@ LNT Submit @@@ ++ '[' -n http://104.154.54.203/db_default/v4/nts/submitRun -a -n lnt-ctmark-aarch64-O3-flto ']' +++ lnt submit http://104.154.54.203/db_default/v4/nts/submitRun /Users/buildslave/jenkins/workspace/lnt-ctmark-aarch64-O3-flto/lnt-sandbox/report.json error: lnt server: internal server error OperationalError('(_mysql_exceptions.OperationalError) (2003, "Can\'t connect to MySQL server on \'104.197.211.174\' (110)")',) ++ LNT_RESULT_URL=

Build Log

 

Issues

Found 1 issues:
Error: lnt server: internal server error + . /Users/buildslave/jenkins/workspace/lnt-ctmark-aarch64-O3-flto/config/tasks/utils/lnt_submit.sh ++ echo '@@@ LNT Submit @@@' @@@ LNT Submit @@@ ++ '[' -n http://104.154.54.203/db_default/v4/nts/submitRun -a -n lnt-ctmark-aarch64-O3-flto ']' +++ lnt submit http://104.154.54.203/db_default/v4/nts/submitRun /Users/buildslave/jenkins/workspace/lnt-ctmark-aarch64-O3-flto/lnt-sandbox/report.json error: lnt server: internal server error OperationalError('(_mysql_exceptions.OperationalError) (2003, "Can\'t connect to MySQL server on \'104.197.211.174\' (110)")',) ++ LNT_RESULT_URL=

Build Log

 

Issues

Found 1 issues:
Error: lnt server: internal server error + . /Users/buildslave/jenkins/workspace/lnt-ctmark-aarch64-O3-flto/config/tasks/utils/lnt_submit.sh ++ echo '@@@ LNT Submit @@@' @@@ LNT Submit @@@ ++ '[' -n http://104.154.54.203/db_default/v4/nts/submitRun -a -n lnt-ctmark-aarch64-O3-flto ']' +++ lnt submit http://104.154.54.203/db_default/v4/nts/submitRun /Users/buildslave/jenkins/workspace/lnt-ctmark-aarch64-O3-flto/lnt-sandbox/report.json error: lnt server: internal server error OperationalError('(_mysql_exceptions.OperationalError) (2003, "Can\'t connect to MySQL server on \'104.197.211.174\' (110)")',) ++ LNT_RESULT_URL=

Build Log

 

Issues

Found 1 issues:
Error: lnt server: internal server error + . /Users/buildslave/jenkins/workspace/lnt-ctmark-aarch64-O3-flto/config/tasks/utils/lnt_submit.sh ++ echo '@@@ LNT Submit @@@' @@@ LNT Submit @@@ ++ '[' -n http://104.154.54.203/db_default/v4/nts/submitRun -a -n lnt-ctmark-aarch64-O3-flto ']' +++ lnt submit http://104.154.54.203/db_default/v4/nts/submitRun /Users/buildslave/jenkins/workspace/lnt-ctmark-aarch64-O3-flto/lnt-sandbox/report.json error: lnt server: internal server error OperationalError('(_mysql_exceptions.OperationalError) (2003, "Can\'t connect to MySQL server on \'104.197.211.174\' (110)")',) ++ LNT_RESULT_URL=

Build Log

Pipeline lnt-ctmark-aarch64-O3-flto

Job automatically generated by zorg/zorg/jenkins/update_jobs.sh

$$job generated from zorg/jenkins/jobs/jobs/lnt-ctmark-aarch64-O3-flto
This project is currently disabled
Recent Changes