FailedConsole Output

Skipping 8,864 KB.. Full Log
Codesection.py (2047 of 2068)
******************** TEST 'lldb-api :: arm/breakpoint-thumb-codesection/TestBreakpointThumbCodesection.py' FAILED ********************
Script:
--
/Users/buildslave/jenkins/workspace/lldb-cmake-sanitized/lldb-build/lldb-test-build.noindex/copied-python /Users/buildslave/jenkins/workspace/lldb-cmake-sanitized/llvm-project/lldb/test/API/dotest.py --arch x86_64 -s /Users/buildslave/jenkins/workspace/lldb-cmake-sanitized/lldb-build/lldb-test-traces -S nm -u CXXFLAGS -u CFLAGS --codesign-identity lldb_codesign --server /Users/buildslave/jenkins/workspace/lldb-cmake-sanitized/lldb-build/./bin/debugserver --arch x86_64 --build-dir /Users/buildslave/jenkins/workspace/lldb-cmake-sanitized/lldb-build/lldb-test-build.noindex -s=/Users/buildslave/jenkins/workspace/lldb-cmake-sanitized/test/logs -t --env TERM=vt100 --env LLVM_LIBS_DIR=/Users/buildslave/jenkins/workspace/lldb-cmake-sanitized/lldb-build/./lib --inferior-env ASAN_OPTIONS=detect_stack_use_after_return=1 --inferior-env DYLD_INSERT_LIBRARIES=/Users/buildslave/jenkins/workspace/lldb-cmake-sanitized/host-compiler/lib/clang/11.0.0/lib/darwin/libclang_rt.asan_osx_dynamic.dylib --build-dir /Users/buildslave/jenkins/workspace/lldb-cmake-sanitized/lldb-build/lldb-test-build.noindex --lldb-module-cache-dir /Users/buildslave/jenkins/workspace/lldb-cmake-sanitized/lldb-build/lldb-test-build.noindex/module-cache-lldb/lldb-api --clang-module-cache-dir /Users/buildslave/jenkins/workspace/lldb-cmake-sanitized/lldb-build/lldb-test-build.noindex/module-cache-clang/lldb-api --executable /Users/buildslave/jenkins/workspace/lldb-cmake-sanitized/lldb-build/./bin/lldb --compiler /Users/buildslave/jenkins/workspace/lldb-cmake-sanitized/lldb-build/./bin/clang --dsymutil /Users/buildslave/jenkins/workspace/lldb-cmake-sanitized/lldb-build/./bin/dsymutil --filecheck /Users/buildslave/jenkins/workspace/lldb-cmake-sanitized/lldb-build/./bin/FileCheck --lldb-libs-dir /Users/buildslave/jenkins/workspace/lldb-cmake-sanitized/lldb-build/./lib /Users/buildslave/jenkins/workspace/lldb-cmake-sanitized/llvm-project/lldb/test/API/arm/breakpoint-thumb-codesection -p TestBreakpointThumbCodesection.py
--
Exit Code: -9

Hide Details

Hide Details

******************** FAIL: lldb-shell :: ObjectFile/ELF/duplicate-section.yaml (2048 of 2068) ******************** TEST 'lldb-shell :: ObjectFile/ELF/duplicate-section.yaml' FAILED ******************** Script: -- : 'RUN: at line 1'; mkdir -p /Users/buildslave/jenkins/workspace/lldb-cmake-sanitized/lldb-build/tools/lldb/test/ObjectFile/ELF/Output/duplicate-section.yaml.tmp/.build-id/1b : 'RUN: at line 2'; /Users/buildslave/jenkins/workspace/lldb-cmake-sanitized/lldb-build/bin/yaml2obj /Users/buildslave/jenkins/workspace/lldb-cmake-sanitized/llvm-project/lldb/test/Shell/ObjectFile/ELF/duplicate-section.yaml > /Users/buildslave/jenkins/workspace/lldb-cmake-sanitized/lldb-build/tools/lldb/test/ObjectFile/ELF/Output/duplicate-section.yaml.tmp/.build-id/1b/8a73ac238390e32a7ff4ac8ebe4d6a41ecf5c9.debug : 'RUN: at line 3'; cd /Users/buildslave/jenkins/workspace/lldb-cmake-sanitized/lldb-build/tools/lldb/test/ObjectFile/ELF/Output/duplicate-section.yaml.tmp : 'RUN: at line 4'; /Users/buildslave/jenkins/workspace/lldb-cmake-sanitized/lldb-build/bin/llvm-objcopy --strip-all --add-gnu-debuglink=.build-id/1b/8a73ac238390e32a7ff4ac8ebe4d6a41ecf5c9.debug /Users/buildslave/jenkins/workspace/lldb-cmake-sanitized/lldb-build/tools/lldb/test/ObjectFile/ELF/Output/duplicate-section.yaml.tmp/.build-id/1b/8a73ac238390e32a7ff4ac8ebe4d6a41ecf5c9.debug /Users/buildslave/jenkins/workspace/lldb-cmake-sanitized/lldb-build/tools/lldb/test/ObjectFile/ELF/Output/duplicate-section.yaml.tmp/stripped.out : 'RUN: at line 5'; /Users/buildslave/jenkins/workspace/lldb-cmake-sanitized/lldb-build/bin/lldb-test object-file /Users/buildslave/jenkins/workspace/lldb-cmake-sanitized/lldb-build/tools/lldb/test/ObjectFile/ELF/Output/duplicate-section.yaml.tmp/stripped.out | /Users/buildslave/jenkins/workspace/lldb-cmake-sanitized/lldb-build/bin/FileCheck /Users/buildslave/jenkins/workspace/lldb-cmake-sanitized/llvm-project/lldb/test/Shell/ObjectFile/ELF/duplicate-section.yaml -- Exit Code: 137

Hide Details

Command Output (stderr): -- /Users/buildslave/jenkins/workspace/lldb-cmake-sanitized/lldb-build/tools/lldb/test/ObjectFile/ELF/Output/duplicate-section.yaml.script: line 5: 60934 Killed: 9 /Users/buildslave/jenkins/workspace/lldb-cmake-sanitized/lldb-build/bin/yaml2obj /Users/buildslave/jenkins/workspace/lldb-cmake-sanitized/llvm-project/lldb/test/Shell/ObjectFile/ELF/duplicate-section.yaml > /Users/buildslave/jenkins/workspace/lldb-cmake-sanitized/lldb-build/tools/lldb/test/ObjectFile/ELF/Output/duplicate-section.yaml.tmp/.build-id/1b/8a73ac238390e32a7ff4ac8ebe4d6a41ecf5c9.debug

Hide Details

--

Hide Details

******************** FAIL: lldb-unit :: Utility/./UtilityTests/PassiveReplayTest.InstrumentedFooInvalid (2049 of 2068) ******************** TEST 'lldb-unit :: Utility/./UtilityTests/PassiveReplayTest.InstrumentedFooInvalid' FAILED ********************

Hide Details

******************** FAIL: lldb-api :: tools/lldb-server/TestGdbRemoteExitCode.py (2050 of 2068) ******************** TEST 'lldb-api :: tools/lldb-server/TestGdbRemoteExitCode.py' FAILED ******************** Script: -- /Users/buildslave/jenkins/workspace/lldb-cmake-sanitized/lldb-build/lldb-test-build.noindex/copied-python /Users/buildslave/jenkins/workspace/lldb-cmake-sanitized/llvm-project/lldb/test/API/dotest.py --arch x86_64 -s /Users/buildslave/jenkins/workspace/lldb-cmake-sanitized/lldb-build/lldb-test-traces -S nm -u CXXFLAGS -u CFLAGS --codesign-identity lldb_codesign --server /Users/buildslave/jenkins/workspace/lldb-cmake-sanitized/lldb-build/./bin/debugserver --arch x86_64 --build-dir /Users/buildslave/jenkins/workspace/lldb-cmake-sanitized/lldb-build/lldb-test-build.noindex -s=/Users/buildslave/jenkins/workspace/lldb-cmake-sanitized/test/logs -t --env TERM=vt100 --env LLVM_LIBS_DIR=/Users/buildslave/jenkins/workspace/lldb-cmake-sanitized/lldb-build/./lib --inferior-env ASAN_OPTIONS=detect_stack_use_after_return=1 --inferior-env DYLD_INSERT_LIBRARIES=/Users/buildslave/jenkins/workspace/lldb-cmake-sanitized/host-compiler/lib/clang/11.0.0/lib/darwin/libclang_rt.asan_osx_dynamic.dylib --build-dir /Users/buildslave/jenkins/workspace/lldb-cmake-sanitized/lldb-build/lldb-test-build.noindex --lldb-module-cache-dir /Users/buildslave/jenkins/workspace/lldb-cmake-sanitized/lldb-build/lldb-test-build.noindex/module-cache-lldb/lldb-api --clang-module-cache-dir /Users/buildslave/jenkins/workspace/lldb-cmake-sanitized/lldb-build/lldb-test-build.noindex/module-cache-clang/lldb-api --executable /Users/buildslave/jenkins/workspace/lldb-cmake-sanitized/lldb-build/./bin/lldb --compiler /Users/buildslave/jenkins/workspace/lldb-cmake-sanitized/lldb-build/./bin/clang --dsymutil /Users/buildslave/jenkins/workspace/lldb-cmake-sanitized/lldb-build/./bin/dsymutil --filecheck /Users/buildslave/jenkins/workspace/lldb-cmake-sanitized/lldb-build/./bin/FileCheck --lldb-libs-dir /Users/buildslave/jenkins/workspace/lldb-cmake-sanitized/lldb-build/./lib /Users/buildslave/jenkins/workspace/lldb-cmake-sanitized/llvm-project/lldb/test/API/tools/lldb-server -p TestGdbRemoteExitCode.py -- Exit Code: -9

Hide Details

Hide Details

******************** FAIL: lldb-unit :: Utility/./UtilityTests/AnsiTerminal.WhiteSpace (2051 of 2068) ******************** TEST 'lldb-unit :: Utility/./UtilityTests/AnsiTerminal.WhiteSpace' FAILED ********************

Hide Details

******************** FAIL: lldb-api :: commands/expression/import-std-module/unique_ptr/TestUniquePtrFromStdModule.py (2052 of 2068) ******************** TEST 'lldb-api :: commands/expression/import-std-module/unique_ptr/TestUniquePtrFromStdModule.py' FAILED ******************** Script: -- /Users/buildslave/jenkins/workspace/lldb-cmake-sanitized/lldb-build/lldb-test-build.noindex/copied-python /Users/buildslave/jenkins/workspace/lldb-cmake-sanitized/llvm-project/lldb/test/API/dotest.py --arch x86_64 -s /Users/buildslave/jenkins/workspace/lldb-cmake-sanitized/lldb-build/lldb-test-traces -S nm -u CXXFLAGS -u CFLAGS --codesign-identity lldb_codesign --server /Users/buildslave/jenkins/workspace/lldb-cmake-sanitized/lldb-build/./bin/debugserver --arch x86_64 --build-dir /Users/buildslave/jenkins/workspace/lldb-cmake-sanitized/lldb-build/lldb-test-build.noindex -s=/Users/buildslave/jenkins/workspace/lldb-cmake-sanitized/test/logs -t --env TERM=vt100 --env LLVM_LIBS_DIR=/Users/buildslave/jenkins/workspace/lldb-cmake-sanitized/lldb-build/./lib --inferior-env ASAN_OPTIONS=detect_stack_use_after_return=1 --inferior-env DYLD_INSERT_LIBRARIES=/Users/buildslave/jenkins/workspace/lldb-cmake-sanitized/host-compiler/lib/clang/11.0.0/lib/darwin/libclang_rt.asan_osx_dynamic.dylib --build-dir /Users/buildslave/jenkins/workspace/lldb-cmake-sanitized/lldb-build/lldb-test-build.noindex --lldb-module-cache-dir /Users/buildslave/jenkins/workspace/lldb-cmake-sanitized/lldb-build/lldb-test-build.noindex/module-cache-lldb/lldb-api --clang-module-cache-dir /Users/buildslave/jenkins/workspace/lldb-cmake-sanitized/lldb-build/lldb-test-build.noindex/module-cache-clang/lldb-api --executable /Users/buildslave/jenkins/workspace/lldb-cmake-sanitized/lldb-build/./bin/lldb --compiler /Users/buildslave/jenkins/workspace/lldb-cmake-sanitized/lldb-build/./bin/clang --dsymutil /Users/buildslave/jenkins/workspace/lldb-cmake-sanitized/lldb-build/./bin/dsymutil --filecheck /Users/buildslave/jenkins/workspace/lldb-cmake-sanitized/lldb-build/./bin/FileCheck --lldb-libs-dir /Users/buildslave/jenkins/workspace/lldb-cmake-sanitized/lldb-build/./lib /Users/buildslave/jenkins/workspace/lldb-cmake-sanitized/llvm-project/lldb/test/API/commands/expression/import-std-module/unique_ptr -p TestUniquePtrFromStdModule.py -- Exit Code: -9

Hide Details

Hide Details

******************** FAIL: lldb-shell :: SymbolFile/DWARF/find-method-local-struct.cpp (2053 of 2068) ******************** TEST 'lldb-shell :: SymbolFile/DWARF/find-method-local-struct.cpp' FAILED ******************** Script: -- : 'RUN: at line 1'; /Users/buildslave/jenkins/workspace/lldb-cmake-sanitized/lldb-build/bin/clang --target=specify-a-target-or-use-a-_host-substitution /Users/buildslave/jenkins/workspace/lldb-cmake-sanitized/llvm-project/lldb/test/Shell/SymbolFile/DWARF/find-method-local-struct.cpp -g -c -o /Users/buildslave/jenkins/workspace/lldb-cmake-sanitized/lldb-build/tools/lldb/test/SymbolFile/DWARF/Output/find-method-local-struct.cpp.tmp --target=x86_64-apple-macosx : 'RUN: at line 2'; /Users/buildslave/jenkins/workspace/lldb-cmake-sanitized/lldb-build/bin/lldb-test symbols --name=foo --find=function --function-flags=method /Users/buildslave/jenkins/workspace/lldb-cmake-sanitized/lldb-build/tools/lldb/test/SymbolFile/DWARF/Output/find-method-local-struct.cpp.tmp | /Users/buildslave/jenkins/workspace/lldb-cmake-sanitized/lldb-build/bin/FileCheck /Users/buildslave/jenkins/workspace/lldb-cmake-sanitized/llvm-project/lldb/test/Shell/SymbolFile/DWARF/find-method-local-struct.cpp -- Exit Code: 137

Hide Details

Command Output (stderr): -- /Users/buildslave/jenkins/workspace/lldb-cmake-sanitized/lldb-build/tools/lldb/test/SymbolFile/DWARF/Output/find-method-local-struct.cpp.script: line 2: 60941 Killed: 9 /Users/buildslave/jenkins/workspace/lldb-cmake-sanitized/lldb-build/bin/clang --target=specify-a-target-or-use-a-_host-substitution /Users/buildslave/jenkins/workspace/lldb-cmake-sanitized/llvm-project/lldb/test/Shell/SymbolFile/DWARF/find-method-local-struct.cpp -g -c -o /Users/buildslave/jenkins/workspace/lldb-cmake-sanitized/lldb-build/tools/lldb/test/SymbolFile/DWARF/Output/find-method-local-struct.cpp.tmp --target=x86_64-apple-macosx

Hide Details

--

Hide Details

******************** FAIL: lldb-unit :: Expression/./ExpressionTests/DiagnosticManagerTest.PutString (2054 of 2068) ******************** TEST 'lldb-unit :: Expression/./ExpressionTests/DiagnosticManagerTest.PutString' FAILED ********************

Hide Details

******************** FAIL: lldb-unit :: Utility/./UtilityTests/RangeTest.LessThanInvalid (2055 of 2068) ******************** TEST 'lldb-unit :: Utility/./UtilityTests/RangeTest.LessThanInvalid' FAILED ********************

Hide Details

******************** FAIL: lldb-shell :: ObjectFile/ELF/section-types.yaml (2056 of 2068) ******************** TEST 'lldb-shell :: ObjectFile/ELF/section-types.yaml' FAILED ******************** Script: -- : 'RUN: at line 1'; /Users/buildslave/jenkins/workspace/lldb-cmake-sanitized/lldb-build/bin/yaml2obj /Users/buildslave/jenkins/workspace/lldb-cmake-sanitized/llvm-project/lldb/test/Shell/ObjectFile/ELF/section-types.yaml > /Users/buildslave/jenkins/workspace/lldb-cmake-sanitized/lldb-build/tools/lldb/test/ObjectFile/ELF/Output/section-types.yaml.tmp : 'RUN: at line 2'; /Users/buildslave/jenkins/workspace/lldb-cmake-sanitized/lldb-build/bin/lldb-test object-file /Users/buildslave/jenkins/workspace/lldb-cmake-sanitized/lldb-build/tools/lldb/test/ObjectFile/ELF/Output/section-types.yaml.tmp | /Users/buildslave/jenkins/workspace/lldb-cmake-sanitized/lldb-build/bin/FileCheck /Users/buildslave/jenkins/workspace/lldb-cmake-sanitized/llvm-project/lldb/test/Shell/ObjectFile/ELF/section-types.yaml -- Exit Code: 137

Hide Details

Command Output (stderr): -- /Users/buildslave/jenkins/workspace/lldb-cmake-sanitized/lldb-build/tools/lldb/test/ObjectFile/ELF/Output/section-types.yaml.script: line 2: 60945 Killed: 9 /Users/buildslave/jenkins/workspace/lldb-cmake-sanitized/lldb-build/bin/yaml2obj /Users/buildslave/jenkins/workspace/lldb-cmake-sanitized/llvm-project/lldb/test/Shell/ObjectFile/ELF/section-types.yaml > /Users/buildslave/jenkins/workspace/lldb-cmake-sanitized/lldb-build/tools/lldb/test/ObjectFile/ELF/Output/section-types.yaml.tmp

Hide Details

--

Hide Details

******************** FAIL: lldb-unit :: Symbol/./SymbolTests/TestTypeSystemClang.TestConvertAccessTypeToAccessSpecifier (2057 of 2068) ******************** TEST 'lldb-unit :: Symbol/./SymbolTests/TestTypeSystemClang.TestConvertAccessTypeToAccessSpecifier' FAILED ********************

Hide Details

******************** FAIL: lldb-unit :: Utility/./UtilityTests/EnvironmentTest.EnvpConstruction (2058 of 2068) ******************** TEST 'lldb-unit :: Utility/./UtilityTests/EnvironmentTest.EnvpConstruction' FAILED ********************

Hide Details

******************** FAIL: lldb-api :: arm/breakpoint-it/TestBreakpointIt.py (2059 of 2068) ******************** TEST 'lldb-api :: arm/breakpoint-it/TestBreakpointIt.py' FAILED ******************** Script: -- /Users/buildslave/jenkins/workspace/lldb-cmake-sanitized/lldb-build/lldb-test-build.noindex/copied-python /Users/buildslave/jenkins/workspace/lldb-cmake-sanitized/llvm-project/lldb/test/API/dotest.py --arch x86_64 -s /Users/buildslave/jenkins/workspace/lldb-cmake-sanitized/lldb-build/lldb-test-traces -S nm -u CXXFLAGS -u CFLAGS --codesign-identity lldb_codesign --server /Users/buildslave/jenkins/workspace/lldb-cmake-sanitized/lldb-build/./bin/debugserver --arch x86_64 --build-dir /Users/buildslave/jenkins/workspace/lldb-cmake-sanitized/lldb-build/lldb-test-build.noindex -s=/Users/buildslave/jenkins/workspace/lldb-cmake-sanitized/test/logs -t --env TERM=vt100 --env LLVM_LIBS_DIR=/Users/buildslave/jenkins/workspace/lldb-cmake-sanitized/lldb-build/./lib --inferior-env ASAN_OPTIONS=detect_stack_use_after_return=1 --inferior-env DYLD_INSERT_LIBRARIES=/Users/buildslave/jenkins/workspace/lldb-cmake-sanitized/host-compiler/lib/clang/11.0.0/lib/darwin/libclang_rt.asan_osx_dynamic.dylib --build-dir /Users/buildslave/jenkins/workspace/lldb-cmake-sanitized/lldb-build/lldb-test-build.noindex --lldb-module-cache-dir /Users/buildslave/jenkins/workspace/lldb-cmake-sanitized/lldb-build/lldb-test-build.noindex/module-cache-lldb/lldb-api --clang-module-cache-dir /Users/buildslave/jenkins/workspace/lldb-cmake-sanitized/lldb-build/lldb-test-build.noindex/module-cache-clang/lldb-api --executable /Users/buildslave/jenkins/workspace/lldb-cmake-sanitized/lldb-build/./bin/lldb --compiler /Users/buildslave/jenkins/workspace/lldb-cmake-sanitized/lldb-build/./bin/clang --dsymutil /Users/buildslave/jenkins/workspace/lldb-cmake-sanitized/lldb-build/./bin/dsymutil --filecheck /Users/buildslave/jenkins/workspace/lldb-cmake-sanitized/lldb-build/./bin/FileCheck --lldb-libs-dir /Users/buildslave/jenkins/workspace/lldb-cmake-sanitized/lldb-build/./lib /Users/buildslave/jenkins/workspace/lldb-cmake-sanitized/llvm-project/lldb/test/API/arm/breakpoint-it -p TestBreakpointIt.py -- Exit Code: -9

Hide Details

Hide Details

******************** FAIL: lldb-unit :: Utility/./UtilityTests/StreamTest.AddressRangeSize (2060 of 2068) ******************** TEST 'lldb-unit :: Utility/./UtilityTests/StreamTest.AddressRangeSize' FAILED ********************

Hide Details

******************** FAIL: lldb-api :: commands/expression/import-std-module/weak_ptr-dbg-info-content/TestDbgInfoContentWeakPtrFromStdModule.py (2061 of 2068) ******************** TEST 'lldb-api :: commands/expression/import-std-module/weak_ptr-dbg-info-content/TestDbgInfoContentWeakPtrFromStdModule.py' FAILED ******************** Script: -- /Users/buildslave/jenkins/workspace/lldb-cmake-sanitized/lldb-build/lldb-test-build.noindex/copied-python /Users/buildslave/jenkins/workspace/lldb-cmake-sanitized/llvm-project/lldb/test/API/dotest.py --arch x86_64 -s /Users/buildslave/jenkins/workspace/lldb-cmake-sanitized/lldb-build/lldb-test-traces -S nm -u CXXFLAGS -u CFLAGS --codesign-identity lldb_codesign --server /Users/buildslave/jenkins/workspace/lldb-cmake-sanitized/lldb-build/./bin/debugserver --arch x86_64 --build-dir /Users/buildslave/jenkins/workspace/lldb-cmake-sanitized/lldb-build/lldb-test-build.noindex -s=/Users/buildslave/jenkins/workspace/lldb-cmake-sanitized/test/logs -t --env TERM=vt100 --env LLVM_LIBS_DIR=/Users/buildslave/jenkins/workspace/lldb-cmake-sanitized/lldb-build/./lib --inferior-env ASAN_OPTIONS=detect_stack_use_after_return=1 --inferior-env DYLD_INSERT_LIBRARIES=/Users/buildslave/jenkins/workspace/lldb-cmake-sanitized/host-compiler/lib/clang/11.0.0/lib/darwin/libclang_rt.asan_osx_dynamic.dylib --build-dir /Users/buildslave/jenkins/workspace/lldb-cmake-sanitized/lldb-build/lldb-test-build.noindex --lldb-module-cache-dir /Users/buildslave/jenkins/workspace/lldb-cmake-sanitized/lldb-build/lldb-test-build.noindex/module-cache-lldb/lldb-api --clang-module-cache-dir /Users/buildslave/jenkins/workspace/lldb-cmake-sanitized/lldb-build/lldb-test-build.noindex/module-cache-clang/lldb-api --executable /Users/buildslave/jenkins/workspace/lldb-cmake-sanitized/lldb-build/./bin/lldb --compiler /Users/buildslave/jenkins/workspace/lldb-cmake-sanitized/lldb-build/./bin/clang --dsymutil /Users/buildslave/jenkins/workspace/lldb-cmake-sanitized/lldb-build/./bin/dsymutil --filecheck /Users/buildslave/jenkins/workspace/lldb-cmake-sanitized/lldb-build/./bin/FileCheck --lldb-libs-dir /Users/buildslave/jenkins/workspace/lldb-cmake-sanitized/lldb-build/./lib /Users/buildslave/jenkins/workspace/lldb-cmake-sanitized/llvm-project/lldb/test/API/commands/expression/import-std-module/weak_ptr-dbg-info-content -p TestDbgInfoContentWeakPtrFromStdModule.py -- Exit Code: -9

Hide Details

Hide Details

******************** FAIL: lldb-api :: commands/command/source/TestCommandSource.py (2062 of 2068) ******************** TEST 'lldb-api :: commands/command/source/TestCommandSource.py' FAILED ******************** Script: -- /Users/buildslave/jenkins/workspace/lldb-cmake-sanitized/lldb-build/lldb-test-build.noindex/copied-python /Users/buildslave/jenkins/workspace/lldb-cmake-sanitized/llvm-project/lldb/test/API/dotest.py --arch x86_64 -s /Users/buildslave/jenkins/workspace/lldb-cmake-sanitized/lldb-build/lldb-test-traces -S nm -u CXXFLAGS -u CFLAGS --codesign-identity lldb_codesign --server /Users/buildslave/jenkins/workspace/lldb-cmake-sanitized/lldb-build/./bin/debugserver --arch x86_64 --build-dir /Users/buildslave/jenkins/workspace/lldb-cmake-sanitized/lldb-build/lldb-test-build.noindex -s=/Users/buildslave/jenkins/workspace/lldb-cmake-sanitized/test/logs -t --env TERM=vt100 --env LLVM_LIBS_DIR=/Users/buildslave/jenkins/workspace/lldb-cmake-sanitized/lldb-build/./lib --inferior-env ASAN_OPTIONS=detect_stack_use_after_return=1 --inferior-env DYLD_INSERT_LIBRARIES=/Users/buildslave/jenkins/workspace/lldb-cmake-sanitized/host-compiler/lib/clang/11.0.0/lib/darwin/libclang_rt.asan_osx_dynamic.dylib --build-dir /Users/buildslave/jenkins/workspace/lldb-cmake-sanitized/lldb-build/lldb-test-build.noindex --lldb-module-cache-dir /Users/buildslave/jenkins/workspace/lldb-cmake-sanitized/lldb-build/lldb-test-build.noindex/module-cache-lldb/lldb-api --clang-module-cache-dir /Users/buildslave/jenkins/workspace/lldb-cmake-sanitized/lldb-build/lldb-test-build.noindex/module-cache-clang/lldb-api --executable /Users/buildslave/jenkins/workspace/lldb-cmake-sanitized/lldb-build/./bin/lldb --compiler /Users/buildslave/jenkins/workspace/lldb-cmake-sanitized/lldb-build/./bin/clang --dsymutil /Users/buildslave/jenkins/workspace/lldb-cmake-sanitized/lldb-build/./bin/dsymutil --filecheck /Users/buildslave/jenkins/workspace/lldb-cmake-sanitized/lldb-build/./bin/FileCheck --lldb-libs-dir /Users/buildslave/jenkins/workspace/lldb-cmake-sanitized/lldb-build/./lib /Users/buildslave/jenkins/workspace/lldb-cmake-sanitized/llvm-project/lldb/test/API/commands/command/source -p TestCommandSource.py -- Exit Code: -9

Hide Details

Hide Details

******************** FAIL: lldb-shell :: BuildScript/toolchain-clang.test (2063 of 2068) ******************** TEST 'lldb-shell :: BuildScript/toolchain-clang.test' FAILED ******************** Script: -- : 'RUN: at line 1'; '/usr/local/opt/python/bin/python3.7' /Users/buildslave/jenkins/workspace/lldb-cmake-sanitized/llvm-project/lldb/test/Shell/helper/build.py --compiler=any --arch=64 --tools-dir=/Users/buildslave/jenkins/workspace/lldb-cmake-sanitized/lldb-build/./bin --libs-dir=/Users/buildslave/jenkins/workspace/lldb-cmake-sanitized/lldb-build/./lib -n --verbose --arch=32 --compiler=clang --mode=compile-and-link -o /Users/buildslave/jenkins/workspace/lldb-cmake-sanitized/lldb-build/tools/lldb/test/BuildScript/Output/toolchain-clang.test.tmp/foo.exe foobar.c | /Users/buildslave/jenkins/workspace/lldb-cmake-sanitized/lldb-build/bin/FileCheck --check-prefix=CHECK --check-prefix=CHECK-32 /Users/buildslave/jenkins/workspace/lldb-cmake-sanitized/llvm-project/lldb/test/Shell/BuildScript/toolchain-clang.test : 'RUN: at line 4'; '/usr/local/opt/python/bin/python3.7' /Users/buildslave/jenkins/workspace/lldb-cmake-sanitized/llvm-project/lldb/test/Shell/helper/build.py --compiler=any --arch=64 --tools-dir=/Users/buildslave/jenkins/workspace/lldb-cmake-sanitized/lldb-build/./bin --libs-dir=/Users/buildslave/jenkins/workspace/lldb-cmake-sanitized/lldb-build/./lib -n --verbose --arch=64 --compiler=clang --mode=compile-and-link -o /Users/buildslave/jenkins/workspace/lldb-cmake-sanitized/lldb-build/tools/lldb/test/BuildScript/Output/toolchain-clang.test.tmp/foo.exe foobar.c | /Users/buildslave/jenkins/workspace/lldb-cmake-sanitized/lldb-build/bin/FileCheck --check-prefix=CHECK --check-prefix=CHECK-64 /Users/buildslave/jenkins/workspace/lldb-cmake-sanitized/llvm-project/lldb/test/Shell/BuildScript/toolchain-clang.test -- Exit Code: 137

Hide Details

Command Output (stderr): -- /Users/buildslave/jenkins/workspace/lldb-cmake-sanitized/lldb-build/tools/lldb/test/BuildScript/Output/toolchain-clang.test.script: line 2: 60955 Killed: 9 '/usr/local/opt/python/bin/python3.7' /Users/buildslave/jenkins/workspace/lldb-cmake-sanitized/llvm-project/lldb/test/Shell/helper/build.py --compiler=any --arch=64 --tools-dir=/Users/buildslave/jenkins/workspace/lldb-cmake-sanitized/lldb-build/./bin --libs-dir=/Users/buildslave/jenkins/workspace/lldb-cmake-sanitized/lldb-build/./lib -n --verbose --arch=32 --compiler=clang --mode=compile-and-link -o /Users/buildslave/jenkins/workspace/lldb-cmake-sanitized/lldb-build/tools/lldb/test/BuildScript/Output/toolchain-clang.test.tmp/foo.exe foobar.c 60956 | /Users/buildslave/jenkins/workspace/lldb-cmake-sanitized/lldb-build/bin/FileCheck --check-prefix=CHECK --check-prefix=CHECK-32 /Users/buildslave/jenkins/workspace/lldb-cmake-sanitized/llvm-project/lldb/test/Shell/BuildScript/toolchain-clang.test

Hide Details

--

Hide Details

******************** UNSUPPORTED: lldb-shell :: ScriptInterpreter/Lua/persistent_state.test (2064 of 2068) FAIL: lldb-shell :: Breakpoint/single-file-split-dwarf.test (2065 of 2068) ******************** TEST 'lldb-shell :: Breakpoint/single-file-split-dwarf.test' FAILED ******************** Script: -- : 'RUN: at line 1'; rm -rf /Users/buildslave/jenkins/workspace/lldb-cmake-sanitized/lldb-build/tools/lldb/test/Breakpoint/Output/single-file-split-dwarf.test.tmp.dir : 'RUN: at line 2'; mkdir /Users/buildslave/jenkins/workspace/lldb-cmake-sanitized/lldb-build/tools/lldb/test/Breakpoint/Output/single-file-split-dwarf.test.tmp.dir : 'RUN: at line 3'; cd /Users/buildslave/jenkins/workspace/lldb-cmake-sanitized/lldb-build/tools/lldb/test/Breakpoint/Output/single-file-split-dwarf.test.tmp.dir : 'RUN: at line 4'; /Users/buildslave/jenkins/workspace/lldb-cmake-sanitized/lldb-build/bin/yaml2obj /Users/buildslave/jenkins/workspace/lldb-cmake-sanitized/llvm-project/lldb/test/Shell/Breakpoint/Inputs/single-file-split-dwarf.yaml > /Users/buildslave/jenkins/workspace/lldb-cmake-sanitized/lldb-build/tools/lldb/test/Breakpoint/Output/single-file-split-dwarf.test.tmp.dir/test : 'RUN: at line 5'; /Users/buildslave/jenkins/workspace/lldb-cmake-sanitized/lldb-build/bin/yaml2obj /Users/buildslave/jenkins/workspace/lldb-cmake-sanitized/llvm-project/lldb/test/Shell/Breakpoint/Inputs/single-file-split-dwarf.o.yaml > /Users/buildslave/jenkins/workspace/lldb-cmake-sanitized/lldb-build/tools/lldb/test/Breakpoint/Output/single-file-split-dwarf.test.tmp.dir/test.o : 'RUN: at line 6'; /Users/buildslave/jenkins/workspace/lldb-cmake-sanitized/lldb-build/bin/lldb-test breakpoints /Users/buildslave/jenkins/workspace/lldb-cmake-sanitized/lldb-build/tools/lldb/test/Breakpoint/Output/single-file-split-dwarf.test.tmp.dir/test /Users/buildslave/jenkins/workspace/lldb-cmake-sanitized/llvm-project/lldb/test/Shell/Breakpoint/single-file-split-dwarf.test | /Users/buildslave/jenkins/workspace/lldb-cmake-sanitized/lldb-build/bin/FileCheck /Users/buildslave/jenkins/workspace/lldb-cmake-sanitized/llvm-project/lldb/test/Shell/Breakpoint/single-file-split-dwarf.test -- Exit Code: 137

Hide Details

Command Output (stderr): -- /Users/buildslave/jenkins/workspace/lldb-cmake-sanitized/lldb-build/tools/lldb/test/Breakpoint/Output/single-file-split-dwarf.test.script: line 6: 60957 Killed: 9 /Users/buildslave/jenkins/workspace/lldb-cmake-sanitized/lldb-build/bin/yaml2obj /Users/buildslave/jenkins/workspace/lldb-cmake-sanitized/llvm-project/lldb/test/Shell/Breakpoint/Inputs/single-file-split-dwarf.yaml > /Users/buildslave/jenkins/workspace/lldb-cmake-sanitized/lldb-build/tools/lldb/test/Breakpoint/Output/single-file-split-dwarf.test.tmp.dir/test

Hide Details

--

Hide Details

******************** FAIL: lldb-unit :: Utility/./UtilityTests/StreamTest.PutHex32ByteOrderLittle (2066 of 2068) ******************** TEST 'lldb-unit :: Utility/./UtilityTests/StreamTest.PutHex32ByteOrderLittle' FAILED ********************

Hide Details

******************** FAIL: lldb-api :: types/TestFloatTypes.py (2067 of 2068) ******************** TEST 'lldb-api :: types/TestFloatTypes.py' FAILED ******************** Script: -- /Users/buildslave/jenkins/workspace/lldb-cmake-sanitized/lldb-build/lldb-test-build.noindex/copied-python /Users/buildslave/jenkins/workspace/lldb-cmake-sanitized/llvm-project/lldb/test/API/dotest.py --arch x86_64 -s /Users/buildslave/jenkins/workspace/lldb-cmake-sanitized/lldb-build/lldb-test-traces -S nm -u CXXFLAGS -u CFLAGS --codesign-identity lldb_codesign --server /Users/buildslave/jenkins/workspace/lldb-cmake-sanitized/lldb-build/./bin/debugserver --arch x86_64 --build-dir /Users/buildslave/jenkins/workspace/lldb-cmake-sanitized/lldb-build/lldb-test-build.noindex -s=/Users/buildslave/jenkins/workspace/lldb-cmake-sanitized/test/logs -t --env TERM=vt100 --env LLVM_LIBS_DIR=/Users/buildslave/jenkins/workspace/lldb-cmake-sanitized/lldb-build/./lib --inferior-env ASAN_OPTIONS=detect_stack_use_after_return=1 --inferior-env DYLD_INSERT_LIBRARIES=/Users/buildslave/jenkins/workspace/lldb-cmake-sanitized/host-compiler/lib/clang/11.0.0/lib/darwin/libclang_rt.asan_osx_dynamic.dylib --build-dir /Users/buildslave/jenkins/workspace/lldb-cmake-sanitized/lldb-build/lldb-test-build.noindex --lldb-module-cache-dir /Users/buildslave/jenkins/workspace/lldb-cmake-sanitized/lldb-build/lldb-test-build.noindex/module-cache-lldb/lldb-api --clang-module-cache-dir /Users/buildslave/jenkins/workspace/lldb-cmake-sanitized/lldb-build/lldb-test-build.noindex/module-cache-clang/lldb-api --executable /Users/buildslave/jenkins/workspace/lldb-cmake-sanitized/lldb-build/./bin/lldb --compiler /Users/buildslave/jenkins/workspace/lldb-cmake-sanitized/lldb-build/./bin/clang --dsymutil /Users/buildslave/jenkins/workspace/lldb-cmake-sanitized/lldb-build/./bin/dsymutil --filecheck /Users/buildslave/jenkins/workspace/lldb-cmake-sanitized/lldb-build/./bin/FileCheck --lldb-libs-dir /Users/buildslave/jenkins/workspace/lldb-cmake-sanitized/lldb-build/./lib /Users/buildslave/jenkins/workspace/lldb-cmake-sanitized/llvm-project/lldb/test/API/types -p TestFloatTypes.py -- Exit Code: 1

Hide Details

Command Output (stdout): -- lldb version 11.0.99 clang revision ba5087f13025a15662e164eb371fe0678258e03f llvm revision ba5087f13025a15662e164eb371fe0678258e03f LLDB library dir: /Users/buildslave/jenkins/workspace/lldb-cmake-sanitized/lldb-build/bin LLDB import library dir: /Users/buildslave/jenkins/workspace/lldb-cmake-sanitized/lldb-build/./lib libstdcxx tests will not be run because: Don't know how to build with libstdcxx on macosx Skipping following debug info categories: ['dwo']

Hide Details

-- Command Output (stderr): --

Hide Details

Session logs for test failures/errors/unexpected successes will go into directory '/Users/buildslave/jenkins/workspace/lldb-cmake-sanitized/test/logs' Change dir to: /Users/buildslave/jenkins/workspace/lldb-cmake-sanitized/llvm-project/lldb/test/API/types runCmd: settings clear -all output:

Hide Details

runCmd: settings set symbols.enable-external-lookup false output:

Hide Details

runCmd: settings set target.auto-apply-fixits false output:

Hide Details

runCmd: settings set plugin.process.gdb-remote.packet-timeout 60 output:

Hide Details

runCmd: settings set symbols.clang-modules-cache-path "/Users/buildslave/jenkins/workspace/lldb-cmake-sanitized/lldb-build/lldb-test-build.noindex/module-cache-lldb/lldb-api" output:

Hide Details

runCmd: settings set use-color false output:

Hide Details

runCmd: setting set target.prefer-dynamic-value no-dynamic-values output:

Hide Details

runCmd: settings set target.env-vars ASAN_OPTIONS=detect_stack_use_after_return=1 DYLD_INSERT_LIBRARIES=/Users/buildslave/jenkins/workspace/lldb-cmake-sanitized/host-compiler/lib/clang/11.0.0/lib/darwin/libclang_rt.asan_osx_dynamic.dylib output:

Hide Details

runCmd: file /Users/buildslave/jenkins/workspace/lldb-cmake-sanitized/lldb-build/lldb-test-build.noindex/types/TestFloatTypes.test_float_type_dsym/test_float_type_dsym output: Current executable set to '/Users/buildslave/jenkins/workspace/lldb-cmake-sanitized/lldb-build/lldb-test-build.noindex/types/TestFloatTypes.test_float_type_dsym/test_float_type_dsym' (x86_64).

Hide Details

Hide Details

runCmd: process launch -o "/Users/buildslave/jenkins/workspace/lldb-cmake-sanitized/lldb-build/lldb-test-build.noindex/types/TestFloatTypes.test_float_type_dsym/test_float_type_dsym-golden-output.txt" output: Process 59749 exited with status = 0 (0x00000000)

Hide Details

Process 59749 launched: '/Users/buildslave/jenkins/workspace/lldb-cmake-sanitized/lldb-build/lldb-test-build.noindex/types/TestFloatTypes.test_float_type_dsym/test_float_type_dsym' (x86_64)

Hide Details

Hide Details

runCmd: settings set target.inline-breakpoint-strategy always output:

Hide Details

Adding tearDown hook: self.addTearDownHook(lambda: self.runCmd( "settings set target.inline-breakpoint-strategy headers"))

Hide Details

Hide Details

runCmd: breakpoint set -f "basic_type.cpp" -l 185 output: Breakpoint 1: where = test_float_type_dsym`main + 2107 at basic_type.cpp:185:5, address = 0x000000010000160b

Hide Details

Hide Details

Expecting pattern: ^Breakpoint (?P<bpno>[0-9]+): (?P<num_locations>[0-9]+) locations\.$ Not matched

Hide Details

Expecting pattern: ^Breakpoint (?P<bpno>[0-9]+): (?P<num_locations>no) locations \(pending\)\. Not matched

Hide Details

Expecting pattern: ^Breakpoint (?P<bpno>[0-9]+): where = (?P<module>.*)`(?P<symbol>[+\-]{0,1}[^+]+)( \+ (?P<offset>[0-9]+)){0,1}( \[inlined\] (?P<inline_symbol>.*)){0,1} at (?P<file>[^:]+):(?P<line_no>[0-9]+)(?P<column>(:[0-9]+)?), address = (?P<address>0x[0-9a-fA-F]+)$ Matched

Hide Details

runCmd: run output: Process 59809 stopped * thread #1, queue = 'com.apple.main-thread', stop reason = breakpoint 1.1 frame #0: 0x000000010000160b test_float_type_dsym`main(argc=1, argv=0x00007ffeefbff6d8) at basic_type.cpp:185:5 182 fprintf (out, "(a_union_zero_t[]) a_union_zero_array_unbounded[1].a = '" T_PRINTF_FORMAT "'\n", a_union_zero_array_unbounded[1].a); 183 184 #endif -> 185 puts("About to exit, break here to check values..."); // Here is the line we will break on to check variables. ^ 186 187 #ifdef TEST_BLOCK_CAPTURED_VARS 188 void (^myBlock)() = ^() {

Hide Details

Process 59809 launched: '/Users/buildslave/jenkins/workspace/lldb-cmake-sanitized/lldb-build/lldb-test-build.noindex/types/TestFloatTypes.test_float_type_dsym/test_float_type_dsym' (x86_64)

Hide Details

Hide Details

runCmd: process status output: Process 59809 stopped * thread #1, queue = 'com.apple.main-thread', stop reason = breakpoint 1.1 frame #0: 0x000000010000160b test_float_type_dsym`main(argc=1, argv=0x00007ffeefbff6d8) at basic_type.cpp:185:5 182 fprintf (out, "(a_union_zero_t[]) a_union_zero_array_unbounded[1].a = '" T_PRINTF_FORMAT "'\n", a_union_zero_array_unbounded[1].a); 183 184 #endif -> 185 puts("About to exit, break here to check values..."); // Here is the line we will break on to check variables. ^ 186 187 #ifdef TEST_BLOCK_CAPTURED_VARS 188 void (^myBlock)() = ^() {

Hide Details

Hide Details

Expecting sub string: stop reason = breakpoint Matched

Hide Details

Expecting sub string: at basic_type.cpp:185 Matched

Hide Details

runCmd: frame variable --show-types a output: (float) a = 1100.125

Hide Details

Hide Details

looking at: float

Hide Details

Expecting sub string: float Matched

Hide Details

looking at: (float) a = 1100.125

Hide Details

Hide Details

Expecting sub string: a = 1100.12 Matched

Hide Details

runCmd: frame variable --show-types *a_ptr output: (float) *a_ptr = 1100.125

Hide Details

Hide Details

looking at: float

Hide Details

Expecting sub string: float Matched

Hide Details

looking at: (float) *a_ptr = 1100.125

Hide Details

Hide Details

Expecting sub string: *a_ptr = 1100.12 Matched

Hide Details

runCmd: frame variable --show-types a_ref output: (float &) a_ref = 0x00007ffeefbff634: { (float) &a_ref = 1100.125 }

Hide Details

Hide Details

looking at: float &

Hide Details

Expecting sub string: float Matched

Hide Details

looking at: (float &) a_ref = 0x00007ffeefbff634: { (float) &a_ref = 1100.125 }

Hide Details

Hide Details

Expecting sub string: a_ref = 1100.12 Matched

Hide Details

runCmd: frame variable --show-types a_array_bounded[0] output: (float) a_array_bounded[0] = 1100.125

Hide Details

Hide Details

looking at: float

Hide Details

Expecting sub string: float Matched

Hide Details

looking at: (float) a_array_bounded[0] = 1100.125

Hide Details

Hide Details

Expecting sub string: a_array_bounded[0] = 1100.12 Matched

Hide Details

runCmd: frame variable --show-types a_array_bounded[1] output: (float) a_array_bounded[1] = 2200.25

Hide Details

Hide Details

looking at: float

Hide Details

Expecting sub string: float Matched

Hide Details

looking at: (float) a_array_bounded[1] = 2200.25

Hide Details

Hide Details

Expecting sub string: a_array_bounded[1] = 2200.25 Matched

Hide Details

runCmd: frame variable --show-types a_array_unbounded[0] output: (float) a_array_unbounded[0] = 1100.125

Hide Details

Hide Details

looking at: float

Hide Details

Expecting sub string: float Matched

Hide Details

looking at: (float) a_array_unbounded[0] = 1100.125

Hide Details

Hide Details

Expecting sub string: a_array_unbounded[0] = 1100.12 Matched

Hide Details

runCmd: frame variable --show-types a_array_unbounded[1] output: (float) a_array_unbounded[1] = 2200.25

Hide Details

Hide Details

looking at: float

Hide Details

Expecting sub string: float Matched

Hide Details

looking at: (float) a_array_unbounded[1] = 2200.25

Hide Details

Hide Details

Expecting sub string: a_array_unbounded[1] = 2200.25 Matched

Hide Details

runCmd: frame variable --show-types a_class_instance.m_a output: (float) a_class_instance.m_a = 1100.125

Hide Details

Hide Details

looking at: float

Hide Details

Expecting sub string: float Matched

Hide Details

looking at: (float) a_class_instance.m_a = 1100.125

Hide Details

Hide Details

Expecting sub string: a_class_instance.m_a = 1100.12 Matched

Hide Details

runCmd: frame variable --show-types a_class_instance.m_b output: (float) a_class_instance.m_b = 2200.25

Hide Details

Hide Details

looking at: float

Hide Details

Expecting sub string: float Matched

Hide Details

looking at: (float) a_class_instance.m_b = 2200.25

Hide Details

Hide Details

Expecting sub string: a_class_instance.m_b = 2200.25 Matched

Hide Details

runCmd: frame variable --show-types a_class_ptr->m_a output: (float) a_class_ptr->m_a = 1100.125

Hide Details

Hide Details

looking at: float

Hide Details

Expecting sub string: float Matched

Hide Details

looking at: (float) a_class_ptr->m_a = 1100.125

Hide Details

Hide Details

Expecting sub string: a_class_ptr->m_a = 1100.12 Matched

Hide Details

runCmd: frame variable --show-types a_class_ptr->m_b output: (float) a_class_ptr->m_b = 2200.25

Hide Details

Hide Details

looking at: float

Hide Details

Expecting sub string: float Matched

Hide Details

looking at: (float) a_class_ptr->m_b = 2200.25

Hide Details

Hide Details

Expecting sub string: a_class_ptr->m_b = 2200.25 Matched

Hide Details

runCmd: frame variable --show-types a_class_ref.m_a output: (float) a_class_ref.m_a = 1100.125

Hide Details

Hide Details

looking at: float

Hide Details

Expecting sub string: float Matched

Hide Details

looking at: (float) a_class_ref.m_a = 1100.125

Hide Details

Hide Details

Expecting sub string: a_class_ref.m_a = 1100.12 Matched

Hide Details

runCmd: frame variable --show-types a_class_ref.m_b output: (float) a_class_ref.m_b = 2200.25

Hide Details

Hide Details

looking at: float

Hide Details

Expecting sub string: float Matched

Hide Details

looking at: (float) a_class_ref.m_b = 2200.25

Hide Details

Hide Details

Expecting sub string: a_class_ref.m_b = 2200.25 Matched

Hide Details

runCmd: frame variable --show-types a_struct.a output: (float) a_struct.a = 1100.125

Hide Details

Hide Details

looking at: float

Hide Details

Expecting sub string: float Matched

Hide Details

looking at: (float) a_struct.a = 1100.125

Hide Details

Hide Details

Expecting sub string: a_struct.a = 1100.12 Matched

Hide Details

runCmd: frame variable --show-types a_struct.b output: (float) a_struct.b = 2200.25

Hide Details

Hide Details

looking at: float

Hide Details

Expecting sub string: float Matched

Hide Details

looking at: (float) a_struct.b = 2200.25

Hide Details

Hide Details

Expecting sub string: a_struct.b = 2200.25 Matched

Hide Details

runCmd: frame variable --show-types a_struct_ptr->a output: (float) a_struct_ptr->a = 1100.125

Hide Details

Hide Details

looking at: float

Hide Details

Expecting sub string: float Matched

Hide Details

looking at: (float) a_struct_ptr->a = 1100.125

Hide Details

Hide Details

Expecting sub string: a_struct_ptr->a = 1100.12 Matched

Hide Details

runCmd: frame variable --show-types a_struct_ptr->b output: (float) a_struct_ptr->b = 2200.25

Hide Details

Hide Details

looking at: float

Hide Details

Expecting sub string: float Matched

Hide Details

looking at: (float) a_struct_ptr->b = 2200.25

Hide Details

Hide Details

Expecting sub string: a_struct_ptr->b = 2200.25 Matched

Hide Details

runCmd: frame variable --show-types a_struct_ref.a output: (float) a_struct_ref.a = 1100.125

Hide Details

Hide Details

looking at: float

Hide Details

Expecting sub string: float Matched

Hide Details

looking at: (float) a_struct_ref.a = 1100.125

Hide Details

Hide Details

Expecting sub string: a_struct_ref.a = 1100.12 Matched

Hide Details

runCmd: frame variable --show-types a_struct_ref.b output: (float) a_struct_ref.b = 2200.25

Hide Details

Hide Details

looking at: float

Hide Details

Expecting sub string: float Matched

Hide Details

looking at: (float) a_struct_ref.b = 2200.25

Hide Details

Hide Details

Expecting sub string: a_struct_ref.b = 2200.25 Matched

Hide Details

runCmd: frame variable --show-types a_union_zero.a output: (float) a_union_zero.a = 1100.125

Hide Details

Hide Details

looking at: float

Hide Details

Expecting sub string: float Matched

Hide Details

looking at: (float) a_union_zero.a = 1100.125

Hide Details

Hide Details

Expecting sub string: a_union_zero.a = 1100.12 Matched

Hide Details

runCmd: frame variable --show-types a_union_zero_ptr->a output: (float) a_union_zero_ptr->a = 1100.125

Hide Details

Hide Details

looking at: float

Hide Details

Expecting sub string: float Matched

Hide Details

looking at: (float) a_union_zero_ptr->a = 1100.125

Hide Details

Hide Details

Expecting sub string: a_union_zero_ptr->a = 1100.12 Matched

Hide Details

runCmd: frame variable --show-types a_union_zero_ref.a output: (float) a_union_zero_ref.a = 1100.125

Hide Details

Hide Details

looking at: float

Hide Details

Expecting sub string: float Matched

Hide Details

looking at: (float) a_union_zero_ref.a = 1100.125

Hide Details

Hide Details

Expecting sub string: a_union_zero_ref.a = 1100.12 Matched

Hide Details

runCmd: frame variable --show-types a_union_nonzero.u.a output: (float) a_union_nonzero.u.a = 1100.125

Hide Details

Hide Details

looking at: float

Hide Details

Expecting sub string: float Matched

Hide Details

looking at: (float) a_union_nonzero.u.a = 1100.125

Hide Details

Hide Details

Expecting sub string: a_union_nonzero.u.a = 1100.12 Matched

Hide Details

runCmd: frame variable --show-types a_union_nonzero_ptr->u.a output: (float) a_union_nonzero_ptr->u.a = 1100.125

Hide Details

Hide Details

looking at: float

Hide Details

Expecting sub string: float Matched

Hide Details

looking at: (float) a_union_nonzero_ptr->u.a = 1100.125

Hide Details

Hide Details

Expecting sub string: a_union_nonzero_ptr->u.a = 1100.12 Matched

Hide Details

runCmd: frame variable --show-types a_union_nonzero_ref.u.a output: (float) a_union_nonzero_ref.u.a = 1100.125

Hide Details

Hide Details

looking at: float

Hide Details

Expecting sub string: float Matched

Hide Details

looking at: (float) a_union_nonzero_ref.u.a = 1100.125

Hide Details

Hide Details

Expecting sub string: a_union_nonzero_ref.u.a = 1100.12 Matched

Hide Details

runCmd: frame variable --show-types a_struct_array_bounded[0].a output: (float) a_struct_array_bounded[0].a = 1100.125

Hide Details

Hide Details

looking at: float

Hide Details

Expecting sub string: float Matched

Hide Details

looking at: (float) a_struct_array_bounded[0].a = 1100.125

Hide Details

Hide Details

Expecting sub string: a_struct_array_bounded[0].a = 1100.12 Matched

Hide Details

runCmd: frame variable --show-types a_struct_array_bounded[0].b output: (float) a_struct_array_bounded[0].b = 2200.25

Hide Details

Hide Details

looking at: float

Hide Details

Expecting sub string: float Matched

Hide Details

looking at: (float) a_struct_array_bounded[0].b = 2200.25

Hide Details

Hide Details

Expecting sub string: a_struct_array_bounded[0].b = 2200.25 Matched

Hide Details

runCmd: frame variable --show-types a_struct_array_bounded[1].a output: (float) a_struct_array_bounded[1].a = 33

Hide Details

Hide Details

looking at: float

Hide Details

Expecting sub string: float Matched

Hide Details

looking at: (float) a_struct_array_bounded[1].a = 33

Hide Details

Hide Details

Expecting sub string: a_struct_array_bounded[1].a = 33 Matched

Hide Details

runCmd: frame variable --show-types a_struct_array_bounded[1].b output: (float) a_struct_array_bounded[1].b = 44

Hide Details

Hide Details

looking at: float

Hide Details

Expecting sub string: float Matched

Hide Details

looking at: (float) a_struct_array_bounded[1].b = 44

Hide Details

Hide Details

Expecting sub string: a_struct_array_bounded[1].b = 44 Matched

Hide Details

runCmd: frame variable --show-types a_struct_array_unbounded[0].a output: (float) a_struct_array_unbounded[0].a = 1100.125

Hide Details

Hide Details

looking at: float

Hide Details

Expecting sub string: float Matched

Hide Details

looking at: (float) a_struct_array_unbounded[0].a = 1100.125

Hide Details

Hide Details

Expecting sub string: a_struct_array_unbounded[0].a = 1100.12 Matched

Hide Details

runCmd: frame variable --show-types a_struct_array_unbounded[0].b output: (float) a_struct_array_unbounded[0].b = 2200.25

Hide Details

Hide Details

looking at: float

Hide Details

Expecting sub string: float Matched

Hide Details

looking at: (float) a_struct_array_unbounded[0].b = 2200.25

Hide Details

Hide Details

Expecting sub string: a_struct_array_unbounded[0].b = 2200.25 Matched

Hide Details

runCmd: frame variable --show-types a_struct_array_unbounded[1].a output: (float) a_struct_array_unbounded[1].a = 33

Hide Details

Hide Details

looking at: float

Hide Details

Expecting sub string: float Matched

Hide Details

looking at: (float) a_struct_array_unbounded[1].a = 33

Hide Details

Hide Details

Expecting sub string: a_struct_array_unbounded[1].a = 33 Matched

Hide Details

runCmd: frame variable --show-types a_struct_array_unbounded[1].b output: (float) a_struct_array_unbounded[1].b = 44

Hide Details

Hide Details

looking at: float

Hide Details

Expecting sub string: float Matched

Hide Details

looking at: (float) a_struct_array_unbounded[1].b = 44

Hide Details

Hide Details

Expecting sub string: a_struct_array_unbounded[1].b = 44 Matched

Hide Details

runCmd: frame variable --show-types a_union_zero_array_bounded[0].a output: (float) a_union_zero_array_bounded[0].a = 1100.125

Hide Details

Hide Details

looking at: float

Hide Details

Expecting sub string: float Matched

Hide Details

looking at: (float) a_union_zero_array_bounded[0].a = 1100.125

Hide Details

Hide Details

Expecting sub string: a_union_zero_array_bounded[0].a = 1100.12 Matched

Hide Details

runCmd: frame variable --show-types a_union_zero_array_bounded[1].a output: (float) a_union_zero_array_bounded[1].a = 2200.25

Hide Details

Hide Details

looking at: float

Hide Details

Expecting sub string: float Matched

Hide Details

looking at: (float) a_union_zero_array_bounded[1].a = 2200.25

Hide Details

Hide Details

Expecting sub string: a_union_zero_array_bounded[1].a = 2200.25 Matched

Hide Details

runCmd: frame variable --show-types a_union_zero_array_unbounded[0].a output: (float) a_union_zero_array_unbounded[0].a = 1100.125

Hide Details

Hide Details

looking at: float

Hide Details

Expecting sub string: float Matched

Hide Details

looking at: (float) a_union_zero_array_unbounded[0].a = 1100.125

Hide Details

Hide Details

Expecting sub string: a_union_zero_array_unbounded[0].a = 1100.12 Matched

Hide Details

runCmd: frame variable --show-types a_union_zero_array_unbounded[1].a output: (float) a_union_zero_array_unbounded[1].a = 2200.25

Hide Details

Hide Details

looking at: float

Hide Details

Expecting sub string: float Matched

Hide Details

looking at: (float) a_union_zero_array_unbounded[1].a = 2200.25

Hide Details

Hide Details

Expecting sub string: a_union_zero_array_unbounded[1].a = 2200.25 Matched

Hide Details

<bound method SBProcess.Kill of <lldb.SBProcess; proxy of <Swig Object of type 'lldb::SBProcess *' at 0x107fc29c0> >>: success

Hide Details

Executing tearDown hook: self.addTearDownHook(lambda: self.runCmd( "settings set target.inline-breakpoint-strategy headers"))

Hide Details

Hide Details

runCmd: settings set target.inline-breakpoint-strategy headers output:

Hide Details

PASS: LLDB (/Users/buildslave/jenkins/workspace/lldb-cmake-sanitized/lldb-build/bin/clang-11-x86_64) :: test_float_type_dsym (TestFloatTypes.FloatTypesTestCase) runCmd: settings clear -all output:

Hide Details

runCmd: settings set symbols.enable-external-lookup false output:

Hide Details

runCmd: settings set target.auto-apply-fixits false output:

Hide Details

runCmd: settings set plugin.process.gdb-remote.packet-timeout 60 output:

Hide Details

runCmd: settings set symbols.clang-modules-cache-path "/Users/buildslave/jenkins/workspace/lldb-cmake-sanitized/lldb-build/lldb-test-build.noindex/module-cache-lldb/lldb-api" output:

Hide Details

runCmd: settings set use-color false output:

Hide Details

runCmd: setting set target.prefer-dynamic-value no-dynamic-values output:

Hide Details

runCmd: settings set target.env-vars ASAN_OPTIONS=detect_stack_use_after_return=1 DYLD_INSERT_LIBRARIES=/Users/buildslave/jenkins/workspace/lldb-cmake-sanitized/host-compiler/lib/clang/11.0.0/lib/darwin/libclang_rt.asan_osx_dynamic.dylib output:

Hide Details

runCmd: file /Users/buildslave/jenkins/workspace/lldb-cmake-sanitized/lldb-build/lldb-test-build.noindex/types/TestFloatTypes.test_float_type_dwarf/test_float_type_dwarf output: Current executable set to '/Users/buildslave/jenkins/workspace/lldb-cmake-sanitized/lldb-build/lldb-test-build.noindex/types/TestFloatTypes.test_float_type_dwarf/test_float_type_dwarf' (x86_64).

Hide Details

Hide Details

runCmd: process launch -o "/Users/buildslave/jenkins/workspace/lldb-cmake-sanitized/lldb-build/lldb-test-build.noindex/types/TestFloatTypes.test_float_type_dwarf/test_float_type_dwarf-golden-output.txt" output: Process 59978 exited with status = 0 (0x00000000)

Hide Details

Process 59978 launched: '/Users/buildslave/jenkins/workspace/lldb-cmake-sanitized/lldb-build/lldb-test-build.noindex/types/TestFloatTypes.test_float_type_dwarf/test_float_type_dwarf' (x86_64)

Hide Details

Hide Details

runCmd: settings set target.inline-breakpoint-strategy always output:

Hide Details

Adding tearDown hook: self.addTearDownHook(lambda: self.runCmd( "settings set target.inline-breakpoint-strategy headers"))

Hide Details

Hide Details

runCmd: breakpoint set -f "basic_type.cpp" -l 185 output: Breakpoint 1: where = test_float_type_dwarf`main + 2107 at basic_type.cpp:185:5, address = 0x000000010000160b

Hide Details

Hide Details

Expecting pattern: ^Breakpoint (?P<bpno>[0-9]+): (?P<num_locations>[0-9]+) locations\.$ Not matched

Hide Details

Expecting pattern: ^Breakpoint (?P<bpno>[0-9]+): (?P<num_locations>no) locations \(pending\)\. Not matched

Hide Details

Expecting pattern: ^Breakpoint (?P<bpno>[0-9]+): where = (?P<module>.*)`(?P<symbol>[+\-]{0,1}[^+]+)( \+ (?P<offset>[0-9]+)){0,1}( \[inlined\] (?P<inline_symbol>.*)){0,1} at (?P<file>[^:]+):(?P<line_no>[0-9]+)(?P<column>(:[0-9]+)?), address = (?P<address>0x[0-9a-fA-F]+)$ Matched

Hide Details

runCmd: run output: Process 60037 stopped * thread #1, queue = 'com.apple.main-thread', stop reason = breakpoint 1.1 frame #0: 0x000000010000160b test_float_type_dwarf`main(argc=1, argv=0x00007ffeefbff6d8) at basic_type.cpp:185:5 182 fprintf (out, "(a_union_zero_t[]) a_union_zero_array_unbounded[1].a = '" T_PRINTF_FORMAT "'\n", a_union_zero_array_unbounded[1].a); 183 184 #endif -> 185 puts("About to exit, break here to check values..."); // Here is the line we will break on to check variables. ^ 186 187 #ifdef TEST_BLOCK_CAPTURED_VARS 188 void (^myBlock)() = ^() {

Hide Details

Process 60037 launched: '/Users/buildslave/jenkins/workspace/lldb-cmake-sanitized/lldb-build/lldb-test-build.noindex/types/TestFloatTypes.test_float_type_dwarf/test_float_type_dwarf' (x86_64)

Hide Details

Hide Details

runCmd: process status output: Process 60037 stopped * thread #1, queue = 'com.apple.main-thread', stop reason = breakpoint 1.1 frame #0: 0x000000010000160b test_float_type_dwarf`main(argc=1, argv=0x00007ffeefbff6d8) at basic_type.cpp:185:5 182 fprintf (out, "(a_union_zero_t[]) a_union_zero_array_unbounded[1].a = '" T_PRINTF_FORMAT "'\n", a_union_zero_array_unbounded[1].a); 183 184 #endif -> 185 puts("About to exit, break here to check values..."); // Here is the line we will break on to check variables. ^ 186 187 #ifdef TEST_BLOCK_CAPTURED_VARS 188 void (^myBlock)() = ^() {

Hide Details

Hide Details

Expecting sub string: stop reason = breakpoint Matched

Hide Details

Expecting sub string: at basic_type.cpp:185 Matched

Hide Details

runCmd: frame variable --show-types a output: (float) a = 1100.125

Hide Details

Hide Details

looking at: float

Hide Details

Expecting sub string: float Matched

Hide Details

looking at: (float) a = 1100.125

Hide Details

Hide Details

Expecting sub string: a = 1100.12 Matched

Hide Details

runCmd: frame variable --show-types *a_ptr output: (float) *a_ptr = 1100.125

Hide Details

Hide Details

looking at: float

Hide Details

Expecting sub string: float Matched

Hide Details

looking at: (float) *a_ptr = 1100.125

Hide Details

Hide Details

Expecting sub string: *a_ptr = 1100.12 Matched

Hide Details

runCmd: frame variable --show-types a_ref output: (float &) a_ref = 0x00007ffeefbff634: { (float) &a_ref = 1100.125 }

Hide Details

Hide Details

looking at: float &

Hide Details

Expecting sub string: float Matched

Hide Details

looking at: (float &) a_ref = 0x00007ffeefbff634: { (float) &a_ref = 1100.125 }

Hide Details

Hide Details

Expecting sub string: a_ref = 1100.12 Matched

Hide Details

runCmd: frame variable --show-types a_array_bounded[0] output: (float) a_array_bounded[0] = 1100.125

Hide Details

Hide Details

looking at: float

Hide Details

Expecting sub string: float Matched

Hide Details

looking at: (float) a_array_bounded[0] = 1100.125

Hide Details

Hide Details

Expecting sub string: a_array_bounded[0] = 1100.12 Matched

Hide Details

runCmd: frame variable --show-types a_array_bounded[1] output: (float) a_array_bounded[1] = 2200.25

Hide Details

Hide Details

looking at: float

Hide Details

Expecting sub string: float Matched

Hide Details

looking at: (float) a_array_bounded[1] = 2200.25

Hide Details

Hide Details

Expecting sub string: a_array_bounded[1] = 2200.25 Matched

Hide Details

runCmd: frame variable --show-types a_array_unbounded[0] output: (float) a_array_unbounded[0] = 1100.125

Hide Details

Hide Details

looking at: float

Hide Details

Expecting sub string: float Matched

Hide Details

looking at: (float) a_array_unbounded[0] = 1100.125

Hide Details

Hide Details

Expecting sub string: a_array_unbounded[0] = 1100.12 Matched

Hide Details

runCmd: frame variable --show-types a_array_unbounded[1] output: (float) a_array_unbounded[1] = 2200.25

Hide Details

Hide Details

looking at: float

Hide Details

Expecting sub string: float Matched

Hide Details

looking at: (float) a_array_unbounded[1] = 2200.25

Hide Details

Hide Details

Expecting sub string: a_array_unbounded[1] = 2200.25 Matched

Hide Details

runCmd: frame variable --show-types a_class_instance.m_a output: (float) a_class_instance.m_a = 1100.125

Hide Details

Hide Details

looking at: float

Hide Details

Expecting sub string: float Matched

Hide Details

looking at: (float) a_class_instance.m_a = 1100.125

Hide Details

Hide Details

Expecting sub string: a_class_instance.m_a = 1100.12 Matched

Hide Details

runCmd: frame variable --show-types a_class_instance.m_b output: (float) a_class_instance.m_b = 2200.25

Hide Details

Hide Details

looking at: float

Hide Details

Expecting sub string: float Matched

Hide Details

looking at: (float) a_class_instance.m_b = 2200.25

Hide Details

Hide Details

Expecting sub string: a_class_instance.m_b = 2200.25 Matched

Hide Details

runCmd: frame variable --show-types a_class_ptr->m_a output: (float) a_class_ptr->m_a = 1100.125

Hide Details

Hide Details

looking at: float

Hide Details

Expecting sub string: float Matched

Hide Details

looking at: (float) a_class_ptr->m_a = 1100.125

Hide Details

Hide Details

Expecting sub string: a_class_ptr->m_a = 1100.12 Matched

Hide Details

runCmd: frame variable --show-types a_class_ptr->m_b output: (float) a_class_ptr->m_b = 2200.25

Hide Details

Hide Details

looking at: float

Hide Details

Expecting sub string: float Matched

Hide Details

looking at: (float) a_class_ptr->m_b = 2200.25

Hide Details

Hide Details

Expecting sub string: a_class_ptr->m_b = 2200.25 Matched

Hide Details

runCmd: frame variable --show-types a_class_ref.m_a output: (float) a_class_ref.m_a = 1100.125

Hide Details

Hide Details

looking at: float

Hide Details

Expecting sub string: float Matched

Hide Details

looking at: (float) a_class_ref.m_a = 1100.125

Hide Details

Hide Details

Expecting sub string: a_class_ref.m_a = 1100.12 Matched

Hide Details

runCmd: frame variable --show-types a_class_ref.m_b output: (float) a_class_ref.m_b = 2200.25

Hide Details

Hide Details

looking at: float

Hide Details

Expecting sub string: float Matched

Hide Details

looking at: (float) a_class_ref.m_b = 2200.25

Hide Details

Hide Details

Expecting sub string: a_class_ref.m_b = 2200.25 Matched

Hide Details

runCmd: frame variable --show-types a_struct.a output: (float) a_struct.a = 1100.125

Hide Details

Hide Details

looking at: float

Hide Details

Expecting sub string: float Matched

Hide Details

looking at: (float) a_struct.a = 1100.125

Hide Details

Hide Details

Expecting sub string: a_struct.a = 1100.12 Matched

Hide Details

runCmd: frame variable --show-types a_struct.b output: (float) a_struct.b = 2200.25

Hide Details

Hide Details

looking at: float

Hide Details

Expecting sub string: float Matched

Hide Details

looking at: (float) a_struct.b = 2200.25

Hide Details

Hide Details

Expecting sub string: a_struct.b = 2200.25 Matched

Hide Details

runCmd: frame variable --show-types a_struct_ptr->a output: (float) a_struct_ptr->a = 1100.125

Hide Details

Hide Details

looking at: float

Hide Details

Expecting sub string: float Matched

Hide Details

looking at: (float) a_struct_ptr->a = 1100.125

Hide Details

Hide Details

Expecting sub string: a_struct_ptr->a = 1100.12 Matched

Hide Details

runCmd: frame variable --show-types a_struct_ptr->b output: (float) a_struct_ptr->b = 2200.25

Hide Details

Hide Details

looking at: float

Hide Details

Expecting sub string: float Matched

Hide Details

looking at: (float) a_struct_ptr->b = 2200.25

Hide Details

Hide Details

Expecting sub string: a_struct_ptr->b = 2200.25 Matched

Hide Details

runCmd: frame variable --show-types a_struct_ref.a output: (float) a_struct_ref.a = 1100.125

Hide Details

Hide Details

looking at: float

Hide Details

Expecting sub string: float Matched

Hide Details

looking at: (float) a_struct_ref.a = 1100.125

Hide Details

Hide Details

Expecting sub string: a_struct_ref.a = 1100.12 Matched

Hide Details

runCmd: frame variable --show-types a_struct_ref.b output: (float) a_struct_ref.b = 2200.25

Hide Details

Hide Details

looking at: float

Hide Details

Expecting sub string: float Matched

Hide Details

looking at: (float) a_struct_ref.b = 2200.25

Hide Details

Hide Details

Expecting sub string: a_struct_ref.b = 2200.25 Matched

Hide Details

runCmd: frame variable --show-types a_union_zero.a output: (float) a_union_zero.a = 1100.125

Hide Details

Hide Details

looking at: float

Hide Details

Expecting sub string: float Matched

Hide Details

looking at: (float) a_union_zero.a = 1100.125

Hide Details

Hide Details

Expecting sub string: a_union_zero.a = 1100.12 Matched

Hide Details

runCmd: frame variable --show-types a_union_zero_ptr->a output: (float) a_union_zero_ptr->a = 1100.125

Hide Details

Hide Details

looking at: float

Hide Details

Expecting sub string: float Matched

Hide Details

looking at: (float) a_union_zero_ptr->a = 1100.125

Hide Details

Hide Details

Expecting sub string: a_union_zero_ptr->a = 1100.12 Matched

Hide Details

runCmd: frame variable --show-types a_union_zero_ref.a output: (float) a_union_zero_ref.a = 1100.125

Hide Details

Hide Details

looking at: float

Hide Details

Expecting sub string: float Matched

Hide Details

looking at: (float) a_union_zero_ref.a = 1100.125

Hide Details

Hide Details

Expecting sub string: a_union_zero_ref.a = 1100.12 Matched

Hide Details

runCmd: frame variable --show-types a_union_nonzero.u.a output: (float) a_union_nonzero.u.a = 1100.125

Hide Details

Hide Details

looking at: float

Hide Details

Expecting sub string: float Matched

Hide Details

looking at: (float) a_union_nonzero.u.a = 1100.125

Hide Details

Hide Details

Expecting sub string: a_union_nonzero.u.a = 1100.12 Matched

Hide Details

runCmd: frame variable --show-types a_union_nonzero_ptr->u.a output: (float) a_union_nonzero_ptr->u.a = 1100.125

Hide Details

Hide Details

looking at: float

Hide Details

Expecting sub string: float Matched

Hide Details

looking at: (float) a_union_nonzero_ptr->u.a = 1100.125

Hide Details

Hide Details

Expecting sub string: a_union_nonzero_ptr->u.a = 1100.12 Matched

Hide Details

runCmd: frame variable --show-types a_union_nonzero_ref.u.a output: (float) a_union_nonzero_ref.u.a = 1100.125

Hide Details

Hide Details

looking at: float

Hide Details

Expecting sub string: float Matched

Hide Details

looking at: (float) a_union_nonzero_ref.u.a = 1100.125

Hide Details

Hide Details

Expecting sub string: a_union_nonzero_ref.u.a = 1100.12 Matched

Hide Details

runCmd: frame variable --show-types a_struct_array_bounded[0].a output: (float) a_struct_array_bounded[0].a = 1100.125

Hide Details

Hide Details

looking at: float

Hide Details

Expecting sub string: float Matched

Hide Details

looking at: (float) a_struct_array_bounded[0].a = 1100.125

Hide Details

Hide Details

Expecting sub string: a_struct_array_bounded[0].a = 1100.12 Matched

Hide Details

runCmd: frame variable --show-types a_struct_array_bounded[0].b output: (float) a_struct_array_bounded[0].b = 2200.25

Hide Details

Hide Details

looking at: float

Hide Details

Expecting sub string: float Matched

Hide Details

looking at: (float) a_struct_array_bounded[0].b = 2200.25

Hide Details

Hide Details

Expecting sub string: a_struct_array_bounded[0].b = 2200.25 Matched

Hide Details

runCmd: frame variable --show-types a_struct_array_bounded[1].a output: (float) a_struct_array_bounded[1].a = 33

Hide Details

Hide Details

looking at: float

Hide Details

Expecting sub string: float Matched

Hide Details

looking at: (float) a_struct_array_bounded[1].a = 33

Hide Details

Hide Details

Expecting sub string: a_struct_array_bounded[1].a = 33 Matched

Hide Details

runCmd: frame variable --show-types a_struct_array_bounded[1].b output: (float) a_struct_array_bounded[1].b = 44

Hide Details

Hide Details

looking at: float

Hide Details

Expecting sub string: float Matched

Hide Details

looking at: (float) a_struct_array_bounded[1].b = 44

Hide Details

Hide Details

Expecting sub string: a_struct_array_bounded[1].b = 44 Matched

Hide Details

runCmd: frame variable --show-types a_struct_array_unbounded[0].a output: (float) a_struct_array_unbounded[0].a = 1100.125

Hide Details

Hide Details

looking at: float

Hide Details

Expecting sub string: float Matched

Hide Details

looking at: (float) a_struct_array_unbounded[0].a = 1100.125

Hide Details

Hide Details

Expecting sub string: a_struct_array_unbounded[0].a = 1100.12 Matched

Hide Details

runCmd: frame variable --show-types a_struct_array_unbounded[0].b output: (float) a_struct_array_unbounded[0].b = 2200.25

Hide Details

Hide Details

looking at: float

Hide Details

Expecting sub string: float Matched

Hide Details

looking at: (float) a_struct_array_unbounded[0].b = 2200.25

Hide Details

Hide Details

Expecting sub string: a_struct_array_unbounded[0].b = 2200.25 Matched

Hide Details

runCmd: frame variable --show-types a_struct_array_unbounded[1].a output: (float) a_struct_array_unbounded[1].a = 33

Hide Details

Hide Details

looking at: float

Hide Details

Expecting sub string: float Matched

Hide Details

looking at: (float) a_struct_array_unbounded[1].a = 33

Hide Details

Hide Details

Expecting sub string: a_struct_array_unbounded[1].a = 33 Matched

Hide Details

runCmd: frame variable --show-types a_struct_array_unbounded[1].b output: (float) a_struct_array_unbounded[1].b = 44

Hide Details

Hide Details

looking at: float

Hide Details

Expecting sub string: float Matched

Hide Details

looking at: (float) a_struct_array_unbounded[1].b = 44

Hide Details

Hide Details

Expecting sub string: a_struct_array_unbounded[1].b = 44 Matched

Hide Details

runCmd: frame variable --show-types a_union_zero_array_bounded[0].a output: (float) a_union_zero_array_bounded[0].a = 1100.125

Hide Details

Hide Details

looking at: float

Hide Details

Expecting sub string: float Matched

Hide Details

looking at: (float) a_union_zero_array_bounded[0].a = 1100.125

Hide Details

Hide Details

Expecting sub string: a_union_zero_array_bounded[0].a = 1100.12 Matched

Hide Details

runCmd: frame variable --show-types a_union_zero_array_bounded[1].a output: (float) a_union_zero_array_bounded[1].a = 2200.25

Hide Details

Hide Details

looking at: float

Hide Details

Expecting sub string: float Matched

Hide Details

looking at: (float) a_union_zero_array_bounded[1].a = 2200.25

Hide Details

Hide Details

Expecting sub string: a_union_zero_array_bounded[1].a = 2200.25 Matched

Hide Details

runCmd: frame variable --show-types a_union_zero_array_unbounded[0].a output: (float) a_union_zero_array_unbounded[0].a = 1100.125

Hide Details

Hide Details

looking at: float

Hide Details

Expecting sub string: float Matched

Hide Details

looking at: (float) a_union_zero_array_unbounded[0].a = 1100.125

Hide Details

Hide Details

Expecting sub string: a_union_zero_array_unbounded[0].a = 1100.12 Matched

Hide Details

runCmd: frame variable --show-types a_union_zero_array_unbounded[1].a output: (float) a_union_zero_array_unbounded[1].a = 2200.25

Hide Details

Hide Details

looking at: float

Hide Details

Expecting sub string: float Matched

Hide Details

looking at: (float) a_union_zero_array_unbounded[1].a = 2200.25

Hide Details

Hide Details

Expecting sub string: a_union_zero_array_unbounded[1].a = 2200.25 Matched

Hide Details

<bound method SBProcess.Kill of <lldb.SBProcess; proxy of <Swig Object of type 'lldb::SBProcess *' at 0x107af0c90> >>: success

Hide Details

Executing tearDown hook: self.addTearDownHook(lambda: self.runCmd( "settings set target.inline-breakpoint-strategy headers"))

Hide Details

Hide Details

runCmd: settings set target.inline-breakpoint-strategy headers output:

Hide Details

PASS: LLDB (/Users/buildslave/jenkins/workspace/lldb-cmake-sanitized/lldb-build/bin/clang-11-x86_64) :: test_float_type_dwarf (TestFloatTypes.FloatTypesTestCase) UNSUPPORTED: LLDB (/Users/buildslave/jenkins/workspace/lldb-cmake-sanitized/lldb-build/bin/clang-11-x86_64) :: test_float_type_dwo (TestFloatTypes.FloatTypesTestCase) (test case does not fall in any category of interest for this run) runCmd: settings clear -all output:

Hide Details

runCmd: settings set symbols.enable-external-lookup false output:

Hide Details

runCmd: settings set target.auto-apply-fixits false output:

Hide Details

runCmd: settings set plugin.process.gdb-remote.packet-timeout 60 output:

Hide Details

runCmd: settings set symbols.clang-modules-cache-path "/Users/buildslave/jenkins/workspace/lldb-cmake-sanitized/lldb-build/lldb-test-build.noindex/module-cache-lldb/lldb-api" output:

Hide Details

runCmd: settings set use-color false output:

Hide Details

runCmd: setting set target.prefer-dynamic-value no-dynamic-values output:

Hide Details

runCmd: settings set target.env-vars ASAN_OPTIONS=detect_stack_use_after_return=1 DYLD_INSERT_LIBRARIES=/Users/buildslave/jenkins/workspace/lldb-cmake-sanitized/host-compiler/lib/clang/11.0.0/lib/darwin/libclang_rt.asan_osx_dynamic.dylib output:

Hide Details

runCmd: file /Users/buildslave/jenkins/workspace/lldb-cmake-sanitized/lldb-build/lldb-test-build.noindex/types/TestFloatTypes.test_float_type_from_block_dsym/test_float_type_from_block_dsym output: Current executable set to '/Users/buildslave/jenkins/workspace/lldb-cmake-sanitized/lldb-build/lldb-test-build.noindex/types/TestFloatTypes.test_float_type_from_block_dsym/test_float_type_from_block_dsym' (x86_64).

Hide Details

Hide Details

runCmd: process launch -o "/Users/buildslave/jenkins/workspace/lldb-cmake-sanitized/lldb-build/lldb-test-build.noindex/types/TestFloatTypes.test_float_type_from_block_dsym/test_float_type_from_block_dsym-golden-output.txt" output: Process 60210 exited with status = 0 (0x00000000)

Hide Details

Process 60210 launched: '/Users/buildslave/jenkins/workspace/lldb-cmake-sanitized/lldb-build/lldb-test-build.noindex/types/TestFloatTypes.test_float_type_from_block_dsym/test_float_type_from_block_dsym' (x86_64)

Hide Details

Hide Details

runCmd: settings set target.inline-breakpoint-strategy always output:

Hide Details

Adding tearDown hook: self.addTearDownHook(lambda: self.runCmd( "settings set target.inline-breakpoint-strategy headers"))

Hide Details

Hide Details

runCmd: breakpoint set -f "basic_type.cpp" -l 215 output: Breakpoint 1: where = test_float_type_from_block_dsym`__main_block_invoke + 1104 at basic_type.cpp:215:18, address = 0x0000000100001690

Hide Details

Hide Details

Expecting pattern: ^Breakpoint (?P<bpno>[0-9]+): (?P<num_locations>[0-9]+) locations\.$ Not matched

Hide Details

Expecting pattern: ^Breakpoint (?P<bpno>[0-9]+): (?P<num_locations>no) locations \(pending\)\. Not matched

Hide Details

Expecting pattern: ^Breakpoint (?P<bpno>[0-9]+): where = (?P<module>.*)`(?P<symbol>[+\-]{0,1}[^+]+)( \+ (?P<offset>[0-9]+)){0,1}( \[inlined\] (?P<inline_symbol>.*)){0,1} at (?P<file>[^:]+):(?P<line_no>[0-9]+)(?P<column>(:[0-9]+)?), address = (?P<address>0x[0-9a-fA-F]+)$ Matched

Hide Details

runCmd: run output: Process 60225 stopped * thread #1, queue = 'com.apple.main-thread', stop reason = breakpoint 1.1 frame #0: 0x0000000100001690 test_float_type_from_block_dsym`__main_block_invoke(.block_descriptor=0x00007ffeefbff4d0) at basic_type.cpp:215:18 212 fprintf (out, "(a_union_nonzero_t*) a_union_nonzero_ptr = %p, a_union_nonzero_ptr->u.a = '" T_PRINTF_FORMAT "'\n", a_union_nonzero_ptr, a_union_nonzero_ptr->u.a); 213 fprintf (out, "(a_union_nonzero_t&) a_union_nonzero_ref = %p, a_union_nonzero_ref.u.a = '" T_PRINTF_FORMAT "'\n", &a_union_nonzero_ref, a_union_nonzero_ref.u.a); 214 -> 215 fprintf (out, "That's All Folks!\n"); // Break here to test block captured variables. ^ 216 }; 217 218 myBlock();

Hide Details

Process 60225 launched: '/Users/buildslave/jenkins/workspace/lldb-cmake-sanitized/lldb-build/lldb-test-build.noindex/types/TestFloatTypes.test_float_type_from_block_dsym/test_float_type_from_block_dsym' (x86_64)

Hide Details

Hide Details

runCmd: process status output: Process 60225 stopped * thread #1, queue = 'com.apple.main-thread', stop reason = breakpoint 1.1 frame #0: 0x0000000100001690 test_float_type_from_block_dsym`__main_block_invoke(.block_descriptor=0x00007ffeefbff4d0) at basic_type.cpp:215:18 212 fprintf (out, "(a_union_nonzero_t*) a_union_nonzero_ptr = %p, a_union_nonzero_ptr->u.a = '" T_PRINTF_FORMAT "'\n", a_union_nonzero_ptr, a_union_nonzero_ptr->u.a); 213 fprintf (out, "(a_union_nonzero_t&) a_union_nonzero_ref = %p, a_union_nonzero_ref.u.a = '" T_PRINTF_FORMAT "'\n", &a_union_nonzero_ref, a_union_nonzero_ref.u.a); 214 -> 215 fprintf (out, "That's All Folks!\n"); // Break here to test block captured variables. ^ 216 }; 217 218 myBlock();

Hide Details

Hide Details

Expecting sub string: stop reason = breakpoint Matched

Hide Details

Expecting sub string: at basic_type.cpp:215 Matched

Hide Details

runCmd: frame variable --show-types a output: (float) a = 1100.125

Hide Details

Hide Details

looking at: float

Hide Details

Expecting sub string: float Matched

Hide Details

looking at: (float) a = 1100.125

Hide Details

Hide Details

Expecting sub string: a = 1100.12 Matched

Hide Details

runCmd: frame variable --show-types *a_ptr output: (float) *a_ptr = 1100.125

Hide Details

Hide Details

looking at: float

Hide Details

Expecting sub string: float Matched

Hide Details

looking at: (float) *a_ptr = 1100.125

Hide Details

Hide Details

Expecting sub string: *a_ptr = 1100.12 Matched

Hide Details

runCmd: frame variable --show-types a_ref output: (float &) a_ref = 0x00007ffeefbff614: { (float) &a_ref = 1100.125 }

Hide Details

Hide Details

looking at: float &

Hide Details

Expecting sub string: float Matched

Hide Details

looking at: (float &) a_ref = 0x00007ffeefbff614: { (float) &a_ref = 1100.125 }

Hide Details

Hide Details

Expecting sub string: a_ref = 1100.12 Matched

Hide Details

runCmd: frame variable --show-types a_class_instance.m_a output: (float) a_class_instance.m_a = 1100.125

Hide Details

Hide Details

looking at: float

Hide Details

Expecting sub string: float Matched

Hide Details

looking at: (float) a_class_instance.m_a = 1100.125

Hide Details

Hide Details

Expecting sub string: a_class_instance.m_a = 1100.12 Matched

Hide Details

runCmd: frame variable --show-types a_class_instance.m_b output: (float) a_class_instance.m_b = 2200.25

Hide Details

Hide Details

looking at: float

Hide Details

Expecting sub string: float Matched

Hide Details

looking at: (float) a_class_instance.m_b = 2200.25

Hide Details

Hide Details

Expecting sub string: a_class_instance.m_b = 2200.25 Matched

Hide Details

runCmd: frame variable --show-types a_class_ptr->m_a output: (float) a_class_ptr->m_a = 1100.125

Hide Details

Hide Details

looking at: float

Hide Details

Expecting sub string: float Matched

Hide Details

looking at: (float) a_class_ptr->m_a = 1100.125

Hide Details

Hide Details

Expecting sub string: a_class_ptr->m_a = 1100.12 Matched

Hide Details

runCmd: frame variable --show-types a_class_ptr->m_b output: (float) a_class_ptr->m_b = 2200.25

Hide Details

Hide Details

looking at: float

Hide Details

Expecting sub string: float Matched

Hide Details

looking at: (float) a_class_ptr->m_b = 2200.25

Hide Details

Hide Details

Expecting sub string: a_class_ptr->m_b = 2200.25 Matched

Hide Details

runCmd: frame variable --show-types a_class_ref.m_a output: (float) a_class_ref.m_a = 1100.125

Hide Details

Hide Details

looking at: float

Hide Details

Expecting sub string: float Matched

Hide Details

looking at: (float) a_class_ref.m_a = 1100.125

Hide Details

Hide Details

Expecting sub string: a_class_ref.m_a = 1100.12 Matched

Hide Details

runCmd: frame variable --show-types a_class_ref.m_b output: (float) a_class_ref.m_b = 2200.25

Hide Details

Hide Details

looking at: float

Hide Details

Expecting sub string: float Matched

Hide Details

looking at: (float) a_class_ref.m_b = 2200.25

Hide Details

Hide Details

Expecting sub string: a_class_ref.m_b = 2200.25 Matched

Hide Details

runCmd: frame variable --show-types a_struct.a output: (float) a_struct.a = 1100.125

Hide Details

Hide Details

looking at: float

Hide Details

Expecting sub string: float Matched

Hide Details

looking at: (float) a_struct.a = 1100.125

Hide Details

Hide Details

Expecting sub string: a_struct.a = 1100.12 Matched

Hide Details

runCmd: frame variable --show-types a_struct.b output: (float) a_struct.b = 2200.25

Hide Details

Hide Details

looking at: float

Hide Details

Expecting sub string: float Matched

Hide Details

looking at: (float) a_struct.b = 2200.25

Hide Details

Hide Details

Expecting sub string: a_struct.b = 2200.25 Matched

Hide Details

runCmd: frame variable --show-types a_struct_ptr->a output: (float) a_struct_ptr->a = 1100.125

Hide Details

Hide Details

looking at: float

Hide Details

Expecting sub string: float Matched

Hide Details

looking at: (float) a_struct_ptr->a = 1100.125

Hide Details

Hide Details

Expecting sub string: a_struct_ptr->a = 1100.12 Matched

Hide Details

runCmd: frame variable --show-types a_struct_ptr->b output: (float) a_struct_ptr->b = 2200.25

Hide Details

Hide Details

looking at: float

Hide Details

Expecting sub string: float Matched

Hide Details

looking at: (float) a_struct_ptr->b = 2200.25

Hide Details

Hide Details

Expecting sub string: a_struct_ptr->b = 2200.25 Matched

Hide Details

runCmd: frame variable --show-types a_struct_ref.a output: (float) a_struct_ref.a = 1100.125

Hide Details

Hide Details

looking at: float

Hide Details

Expecting sub string: float Matched

Hide Details

looking at: (float) a_struct_ref.a = 1100.125

Hide Details

Hide Details

Expecting sub string: a_struct_ref.a = 1100.12 Matched

Hide Details

runCmd: frame variable --show-types a_struct_ref.b output: (float) a_struct_ref.b = 2200.25

Hide Details

Hide Details

looking at: float

Hide Details

Expecting sub string: float Matched

Hide Details

looking at: (float) a_struct_ref.b = 2200.25

Hide Details

Hide Details

Expecting sub string: a_struct_ref.b = 2200.25 Matched

Hide Details

runCmd: frame variable --show-types a_union_zero.a output: (float) a_union_zero.a = 1100.125

Hide Details

Hide Details

looking at: float

Hide Details

Expecting sub string: float Matched

Hide Details

looking at: (float) a_union_zero.a = 1100.125

Hide Details

Hide Details

Expecting sub string: a_union_zero.a = 1100.12 Matched

Hide Details

runCmd: frame variable --show-types a_union_zero_ptr->a output: (float) a_union_zero_ptr->a = 1100.125

Hide Details

Hide Details

looking at: float

Hide Details

Expecting sub string: float Matched

Hide Details

looking at: (float) a_union_zero_ptr->a = 1100.125

Hide Details

Hide Details

Expecting sub string: a_union_zero_ptr->a = 1100.12 Matched

Hide Details

runCmd: frame variable --show-types a_union_zero_ref.a output: (float) a_union_zero_ref.a = 1100.125

Hide Details

Hide Details

looking at: float

Hide Details

Expecting sub string: float Matched

Hide Details

looking at: (float) a_union_zero_ref.a = 1100.125

Hide Details

Hide Details

Expecting sub string: a_union_zero_ref.a = 1100.12 Matched

Hide Details

runCmd: frame variable --show-types a_union_nonzero.u.a output: (float) a_union_nonzero.u.a = 1100.125

Hide Details

Hide Details

looking at: float

Hide Details

Expecting sub string: float Matched

Hide Details

looking at: (float) a_union_nonzero.u.a = 1100.125

Hide Details

Hide Details

Expecting sub string: a_union_nonzero.u.a = 1100.12 Matched

Hide Details

runCmd: frame variable --show-types a_union_nonzero_ptr->u.a output: (float) a_union_nonzero_ptr->u.a = 1100.125

Hide Details

Hide Details

looking at: float

Hide Details

Expecting sub string: float Matched

Hide Details

looking at: (float) a_union_nonzero_ptr->u.a = 1100.125

Hide Details

Hide Details

Expecting sub string: a_union_nonzero_ptr->u.a = 1100.12 Matched

Hide Details

runCmd: frame variable --show-types a_union_nonzero_ref.u.a output: (float) a_union_nonzero_ref.u.a = 1100.125

Hide Details

Hide Details

looking at: float

Hide Details

Expecting sub string: float Matched

Hide Details

looking at: (float) a_union_nonzero_ref.u.a = 1100.125

Hide Details

Hide Details

Expecting sub string: a_union_nonzero_ref.u.a = 1100.12 Matched

Hide Details

runCmd: frame variable --show-types a output: (float) a = 1100.125

Hide Details

Hide Details

looking at: float

Hide Details

Expecting sub string: float Matched

Hide Details

looking at: (float) a = 1100.125

Hide Details

Hide Details

Expecting sub string: a = 1100.12 Matched

Hide Details

runCmd: frame variable --show-types *a_ptr output: (float) *a_ptr = 1100.125

Hide Details

Hide Details

looking at: float

Hide Details

Expecting sub string: float Matched

Hide Details

looking at: (float) *a_ptr = 1100.125

Hide Details

Hide Details

Expecting sub string: *a_ptr = 1100.12 Matched

Hide Details

runCmd: frame variable --show-types a_ref output: (float &) a_ref = 0x00007ffeefbff614: { (float) &a_ref = 1100.125 }

Hide Details

Hide Details

looking at: float &

Hide Details

Expecting sub string: float Matched

Hide Details

looking at: (float &) a_ref = 0x00007ffeefbff614: { (float) &a_ref = 1100.125 }

Hide Details

Hide Details

Expecting sub string: a_ref = 1100.12 Matched

Hide Details

runCmd: frame variable --show-types a_class_instance.m_a output: (float) a_class_instance.m_a = 1100.125

Hide Details

Hide Details

looking at: float

Hide Details

Expecting sub string: float Matched

Hide Details

looking at: (float) a_class_instance.m_a = 1100.125

Hide Details

Hide Details

Expecting sub string: a_class_instance.m_a = 1100.12 Matched

Hide Details

runCmd: frame variable --show-types a_class_instance.m_b output: (float) a_class_instance.m_b = 2200.25

Hide Details

Hide Details

looking at: float

Hide Details

Expecting sub string: float Matched

Hide Details

looking at: (float) a_class_instance.m_b = 2200.25

Hide Details

Hide Details

Expecting sub string: a_class_instance.m_b = 2200.25 Matched

Hide Details

runCmd: frame variable --show-types a_class_ptr->m_a output: (float) a_class_ptr->m_a = 1100.125

Hide Details

Hide Details

looking at: float

Hide Details

Expecting sub string: float Matched

Hide Details

looking at: (float) a_class_ptr->m_a = 1100.125

Hide Details

Hide Details

Expecting sub string: a_class_ptr->m_a = 1100.12 Matched

Hide Details

runCmd: frame variable --show-types a_class_ptr->m_b output: (float) a_class_ptr->m_b = 2200.25

Hide Details

Hide Details

looking at: float

Hide Details

Expecting sub string: float Matched

Hide Details

looking at: (float) a_class_ptr->m_b = 2200.25

Hide Details

Hide Details

Expecting sub string: a_class_ptr->m_b = 2200.25 Matched

Hide Details

runCmd: frame variable --show-types a_class_ref.m_a output: (float) a_class_ref.m_a = 1100.125

Hide Details

Hide Details

looking at: float

Hide Details

Expecting sub string: float Matched

Hide Details

looking at: (float) a_class_ref.m_a = 1100.125

Hide Details

Hide Details

Expecting sub string: a_class_ref.m_a = 1100.12 Matched

Hide Details

runCmd: frame variable --show-types a_class_ref.m_b output: (float) a_class_ref.m_b = 2200.25

Hide Details

Hide Details

looking at: float

Hide Details

Expecting sub string: float Matched

Hide Details

looking at: (float) a_class_ref.m_b = 2200.25

Hide Details

Hide Details

Expecting sub string: a_class_ref.m_b = 2200.25 Matched

Hide Details

runCmd: frame variable --show-types a_struct.a output: (float) a_struct.a = 1100.125

Hide Details

Hide Details

looking at: float

Hide Details

Expecting sub string: float Matched

Hide Details

looking at: (float) a_struct.a = 1100.125

Hide Details

Hide Details

Expecting sub string: a_struct.a = 1100.12 Matched

Hide Details

runCmd: frame variable --show-types a_struct.b output: (float) a_struct.b = 2200.25

Hide Details

Hide Details

looking at: float

Hide Details

Expecting sub string: float Matched

Hide Details

looking at: (float) a_struct.b = 2200.25

Hide Details

Hide Details

Expecting sub string: a_struct.b = 2200.25 Matched

Hide Details

runCmd: frame variable --show-types a_struct_ptr->a output: (float) a_struct_ptr->a = 1100.125

Hide Details

Hide Details

looking at: float

Hide Details

Expecting sub string: float Matched

Hide Details

looking at: (float) a_struct_ptr->a = 1100.125

Hide Details

Hide Details

Expecting sub string: a_struct_ptr->a = 1100.12 Matched

Hide Details

runCmd: frame variable --show-types a_struct_ptr->b output: (float) a_struct_ptr->b = 2200.25

Hide Details

Hide Details

looking at: float

Hide Details

Expecting sub string: float Matched

Hide Details

looking at: (float) a_struct_ptr->b = 2200.25

Hide Details

Hide Details

Expecting sub string: a_struct_ptr->b = 2200.25 Matched

Hide Details

runCmd: frame variable --show-types a_struct_ref.a output: (float) a_struct_ref.a = 1100.125

Hide Details

Hide Details

looking at: float

Hide Details

Expecting sub string: float Matched

Hide Details

looking at: (float) a_struct_ref.a = 1100.125

Hide Details

Hide Details

Expecting sub string: a_struct_ref.a = 1100.12 Matched

Hide Details

runCmd: frame variable --show-types a_struct_ref.b output: (float) a_struct_ref.b = 2200.25

Hide Details

Hide Details

looking at: float

Hide Details

Expecting sub string: float Matched

Hide Details

looking at: (float) a_struct_ref.b = 2200.25

Hide Details

Hide Details

Expecting sub string: a_struct_ref.b = 2200.25 Matched

Hide Details

runCmd: frame variable --show-types a_union_zero.a output: (float) a_union_zero.a = 1100.125

Hide Details

Hide Details

looking at: float

Hide Details

Expecting sub string: float Matched

Hide Details

looking at: (float) a_union_zero.a = 1100.125

Hide Details

Hide Details

Expecting sub string: a_union_zero.a = 1100.12 Matched

Hide Details

runCmd: frame variable --show-types a_union_zero_ptr->a output: (float) a_union_zero_ptr->a = 1100.125

Hide Details

Hide Details

looking at: float

Hide Details

Expecting sub string: float Matched

Hide Details

looking at: (float) a_union_zero_ptr->a = 1100.125

Hide Details

Hide Details

Expecting sub string: a_union_zero_ptr->a = 1100.12 Matched

Hide Details

runCmd: frame variable --show-types a_union_zero_ref.a output: (float) a_union_zero_ref.a = 1100.125

Hide Details

Hide Details

looking at: float

Hide Details

Expecting sub string: float Matched

Hide Details

looking at: (float) a_union_zero_ref.a = 1100.125

Hide Details

Hide Details

Expecting sub string: a_union_zero_ref.a = 1100.12 Matched

Hide Details

runCmd: frame variable --show-types a_union_nonzero.u.a output: (float) a_union_nonzero.u.a = 1100.125

Hide Details

Hide Details

looking at: float

Hide Details

Expecting sub string: float Matched

Hide Details

looking at: (float) a_union_nonzero.u.a = 1100.125

Hide Details

Hide Details

Expecting sub string: a_union_nonzero.u.a = 1100.12 Matched

Hide Details

runCmd: frame variable --show-types a_union_nonzero_ptr->u.a output: (float) a_union_nonzero_ptr->u.a = 1100.125

Hide Details

Hide Details

looking at: float

Hide Details

Expecting sub string: float Matched

Hide Details

looking at: (float) a_union_nonzero_ptr->u.a = 1100.125

Hide Details

Hide Details

Expecting sub string: a_union_nonzero_ptr->u.a = 1100.12 Matched

Hide Details

runCmd: frame variable --show-types a_union_nonzero_ref.u.a output: (float) a_union_nonzero_ref.u.a = 1100.125

Hide Details

Hide Details

looking at: float

Hide Details

Expecting sub string: float Matched

Hide Details

looking at: (float) a_union_nonzero_ref.u.a = 1100.125

Hide Details

Hide Details

Expecting sub string: a_union_nonzero_ref.u.a = 1100.12 Matched

Hide Details

<bound method SBProcess.Kill of <lldb.SBProcess; proxy of <Swig Object of type 'lldb::SBProcess *' at 0x107ed7300> >>: success

Hide Details

Executing tearDown hook: self.addTearDownHook(lambda: self.runCmd( "settings set target.inline-breakpoint-strategy headers"))

Hide Details

Hide Details

runCmd: settings set target.inline-breakpoint-strategy headers output:

Hide Details

PASS: LLDB (/Users/buildslave/jenkins/workspace/lldb-cmake-sanitized/lldb-build/bin/clang-11-x86_64) :: test_float_type_from_block_dsym (TestFloatTypes.FloatTypesTestCase) runCmd: settings clear -all output:

Hide Details

runCmd: settings set symbols.enable-external-lookup false output:

Hide Details

runCmd: settings set target.auto-apply-fixits false output:

Hide Details

runCmd: settings set plugin.process.gdb-remote.packet-timeout 60 output:

Hide Details

runCmd: settings set symbols.clang-modules-cache-path "/Users/buildslave/jenkins/workspace/lldb-cmake-sanitized/lldb-build/lldb-test-build.noindex/module-cache-lldb/lldb-api" output:

Hide Details

runCmd: settings set use-color false output:

Hide Details

runCmd: setting set target.prefer-dynamic-value no-dynamic-values output:

Hide Details

runCmd: settings set target.env-vars ASAN_OPTIONS=detect_stack_use_after_return=1 DYLD_INSERT_LIBRARIES=/Users/buildslave/jenkins/workspace/lldb-cmake-sanitized/host-compiler/lib/clang/11.0.0/lib/darwin/libclang_rt.asan_osx_dynamic.dylib output:

Hide Details

FAIL: LLDB (/Users/buildslave/jenkins/workspace/lldb-cmake-sanitized/lldb-build/bin/clang-11-x86_64) :: test_float_type_from_block_dwarf (TestFloatTypes.FloatTypesTestCase) UNSUPPORTED: LLDB (/Users/buildslave/jenkins/workspace/lldb-cmake-sanitized/lldb-build/bin/clang-11-x86_64) :: test_float_type_from_block_dwo (TestFloatTypes.FloatTypesTestCase) (test case does not fall in any category of interest for this run) runCmd: settings clear -all output:

Hide Details

runCmd: settings set symbols.enable-external-lookup false output:

Hide Details

runCmd: settings set target.auto-apply-fixits false output:

Hide Details

runCmd: settings set plugin.process.gdb-remote.packet-timeout 60 output:

Hide Details

runCmd: settings set symbols.clang-modules-cache-path "/Users/buildslave/jenkins/workspace/lldb-cmake-sanitized/lldb-build/lldb-test-build.noindex/module-cache-lldb/lldb-api" output:

Hide Details

runCmd: settings set use-color false output:

Hide Details

runCmd: setting set target.prefer-dynamic-value no-dynamic-values output:

Hide Details

runCmd: settings set target.env-vars ASAN_OPTIONS=detect_stack_use_after_return=1 DYLD_INSERT_LIBRARIES=/Users/buildslave/jenkins/workspace/lldb-cmake-sanitized/host-compiler/lib/clang/11.0.0/lib/darwin/libclang_rt.asan_osx_dynamic.dylib output:

Hide Details

FAIL: LLDB (/Users/buildslave/jenkins/workspace/lldb-cmake-sanitized/lldb-build/bin/clang-11-x86_64) :: test_float_type_from_block_gmodules (TestFloatTypes.FloatTypesTestCase) runCmd: settings clear -all output:

Hide Details

runCmd: settings set symbols.enable-external-lookup false output:

Hide Details

runCmd: settings set target.auto-apply-fixits false output:

Hide Details

runCmd: settings set plugin.process.gdb-remote.packet-timeout 60 output:

Hide Details

runCmd: settings set symbols.clang-modules-cache-path "/Users/buildslave/jenkins/workspace/lldb-cmake-sanitized/lldb-build/lldb-test-build.noindex/module-cache-lldb/lldb-api" output:

Hide Details

runCmd: settings set use-color false output:

Hide Details

runCmd: setting set target.prefer-dynamic-value no-dynamic-values output:

Hide Details

runCmd: settings set target.env-vars ASAN_OPTIONS=detect_stack_use_after_return=1 DYLD_INSERT_LIBRARIES=/Users/buildslave/jenkins/workspace/lldb-cmake-sanitized/host-compiler/lib/clang/11.0.0/lib/darwin/libclang_rt.asan_osx_dynamic.dylib output:

Hide Details

runCmd: file /Users/buildslave/jenkins/workspace/lldb-cmake-sanitized/lldb-build/lldb-test-build.noindex/types/TestFloatTypes.test_float_type_gmodules/test_float_type_gmodules output: Current executable set to '/Users/buildslave/jenkins/workspace/lldb-cmake-sanitized/lldb-build/lldb-test-build.noindex/types/TestFloatTypes.test_float_type_gmodules/test_float_type_gmodules' (x86_64).

Hide Details

Hide Details

runCmd: process launch -o "/Users/buildslave/jenkins/workspace/lldb-cmake-sanitized/lldb-build/lldb-test-build.noindex/types/TestFloatTypes.test_float_type_gmodules/test_float_type_gmodules-golden-output.txt" output: Process 60677 exited with status = 0 (0x00000000)

Hide Details

Process 60677 launched: '/Users/buildslave/jenkins/workspace/lldb-cmake-sanitized/lldb-build/lldb-test-build.noindex/types/TestFloatTypes.test_float_type_gmodules/test_float_type_gmodules' (x86_64)

Hide Details

Hide Details

runCmd: settings set target.inline-breakpoint-strategy always output:

Hide Details

Adding tearDown hook: self.addTearDownHook(lambda: self.runCmd( "settings set target.inline-breakpoint-strategy headers"))

Hide Details

Hide Details

runCmd: breakpoint set -f "basic_type.cpp" -l 185 output: Breakpoint 1: where = test_float_type_gmodules`main + 2107 at basic_type.cpp:185:5, address = 0x000000010000160b

Hide Details

Hide Details

Expecting pattern: ^Breakpoint (?P<bpno>[0-9]+): (?P<num_locations>[0-9]+) locations\.$ Not matched

Hide Details

Expecting pattern: ^Breakpoint (?P<bpno>[0-9]+): (?P<num_locations>no) locations \(pending\)\. Not matched

Hide Details

Expecting pattern: ^Breakpoint (?P<bpno>[0-9]+): where = (?P<module>.*)`(?P<symbol>[+\-]{0,1}[^+]+)( \+ (?P<offset>[0-9]+)){0,1}( \[inlined\] (?P<inline_symbol>.*)){0,1} at (?P<file>[^:]+):(?P<line_no>[0-9]+)(?P<column>(:[0-9]+)?), address = (?P<address>0x[0-9a-fA-F]+)$ Matched

Hide Details

runCmd: run runCmd failed! error: shell expansion failed (reason: lldb-argdumper exited with error -1). consider launching with 'process launch'.

Hide Details

Hide Details

Command 'run' failed!

Hide Details

FAIL: LLDB (/Users/buildslave/jenkins/workspace/lldb-cmake-sanitized/lldb-build/bin/clang-11-x86_64) :: test_float_type_gmodules (TestFloatTypes.FloatTypesTestCase) Executing tearDown hook: self.addTearDownHook(lambda: self.runCmd( "settings set target.inline-breakpoint-strategy headers"))

Hide Details

Hide Details

runCmd: settings set target.inline-breakpoint-strategy headers output:

Hide Details

Restore dir to: /Users/buildslave/jenkins/workspace/lldb-cmake-sanitized/lldb-build/tools/lldb/test ====================================================================== ERROR: test_float_type_from_block_dwarf (TestFloatTypes.FloatTypesTestCase) Test that float-type variables are displayed correctly from a block. ---------------------------------------------------------------------- Error when building test subject.

Hide Details

Build Command: make VPATH=/Users/buildslave/jenkins/workspace/lldb-cmake-sanitized/llvm-project/lldb/test/API/types -C /Users/buildslave/jenkins/workspace/lldb-cmake-sanitized/lldb-build/lldb-test-build.noindex/types/TestFloatTypes.test_float_type_from_block_dwarf -I /Users/buildslave/jenkins/workspace/lldb-cmake-sanitized/llvm-project/lldb/test/API/types -I /Users/buildslave/jenkins/workspace/lldb-cmake-sanitized/llvm-project/lldb/packages/Python/lldbsuite/test/make -f /Users/buildslave/jenkins/workspace/lldb-cmake-sanitized/llvm-project/lldb/test/API/types/Makefile MAKE_DSYM=NO ARCH=x86_64 CC="/Users/buildslave/jenkins/workspace/lldb-cmake-sanitized/lldb-build/bin/clang-11" DSYMUTIL=/Users/buildslave/jenkins/workspace/lldb-cmake-sanitized/lldb-build/./bin/dsymutil CLANG_MODULE_CACHE_DIR=/Users/buildslave/jenkins/workspace/lldb-cmake-sanitized/lldb-build/lldb-test-build.noindex/module-cache-clang/lldb-api CXX_SOURCES='float.cpp' EXE='test_float_type_from_block_dwarf' CFLAGS_EXTRAS='-DTEST_BLOCK_CAPTURED_VARS'

Hide Details

Build Command Output: /bin/sh: line 1: 60415 Killed: 9 /Users/buildslave/jenkins/workspace/lldb-cmake-sanitized/lldb-build/bin/clang-11 -M -std=c++11 -g -O0 -fno-builtin -isysroot "/Applications/Xcode.app/Contents/Developer/Platforms/MacOSX.platform/Developer/SDKs/MacOSX10.15.sdk" -arch x86_64 -I/Users/buildslave/jenkins/workspace/lldb-cmake-sanitized/llvm-project/lldb/packages/Python/lldbsuite/test/make/../../../../../include -I/Users/buildslave/jenkins/workspace/lldb-cmake-sanitized/llvm-project/lldb/test/API/types -I/Users/buildslave/jenkins/workspace/lldb-cmake-sanitized/llvm-project/lldb/packages/Python/lldbsuite/test/make -include /Users/buildslave/jenkins/workspace/lldb-cmake-sanitized/llvm-project/lldb/packages/Python/lldbsuite/test/make/test_common.h -fno-limit-debug-info -DTEST_BLOCK_CAPTURED_VARS --driver-mode=g++ /Users/buildslave/jenkins/workspace/lldb-cmake-sanitized/llvm-project/lldb/test/API/types/float.cpp > float.d.tmp make: *** [float.o] Killed: 9

Hide Details

Test Directory: /Users/buildslave/jenkins/workspace/lldb-cmake-sanitized/llvm-project/lldb/test/API/types ====================================================================== ERROR: test_float_type_from_block_gmodules (TestFloatTypes.FloatTypesTestCase) Test that float-type variables are displayed correctly from a block. ---------------------------------------------------------------------- Traceback (most recent call last): File "/Users/buildslave/jenkins/workspace/lldb-cmake-sanitized/llvm-project/lldb/packages/Python/lldbsuite/test/lldbtest.py", line 1774, in test_method return attrvalue(self) File "/Users/buildslave/jenkins/workspace/lldb-cmake-sanitized/llvm-project/lldb/test/API/types/TestFloatTypes.py", line 26, in test_float_type_from_block self.build_and_run('float.cpp', set(['float']), bc=True) File "/Users/buildslave/jenkins/workspace/lldb-cmake-sanitized/llvm-project/lldb/test/API/types/AbstractBase.py", line 68, in build_and_run source, atoms, expr=False, bc=bc, qd=qd) File "/Users/buildslave/jenkins/workspace/lldb-cmake-sanitized/llvm-project/lldb/test/API/types/AbstractBase.py", line 82, in build_and_run_with_source_atoms_expr self.build(dictionary=d) File "/Users/buildslave/jenkins/workspace/lldb-cmake-sanitized/llvm-project/lldb/packages/Python/lldbsuite/test/lldbtest.py", line 2526, in build return self.buildGModules(architecture, compiler, dictionary) File "/Users/buildslave/jenkins/workspace/lldb-cmake-sanitized/llvm-project/lldb/packages/Python/lldbsuite/test/lldbtest.py", line 1604, in buildGModules dictionary, testdir, testname): File "/Users/buildslave/jenkins/workspace/lldb-cmake-sanitized/llvm-project/lldb/packages/Python/lldbsuite/test/plugins/builder_base.py", line 257, in buildGModules lldbtest.system(commands, sender=sender) File "/Users/buildslave/jenkins/workspace/lldb-cmake-sanitized/llvm-project/lldb/packages/Python/lldbsuite/test/lldbtest.py", line 447, in system raise cpe subprocess.CalledProcessError: Command 'make VPATH=/Users/buildslave/jenkins/workspace/lldb-cmake-sanitized/llvm-project/lldb/test/API/types -C /Users/buildslave/jenkins/workspace/lldb-cmake-sanitized/lldb-build/lldb-test-build.noindex/types/TestFloatTypes.test_float_type_from_block_gmodules -I /Users/buildslave/jenkins/workspace/lldb-cmake-sanitized/llvm-project/lldb/test/API/types -I /Users/buildslave/jenkins/workspace/lldb-cmake-sanitized/llvm-project/lldb/packages/Python/lldbsuite/test/make -f /Users/buildslave/jenkins/workspace/lldb-cmake-sanitized/llvm-project/lldb/test/API/types/Makefile MAKE_DSYM=NO MAKE_GMODULES=YES ARCH=x86_64 CC="/Users/buildslave/jenkins/workspace/lldb-cmake-sanitized/lldb-build/bin/clang-11" DSYMUTIL=/Users/buildslave/jenkins/workspace/lldb-cmake-sanitized/lldb-build/./bin/dsymutil CLANG_MODULE_CACHE_DIR=/Users/buildslave/jenkins/workspace/lldb-cmake-sanitized/lldb-build/lldb-test-build.noindex/module-cache-clang/lldb-api CXX_SOURCES='float.cpp' EXE='test_float_type_from_block_gmodules' CFLAGS_EXTRAS='-DTEST_BLOCK_CAPTURED_VARS'' returned non-zero exit status 2. Config=x86_64-/Users/buildslave/jenkins/workspace/lldb-cmake-sanitized/lldb-build/bin/clang-11 ====================================================================== FAIL: test_float_type_gmodules (TestFloatTypes.FloatTypesTestCase) Test that float-type variables are displayed correctly. ---------------------------------------------------------------------- Traceback (most recent call last): File "/Users/buildslave/jenkins/workspace/lldb-cmake-sanitized/llvm-project/lldb/packages/Python/lldbsuite/test/lldbtest.py", line 1774, in test_method return attrvalue(self) File "/Users/buildslave/jenkins/workspace/lldb-cmake-sanitized/llvm-project/lldb/test/API/types/TestFloatTypes.py", line 21, in test_float_type self.build_and_run('float.cpp', set(['float'])) File "/Users/buildslave/jenkins/workspace/lldb-cmake-sanitized/llvm-project/lldb/test/API/types/AbstractBase.py", line 68, in build_and_run source, atoms, expr=False, bc=bc, qd=qd) File "/Users/buildslave/jenkins/workspace/lldb-cmake-sanitized/llvm-project/lldb/test/API/types/AbstractBase.py", line 92, in build_and_run_with_source_atoms_expr quotedDisplay=qd) File "/Users/buildslave/jenkins/workspace/lldb-cmake-sanitized/llvm-project/lldb/test/API/types/AbstractBase.py", line 175, in generic_type_tester self.runCmd("run", RUN_SUCCEEDED) File "/Users/buildslave/jenkins/workspace/lldb-cmake-sanitized/llvm-project/lldb/packages/Python/lldbsuite/test/lldbtest.py", line 2107, in runCmd msg if (msg) else CMD_MSG(cmd)) AssertionError: False is not True : Process is launched successfully Error output: error: shell expansion failed (reason: lldb-argdumper exited with error -1). consider launching with 'process launch'.

Hide Details

Config=x86_64-/Users/buildslave/jenkins/workspace/lldb-cmake-sanitized/lldb-build/bin/clang-11 ---------------------------------------------------------------------- Ran 8 tests in 13.626s

Hide Details

RESULT: FAILED (3 passes, 1 failures, 2 errors, 2 skipped, 0 expected failures, 0 unexpected successes)

Hide Details

--

Hide Details

******************** FAIL: lldb-api :: tools/lldb-server/TestGdbRemoteThreadsInStopReply.py (2068 of 2068) ******************** TEST 'lldb-api :: tools/lldb-server/TestGdbRemoteThreadsInStopReply.py' FAILED ******************** Script: -- /Users/buildslave/jenkins/workspace/lldb-cmake-sanitized/lldb-build/lldb-test-build.noindex/copied-python /Users/buildslave/jenkins/workspace/lldb-cmake-sanitized/llvm-project/lldb/test/API/dotest.py --arch x86_64 -s /Users/buildslave/jenkins/workspace/lldb-cmake-sanitized/lldb-build/lldb-test-traces -S nm -u CXXFLAGS -u CFLAGS --codesign-identity lldb_codesign --server /Users/buildslave/jenkins/workspace/lldb-cmake-sanitized/lldb-build/./bin/debugserver --arch x86_64 --build-dir /Users/buildslave/jenkins/workspace/lldb-cmake-sanitized/lldb-build/lldb-test-build.noindex -s=/Users/buildslave/jenkins/workspace/lldb-cmake-sanitized/test/logs -t --env TERM=vt100 --env LLVM_LIBS_DIR=/Users/buildslave/jenkins/workspace/lldb-cmake-sanitized/lldb-build/./lib --inferior-env ASAN_OPTIONS=detect_stack_use_after_return=1 --inferior-env DYLD_INSERT_LIBRARIES=/Users/buildslave/jenkins/workspace/lldb-cmake-sanitized/host-compiler/lib/clang/11.0.0/lib/darwin/libclang_rt.asan_osx_dynamic.dylib --build-dir /Users/buildslave/jenkins/workspace/lldb-cmake-sanitized/lldb-build/lldb-test-build.noindex --lldb-module-cache-dir /Users/buildslave/jenkins/workspace/lldb-cmake-sanitized/lldb-build/lldb-test-build.noindex/module-cache-lldb/lldb-api --clang-module-cache-dir /Users/buildslave/jenkins/workspace/lldb-cmake-sanitized/lldb-build/lldb-test-build.noindex/module-cache-clang/lldb-api --executable /Users/buildslave/jenkins/workspace/lldb-cmake-sanitized/lldb-build/./bin/lldb --compiler /Users/buildslave/jenkins/workspace/lldb-cmake-sanitized/lldb-build/./bin/clang --dsymutil /Users/buildslave/jenkins/workspace/lldb-cmake-sanitized/lldb-build/./bin/dsymutil --filecheck /Users/buildslave/jenkins/workspace/lldb-cmake-sanitized/lldb-build/./bin/FileCheck --lldb-libs-dir /Users/buildslave/jenkins/workspace/lldb-cmake-sanitized/lldb-build/./lib /Users/buildslave/jenkins/workspace/lldb-cmake-sanitized/llvm-project/lldb/test/API/tools/lldb-server -p TestGdbRemoteThreadsInStopReply.py -- Exit Code: 1

Hide Details

Command Output (stdout): -- lldb version 11.0.99 clang revision ba5087f13025a15662e164eb371fe0678258e03f llvm revision ba5087f13025a15662e164eb371fe0678258e03f LLDB library dir: /Users/buildslave/jenkins/workspace/lldb-cmake-sanitized/lldb-build/bin LLDB import library dir: /Users/buildslave/jenkins/workspace/lldb-cmake-sanitized/lldb-build/./lib libstdcxx tests will not be run because: Don't know how to build with libstdcxx on macosx Skipping following debug info categories: ['dwo']

Hide Details

-- Command Output (stderr): --

Hide Details

Session logs for test failures/errors/unexpected successes will go into directory '/Users/buildslave/jenkins/workspace/lldb-cmake-sanitized/test/logs' Change dir to: /Users/buildslave/jenkins/workspace/lldb-cmake-sanitized/llvm-project/lldb/test/API/tools/lldb-server runCmd: settings clear -all output:

Hide Details

runCmd: settings set symbols.enable-external-lookup false output:

Hide Details

runCmd: settings set target.auto-apply-fixits false output:

Hide Details

runCmd: settings set plugin.process.gdb-remote.packet-timeout 60 output:

Hide Details

runCmd: settings set symbols.clang-modules-cache-path "/Users/buildslave/jenkins/workspace/lldb-cmake-sanitized/lldb-build/lldb-test-build.noindex/module-cache-lldb/lldb-api" output:

Hide Details

runCmd: settings set use-color false output:

Hide Details

runCmd: setting set target.prefer-dynamic-value no-dynamic-values output:

Hide Details

runCmd: settings set target.env-vars ASAN_OPTIONS=detect_stack_use_after_return=1 DYLD_INSERT_LIBRARIES=/Users/buildslave/jenkins/workspace/lldb-cmake-sanitized/host-compiler/lib/clang/11.0.0/lib/darwin/libclang_rt.asan_osx_dynamic.dylib output:

Hide Details

Adding tearDown hook: def shutdown_named_pipe(): # Close the pipe. try: named_pipe.close() except: print("failed to close named pipe") None

Hide Details

# Delete the pipe. try: os.remove(named_pipe_path) except: print("failed to delete named pipe: {}".format(named_pipe_path)) None

Hide Details

# Delete the temp directory. try: os.rmdir(temp_dir) except: print( "failed to delete temp dir: {}, directory contents: '{}'".format( temp_dir, os.listdir(temp_dir))) None

Hide Details

Hide Details

Adding tearDown hook: def cleanupSubprocesses(self): # Ensure any subprocesses are cleaned up for p in self.subprocesses: p.terminate() del p del self.subprocesses[:] # Ensure any forked processes are cleaned up for pid in self.forkedProcessPids: try: os.kill(pid, signal.SIGTERM) except OSError: pass

Hide Details

Hide Details

Adding tearDown hook: def shutdown_debug_monitor(): try: server.terminate() except: logger.warning( "failed to terminate server for debug monitor: {}; ignoring".format( sys.exc_info()[0]))

Hide Details

Hide Details

Adding tearDown hook: def shutdown_socket(): if sock: try: # send the kill packet so lldb-server shuts down gracefully sock.sendall(GdbRemoteTestCaseBase._GDBREMOTE_KILL_PACKET) except: logger.warning( "failed to send kill packet to debug monitor: {}; ignoring".format( sys.exc_info()[0]))

Hide Details

try: sock.close() except: logger.warning( "failed to close socket to debug monitor: {}; ignoring".format( sys.exc_info()[0]))

Hide Details

Hide Details

Executing tearDown hook: def shutdown_socket(): if sock: try: # send the kill packet so lldb-server shuts down gracefully sock.sendall(GdbRemoteTestCaseBase._GDBREMOTE_KILL_PACKET) except: logger.warning( "failed to send kill packet to debug monitor: {}; ignoring".format( sys.exc_info()[0]))

Hide Details

try: sock.close() except: logger.warning( "failed to close socket to debug monitor: {}; ignoring".format( sys.exc_info()[0]))

Hide Details

Hide Details

2020-07-02 00:15:46,761 WARNING failed to send kill packet to debug monitor: <class 'TypeError'>; ignoring Executing tearDown hook: def shutdown_debug_monitor(): try: server.terminate() except: logger.warning( "failed to terminate server for debug monitor: {}; ignoring".format( sys.exc_info()[0]))

Hide Details

Hide Details

Executing tearDown hook: def cleanupSubprocesses(self): # Ensure any subprocesses are cleaned up for p in self.subprocesses: p.terminate() del p del self.subprocesses[:] # Ensure any forked processes are cleaned up for pid in self.forkedProcessPids: try: os.kill(pid, signal.SIGTERM) except OSError: pass

Hide Details

Hide Details

Executing tearDown hook: def shutdown_named_pipe(): # Close the pipe. try: named_pipe.close() except: print("failed to close named pipe") None

Hide Details

# Delete the pipe. try: os.remove(named_pipe_path) except: print("failed to delete named pipe: {}".format(named_pipe_path)) None

Hide Details

# Delete the temp directory. try: os.rmdir(temp_dir) except: print( "failed to delete temp dir: {}, directory contents: '{}'".format( temp_dir, os.listdir(temp_dir))) None

Hide Details

Hide Details

PASS: LLDB (/Users/buildslave/jenkins/workspace/lldb-cmake-sanitized/lldb-build/bin/clang-11-x86_64) :: test_QListThreadsInStopReply_supported_debugserver (TestGdbRemoteThreadsInStopReply.TestGdbRemoteThreadsInStopReply) runCmd: settings clear -all output:

Hide Details

runCmd: settings set symbols.enable-external-lookup false output:

Hide Details

runCmd: settings set target.auto-apply-fixits false output:

Hide Details

runCmd: settings set plugin.process.gdb-remote.packet-timeout 60 output:

Hide Details

runCmd: settings set symbols.clang-modules-cache-path "/Users/buildslave/jenkins/workspace/lldb-cmake-sanitized/lldb-build/lldb-test-build.noindex/module-cache-lldb/lldb-api" output:

Hide Details

runCmd: settings set use-color false output:

Hide Details

runCmd: setting set target.prefer-dynamic-value no-dynamic-values output:

Hide Details

runCmd: settings set target.env-vars ASAN_OPTIONS=detect_stack_use_after_return=1 DYLD_INSERT_LIBRARIES=/Users/buildslave/jenkins/workspace/lldb-cmake-sanitized/host-compiler/lib/clang/11.0.0/lib/darwin/libclang_rt.asan_osx_dynamic.dylib output:

Hide Details

UNSUPPORTED: LLDB (/Users/buildslave/jenkins/workspace/lldb-cmake-sanitized/lldb-build/bin/clang-11-x86_64) :: test_QListThreadsInStopReply_supported_llgs (TestGdbRemoteThreadsInStopReply.TestGdbRemoteThreadsInStopReply) (llgs tests) runCmd: settings clear -all output:

Hide Details

runCmd: settings set symbols.enable-external-lookup false output:

Hide Details

runCmd: settings set target.auto-apply-fixits false output:

Hide Details

runCmd: settings set plugin.process.gdb-remote.packet-timeout 60 output:

Hide Details

runCmd: settings set symbols.clang-modules-cache-path "/Users/buildslave/jenkins/workspace/lldb-cmake-sanitized/lldb-build/lldb-test-build.noindex/module-cache-lldb/lldb-api" output:

Hide Details

runCmd: settings set use-color false output:

Hide Details

runCmd: setting set target.prefer-dynamic-value no-dynamic-values output:

Hide Details

runCmd: settings set target.env-vars ASAN_OPTIONS=detect_stack_use_after_return=1 DYLD_INSERT_LIBRARIES=/Users/buildslave/jenkins/workspace/lldb-cmake-sanitized/host-compiler/lib/clang/11.0.0/lib/darwin/libclang_rt.asan_osx_dynamic.dylib output:

Hide Details

Adding tearDown hook: def shutdown_named_pipe(): # Close the pipe. try: named_pipe.close() except: print("failed to close named pipe") None

Hide Details

# Delete the pipe. try: os.remove(named_pipe_path) except: print("failed to delete named pipe: {}".format(named_pipe_path)) None

Hide Details

# Delete the temp directory. try: os.rmdir(temp_dir) except: print( "failed to delete temp dir: {}, directory contents: '{}'".format( temp_dir, os.listdir(temp_dir))) None

Hide Details

Hide Details

Adding tearDown hook: def cleanupSubprocesses(self): # Ensure any subprocesses are cleaned up for p in self.subprocesses: p.terminate() del p del self.subprocesses[:] # Ensure any forked processes are cleaned up for pid in self.forkedProcessPids: try: os.kill(pid, signal.SIGTERM) except OSError: pass

Hide Details

Hide Details

Adding tearDown hook: def shutdown_debug_monitor(): try: server.terminate() except: logger.warning( "failed to terminate server for debug monitor: {}; ignoring".format( sys.exc_info()[0]))

Hide Details

Hide Details

Adding tearDown hook: def shutdown_socket(): if sock: try: # send the kill packet so lldb-server shuts down gracefully sock.sendall(GdbRemoteTestCaseBase._GDBREMOTE_KILL_PACKET) except: logger.warning( "failed to send kill packet to debug monitor: {}; ignoring".format( sys.exc_info()[0]))

Hide Details

try: sock.close() except: logger.warning( "failed to close socket to debug monitor: {}; ignoring".format( sys.exc_info()[0]))

Hide Details

Hide Details

Executing tearDown hook: def shutdown_socket(): if sock: try: # send the kill packet so lldb-server shuts down gracefully sock.sendall(GdbRemoteTestCaseBase._GDBREMOTE_KILL_PACKET) except: logger.warning( "failed to send kill packet to debug monitor: {}; ignoring".format( sys.exc_info()[0]))

Hide Details

try: sock.close() except: logger.warning( "failed to close socket to debug monitor: {}; ignoring".format( sys.exc_info()[0]))

Hide Details

Hide Details

2020-07-02 00:16:45,629 WARNING failed to send kill packet to debug monitor: <class 'TypeError'>; ignoring Executing tearDown hook: def shutdown_debug_monitor(): try: server.terminate() except: logger.warning( "failed to terminate server for debug monitor: {}; ignoring".format( sys.exc_info()[0]))

Hide Details

Hide Details

Executing tearDown hook: def cleanupSubprocesses(self): # Ensure any subprocesses are cleaned up for p in self.subprocesses: p.terminate() del p del self.subprocesses[:] # Ensure any forked processes are cleaned up for pid in self.forkedProcessPids: try: os.kill(pid, signal.SIGTERM) except OSError: pass

Hide Details

Hide Details

Executing tearDown hook: def shutdown_named_pipe(): # Close the pipe. try: named_pipe.close() except: print("failed to close named pipe") None

Hide Details

# Delete the pipe. try: os.remove(named_pipe_path) except: print("failed to delete named pipe: {}".format(named_pipe_path)) None

Hide Details

# Delete the temp directory. try: os.rmdir(temp_dir) except: print( "failed to delete temp dir: {}, directory contents: '{}'".format( temp_dir, os.listdir(temp_dir))) None

Hide Details

Hide Details

PASS: LLDB (/Users/buildslave/jenkins/workspace/lldb-cmake-sanitized/lldb-build/bin/clang-11-x86_64) :: test_no_QListThreadsInStopReply_supplies_no_threads_debugserver (TestGdbRemoteThreadsInStopReply.TestGdbRemoteThreadsInStopReply) runCmd: settings clear -all output:

Hide Details

runCmd: settings set symbols.enable-external-lookup false output:

Hide Details

runCmd: settings set target.auto-apply-fixits false output:

Hide Details

runCmd: settings set plugin.process.gdb-remote.packet-timeout 60 output:

Hide Details

runCmd: settings set symbols.clang-modules-cache-path "/Users/buildslave/jenkins/workspace/lldb-cmake-sanitized/lldb-build/lldb-test-build.noindex/module-cache-lldb/lldb-api" output:

Hide Details

runCmd: settings set use-color false output:

Hide Details

runCmd: setting set target.prefer-dynamic-value no-dynamic-values output:

Hide Details

runCmd: settings set target.env-vars ASAN_OPTIONS=detect_stack_use_after_return=1 DYLD_INSERT_LIBRARIES=/Users/buildslave/jenkins/workspace/lldb-cmake-sanitized/host-compiler/lib/clang/11.0.0/lib/darwin/libclang_rt.asan_osx_dynamic.dylib output:

Hide Details

UNSUPPORTED: LLDB (/Users/buildslave/jenkins/workspace/lldb-cmake-sanitized/lldb-build/bin/clang-11-x86_64) :: test_no_QListThreadsInStopReply_supplies_no_threads_llgs (TestGdbRemoteThreadsInStopReply.TestGdbRemoteThreadsInStopReply) (llgs tests) runCmd: settings clear -all output:

Hide Details

runCmd: settings set symbols.enable-external-lookup false output:

Hide Details

runCmd: settings set target.auto-apply-fixits false output:

Hide Details

runCmd: settings set plugin.process.gdb-remote.packet-timeout 60 output:

Hide Details

runCmd: settings set symbols.clang-modules-cache-path "/Users/buildslave/jenkins/workspace/lldb-cmake-sanitized/lldb-build/lldb-test-build.noindex/module-cache-lldb/lldb-api" output:

Hide Details

runCmd: settings set use-color false output:

Hide Details

runCmd: setting set target.prefer-dynamic-value no-dynamic-values output:

Hide Details

runCmd: settings set target.env-vars ASAN_OPTIONS=detect_stack_use_after_return=1 DYLD_INSERT_LIBRARIES=/Users/buildslave/jenkins/workspace/lldb-cmake-sanitized/host-compiler/lib/clang/11.0.0/lib/darwin/libclang_rt.asan_osx_dynamic.dylib output:

Hide Details

Adding tearDown hook: def shutdown_named_pipe(): # Close the pipe. try: named_pipe.close() except: print("failed to close named pipe") None

Hide Details

# Delete the pipe. try: os.remove(named_pipe_path) except: print("failed to delete named pipe: {}".format(named_pipe_path)) None

Hide Details

# Delete the temp directory. try: os.rmdir(temp_dir) except: print( "failed to delete temp dir: {}, directory contents: '{}'".format( temp_dir, os.listdir(temp_dir))) None

Hide Details

Hide Details

Adding tearDown hook: def cleanupSubprocesses(self): # Ensure any subprocesses are cleaned up for p in self.subprocesses: p.terminate() del p del self.subprocesses[:] # Ensure any forked processes are cleaned up for pid in self.forkedProcessPids: try: os.kill(pid, signal.SIGTERM) except OSError: pass

Hide Details

Hide Details

Adding tearDown hook: def shutdown_debug_monitor(): try: server.terminate() except: logger.warning( "failed to terminate server for debug monitor: {}; ignoring".format( sys.exc_info()[0]))

Hide Details

Hide Details

Adding tearDown hook: def shutdown_socket(): if sock: try: # send the kill packet so lldb-server shuts down gracefully sock.sendall(GdbRemoteTestCaseBase._GDBREMOTE_KILL_PACKET) except: logger.warning( "failed to send kill packet to debug monitor: {}; ignoring".format( sys.exc_info()[0]))

Hide Details

try: sock.close() except: logger.warning( "failed to close socket to debug monitor: {}; ignoring".format( sys.exc_info()[0]))

Hide Details

Hide Details

Executing tearDown hook: def shutdown_socket(): if sock: try: # send the kill packet so lldb-server shuts down gracefully sock.sendall(GdbRemoteTestCaseBase._GDBREMOTE_KILL_PACKET) except: logger.warning( "failed to send kill packet to debug monitor: {}; ignoring".format( sys.exc_info()[0]))

Hide Details

try: sock.close() except: logger.warning( "failed to close socket to debug monitor: {}; ignoring".format( sys.exc_info()[0]))

Hide Details

Hide Details

2020-07-02 00:17:44,437 WARNING failed to send kill packet to debug monitor: <class 'TypeError'>; ignoring Executing tearDown hook: def shutdown_debug_monitor(): try: server.terminate() except: logger.warning( "failed to terminate server for debug monitor: {}; ignoring".format( sys.exc_info()[0]))

Hide Details

Hide Details

Executing tearDown hook: def cleanupSubprocesses(self): # Ensure any subprocesses are cleaned up for p in self.subprocesses: p.terminate() del p del self.subprocesses[:] # Ensure any forked processes are cleaned up for pid in self.forkedProcessPids: try: os.kill(pid, signal.SIGTERM) except OSError: pass

Hide Details

Hide Details

Executing tearDown hook: def shutdown_named_pipe(): # Close the pipe. try: named_pipe.close() except: print("failed to close named pipe") None

Hide Details

# Delete the pipe. try: os.remove(named_pipe_path) except: print("failed to delete named pipe: {}".format(named_pipe_path)) None

Hide Details

# Delete the temp directory. try: os.rmdir(temp_dir) except: print( "failed to delete temp dir: {}, directory contents: '{}'".format( temp_dir, os.listdir(temp_dir))) None

Hide Details

Hide Details

PASS: LLDB (/Users/buildslave/jenkins/workspace/lldb-cmake-sanitized/lldb-build/bin/clang-11-x86_64) :: test_stop_reply_contains_thread_pcs_debugserver (TestGdbRemoteThreadsInStopReply.TestGdbRemoteThreadsInStopReply) runCmd: settings clear -all output:

Hide Details

runCmd: settings set symbols.enable-external-lookup false output:

Hide Details

runCmd: settings set target.auto-apply-fixits false output:

Hide Details

runCmd: settings set plugin.process.gdb-remote.packet-timeout 60 output:

Hide Details

runCmd: settings set symbols.clang-modules-cache-path "/Users/buildslave/jenkins/workspace/lldb-cmake-sanitized/lldb-build/lldb-test-build.noindex/module-cache-lldb/lldb-api" output:

Hide Details

runCmd: settings set use-color false output:

Hide Details

runCmd: setting set target.prefer-dynamic-value no-dynamic-values output:

Hide Details

runCmd: settings set target.env-vars ASAN_OPTIONS=detect_stack_use_after_return=1 DYLD_INSERT_LIBRARIES=/Users/buildslave/jenkins/workspace/lldb-cmake-sanitized/host-compiler/lib/clang/11.0.0/lib/darwin/libclang_rt.asan_osx_dynamic.dylib output:

Hide Details

UNSUPPORTED: LLDB (/Users/buildslave/jenkins/workspace/lldb-cmake-sanitized/lldb-build/bin/clang-11-x86_64) :: test_stop_reply_contains_thread_pcs_llgs (TestGdbRemoteThreadsInStopReply.TestGdbRemoteThreadsInStopReply) (llgs tests) runCmd: settings clear -all output:

Hide Details

runCmd: settings set symbols.enable-external-lookup false output:

Hide Details

runCmd: settings set target.auto-apply-fixits false output:

Hide Details

runCmd: settings set plugin.process.gdb-remote.packet-timeout 60 output:

Hide Details

runCmd: settings set symbols.clang-modules-cache-path "/Users/buildslave/jenkins/workspace/lldb-cmake-sanitized/lldb-build/lldb-test-build.noindex/module-cache-lldb/lldb-api" output:

Hide Details

runCmd: settings set use-color false output:

Hide Details

runCmd: setting set target.prefer-dynamic-value no-dynamic-values output:

Hide Details

runCmd: settings set target.env-vars ASAN_OPTIONS=detect_stack_use_after_return=1 DYLD_INSERT_LIBRARIES=/Users/buildslave/jenkins/workspace/lldb-cmake-sanitized/host-compiler/lib/clang/11.0.0/lib/darwin/libclang_rt.asan_osx_dynamic.dylib output:

Hide Details

Adding tearDown hook: def shutdown_named_pipe(): # Close the pipe. try: named_pipe.close() except: print("failed to close named pipe") None

Hide Details

# Delete the pipe. try: os.remove(named_pipe_path) except: print("failed to delete named pipe: {}".format(named_pipe_path)) None

Hide Details

# Delete the temp directory. try: os.rmdir(temp_dir) except: print( "failed to delete temp dir: {}, directory contents: '{}'".format( temp_dir, os.listdir(temp_dir))) None

Hide Details

Hide Details

Adding tearDown hook: def cleanupSubprocesses(self): # Ensure any subprocesses are cleaned up for p in self.subprocesses: p.terminate() del p del self.subprocesses[:] # Ensure any forked processes are cleaned up for pid in self.forkedProcessPids: try: os.kill(pid, signal.SIGTERM) except OSError: pass

Hide Details

Hide Details

Adding tearDown hook: def shutdown_debug_monitor(): try: server.terminate() except: logger.warning( "failed to terminate server for debug monitor: {}; ignoring".format( sys.exc_info()[0]))

Hide Details

Hide Details

Adding tearDown hook: def shutdown_socket(): if sock: try: # send the kill packet so lldb-server shuts down gracefully sock.sendall(GdbRemoteTestCaseBase._GDBREMOTE_KILL_PACKET) except: logger.warning( "failed to send kill packet to debug monitor: {}; ignoring".format( sys.exc_info()[0]))

Hide Details

try: sock.close() except: logger.warning( "failed to close socket to debug monitor: {}; ignoring".format( sys.exc_info()[0]))

Hide Details

Hide Details

Executing tearDown hook: def shutdown_socket(): if sock: try: # send the kill packet so lldb-server shuts down gracefully sock.sendall(GdbRemoteTestCaseBase._GDBREMOTE_KILL_PACKET) except: logger.warning( "failed to send kill packet to debug monitor: {}; ignoring".format( sys.exc_info()[0]))

Hide Details

try: sock.close() except: logger.warning( "failed to close socket to debug monitor: {}; ignoring".format( sys.exc_info()[0]))

Hide Details

Hide Details

2020-07-02 00:18:43,325 WARNING failed to send kill packet to debug monitor: <class 'TypeError'>; ignoring Executing tearDown hook: def shutdown_debug_monitor(): try: server.terminate() except: logger.warning( "failed to terminate server for debug monitor: {}; ignoring".format( sys.exc_info()[0]))

Hide Details

Hide Details

Executing tearDown hook: def cleanupSubprocesses(self): # Ensure any subprocesses are cleaned up for p in self.subprocesses: p.terminate() del p del self.subprocesses[:] # Ensure any forked processes are cleaned up for pid in self.forkedProcessPids: try: os.kill(pid, signal.SIGTERM) except OSError: pass

Hide Details

Hide Details

Executing tearDown hook: def shutdown_named_pipe(): # Close the pipe. try: named_pipe.close() except: print("failed to close named pipe") None

Hide Details

# Delete the pipe. try: os.remove(named_pipe_path) except: print("failed to delete named pipe: {}".format(named_pipe_path)) None

Hide Details

# Delete the temp directory. try: os.rmdir(temp_dir) except: print( "failed to delete temp dir: {}, directory contents: '{}'".format( temp_dir, os.listdir(temp_dir))) None

Hide Details

Hide Details

PASS: LLDB (/Users/buildslave/jenkins/workspace/lldb-cmake-sanitized/lldb-build/bin/clang-11-x86_64) :: test_stop_reply_reports_correct_threads_debugserver (TestGdbRemoteThreadsInStopReply.TestGdbRemoteThreadsInStopReply) runCmd: settings clear -all output:

Hide Details

runCmd: settings set symbols.enable-external-lookup false output:

Hide Details

runCmd: settings set target.auto-apply-fixits false output:

Hide Details

runCmd: settings set plugin.process.gdb-remote.packet-timeout 60 output:

Hide Details

runCmd: settings set symbols.clang-modules-cache-path "/Users/buildslave/jenkins/workspace/lldb-cmake-sanitized/lldb-build/lldb-test-build.noindex/module-cache-lldb/lldb-api" output:

Hide Details

runCmd: settings set use-color false output:

Hide Details

runCmd: setting set target.prefer-dynamic-value no-dynamic-values output:

Hide Details

runCmd: settings set target.env-vars ASAN_OPTIONS=detect_stack_use_after_return=1 DYLD_INSERT_LIBRARIES=/Users/buildslave/jenkins/workspace/lldb-cmake-sanitized/host-compiler/lib/clang/11.0.0/lib/darwin/libclang_rt.asan_osx_dynamic.dylib output:

Hide Details

UNSUPPORTED: LLDB (/Users/buildslave/jenkins/workspace/lldb-cmake-sanitized/lldb-build/bin/clang-11-x86_64) :: test_stop_reply_reports_correct_threads_llgs (TestGdbRemoteThreadsInStopReply.TestGdbRemoteThreadsInStopReply) (llgs tests) runCmd: settings clear -all output:

Hide Details

runCmd: settings set symbols.enable-external-lookup false output:

Hide Details

runCmd: settings set target.auto-apply-fixits false output:

Hide Details

runCmd: settings set plugin.process.gdb-remote.packet-timeout 60 output:

Hide Details

runCmd: settings set symbols.clang-modules-cache-path "/Users/buildslave/jenkins/workspace/lldb-cmake-sanitized/lldb-build/lldb-test-build.noindex/module-cache-lldb/lldb-api" output:

Hide Details

runCmd: settings set use-color false output:

Hide Details

runCmd: setting set target.prefer-dynamic-value no-dynamic-values output:

Hide Details

runCmd: settings set target.env-vars ASAN_OPTIONS=detect_stack_use_after_return=1 DYLD_INSERT_LIBRARIES=/Users/buildslave/jenkins/workspace/lldb-cmake-sanitized/host-compiler/lib/clang/11.0.0/lib/darwin/libclang_rt.asan_osx_dynamic.dylib output:

Hide Details

Adding tearDown hook: def shutdown_named_pipe(): # Close the pipe. try: named_pipe.close() except: print("failed to close named pipe") None

Hide Details

# Delete the pipe. try: os.remove(named_pipe_path) except: print("failed to delete named pipe: {}".format(named_pipe_path)) None

Hide Details

# Delete the temp directory. try: os.rmdir(temp_dir) except: print( "failed to delete temp dir: {}, directory contents: '{}'".format( temp_dir, os.listdir(temp_dir))) None

Hide Details

Hide Details

FAIL: LLDB (/Users/buildslave/jenkins/workspace/lldb-cmake-sanitized/lldb-build/bin/clang-11-x86_64) :: test_stop_reply_reports_multiple_threads_debugserver (TestGdbRemoteThreadsInStopReply.TestGdbRemoteThreadsInStopReply) Executing tearDown hook: def shutdown_named_pipe(): # Close the pipe. try: named_pipe.close() except: print("failed to close named pipe") None

Hide Details

# Delete the pipe. try: os.remove(named_pipe_path) except: print("failed to delete named pipe: {}".format(named_pipe_path)) None

Hide Details

# Delete the temp directory. try: os.rmdir(temp_dir) except: print( "failed to delete temp dir: {}, directory contents: '{}'".format( temp_dir, os.listdir(temp_dir))) None

Hide Details

Hide Details

runCmd: settings clear -all output:

Hide Details

runCmd: settings set symbols.enable-external-lookup false output:

Hide Details

runCmd: settings set target.auto-apply-fixits false output:

Hide Details

runCmd: settings set plugin.process.gdb-remote.packet-timeout 60 output:

Hide Details

runCmd: settings set symbols.clang-modules-cache-path "/Users/buildslave/jenkins/workspace/lldb-cmake-sanitized/lldb-build/lldb-test-build.noindex/module-cache-lldb/lldb-api" output:

Hide Details

runCmd: settings set use-color false output:

Hide Details

runCmd: setting set target.prefer-dynamic-value no-dynamic-values output:

Hide Details

runCmd: settings set target.env-vars ASAN_OPTIONS=detect_stack_use_after_return=1 DYLD_INSERT_LIBRARIES=/Users/buildslave/jenkins/workspace/lldb-cmake-sanitized/host-compiler/lib/clang/11.0.0/lib/darwin/libclang_rt.asan_osx_dynamic.dylib output:

Hide Details

UNSUPPORTED: LLDB (/Users/buildslave/jenkins/workspace/lldb-cmake-sanitized/lldb-build/bin/clang-11-x86_64) :: test_stop_reply_reports_multiple_threads_llgs (TestGdbRemoteThreadsInStopReply.TestGdbRemoteThreadsInStopReply) (llgs tests) Restore dir to: /Users/buildslave/jenkins/workspace/lldb-cmake-sanitized/lldb-build/tools/lldb/test ====================================================================== ERROR: test_stop_reply_reports_multiple_threads_debugserver (TestGdbRemoteThreadsInStopReply.TestGdbRemoteThreadsInStopReply) ---------------------------------------------------------------------- Error when building test subject.

Hide Details

Build Command: make VPATH=/Users/buildslave/jenkins/workspace/lldb-cmake-sanitized/llvm-project/lldb/test/API/tools/lldb-server -C /Users/buildslave/jenkins/workspace/lldb-cmake-sanitized/lldb-build/lldb-test-build.noindex/tools/lldb-server/TestGdbRemoteThreadsInStopReply.test_stop_reply_reports_multiple_threads_debugserver -I /Users/buildslave/jenkins/workspace/lldb-cmake-sanitized/llvm-project/lldb/test/API/tools/lldb-server -I /Users/buildslave/jenkins/workspace/lldb-cmake-sanitized/llvm-project/lldb/packages/Python/lldbsuite/test/make -f /Users/buildslave/jenkins/workspace/lldb-cmake-sanitized/llvm-project/lldb/test/API/tools/lldb-server/Makefile all ARCH=x86_64 CC="/Users/buildslave/jenkins/workspace/lldb-cmake-sanitized/lldb-build/bin/clang-11" DSYMUTIL=/Users/buildslave/jenkins/workspace/lldb-cmake-sanitized/lldb-build/./bin/dsymutil CLANG_MODULE_CACHE_DIR=/Users/buildslave/jenkins/workspace/lldb-cmake-sanitized/lldb-build/lldb-test-build.noindex/module-cache-clang/lldb-api

Hide Details

Build Command Output: make: *** [a.out] Killed: 9

Hide Details

Test Directory: /Users/buildslave/jenkins/workspace/lldb-cmake-sanitized/llvm-project/lldb/test/API/tools/lldb-server ---------------------------------------------------------------------- Ran 10 tests in 192.736s

Hide Details

RESULT: FAILED (4 passes, 0 failures, 1 errors, 5 skipped, 0 expected failures, 0 unexpected successes)

Hide Details

--

Hide Details

******************** Slowest Tests: -------------------------------------------------------------------------- 347.64s: lldb-api :: tools/lldb-server/TestLldbGdbServer.py 260.24s: lldb-api :: lang/cpp/enum_types/TestCPP11EnumTypes.py 246.52s: lldb-api :: api/multithreaded/TestMultithreaded.py 232.79s: lldb-api :: lang/objc/hidden-ivars/TestHiddenIvars.py 207.03s: lldb-api :: lang/objc/foundation/TestObjCMethods.py 194.09s: lldb-api :: tools/lldb-server/TestGdbRemoteThreadsInStopReply.py 145.62s: lldb-api :: lang/objc/exceptions/TestObjCExceptions.py 139.09s: lldb-api :: lang/objc/objc-new-syntax/TestObjCNewSyntaxLiteral.py 134.77s: lldb-api :: lang/objc/real-definition/TestRealDefinition.py 120.46s: lldb-api :: types/TestLongTypesExpr.py 119.05s: lldb-api :: tools/lldb-server/TestGdbRemote_qThreadStopInfo.py 108.82s: lldb-api :: lang/objc/foundation/TestObjCMethodsString.py 105.15s: lldb-api :: lang/objc/objc-new-syntax/TestObjCNewSyntaxDictionary.py 104.80s: lldb-api :: lang/objc/foundation/TestObjCMethodsNSError.py 99.72s: lldb-api :: lang/objc/objc-new-syntax/TestObjCNewSyntaxArray.py 90.66s: lldb-api :: lang/objc/objc_direct-methods/TestObjCDirectMethods.py 86.71s: lldb-api :: functionalities/data-formatter/compactvectors/TestCompactVectors.py 84.59s: lldb-api :: types/TestCharTypeExpr.py 81.54s: lldb-api :: types/TestLongTypes.py 80.03s: lldb-api :: python_api/lldbutil/iter/TestLLDBIterator.py

Hide Details

Tests Times: -------------------------------------------------------------------------- [ Range ] :: [ Percentage ] :: [ Count ] -------------------------------------------------------------------------- [340s,360s) :: [ ] :: [ 1/2068] [320s,340s) :: [ ] :: [ 0/2068] [300s,320s) :: [ ] :: [ 0/2068] [280s,300s) :: [ ] :: [ 0/2068] [260s,280s) :: [ ] :: [ 1/2068] [240s,260s) :: [ ] :: [ 2/2068] [220s,240s) :: [ ] :: [ 0/2068] [200s,220s) :: [ ] :: [ 2/2068] [180s,200s) :: [ ] :: [ 0/2068] [160s,180s) :: [ ] :: [ 0/2068] [140s,160s) :: [ ] :: [ 2/2068] [120s,140s) :: [ ] :: [ 3/2068] [100s,120s) :: [ ] :: [ 4/2068] [ 80s,100s) :: [ ] :: [ 5/2068] [ 60s, 80s) :: [ ] :: [ 23/2068] [ 40s, 60s) :: [* ] :: [ 52/2068] [ 20s, 40s) :: [** ] :: [ 118/2068] [ 0s, 20s) :: [*********************************** ] :: [1855/2068] -------------------------------------------------------------------------- ******************** Failed Tests (263): lldb-api :: tools/lldb-server/TestGdbRemoteThreadsInStopReply.py lldb-api :: types/TestFloatTypes.py lldb-api :: functionalities/data-formatter/parray/TestPrintArray.py lldb-shell :: SymbolFile/NativePDB/globals-fundamental.cpp lldb-unit :: Utility/./UtilityTests/StringExtractorTest.GetHexBytes lldb-api :: functionalities/tsan/thread_leak/TestTsanThreadLeak.py lldb-unit :: ScriptInterpreter/Python/./ScriptInterpreterPythonTests/PythonDataObjectsTest.TestCallable lldb-shell :: ExecControl/StopHook/stop-hook.test lldb-unit :: Utility/./UtilityTests/SerializationRountripTest.SerializeDeserializePod lldb-unit :: Language/CPlusPlus/./LanguageCPlusPlusTests/CPlusPlusLanguage.CPlusPlusNameParser lldb-api :: lang/cpp/virtual-overload/TestVirtualOverload.py lldb-unit :: Utility/./UtilityTests/BinaryStreamTest.PutSLEB128ThreeBytes lldb-api :: functionalities/data-formatter/data-formatter-globals/TestDataFormatterGlobals.py lldb-api :: functionalities/thread/concurrent_events/TestConcurrentDelayWatchBreak.py lldb-api :: commands/expression/completion-crash-incomplete-record/TestCompletionCrashIncompleteRecord.py lldb-api :: python_api/watchpoint/TestWatchpointIgnoreCount.py lldb-api :: python_api/frame/get-variables/TestGetVariables.py lldb-shell :: SymbolFile/NativePDB/ast-types.cpp lldb-unit :: Utility/./UtilityTests/LogTest.Unregister lldb-unit :: Utility/./UtilityTests/VMRange.Ordering lldb-api :: lang/objc/objc-struct-argument/TestObjCStructArgument.py lldb-unit :: Utility/./UtilityTests/ReproducerTest.SetReplay lldb-api :: functionalities/data-formatter/setvaluefromcstring/TestSetValueFromCString.py lldb-api :: commands/expression/import-std-module/no-std-module/TestMissingStdModule.py lldb-unit :: Symbol/./SymbolTests/TestTypeSystemClang.TestRemoveFastQualifiers lldb-unit :: Host/./HostTests/SocketTest.TCPListen0GetPort lldb-unit :: DataFormatter/./LLDBFormatterTests/FormatManagerTests.CompatibleLangs lldb-unit :: Utility/./UtilityTests/LogTest.LLDB_LOG_nullptr lldb-unit :: Host/./HostTests/SocketAddressTest.GetAddressInfo lldb-unit :: Process/minidump/./LLDBMinidumpTests/RegisterContextMinidump.ConvertMinidumpContext_x86_32 lldb-api :: commands/expression/ignore-artificial-constructors/TestIgnoreArtificialConstructors.py lldb-api :: lang/objc/self/TestObjCSelf.py lldb-api :: functionalities/load_using_paths/TestLoadUsingPaths.py lldb-api :: tools/lldb-vscode/console/TestVSCode_console.py lldb-api :: functionalities/data-formatter/ptr_ref_typedef/TestPtrRef2Typedef.py lldb-unit :: Utility/./UtilityTests/BinaryStreamTest.PutULEB128SixBytes lldb-shell :: SymbolFile/NativePDB/function-types-builtins.cpp lldb-api :: commands/watchpoints/watchpoint_commands/command/TestWatchpointCommandPython.py lldb-unit :: Expression/./ExpressionTests/CppModuleConfigurationTest.UnrelatedLibrary lldb-api :: python_api/function_symbol/TestSymbolAPI.py lldb-api :: lang/cpp/global_operators/TestCppGlobalOperators.py lldb-unit :: Language/Highlighting/./HighlighterTests/HighlighterTest.ClangComments lldb-unit :: Utility/./UtilityTests/CompletionRequest.DuplicateFiltering lldb-api :: benchmarks/continue/TestBenchmarkContinue.py lldb-api :: tools/lldb-server/signal-filtering/TestGdbRemote_QPassSignals.py lldb-api :: lang/cpp/this/TestCPPThis.py lldb-api :: linux/mix-dwo-and-regular-objects/TestMixedDwarfBinary.py lldb-unit :: Process/gdb-remote/./ProcessGdbRemoteTests/GDBRemoteCommunicationServerTest.SendErrorResponse_ErrorList lldb-unit :: Utility/./UtilityTests/StringListTest.PopBack lldb-api :: commands/expression/diagnostics/TestExprDiagnostics.py lldb-api :: lang/objc/objc-ivar-protocols/TestIvarProtocols.py lldb-unit :: Process/minidump/./LLDBMinidumpTests/MinidumpParserTest.GetPidWindows lldb-unit :: Expression/./ExpressionTests/DWARFExpression.DW_OP_stack_value lldb-shell :: SymbolFile/DWARF/DW_AT_low_pc-addrx.s lldb-api :: tools/lldb-vscode/variables/TestVSCode_variables.py lldb-api :: api/multiple-targets/TestMultipleTargets.py lldb-api :: commands/expression/import-std-module/forward_list/TestForwardListFromStdModule.py lldb-api :: commands/expression/completion/TestExprCompletion.py lldb-api :: functionalities/darwin_log/source/info/TestDarwinLogSourceInfo.py lldb-shell :: ObjectFile/MachO/symtab.yaml lldb-api :: lang/objc/objc-runtime-ivars/TestRuntimeIvars.py lldb-api :: functionalities/ubsan/basic/TestUbsanBasic.py lldb-unit :: Utility/./UtilityTests/StringListTest.AppendListCStringArray lldb-unit :: Utility/./UtilityTests/IndexToObjectTest.ObjectForIndex lldb-api :: commands/expression/ir-interpreter/TestIRInterpreter.py lldb-unit :: SymbolFile/DWARF/./SymbolFileDWARFTests/SymbolFileDWARFTests.TestAbbrevOutOfOrder lldb-unit :: SymbolFile/NativePDB/./SymbolFileNativePDBTests/PDBFPOProgramToDWARFExpressionTests.UnresolvedCyclicRegisterAssignmentReference lldb-unit :: Platform/Android/./AdbClientTests/AdbClientTest.CreateByDeviceId_ByEnvVar lldb-unit :: DataFormatter/./LLDBFormatterTests/StringPrinterTests.CxxASCII lldb-api :: functionalities/data-formatter/data-formatter-objc/TestDataFormatterObjCNSBundle.py lldb-unit :: Host/./HostTests/SocketTest.TCPListen0ConnectAccept lldb-unit :: Utility/./UtilityTests/StreamTest.PutHex64ByteOrderLittle lldb-api :: lang/objc/bitfield_ivars/TestBitfieldIvars.py lldb-api :: commands/command/script_alias/TestCommandScriptAlias.py lldb-api :: iohandler/completion/TestIOHandlerCompletion.py lldb-unit :: Utility/./UtilityTests/VASprintfTest.BufferResize lldb-api :: python_api/symbol-context/TestSymbolContext.py lldb-api :: functionalities/gdb_remote_client/TestWriteMemory.py lldb-unit :: Utility/./UtilityTests/UriParserTest.Minimal lldb-unit :: Symbol/./SymbolTests/TestTypeSystemClang.TestGetBasicTypeFromEnum lldb-api :: functionalities/data-formatter/type_summary_list_arg/TestTypeSummaryListArg.py lldb-unit :: Utility/./UtilityTests/StringListTest.AppendStringCString lldb-unit :: Utility/./UtilityTests/StringListTest.InsertStringAtIndexStart lldb-api :: functionalities/memory/cache/TestMemoryCache.py lldb-unit :: Symbol/./SymbolTests/TestClangASTImporter.CanImportInvalidType lldb-api :: lang/objc/radar-9691614/TestObjCMethodReturningBOOL.py lldb-unit :: Utility/./UtilityTests/StringExtractorTest.GetU64LittleEndian lldb-api :: functionalities/data-formatter/data-formatter-disabling/TestDataFormatterDisabling.py lldb-unit :: Utility/./UtilityTests/StringListTest.InsertStringAtIndexOutOfBounds lldb-api :: python_api/process/TestProcessAPI.py lldb-api :: python_api/disassemble-raw-data/TestDisassemble_VST1_64.py lldb-unit :: Utility/./UtilityTests/ProcessInstanceInfoList.Yaml lldb-unit :: Utility/./UtilityTests/BinaryStreamTest.PutULEB128TwoBytes lldb-unit :: Process/minidump/./LLDBMinidumpTests/MinidumpParserTest.GetThreadContext_x86_32_wow64 lldb-api :: types/TestDoubleTypes.py lldb-api :: functionalities/darwin_log/filter/exact_match/message/TestDarwinLogFilterMatchMessage.py lldb-unit :: Host/./HostTests/FileSystemTest.EnumerateDirectory lldb-api :: lang/c/inlines/TestRedefinitionsInInlines.py lldb-api :: functionalities/data-formatter/data-formatter-synthval/TestDataFormatterSynthVal.py lldb-unit :: debugserver/./debugserverTests/RNBSocket.LoopBackConnectIPv4 lldb-shell :: Process/Optimization.test lldb-unit :: UnwindAssembly/x86/./UnwindAssemblyx86Tests/Testx86AssemblyInspectionEngine.TestPushEBX lldb-api :: functionalities/postmortem/minidump-new/TestMiniDumpNew.py lldb-shell :: Reproducer/TestWorkingDir.test lldb-unit :: SymbolFile/DWARF/./SymbolFileDWARFTests/SymbolFileDWARFTests.TestAbbrevMissingTerminator lldb-api :: lang/objc/objc-builtin-types/TestObjCBuiltinTypes.py lldb-api :: tools/lldb-server/TestGdbRemoteRegisterState.py lldb-api :: commands/expression/import-std-module/empty-module/TestEmptyStdModule.py lldb-api :: functionalities/thread/concurrent_events/TestConcurrentBreakpointDelayBreakpointOneSignal.py lldb-shell :: ObjectFile/PECOFF/sections.yaml lldb-api :: macosx/lc-note/kern-ver-str/TestKernVerStrLCNOTE.py lldb-shell :: SymbolFile/DWARF/debug_loc.s lldb-api :: functionalities/data-formatter/data-formatter-stl/libcxx/vbool/TestDataFormatterLibcxxVBool.py lldb-api :: commands/settings/TestSettings.py lldb-api :: commands/target/select/TestTargetSelect.py lldb-unit :: Language/Highlighting/./HighlighterTests/HighlighterTest.ClangTrailingBackslashWithWhitespace lldb-unit :: Utility/./UtilityTests/StringExtractorTest.GetNameColonValueNoSemicolon lldb-unit :: Host/./HostTests/NativeProcessProtocolTest.ReadMemoryWithoutTrap lldb-unit :: Host/./HostTests/FileSystemTest.OpenErrno lldb-api :: commands/frame/diagnose/dereference-function-return/TestDiagnoseDereferenceFunctionReturn.py lldb-api :: lang/objc/objc-ivar-stripped/TestObjCIvarStripped.py lldb-shell :: SymbolFile/symbol-binding.test lldb-api :: lang/c/find_struct_type/TestFindStructTypes.py lldb-unit :: Process/gdb-remote/./ProcessGdbRemoteTests/GDBRemoteCommunicationClientTest.GetModulesInfo_UUID20 lldb-api :: lang/c/shared_lib/TestSharedLib.py lldb-unit :: Process/gdb-remote/./ProcessGdbRemoteTests/GDBRemoteClientBaseTest.SendContinueAndAsyncSignal lldb-unit :: Utility/./UtilityTests/StringExtractorTest.GetU32BigEndian lldb-api :: functionalities/thread/concurrent_events/TestConcurrentTwoBreakpointsOneWatchpoint.py lldb-api :: functionalities/data-formatter/typedef_array/TestTypedefArray.py lldb-api :: functionalities/tsan/basic/TestTsanBasic.py lldb-api :: lang/c/conflicting-symbol/TestConflictingSymbol.py lldb-unit :: Symbol/./SymbolTests/TestTypeSystemClang.TestIsClangType lldb-api :: lang/objc/modules-inline-functions/TestModulesInlineFunctions.py lldb-api :: functionalities/breakpoint/auto_continue/TestBreakpointAutoContinue.py lldb-unit :: Utility/./UtilityTests/RangeTest.NotEqual lldb-unit :: Utility/./UtilityTests/StringListTest.ShiftCString lldb-api :: functionalities/data-formatter/data-formatter-stl/libcxx/vector/TestDataFormatterLibcxxVector.py lldb-unit :: Utility/./UtilityTests/GeneratorTest.Create lldb-api :: commands/expression/import-std-module/unique_ptr-dbg-info-content/TestUniquePtrDbgInfoContent.py lldb-api :: python_api/sbtype_typeclass/TestSBTypeTypeClass.py lldb-api :: lang/c/enum_types/TestEnumTypes.py lldb-unit :: UnwindAssembly/x86/./UnwindAssemblyx86Tests/Testx86AssemblyInspectionEngine.TestPopEDI lldb-api :: commands/watchpoints/multi_watchpoint_slots/TestWatchpointMultipleSlots.py lldb-api :: functionalities/data-formatter/data-formatter-objc/TestDataFormatterObjCPlain.py lldb-api :: lang/cpp/namespace/TestNamespaceLookup.py lldb-unit :: Process/minidump/./LLDBMinidumpTests/MinidumpParserTest.GetFilteredModuleList lldb-api :: python_api/value/change_values/TestChangeValueAPI.py lldb-unit :: Language/Highlighting/./HighlighterTests/HighlighterTest.HighlighterSelectionType lldb-unit :: Process/gdb-remote/./ProcessGdbRemoteTests/GDBRemoteCommunicationClientTest.SendStartTracePacket lldb-unit :: Utility/./UtilityTests/UriParserTest.Empty lldb-unit :: ScriptInterpreter/Python/./ScriptInterpreterPythonTests/PythonDataObjectsTest.TestPythonString lldb-api :: functionalities/signal/raise/TestRaise.py lldb-api :: functionalities/breakpoint/breakpoint_in_delayslot/TestAvoidBreakpointInDelaySlot.py lldb-api :: python_api/name_lookup/TestNameLookup.py lldb-api :: functionalities/data-formatter/data-formatter-objc/TestDataFormatterObjNSException.py lldb-api :: functionalities/data-formatter/nssetsynth/TestNSSetSynthetic.py lldb-shell :: SymbolFile/DWARF/debug_loc-aslr.s lldb-api :: lang/c/stepping/TestStepAndBreakpoints.py lldb-api :: functionalities/postmortem/wow64_minidump/TestWow64MiniDump.py lldb-shell :: ScriptInterpreter/Python/scripted_breakpoint.test lldb-api :: commands/target/auto-install-main-executable/TestAutoInstallMainExecutable.py lldb-shell :: ObjectFile/PECOFF/symbol.yaml lldb-unit :: Target/./TargetTests/ExecutionContextTest.GetByteOrderTarget lldb-api :: commands/gui/invalid-args/TestInvalidArgsGui.py lldb-api :: lang/c/struct_types/TestStructTypes.py lldb-api :: commands/expression/deleting-implicit-copy-constructor/TestDeletingImplicitCopyConstructor.py lldb-api :: functionalities/limit-debug-info/TestLimitDebugInfo.py lldb-unit :: Utility/./UtilityTests/ArgsTest.TestOverwriteArgs lldb-api :: functionalities/data-formatter/data-formatter-stl/libcxx/map/TestDataFormatterLibccMap.py lldb-api :: commands/expression/regression-access-function-template-in-record/TestRegressionAccessFunctionTemplateInRecord.py lldb-unit :: Symbol/./SymbolTests/TestClangASTImporter.RecordLayout lldb-api :: functionalities/breakpoint/source_regexp/TestSourceRegexBreakpoints.py lldb-api :: functionalities/gdb_remote_client/TestWasm.py lldb-unit :: Signals/./SignalsTests/UnixSignalsTest.Iteration lldb-unit :: tools/lldb-server/tests/./LLDBServerTests/TestBase.DebugserverEnv lldb-api :: functionalities/multiword-commands/TestMultiWordCommands.py lldb-unit :: Expression/./ExpressionTests/CppModuleConfigurationTest.Sysroot lldb-api :: commands/expression/import-std-module/shared_ptr-dbg-info-content/TestSharedPtrDbgInfoContentFromStdModule.py lldb-api :: lang/cpp/dynamic-value/TestDynamicValue.py lldb-api :: linux/thread/create_during_instruction_step/TestCreateDuringInstructionStep.py lldb-shell :: SymbolFile/DWARF/find-inline-method.s lldb-unit :: UnwindAssembly/x86/./UnwindAssemblyx86Tests/Testx86AssemblyInspectionEngine.TestPushRBP lldb-unit :: SymbolFile/NativePDB/./SymbolFileNativePDBTests/PDBFPOProgramToDWARFExpressionTests.MultipleIndependentAssignments lldb-api :: functionalities/postmortem/netbsd-core/TestNetBSDCore.py lldb-shell :: Driver/TestUseColor.test lldb-shell :: Quit/TestQuitExitCodeImplicit0.test lldb-api :: commands/settings/quoting/TestQuoting.py lldb-unit :: Utility/./UtilityTests/FileSpecTest.EqualDotsPosixRoot lldb-unit :: Utility/./UtilityTests/ListenerTest.GetEventWait lldb-shell :: ObjectFile/ELF/section-types-edgecases.yaml lldb-shell :: Driver/TestPositionalArgs.test lldb-unit :: Utility/./UtilityTests/StringListTest.AppendListCStringArrayEmpty lldb-api :: commands/process/attach-resume/TestAttachResume.py lldb-api :: functionalities/testid/TestTestId.py lldb-api :: commands/target/stop-hooks/TestStopHooks.py lldb-unit :: Symbol/./SymbolTests/TestTypeSystemClang.TestGetEnumIntegerTypeUnexpectedType lldb-unit :: Utility/./UtilityTests/StringExtractorTest.GetHexBytes_Underflow lldb-api :: commands/expression/rdar42038760/TestScalarURem.py lldb-unit :: Utility/./UtilityTests/ScalarTest.Promotion lldb-shell :: ObjectFile/PECOFF/export-dllfunc.yaml lldb-shell :: Minidump/Windows/Sigsegv/sigsegv.test lldb-shell :: SymbolFile/DWARF/debug_aranges-empty-section.s lldb-api :: benchmarks/expression/TestExpressionCmd.py lldb-unit :: Utility/./UtilityTests/DataExtractorTest.GetCStrEmpty lldb-api :: functionalities/data-formatter/data-formatter-stl/libstdcpp/vector/TestDataFormatterStdVector.py lldb-unit :: Utility/./UtilityTests/StreamTeeTest.Constructor1Stream lldb-api :: functionalities/deleted-executable/TestDeletedExecutable.py lldb-shell :: Breakpoint/case-sensitive.test lldb-unit :: Utility/./UtilityTests/ArgsTest.TestSingleArg lldb-unit :: Utility/./UtilityTests/ScalarTest.ExtractBitfield lldb-api :: lang/cpp/thread_local/TestThreadLocal.py lldb-api :: python_api/sbstructureddata/TestStructuredDataAPI.py lldb-unit :: SymbolFile/NativePDB/./SymbolFileNativePDBTests/PDBFPOProgramToDWARFExpressionTests.MissingTargetRegister lldb-unit :: Utility/./UtilityTests/LogChannelEnabledTest.LogThread lldb-unit :: Utility/./UtilityTests/StreamTest.AddressSuffix lldb-api :: lang/objc/modules/TestObjCModules.py lldb-api :: api/multiple-debuggers/TestMultipleDebuggers.py lldb-api :: commands/expression/po_verbosity/TestPoVerbosity.py lldb-api :: commands/command/script/import/rdar-12586188/TestRdar12586188.py lldb-unit :: Utility/./UtilityTests/StringListTest.CopyListSingle lldb-api :: commands/expression/persistent_variables/TestPersistentVariables.py lldb-api :: functionalities/breakpoint/breakpoint_ignore_count/TestBreakpointIgnoreCount.py lldb-unit :: Language/Highlighting/./HighlighterTests/HighlighterTest.ClangSquareBrackets lldb-api :: lang/cpp/modules-import/TestCXXModulesImport.py lldb-shell :: Reproducer/Functionalities/TestStepping.test lldb-unit :: Utility/./UtilityTests/StringExtractorTest.GetNameColonValueNoColon lldb-unit :: ScriptInterpreter/Python/./ScriptInterpreterPythonTests/PythonDataObjectsTest.TestPythonDictionaryManipulation lldb-unit :: Symbol/./SymbolTests/TestClangASTImporter.ImportInvalidType lldb-shell :: SymbolFile/NativePDB/bitfields.cpp lldb-unit :: ObjectFile/Breakpad/./ObjectFileBreakpadTests/StackWinRecord.parse lldb-shell :: SymbolFile/DWARF/debug-names-compressed.cpp lldb-unit :: Utility/./UtilityTests/DataExtractorTest.GetULEB128_bit63 lldb-shell :: SymbolFile/DWARF/debug-types-line-tables.s lldb-unit :: Process/gdb-remote/./ProcessGdbRemoteTests/GDBRemoteCommunicationClientTest.GetQOffsets lldb-shell :: Expr/TestMultilineExpr.test lldb-api :: functionalities/breakpoint/move_nearest/TestMoveNearest.py lldb-api :: commands/frame/diagnose/complicated-expression/TestComplicatedExpression.py lldb-api :: functionalities/signal/handle-abrt/TestHandleAbort.py lldb-api :: tools/lldb-server/TestGdbRemoteHostInfo.py lldb-api :: lang/cpp/chained-calls/TestCppChainedCalls.py lldb-api :: lang/objc/foundation/TestRuntimeTypes.py lldb-unit :: Utility/./UtilityTests/UriParserTest.BracketedHostnameWithColon lldb-shell :: SymbolFile/Breakpad/unwind-via-stack-win-no-memory-info.yaml lldb-api :: commands/expression/import-std-module/deque-dbg-info-content/TestDbgInfoContentDequeFromStdModule.py lldb-shell :: ObjectFile/ELF/duplicate-section.yaml lldb-api :: arm/breakpoint-thumb-codesection/TestBreakpointThumbCodesection.py lldb-unit :: Utility/./UtilityTests/PassiveReplayTest.InstrumentedFooInvalid lldb-api :: tools/lldb-server/TestGdbRemoteExitCode.py lldb-unit :: Utility/./UtilityTests/AnsiTerminal.WhiteSpace lldb-api :: commands/expression/import-std-module/unique_ptr/TestUniquePtrFromStdModule.py lldb-shell :: SymbolFile/DWARF/find-method-local-struct.cpp lldb-unit :: Expression/./ExpressionTests/DiagnosticManagerTest.PutString lldb-unit :: Utility/./UtilityTests/RangeTest.LessThanInvalid lldb-shell :: ObjectFile/ELF/section-types.yaml lldb-unit :: Symbol/./SymbolTests/TestTypeSystemClang.TestConvertAccessTypeToAccessSpecifier lldb-unit :: Utility/./UtilityTests/EnvironmentTest.EnvpConstruction lldb-api :: arm/breakpoint-it/TestBreakpointIt.py lldb-unit :: Utility/./UtilityTests/StreamTest.AddressRangeSize lldb-api :: commands/expression/import-std-module/weak_ptr-dbg-info-content/TestDbgInfoContentWeakPtrFromStdModule.py lldb-shell :: Breakpoint/single-file-split-dwarf.test lldb-api :: commands/command/source/TestCommandSource.py lldb-shell :: BuildScript/toolchain-clang.test lldb-unit :: Utility/./UtilityTests/StreamTest.PutHex32ByteOrderLittle

Hide Details

Hide Details

Testing Time: 3644.54s Unsupported : 159 Passed : 1640 Expectedly Failed: 6 Failed : 263 FAILED: tools/lldb/test/CMakeFiles/check-lldb-lit cd /Users/buildslave/jenkins/workspace/lldb-cmake-sanitized/lldb-build/tools/lldb/test && /usr/local/Frameworks/Python.framework/Versions/3.7/bin/python3.7 /Users/buildslave/jenkins/workspace/lldb-cmake-sanitized/lldb-build/./bin/llvm-lit -v --time-tests --shuffle --xunit-xml-output=/Users/buildslave/jenkins/workspace/lldb-cmake-sanitized/test/results.xml -v -j 4 --timeout 1200 /Users/buildslave/jenkins/workspace/lldb-cmake-sanitized/lldb-build/tools/lldb/test ninja: build stopped: subcommand failed. Command failed: Command '['/usr/bin/env', 'TERM=vt100', '/usr/local/bin/ninja', '-v', 'check-lldb']' returned non-zero exit status 1. Command: ['/usr/bin/env', 'TERM=vt100', '/usr/local/bin/ninja', '-v', 'check-lldb'] [Pipeline] } [Pipeline] // timeout [Pipeline] } [Pipeline] // stage [Pipeline] stage [Pipeline] { (Declarative: Post Actions) [Pipeline] scanForIssues [Clang (LLVM based)] Sleeping for 5 seconds due to JENKINS-32191... [Clang (LLVM based)] Parsing console log (workspace: '/Users/buildslave/jenkins/workspace/lldb-cmake-sanitized') [Clang (LLVM based)] Successfully parsed console log [Clang (LLVM based)] -> found 2 issues (skipped 0 duplicates) [Clang (LLVM based)] Post processing issues on 'green-dragon-23' with source code encoding 'UTF-8' [Clang (LLVM based)] Creating SCM blamer to obtain author and commit information for affected files [Clang (LLVM based)] Creating SCM miner to obtain statistics for affected repository files [Clang (LLVM based)] Resolving file names for all issues in source directory '/Users/buildslave/jenkins/workspace/lldb-cmake-sanitized' [Clang (LLVM based)] -> resolved paths in source directory (1 found, 0 not found) [Clang (LLVM based)] Resolving module names from module definitions (build.xml, pom.xml, or Manifest.mf files) [Clang (LLVM based)] -> resolved module names for 2 issues [Clang (LLVM based)] Resolving package names (or namespaces) by parsing the affected files [Clang (LLVM based)] -> resolved package names of 1 affected files [Clang (LLVM based)] No filter has been set, publishing all 2 issues [Clang (LLVM based)] Creating fingerprints for all affected code blocks to track issues over different builds [Clang (LLVM based)] -> created fingerprints for 2 issues (skipped 0 issues) [Clang (LLVM based)] Copying affected files to Jenkins' build folder '/Users/Shared/Jenkins/Home/jobs/lldb-cmake-sanitized/builds/1592/files-with-issues' [Clang (LLVM based)] -> 1 copied, 0 not in workspace, 0 not-found, 0 with I/O error [Pipeline] junit Recording test results [Pipeline] } [Pipeline] // stage [Pipeline] } [Pipeline] // withEnv [Pipeline] } [Pipeline] // node [Pipeline] End of Pipeline ERROR: script returned exit code 1 Finished: FAILURE