FailedConsole Output

Skipping 8,856 KB.. Full Log
ead/step_out/TestThreadStepOut.py (620 of 2074)
PASS: lldb-unit :: Utility/./UtilityTests/ArgsTest.AppendArguments (621 of 2074)
PASS: lldb-unit :: Utility/./UtilityTests/DataExtractorTest.GetCStrAtEnd (622 of 2074)
PASS: lldb-unit :: Symbol/./SymbolTests/TestClangASTImporter.ImportInvalidType (623 of 2074)
PASS: lldb-unit :: Language/Highlighting/./HighlighterTests/HighlighterTest.ClangTrailingBackslashBeforeNewline (624 of 2074)
PASS: lldb-api :: commands/disassemble/basic/TestDisassembleBreakpoint.py (625 of 2074)
PASS: lldb-api :: lang/objc/objc-ivar-stripped/TestObjCIvarStripped.py (626 of 2074)
PASS: lldb-api :: functionalities/type_completion/TestTypeCompletion.py (627 of 2074)
PASS: lldb-unit :: Utility/./UtilityTests/StreamTest.PutRawBytesToLittleEndian (628 of 2074)
PASS: lldb-api :: functionalities/thread/concurrent_events/TestConcurrentDelayedCrashWithBreakpointWatchpoint.py (629 of 2074)
PASS: lldb-api :: commands/target/select/TestTargetSelect.py (630 of 2074)
PASS: lldb-api :: lang/cpp/scope/TestCppScope.py (631 of 2074)
PASS: lldb-shell :: ObjectFile/PECOFF/symbol.yaml (632 of 2074)
UNSUPPORTED: lldb-api :: functionalities/darwin_log/source/info/TestDarwinLogSourceInfo.py (633 of 2074)
UNSUPPORTED: lldb-shell :: ObjectFile/PECOFF/disassemble-thumb.yaml (634 of 2074)
PASS: lldb-api :: lang/c/function_types/TestFunctionTypes.py (635 of 2074)
PASS: lldb-api :: lang/cpp/virtual-functions/TestCppVirtualFunctions.py (636 of 2074)
PASS: lldb-unit :: Language/Highlighting/./HighlighterTests/HighlighterTest.ClangSquareBrackets (637 of 2074)
PASS: lldb-unit :: Utility/./UtilityTests/StreamTest.PutPtr (638 of 2074)
PASS: lldb-unit :: Utility/./UtilityTests/ScalarTest.ComparisonFloat (639 of 2074)
PASS: lldb-shell :: Register/x86-64-read.test (640 of 2074)
PASS: lldb-api :: functionalities/thread/state_after_expression/TestStateAfterExpression.py (641 of 2074)
PASS: lldb-shell :: Reproducer/Functionalities/TestExpressionEvaluation.test (642 of 2074)
PASS: lldb-shell :: Register/x86-64-gp-read.test (643 of 2074)
PASS: lldb-unit :: Process/minidump/./LLDBMinidumpTests/MinidumpParserTest.GetThreadContext_x86_32_wow64 (644 of 2074)
PASS: lldb-api :: functionalities/thread/exit_during_step/TestExitDuringStep.py (645 of 2074)
PASS: lldb-api :: tools/lldb-server/TestLldbGdbServer.py (646 of 2074)
PASS: lldb-shell :: SymbolFile/DWARF/debug-types-dwo-cross-reference.cpp (647 of 2074)
PASS: lldb-api :: functionalities/thread/thread_specific_break/TestThreadSpecificBreakpoint.py (648 of 2074)
UNSUPPORTED: lldb-api :: functionalities/darwin_log/filter/regex/category/TestDarwinLogFilterRegexCategory.py (649 of 2074)
PASS: lldb-shell :: Reproducer/Functionalities/TestStepping.test (650 of 2074)
PASS: lldb-unit :: UnwindAssembly/x86/./UnwindAssemblyx86Tests/Testx86AssemblyInspectionEngine.TestSubRSP (651 of 2074)
PASS: lldb-unit :: Utility/./UtilityTests/SerializationRountripTest.SerializeDeserializeCStringArrayNullptr (652 of 2074)
PASS: lldb-unit :: Process/gdb-remote/./ProcessGdbRemoteTests/GDBRemoteCommunicationClientTest.ReadRegister (653 of 2074)
PASS: lldb-unit :: Utility/./UtilityTests/StreamTest.ShiftOperatorChars (654 of 2074)
PASS: lldb-api :: tools/lldb-server/TestGdbRemoteRegisterState.py (655 of 2074)
PASS: lldb-unit :: Utility/./UtilityTests/LogChannelEnabledTest.LogGetLogThread (656 of 2074)
PASS: lldb-unit :: Utility/./UtilityTests/FileSpecTest.Yaml (657 of 2074)
PASS: lldb-api :: functionalities/breakpoint/auto_continue/TestBreakpointAutoContinue.py (658 of 2074)
PASS: lldb-unit :: Utility/./UtilityTests/LogChannelTest.Disable (659 of 2074)
PASS: lldb-shell :: SymbolFile/NativePDB/break-by-line.cpp (660 of 2074)
PASS: lldb-unit :: Utility/./UtilityTests/UriParserTest.SchemeHostSeparator2 (661 of 2074)
UNSUPPORTED: lldb-api :: functionalities/tsan/cpp_global_location/TestTsanCPPGlobalLocation.py (662 of 2074)
PASS: lldb-unit :: Symbol/./SymbolTests/TestTypeSystemClang.TestGetEnumIntegerTypeInvalid (663 of 2074)
PASS: lldb-api :: functionalities/postmortem/elf-core/TestLinuxCore.py (664 of 2074)
PASS: lldb-unit :: Utility/./UtilityTests/Flags.Test (665 of 2074)
PASS: lldb-api :: functionalities/breakpoint/breakpoint_command/TestBreakpointCommandsFromPython.py (666 of 2074)
PASS: lldb-shell :: SymbolFile/NativePDB/globals-fundamental.cpp (667 of 2074)
PASS: lldb-api :: commands/expression/import-std-module/deque-dbg-info-content/TestDbgInfoContentDequeFromStdModule.py (668 of 2074)
PASS: lldb-api :: driver/batch_mode/TestBatchMode.py (669 of 2074)
PASS: lldb-shell :: Breakpoint/debug_rnglist_offset_pair.test (670 of 2074)
PASS: lldb-api :: functionalities/breakpoint/scripted_bkpt/TestScriptedResolver.py (671 of 2074)
PASS: lldb-unit :: Utility/./UtilityTests/FileSpecTest.FormatFileSpec (672 of 2074)
PASS: lldb-api :: commands/expression/function_template_specialization_temp_args/TestFunctionTemplateSpecializationTempArgs.py (673 of 2074)
PASS: lldb-unit :: ScriptInterpreter/Python/./ScriptInterpreterPythonTests/PythonDataObjectsTest.TestModuleNameResolutionNoDot (674 of 2074)
PASS: lldb-api :: commands/expression/rdar42038760/TestScalarURem.py (675 of 2074)
PASS: lldb-shell :: ObjectFile/ELF/netbsd-exec-8.99.30-amd64.yaml (676 of 2074)
PASS: lldb-unit :: UnwindAssembly/x86/./UnwindAssemblyx86Tests/Testx86AssemblyInspectionEngine.TestDisassemblyMidFunctionEpilogues (677 of 2074)
PASS: lldb-api :: functionalities/thread/concurrent_events/TestConcurrentWatchBreakDelay.py (678 of 2074)
PASS: lldb-shell :: Settings/TestLineMarkerColor.test (679 of 2074)
PASS: lldb-unit :: Symbol/./SymbolTests/TestClangASTImporter.RecordLayout (680 of 2074)
PASS: lldb-unit :: Utility/./UtilityTests/StreamTest.PutHex8 (681 of 2074)
PASS: lldb-unit :: Utility/./UtilityTests/ArgsTest.TestTrailingBackslash (682 of 2074)
XFAIL: lldb-shell :: SymbolFile/DWARF/find-type-in-function.cpp (683 of 2074)
PASS: lldb-unit :: Host/./HostTests/FileSystemTest.GetPermissions (684 of 2074)
PASS: lldb-api :: lang/c/conflicting-symbol/TestConflictingSymbol.py (685 of 2074)
PASS: lldb-api :: functionalities/data-formatter/data-formatter-objc/TestDataFormatterObjNSException.py (686 of 2074)
PASS: lldb-shell :: SymbolFile/DWARF/debug-types-address-ranges.s (687 of 2074)
PASS: lldb-shell :: SymbolFile/Breakpad/line-table-missing-file.test (688 of 2074)
PASS: lldb-api :: commands/process/launch/TestProcessLaunch.py (689 of 2074)
PASS: lldb-unit :: Utility/./UtilityTests/SerializationRountripTest.SerializeDeserializePodReferences (690 of 2074)
PASS: lldb-api :: python_api/value/TestValueAPI.py (691 of 2074)
PASS: lldb-shell :: Breakpoint/implicit_const_form_support.test (692 of 2074)
PASS: lldb-shell :: Breakpoint/debug_rnglistx_rlex.test (693 of 2074)
PASS: lldb-api :: python_api/sbvalue_persist/TestSBValuePersist.py (694 of 2074)
PASS: lldb-unit :: Utility/./UtilityTests/RecordReplayTest.InstrumentedBar (695 of 2074)
PASS: lldb-unit :: Utility/./UtilityTests/StreamTest.PutRawBytesToBigEndian (696 of 2074)
PASS: lldb-unit :: Process/gdb-remote/./ProcessGdbRemoteTests/GDBRemoteCommunicationClientTest.SyncThreadState (697 of 2074)
UNSUPPORTED: lldb-api :: lang/objc/modules-update/TestClangModulesUpdate.py (698 of 2074)
PASS: lldb-unit :: ScriptInterpreter/Python/./ScriptInterpreterPythonTests/PythonDataObjectsTest.TestTypeNameResolutionNoDot (699 of 2074)
PASS: lldb-api :: lang/cpp/const_this/TestConstThis.py (700 of 2074)
PASS: lldb-api :: tools/lldb-vscode/stackTrace/TestVSCode_stackTrace.py (701 of 2074)
PASS: lldb-shell :: ObjectFile/wasm/unified-debug-sections.yaml (702 of 2074)
UNSUPPORTED: lldb-shell :: ObjectFile/ELF/minidebuginfo-set-and-hit-breakpoint.test (703 of 2074)
PASS: lldb-api :: commands/expression/weak_symbols/TestWeakSymbols.py (704 of 2074)
PASS: lldb-unit :: Utility/./UtilityTests/RangeTest.Equal (705 of 2074)
PASS: lldb-shell :: Reproducer/TestCaptureEnvOverride.test (706 of 2074)
PASS: lldb-api :: lang/objc/foundation/TestObjCMethods2.py (707 of 2074)
UNSUPPORTED: lldb-api :: lang/objc/objc-dynamic-value/TestObjCDynamicValue.py (708 of 2074)
PASS: lldb-shell :: Reproducer/TestPythonImport.test (709 of 2074)
PASS: lldb-unit :: Interpreter/./InterpreterTests/CompletionTest.FileCompletionAbsolute (710 of 2074)
PASS: lldb-unit :: Host/./HostTests/NativeProcessProtocolTest.SetBreakpointFailVerify (711 of 2074)
PASS: lldb-api :: commands/expression/import-std-module/forward_list/TestForwardListFromStdModule.py (712 of 2074)
UNSUPPORTED: lldb-api :: lang/objc/ptr_refs/TestPtrRefsObjC.py (713 of 2074)
PASS: lldb-api :: macosx/indirect_symbol/TestIndirectSymbols.py (714 of 2074)
PASS: lldb-unit :: SymbolFile/NativePDB/./SymbolFileNativePDBTests/PDBFPOProgramToDWARFExpressionTests.UnresolvedDependentCyclicRegisterAssignmentReference (715 of 2074)
UNSUPPORTED: lldb-api :: functionalities/darwin_log/source/debug/TestDarwinLogSourceDebug.py (716 of 2074)
PASS: lldb-api :: functionalities/thread/create_after_attach/TestCreateAfterAttach.py (717 of 2074)
UNSUPPORTED: lldb-shell :: SymbolFile/PDB/function-nested-block.test (718 of 2074)
PASS: lldb-api :: commands/watchpoints/watchpoint_set_command/TestWatchLocationWithWatchSet.py (719 of 2074)
PASS: lldb-api :: lang/cpp/virtual-overload/TestVirtualOverload.py (720 of 2074)
UNSUPPORTED: lldb-api :: functionalities/data-formatter/data-formatter-stl/libstdcpp/smart_ptr/TestDataFormatterStdSmartPtr.py (721 of 2074)
PASS: lldb-api :: tools/lldb-server/TestAppleSimulatorOSType.py (722 of 2074)
PASS: lldb-shell :: SymbolFile/Breakpad/unwind-via-stack-win.test (723 of 2074)
PASS: lldb-unit :: Language/Highlighting/./HighlighterTests/HighlighterTest.DefaultHighlighterWithCursor (724 of 2074)
PASS: lldb-unit :: Utility/./UtilityTests/StreamTest.AddressRangeInvalidRange (725 of 2074)
UNSUPPORTED: lldb-shell :: ScriptInterpreter/Lua/bindings.test (726 of 2074)
PASS: lldb-unit :: Utility/./UtilityTests/StringExtractorTest.GetHexBytes (727 of 2074)
PASS: lldb-unit :: Process/minidump/./LLDBMinidumpTests/MinidumpParserTest.GetThreadsAndGetThreadContext (728 of 2074)
UNSUPPORTED: lldb-shell :: SymbolFile/Breakpad/stack-cfi-arm.yaml (729 of 2074)
PASS: lldb-unit :: Language/Highlighting/./HighlighterTests/HighlighterTest.HighlighterSelectionPath (730 of 2074)
PASS: lldb-api :: python_api/section/TestSectionAPI.py (731 of 2074)
PASS: lldb-api :: commands/frame/recognizer/TestFrameRecognizer.py (732 of 2074)
PASS: lldb-unit :: Process/gdb-remote/./ProcessGdbRemoteTests/GDBRemoteClientBaseTest.SendPacketAndReceiveResponseWithOutputSupport (733 of 2074)
PASS: lldb-unit :: Utility/./UtilityTests/BinaryStreamTest.PutSLEB128TwoBytes (734 of 2074)
PASS: lldb-api :: functionalities/signal/handle-abrt/TestHandleAbort.py (735 of 2074)
PASS: lldb-api :: lang/cpp/template/TestTemplateArgs.py (736 of 2074)
PASS: lldb-api :: lang/c/step_over_no_deadlock/TestStepOverDoesntBlock.py (737 of 2074)
PASS: lldb-unit :: DataFormatter/./LLDBFormatterTests/FormatManagerTests.CompatibleLangs (738 of 2074)
PASS: lldb-shell :: Breakpoint/debug_addrx.test (739 of 2074)
PASS: lldb-unit :: Utility/./UtilityTests/RangeTest.DoesIntersect (740 of 2074)
PASS: lldb-unit :: Utility/./UtilityTests/PassiveReplayTest.InstrumentedFoo (741 of 2074)
PASS: lldb-api :: lang/objc/objc-checker/TestObjCCheckers.py (742 of 2074)
PASS: lldb-shell :: BuildScript/script-args.test (743 of 2074)
PASS: lldb-unit :: Utility/./UtilityTests/StringExtractorTest.GetHexU8_Extra (744 of 2074)
PASS: lldb-api :: commands/expression/inline-namespace/TestInlineNamespace.py (745 of 2074)
PASS: lldb-api :: lang/cpp/inlines/TestInlines.py (746 of 2074)
PASS: lldb-unit :: ObjectFile/ELF/./ObjectFileELFTests/ObjectFileELFTest.GetSymtab_NoSymEntryPointArmAddressClass (747 of 2074)
PASS: lldb-api :: commands/process/signal/TestProcessSignal.py (748 of 2074)
PASS: lldb-unit :: SymbolFile/NativePDB/./SymbolFileNativePDBTests/PDBFPOProgramToDWARFExpressionTests.MultipleIndependentAssignments (749 of 2074)
PASS: lldb-unit :: Language/Highlighting/./HighlighterTests/HighlighterTest.ClangScalarLiterals (750 of 2074)
UNSUPPORTED: lldb-shell :: Unwind/eh-frame-small-fde.test (751 of 2074)
PASS: lldb-api :: commands/expression/result_numbering/TestResultNumbering.py (752 of 2074)
PASS: lldb-api :: commands/breakpoint/command/list/TestBreakpointCommandList.py (753 of 2074)
PASS: lldb-api :: functionalities/plugins/python_os_plugin/stepping_plugin_threads/TestOSPluginStepping.py (754 of 2074)
PASS: lldb-unit :: Utility/./UtilityTests/RangeTest.Union (755 of 2074)
PASS: lldb-unit :: Host/./HostTests/SocketTest.UDPGetConnectURI (756 of 2074)
PASS: lldb-unit :: Symbol/./SymbolTests/TestTypeSystemClang.TestDeletingImplicitCopyCstrDueToMoveCStr (757 of 2074)
PASS: lldb-unit :: ScriptInterpreter/Python/./ScriptInterpreterPythonTests/PythonDataObjectsTest.TestPythonInteger (758 of 2074)
PASS: lldb-unit :: Utility/./UtilityTests/StringListTest.LongestCommonPrefixSingleElement (759 of 2074)
PASS: lldb-shell :: Recognizer/assert.test (760 of 2074)
PASS: lldb-api :: lang/cpp/char8_t/TestCxxChar8_t.py (761 of 2074)
PASS: lldb-shell :: ObjectFile/ELF/section-types.yaml (762 of 2074)
PASS: lldb-unit :: Process/gdb-remote/./ProcessGdbRemoteTests/GDBRemoteCommunicationClientTest.SendStopTracePacket (763 of 2074)
PASS: lldb-unit :: Utility/./UtilityTests/LogChannelEnabledTest.LLDB_LOG_ERROR (764 of 2074)
PASS: lldb-api :: functionalities/param_entry_vals/basic_entry_values/TestBasicEntryValues.py (765 of 2074)
PASS: lldb-shell :: ObjectFile/ELF/duplicate-section.yaml (766 of 2074)
PASS: lldb-unit :: Utility/./UtilityTests/StringListTest.ForRangeEmpty (767 of 2074)
UNSUPPORTED: lldb-api :: benchmarks/turnaround/TestCompileRunToBreakpointTurnaround.py (768 of 2074)
PASS: lldb-unit :: tools/lldb-server/tests/./LLDBServerTests/StandardStartupTest.TestStopReplyContainsThreadPcs (769 of 2074)
PASS: lldb-unit :: Target/./TargetTests/StackFrameRecognizerTest.NullModuleRegex (770 of 2074)
UNSUPPORTED: lldb-api :: functionalities/thread/state/TestThreadStates.py (771 of 2074)
PASS: lldb-unit :: Process/gdb-remote/./ProcessGdbRemoteTests/GDBRemoteCommunicationClientTest.SendSignalsToIgnore (772 of 2074)
PASS: lldb-api :: commands/expression/test/TestExprs.py (773 of 2074)
PASS: lldb-unit :: SymbolFile/NativePDB/./SymbolFileNativePDBTests/PDBFPOProgramToDWARFExpressionTests.InvalidOpBinary (774 of 2074)
PASS: lldb-api :: lang/c/array_types/TestArrayTypes.py (775 of 2074)
PASS: lldb-shell :: ObjectFile/ELF/section-addresses.yaml (776 of 2074)
PASS: lldb-shell :: ObjectFile/Breakpad/sections-trailing-func.test (777 of 2074)
PASS: lldb-shell :: Driver/TestCommands.test (778 of 2074)
PASS: lldb-api :: commands/frame/diagnose/local-variable/TestLocalVariable.py (779 of 2074)
PASS: lldb-api :: python_api/hello_world/TestHelloWorld.py (780 of 2074)
UNSUPPORTED: lldb-api :: lang/objc/bitfield_ivars/TestBitfieldIvars.py (781 of 2074)
PASS: lldb-unit :: Utility/./UtilityTests/XcodeSDKTest.GetSDKTypeForTriple (782 of 2074)
PASS: lldb-api :: tools/lldb-server/TestGdbRemote_qThreadStopInfo.py (783 of 2074)
PASS: lldb-api :: commands/expression/class_template_specialization_empty_pack/TestClassTemplateSpecializationParametersHandling.py (784 of 2074)
PASS: lldb-api :: lang/cpp/global_variables/TestCPPGlobalVariables.py (785 of 2074)
PASS: lldb-api :: lang/c/complex_int/TestComplexInt.py (786 of 2074)
PASS: lldb-unit :: Host/./HostTests/SocketTest.TCPListen0GetPort (787 of 2074)
PASS: lldb-api :: functionalities/inferior-changed/TestInferiorChanged.py (788 of 2074)
PASS: lldb-api :: functionalities/data-formatter/cstring-utf8-summary/TestCstringUnicode.py (789 of 2074)
PASS: lldb-unit :: Utility/./UtilityTests/BinaryStreamTest.PutSLEB128EightBytes (790 of 2074)
PASS: lldb-unit :: Utility/./UtilityTests/StringExtractorTest.InitEmpty (791 of 2074)
PASS: lldb-unit :: Symbol/./SymbolTests/TestClangASTImporter.MetadataPropagation (792 of 2074)
PASS: lldb-unit :: Utility/./UtilityTests/BinaryStreamTest.PutSLEB128One (793 of 2074)
PASS: lldb-unit :: Utility/./UtilityTests/ArchSpecTest.MergeFromMachOUnknown (794 of 2074)
PASS: lldb-api :: lang/objc/objc-struct-argument/TestObjCStructArgument.py (795 of 2074)
PASS: lldb-unit :: Process/minidump/./LLDBMinidumpTests/MinidumpParserTest.InvalidMinidump (796 of 2074)
PASS: lldb-api :: macosx/load-kext/TestLoadKext.py (797 of 2074)
PASS: lldb-api :: python_api/type/TestTypeList.py (798 of 2074)
PASS: lldb-api :: commands/expression/regression-access-function-template-in-record/TestRegressionAccessFunctionTemplateInRecord.py (799 of 2074)
PASS: lldb-api :: functionalities/breakpoint/serialize/TestBreakpointSerialization.py (800 of 2074)
PASS: lldb-unit :: Utility/./UtilityTests/UriParserTest.BracketedHostnameWithColon (801 of 2074)
PASS: lldb-api :: functionalities/data-formatter/data-formatter-stl/libcxx/list/TestDataFormatterLibcxxList.py (802 of 2074)
PASS: lldb-shell :: SymbolFile/Breakpad/line-table-mixed-path-styles.test (803 of 2074)
PASS: lldb-unit :: Utility/./UtilityTests/StatusTest.ErrorConversion (804 of 2074)
PASS: lldb-unit :: Utility/./UtilityTests/StatusTest.Formatv (805 of 2074)
PASS: lldb-unit :: Core/./LLDBCoreTests/RichManglingContextTest.SwitchProvider (806 of 2074)
PASS: lldb-unit :: Utility/./UtilityTests/ListenerTest.GetEventImmediate (807 of 2074)
PASS: lldb-unit :: Utility/./UtilityTests/ScalarTest.APIntConstructor (808 of 2074)
PASS: lldb-unit :: Utility/./UtilityTests/ArgsTest.EscapeLLDBCommandArgument (809 of 2074)
PASS: lldb-api :: functionalities/stats_api/TestStatisticsAPI.py (810 of 2074)
PASS: lldb-shell :: Settings/TestFrameFormatMangling.test (811 of 2074)
UNSUPPORTED: lldb-shell :: Unwind/eh-frame-augment-noop.test (812 of 2074)
PASS: lldb-api :: lang/cpp/rvalue-references/TestRvalueReferences.py (813 of 2074)
PASS: lldb-api :: macosx/safe-to-func-call/TestSafeFuncCalls.py (814 of 2074)
PASS: lldb-unit :: Utility/./UtilityTests/AnsiTerminal.Empty (815 of 2074)
PASS: lldb-unit :: Utility/./UtilityTests/FileSpecTest.Match (816 of 2074)
PASS: lldb-unit :: Host/./HostTests/MainLoopTest.Signal (817 of 2074)
PASS: lldb-api :: commands/expression/entry-bp/TestExprEntryBP.py (818 of 2074)
UNSUPPORTED: lldb-api :: macosx/macabi/TestMacABImacOSFramework.py (819 of 2074)
UNSUPPORTED: lldb-shell :: SymbolFile/PDB/calling-conventions.test (820 of 2074)
PASS: lldb-api :: lang/c/stepping/TestStepAndBreakpoints.py (821 of 2074)
PASS: lldb-shell :: SymbolFile/Breakpad/symtab-macho.test (822 of 2074)
PASS: lldb-api :: commands/help/TestHelp.py (823 of 2074)
PASS: lldb-api :: lang/cpp/namespace_definitions/TestNamespaceDefinitions.py (824 of 2074)
PASS: lldb-api :: functionalities/gdb_remote_client/TestNestedRegDefinitions.py (825 of 2074)
PASS: lldb-api :: functionalities/signal/TestSendSignal.py (826 of 2074)
PASS: lldb-unit :: Utility/./UtilityTests/Flags.Clear (827 of 2074)
PASS: lldb-unit :: Utility/./UtilityTests/ArgsTest.TestUnknownEscape (828 of 2074)
PASS: lldb-unit :: Utility/./UtilityTests/StreamTest.PutHex32ByteOrderLittle (829 of 2074)
PASS: lldb-shell :: SymbolFile/NativePDB/function-types-classes.cpp (830 of 2074)
PASS: lldb-unit :: Utility/./UtilityTests/StringExtractorTest.GetHexBytes_Underflow (831 of 2074)
PASS: lldb-api :: commands/expression/import-std-module/conflicts/TestStdModuleWithConflicts.py (832 of 2074)
PASS: lldb-api :: lang/objc/foundation/TestRuntimeTypes.py (833 of 2074)
PASS: lldb-unit :: UnwindAssembly/x86/./UnwindAssemblyx86Tests/Testx86AssemblyInspectionEngine.TestPopEBX (834 of 2074)
PASS: lldb-unit :: Utility/./UtilityTests/ScalarTest.CastOperations (835 of 2074)
PASS: lldb-api :: functionalities/breakpoint/step_over_breakpoint/TestStepOverBreakpoint.py (836 of 2074)
PASS: lldb-unit :: Utility/./UtilityTests/ArgsTest.TestArgv (837 of 2074)
PASS: lldb-api :: python_api/watchpoint/TestSetWatchpoint.py (838 of 2074)
PASS: lldb-unit :: Process/minidump/./LLDBMinidumpTests/MinidumpParserTest.GetMiscInfo_no_stream (839 of 2074)
PASS: lldb-shell :: ObjectFile/wasm/basic.yaml (840 of 2074)
PASS: lldb-shell :: ObjectFile/ELF/many-sections.s (841 of 2074)
PASS: lldb-unit :: Utility/./UtilityTests/StringListTest.InsertStringAtIndexEnd (842 of 2074)
PASS: lldb-unit :: Utility/./UtilityTests/OptionsWithRawTest.EmptyInput (843 of 2074)
PASS: lldb-unit :: ObjectFile/Breakpad/./ObjectFileBreakpadTests/LineRecord.parse (844 of 2074)
PASS: lldb-api :: macosx/function-starts/TestFunctionStarts.py (845 of 2074)
PASS: lldb-shell :: Driver/TestProcessAttach.test (846 of 2074)
PASS: lldb-unit :: ScriptInterpreter/Python/./ScriptInterpreterPythonTests/PythonDataObjectsTest.TestPythonListToStructuredList (847 of 2074)
PASS: lldb-unit :: Utility/./UtilityTests/StreamTest.PutSLEB128 (848 of 2074)
PASS: lldb-unit :: Utility/./UtilityTests/StringListTest.AppendStringMove (849 of 2074)
PASS: lldb-api :: functionalities/thread/concurrent_events/TestConcurrentTwoWatchpointsOneBreakpoint.py (850 of 2074)
PASS: lldb-api :: lang/cpp/bitfields/TestCppBitfields.py (851 of 2074)
PASS: lldb-unit :: Utility/./UtilityTests/RangeTest.NotEqualInvalid (852 of 2074)
PASS: lldb-api :: functionalities/dead-strip/TestDeadStrip.py (853 of 2074)
PASS: lldb-unit :: SymbolFile/DWARF/./SymbolFileDWARFTests/SymbolFileDWARFTests.TestAbbrevOutOfOrder (854 of 2074)
PASS: lldb-unit :: Utility/./UtilityTests/StringExtractorTest.GetHexU8_InvalidHex_NoEof (855 of 2074)
PASS: lldb-shell :: Unwind/thread-step-out-ret-addr-check.test (856 of 2074)
PASS: lldb-unit :: Utility/./UtilityTests/VMRange.Comparison (857 of 2074)
PASS: lldb-unit :: Utility/./UtilityTests/ScalarTest.Equality (858 of 2074)
PASS: lldb-unit :: Host/./HostTests/SocketTest.DomainGetConnectURI (859 of 2074)
PASS: lldb-unit :: Language/CPlusPlus/./LanguageCPlusPlusTests/CPlusPlusLanguage.ExtractContextAndIdentifier (860 of 2074)
PASS: lldb-api :: lang/objc/foundation/TestObjCMethodsNSError.py (861 of 2074)
PASS: lldb-unit :: Host/./HostTests/ConnectionFileDescriptorTest.TCPGetURIv4 (862 of 2074)
PASS: lldb-unit :: ScriptInterpreter/Python/./ScriptInterpreterPythonTests/PythonDataObjectsTest.TestResetting (863 of 2074)
PASS: lldb-unit :: Platform/./LLDBPlatformTests/PlatformDarwinTest.FindComponentInPath (864 of 2074)
PASS: lldb-unit :: Utility/./UtilityTests/DataExtractorTest.GetDouble (865 of 2074)
PASS: lldb-api :: source-manager/TestSourceManager.py (866 of 2074)
PASS: lldb-api :: lang/c/global_variables/TestGlobalVariables.py (867 of 2074)
PASS: lldb-api :: functionalities/tail_call_frames/cross_dso/TestCrossDSOTailCalls.py (868 of 2074)
PASS: lldb-api :: functionalities/breakpoint/breakpoint_names/TestBreakpointNames.py (869 of 2074)
PASS: lldb-unit :: Utility/./UtilityTests/ConstStringTest.FromMidOfBufferStringRef (870 of 2074)
PASS: lldb-unit :: Utility/./UtilityTests/FileSpecTest.EqualDotsPosix (871 of 2074)
PASS: lldb-unit :: SymbolFile/NativePDB/./SymbolFileNativePDBTests/PDBFPOProgramToDWARFExpressionTests.InvalidOpUnary (872 of 2074)
PASS: lldb-api :: tools/lldb-server/TestGdbRemoteSingleStep.py (873 of 2074)
PASS: lldb-unit :: Utility/./UtilityTests/OptionsWithRawTest.SingleWhitespaceInput (874 of 2074)
PASS: lldb-api :: lang/cpp/exceptions/TestCPPExceptionBreakpoints.py (875 of 2074)
PASS: lldb-unit :: SymbolFile/NativePDB/./SymbolFileNativePDBTests/PDBFPOProgramToDWARFExpressionTests.UnresolvedCyclicRegisterAssignmentReference (876 of 2074)
PASS: lldb-api :: commands/target/stop-hook/disable/TestTargetStopHookDisable.py (877 of 2074)
UNSUPPORTED: lldb-api :: arm/breakpoint-thumb-codesection/TestBreakpointThumbCodesection.py (878 of 2074)
PASS: lldb-unit :: Utility/./UtilityTests/AnsiTerminal.Twice (879 of 2074)
PASS: lldb-unit :: Utility/./UtilityTests/RangeTest.ContainsEndInclusive (880 of 2074)
PASS: lldb-unit :: UnwindAssembly/x86/./UnwindAssemblyx86Tests/Testx86AssemblyInspectionEngine.TestPopESI (881 of 2074)
PASS: lldb-shell :: SymbolFile/DWARF/dir-separator-posix.s (882 of 2074)
PASS: lldb-unit :: Expression/./ExpressionTests/DWARFExpression.DW_OP_unknown (883 of 2074)
PASS: lldb-api :: commands/command/history/TestCommandHistory.py (884 of 2074)
PASS: lldb-unit :: Utility/./UtilityTests/CompletionRequest.ShiftArguments (885 of 2074)
PASS: lldb-unit :: Interpreter/./InterpreterTests/OptionArgParserTest.toBoolean (886 of 2074)
PASS: lldb-api :: commands/expression/import-std-module/unique_ptr-dbg-info-content/TestUniquePtrDbgInfoContent.py (887 of 2074)
PASS: lldb-api :: functionalities/optimized_code/TestNoASanExceptionAfterEvalOP_piece.py (888 of 2074)
PASS: lldb-unit :: UnwindAssembly/x86/./UnwindAssemblyx86Tests/Testx86AssemblyInspectionEngine.TestDisassemblyJunkBytes (889 of 2074)
PASS: lldb-shell :: Minidump/Windows/find-module.test (890 of 2074)
UNSUPPORTED: lldb-api :: functionalities/data-formatter/data-formatter-stl/libstdcpp/string/TestDataFormatterStdString.py (891 of 2074)
PASS: lldb-shell :: Breakpoint/case-sensitive.test (892 of 2074)
PASS: lldb-api :: lang/cpp/alignas_base_class/TestAlignAsBaseClass.py (893 of 2074)
PASS: lldb-api :: functionalities/data-formatter/data-formatter-objc/TestDataFormatterObjCNSBundle.py (894 of 2074)
PASS: lldb-unit :: Expression/./ExpressionTests/DiagnosticManagerTest.GetStringNoDiags (895 of 2074)
PASS: lldb-unit :: Utility/./UtilityTests/StreamTest.SetIndentLevel (896 of 2074)
PASS: lldb-unit :: Process/gdb-remote/./ProcessGdbRemoteTests/GDBRemoteCommunicationClientTest.GetMemoryRegionInfoInvalidResponse (897 of 2074)
PASS: lldb-api :: commands/expression/import-std-module/stack/TestStackFromStdModule.py (898 of 2074)
PASS: lldb-api :: commands/target/stop-hook/enable/TestTargetStopHookEnable.py (899 of 2074)
PASS: lldb-unit :: Process/minidump/./LLDBMinidumpTests/MinidumpParserTest.GetMemoryRegionInfoLinuxMaps (900 of 2074)
PASS: lldb-unit :: Symbol/./SymbolTests/TestTypeSystemClang.TestFunctionTemplateInRecordConstruction (901 of 2074)
PASS: lldb-api :: commands/expression/top-level/TestTopLevelExprs.py (902 of 2074)
PASS: lldb-api :: functionalities/inferior-crashing/recursive-inferior/TestRecursiveInferiorStep.py (903 of 2074)
PASS: lldb-api :: lang/objc/objc-static-method-stripped/TestObjCStaticMethodStripped.py (904 of 2074)
PASS: lldb-api :: tools/lldb-server/TestGdbRemote_vCont.py (905 of 2074)
PASS: lldb-api :: functionalities/data-formatter/data-formatter-proper-plurals/TestFormattersOneIsSingular.py (906 of 2074)
PASS: lldb-unit :: Utility/./UtilityTests/StringListTest.LongestCommonPrefixDuplicateElement (907 of 2074)
PASS: lldb-api :: sanity/TestSettingSkipping.py (908 of 2074)
PASS: lldb-unit :: Utility/./UtilityTests/BinaryStreamTest.PutULEB128FourBytes (909 of 2074)
PASS: lldb-shell :: SymbolFile/DWARF/inline-function-address-shared.test (910 of 2074)
PASS: lldb-api :: commands/expression/dollar-in-variable/TestDollarInVariable.py (911 of 2074)
PASS: lldb-unit :: Utility/./UtilityTests/StreamTest.Indent (912 of 2074)
UNSUPPORTED: lldb-api :: lang/cpp/static_members/TestCPPStaticMembers.py (913 of 2074)
PASS: lldb-unit :: Process/minidump/./LLDBMinidumpTests/MinidumpParserTest.GetMemoryRegionInfoFromMemoryList (914 of 2074)
PASS: lldb-api :: functionalities/deleted-executable/TestDeletedExecutable.py (915 of 2074)
PASS: lldb-unit :: Expression/./ExpressionTests/CppModuleConfigurationTest.LinuxLocalLibCpp (916 of 2074)
PASS: lldb-unit :: ScriptInterpreter/Python/./ScriptInterpreterPythonTests/PythonDataObjectsTest.TestPythonCallableCheck (917 of 2074)
PASS: lldb-api :: commands/expression/radar_9673664/TestExprHelpExamples.py (918 of 2074)
PASS: lldb-unit :: Utility/./UtilityTests/SubsystemRAIITest.SubsystemWithErrorSuccess (919 of 2074)
PASS: lldb-unit :: Expression/./ExpressionTests/CppModuleConfigurationTest.IgnoreLibStdCpp (920 of 2074)
PASS: lldb-shell :: SymbolFile/DWARF/dwp-separate-debug-file.cpp (921 of 2074)
PASS: lldb-api :: functionalities/breakpoint/move_nearest/TestMoveNearest.py (922 of 2074)
PASS: lldb-unit :: Utility/./UtilityTests/ArgsTest.TestOverwriteArgs (923 of 2074)
UNSUPPORTED: lldb-api :: functionalities/process_save_core/TestProcessSaveCore.py (924 of 2074)
PASS: lldb-unit :: Symbol/./SymbolTests/DWARFCallFrameInfoTest.Basic_eh (925 of 2074)
PASS: lldb-api :: commands/expression/unwind_expression/TestUnwindExpression.py (926 of 2074)
PASS: lldb-api :: functionalities/gdb_remote_client/TestArmRegisterDefinition.py (927 of 2074)
UNSUPPORTED: lldb-api :: commands/watchpoints/hello_watchlocation/TestWatchLocation.py (928 of 2074)
PASS: lldb-unit :: Utility/./UtilityTests/NameMatchesTest.Contains (929 of 2074)
PASS: lldb-api :: lang/mixed/TestMixedLanguages.py (930 of 2074)
UNSUPPORTED: lldb-api :: commands/gui/basic/TestGuiBasic.py (931 of 2074)
PASS: lldb-unit :: Language/Highlighting/./HighlighterTests/HighlighterTest.ClangCursorPos (932 of 2074)
PASS: lldb-unit :: Utility/./UtilityTests/ScalarTest.Promotion (933 of 2074)
UNSUPPORTED: lldb-api :: iohandler/unicode/TestUnicode.py (934 of 2074)
PASS: lldb-api :: commands/frame/var/TestFrameVar.py (935 of 2074)
XFAIL: lldb-shell :: Register/x86-64-ymm-write.test (936 of 2074)
PASS: lldb-shell :: ObjectFile/MachO/symtab.yaml (937 of 2074)
PASS: lldb-api :: functionalities/data-formatter/data-formatter-stl/libcxx/multiset/TestDataFormatterLibcxxMultiSet.py (938 of 2074)
PASS: lldb-unit :: Utility/./UtilityTests/StreamTest.AddressSize (939 of 2074)
PASS: lldb-unit :: Interpreter/./InterpreterTests/CompletionTest.DirCompletionAbsolute (940 of 2074)
PASS: lldb-shell :: VSCode/TestOptions.test (941 of 2074)
PASS: lldb-unit :: Utility/./UtilityTests/BinaryStreamTest.PutSLEB128SixBytes (942 of 2074)
UNSUPPORTED: lldb-shell :: Register/x86-64-zmm-read.test (943 of 2074)
PASS: lldb-unit :: ScriptInterpreter/Python/./ScriptInterpreterPythonTests/PythonDataObjectsTest.TestPythonStringToStructuredString (944 of 2074)
PASS: lldb-api :: tools/lldb-vscode/breakpoint/TestVSCode_setFunctionBreakpoints.py (945 of 2074)
PASS: lldb-api :: lang/objc/rdar-11355592/TestRdar11355592.py (946 of 2074)
PASS: lldb-api :: lang/cpp/stl/TestStdCXXDisassembly.py (947 of 2074)
PASS: lldb-shell :: SymbolFile/NativePDB/s_constant.cpp (948 of 2074)
UNSUPPORTED: lldb-api :: benchmarks/stepping/TestSteppingSpeed.py (949 of 2074)
PASS: lldb-shell :: Minidump/disassemble-no-module.yaml (950 of 2074)
UNSUPPORTED: lldb-api :: functionalities/darwin_log/basic/TestDarwinLogBasic.py (951 of 2074)
PASS: lldb-api :: commands/expression/persist_objc_pointeetype/TestPersistObjCPointeeType.py (952 of 2074)
PASS: lldb-unit :: Utility/./UtilityTests/StringExtractorTest.GetHexBytes_Partial (953 of 2074)
PASS: lldb-api :: types/TestFloatTypes.py (954 of 2074)
PASS: lldb-api :: commands/expression/test/TestExprs2.py (955 of 2074)
PASS: lldb-api :: functionalities/data-formatter/data-formatter-objc/TestDataFormatterObjCNSURL.py (956 of 2074)
PASS: lldb-api :: commands/expression/persistent_types/TestPersistentTypes.py (957 of 2074)
PASS: lldb-api :: commands/expression/import-std-module/empty-module/TestEmptyStdModule.py (958 of 2074)
PASS: lldb-api :: functionalities/gdb_remote_client/TestGDBRemoteClient.py (959 of 2074)
PASS: lldb-api :: commands/expression/unicode-in-variable/TestUnicodeInVariable.py (960 of 2074)
PASS: lldb-unit :: Utility/./UtilityTests/RangeTest.DefaultConstructor (961 of 2074)
UNSUPPORTED: lldb-api :: linux/add-symbols/TestTargetSymbolsAddCommand.py (962 of 2074)
PASS: lldb-unit :: ObjectFile/PECOFF/./ObjectFilePECOFFTests/PECallFrameInfoTest.Chained_eh (963 of 2074)
PASS: lldb-unit :: Utility/./UtilityTests/TildeExpressionResolver.ResolveFullPath (964 of 2074)
PASS: lldb-unit :: Utility/./UtilityTests/FileSpecTest.CopyByAppendingPathComponent (965 of 2074)
PASS: lldb-api :: types/TestShortType.py (966 of 2074)
PASS: lldb-shell :: ObjectFile/Breakpad/uuid-matching-mac.test (967 of 2074)
PASS: lldb-shell :: SymbolFile/Breakpad/symtab.test (968 of 2074)
PASS: lldb-api :: lang/c/unions/TestUnionMembers.py (969 of 2074)
UNSUPPORTED: lldb-shell :: Register/x86-64-ymm16-read.test (970 of 2074)
PASS: lldb-unit :: Utility/./UtilityTests/StreamTeeTest.DefaultConstructor (971 of 2074)
PASS: lldb-unit :: Symbol/./SymbolTests/LineEntryTest.GetSameLineContiguousAddressRangeNoInlines (972 of 2074)
PASS: lldb-api :: tools/lldb-vscode/breakpoint/TestVSCode_setBreakpoints.py (973 of 2074)
PASS: lldb-api :: tools/lldb-server/inferior-crash/TestGdbRemoteAbort.py (974 of 2074)
UNSUPPORTED: lldb-api :: linux/sepdebugsymlink/TestTargetSymbolsSepDebugSymlink.py (975 of 2074)
PASS: lldb-shell :: Driver/TestUseColor.test (976 of 2074)
PASS: lldb-unit :: Utility/./UtilityTests/GeneratorTest.GetOrCreate (977 of 2074)
PASS: lldb-unit :: Utility/./UtilityTests/StringListTest.DefaultConstructor (978 of 2074)
PASS: lldb-api :: commands/expression/namespace_local_var_same_name_obj_c/TestNamespaceLocalVarSameNameObjC.py (979 of 2074)
PASS: lldb-unit :: Utility/./UtilityTests/StringListTest.JoinSingle (980 of 2074)
PASS: lldb-unit :: SymbolFile/DWARF/./SymbolFileDWARFTests/SymbolFileDWARFTests.TestAbbrevNullAttrValidForm (981 of 2074)
PASS: lldb-unit :: Language/Highlighting/./HighlighterTests/HighlighterTest.ClangCursorPosEndOfLine (982 of 2074)
PASS: lldb-shell :: SymbolFile/Breakpad/stack-cfi-parsing.test (983 of 2074)
PASS: lldb-api :: python_api/sbplatform/TestSBPlatform.py (984 of 2074)
PASS: lldb-unit :: ScriptInterpreter/Python/./ScriptInterpreterPythonTests/PythonDataObjectsTest.TestRun (985 of 2074)
PASS: lldb-unit :: Host/./HostTests/HostInfoTest.GetHostname (986 of 2074)
PASS: lldb-unit :: Core/./LLDBCoreTests/SourceFileCache.FindSourceFileNotFound (987 of 2074)
PASS: lldb-unit :: Utility/./UtilityTests/AnsiTerminal.AtStart (988 of 2074)
PASS: lldb-unit :: UnwindAssembly/x86/./UnwindAssemblyx86Tests/Testx86AssemblyInspectionEngine.TestStackRealign8BitDisp_i386 (989 of 2074)
PASS: lldb-shell :: Minidump/no-process-id.yaml (990 of 2074)
PASS: lldb-api :: functionalities/data-formatter/poarray/TestPrintObjectArray.py (991 of 2074)
PASS: lldb-api :: functionalities/data-formatter/data-formatter-synthval/TestDataFormatterSynthVal.py (992 of 2074)
PASS: lldb-unit :: Symbol/./SymbolTests/TestTypeSystemClang.TestGetBasicTypeFromName (993 of 2074)
PASS: lldb-shell :: SymbolFile/DWARF/debug_aranges-empty-section.s (994 of 2074)
UNSUPPORTED: lldb-api :: commands/register/register/intel_xtended_registers/mpx_offset_intersection/TestMPXOffsetIntersection.py (995 of 2074)
PASS: lldb-unit :: Utility/./UtilityTests/StreamTeeTest.GetStreamAtIndexOutOfBounds (996 of 2074)
PASS: lldb-unit :: Utility/./UtilityTests/LogChannelTest.EnableOptions (997 of 2074)
PASS: lldb-api :: functionalities/thread/concurrent_events/TestConcurrentCrashWithSignal.py (998 of 2074)
PASS: lldb-api :: commands/watchpoints/multiple_threads/TestWatchpointMultipleThreads.py (999 of 2074)
PASS: lldb-unit :: Utility/./UtilityTests/StringLexerTest.AdvanceIf (1000 of 2074)
PASS: lldb-api :: python_api/process/read-mem-cstring/TestReadMemCString.py (1001 of 2074)
PASS: lldb-unit :: Utility/./UtilityTests/SerializationRountripTest.SerializeDeserializeObjectReference (1002 of 2074)
PASS: lldb-unit :: Utility/./UtilityTests/RangeTest.Slide (1003 of 2074)
PASS: lldb-api :: commands/target/stop-hook/delete/TestTargetStopHookDelete.py (1004 of 2074)
PASS: lldb-unit :: Utility/./UtilityTests/PassiveReplayTest.InstrumentedBarRef (1005 of 2074)
PASS: lldb-unit :: Host/./HostTests/NativeProcessProtocolTest.ReadCStringFromMemory_MaxSize (1006 of 2074)
PASS: lldb-api :: functionalities/data-formatter/type_summary_list_arg/TestTypeSummaryListArg.py (1007 of 2074)
PASS: lldb-api :: lang/cpp/offsetof/TestOffsetofCpp.py (1008 of 2074)
PASS: lldb-unit :: Expression/./ExpressionTests/CppModuleConfigurationTest.MissingUsrInclude (1009 of 2074)
PASS: lldb-unit :: UnwindAssembly/x86/./UnwindAssemblyx86Tests/Testx86AssemblyInspectionEngine.Test64bitFramelessBigStackFrame (1010 of 2074)
PASS: lldb-api :: functionalities/breakpoint/debugbreak/TestDebugBreak.py (1011 of 2074)
PASS: lldb-unit :: UnwindAssembly/x86/./UnwindAssemblyx86Tests/Testx86AssemblyInspectionEngine.TestSpillRegToStackViaMOVx86_64 (1012 of 2074)
PASS: lldb-shell :: Reproducer/TestCrash.test (1013 of 2074)
PASS: lldb-shell :: SymbolFile/DWARF/dwarf5-atomic.s (1014 of 2074)
PASS: lldb-unit :: Utility/./UtilityTests/SerializationRountripTest.SerializeDeserializeCString (1015 of 2074)
PASS: lldb-api :: functionalities/postmortem/elf-core/gcore/TestGCore.py (1016 of 2074)
PASS: lldb-unit :: Utility/./UtilityTests/EnvironmentTest.EnvpConstruction (1017 of 2074)
PASS: lldb-unit :: Process/gdb-remote/./ProcessGdbRemoteTests/GDBRemoteCommunicationServerTest.SendErrorResponse_StringError (1018 of 2074)
PASS: lldb-unit :: Core/./LLDBCoreTests/StreamCallbackTest.Callback (1019 of 2074)
PASS: lldb-unit :: Symbol/./SymbolTests/TestTypeSystemClang.TemplateArguments (1020 of 2074)
PASS: lldb-api :: lang/c/complex/TestComplexC99.py (1021 of 2074)
PASS: lldb-api :: commands/expression/import-std-module/forward_list-dbg-info-content/TestDbgInfoContentForwardListFromStdModule.py (1022 of 2074)
PASS: lldb-unit :: Utility/./UtilityTests/UriParserTest.Minimal (1023 of 2074)
PASS: lldb-unit :: Utility/./UtilityTests/StringExtractorTest.GetHexBytesAvail_Underflow (1024 of 2074)
PASS: lldb-api :: commands/expression/char/TestExprsChar.py (1025 of 2074)
PASS: lldb-api :: commands/expression/completion-in-lambda-and-unnamed-class/TestCompletionInLambdaAndUnnamedClass.py (1026 of 2074)
PASS: lldb-api :: commands/gui/invalid-args/TestInvalidArgsGui.py (1027 of 2074)
UNSUPPORTED: lldb-shell :: Breakpoint/ppc64-localentry.test (1028 of 2074)
PASS: lldb-api :: lang/objc/hidden-ivars/TestHiddenIvars.py (1029 of 2074)
PASS: lldb-shell :: Reproducer/TestDump.test (1030 of 2074)
PASS: lldb-unit :: Host/./HostTests/NativeProcessProtocolTest.ReadCStringFromMemory_CrossPageBoundary (1031 of 2074)
UNSUPPORTED: lldb-api :: python_api/disassemble-raw-data/TestDisassemble_VST1_64.py (1032 of 2074)
PASS: lldb-unit :: Utility/./UtilityTests/BinaryStreamTest.PutULEB128ThreeBytes (1033 of 2074)
PASS: lldb-api :: lang/cpp/enum_types/TestCPP11EnumTypes.py (1034 of 2074)
PASS: lldb-unit :: ScriptInterpreter/Python/./ScriptInterpreterPythonTests/PythonDataObjectsTest.TestPythonTupleToStructuredList (1035 of 2074)
PASS: lldb-api :: lang/objc/conflicting-definition/TestConflictingDefinition.py (1036 of 2074)
PASS: lldb-api :: macosx/nslog/TestDarwinNSLogOutput.py (1037 of 2074)
PASS: lldb-shell :: Breakpoint/debug_rnglist_rlestartend.test (1038 of 2074)
PASS: lldb-api :: lang/cpp/call-function/TestCallCPPFunction.py (1039 of 2074)
UNSUPPORTED: lldb-api :: lang/cpp/printf/TestPrintf.py (1040 of 2074)
PASS: lldb-shell :: Minidump/memory-region-from-module.yaml (1041 of 2074)
PASS: lldb-api :: tools/lldb-vscode/breakpoint-events/TestVSCode_breakpointEvents.py (1042 of 2074)
PASS: lldb-api :: python_api/target/TestTargetAPI.py (1043 of 2074)
PASS: lldb-unit :: ScriptInterpreter/Python/./ScriptInterpreterPythonTests/PythonDataObjectsTest.TestScript (1044 of 2074)
PASS: lldb-api :: python_api/disassemble-raw-data/TestDisassembleRawData.py (1045 of 2074)
PASS: lldb-api :: lang/cpp/this/TestCPPThis.py (1046 of 2074)
PASS: lldb-unit :: UnwindAssembly/x86/./UnwindAssemblyx86Tests/Testx86AssemblyInspectionEngine.TestMovRSPtoRBP (1047 of 2074)
UNSUPPORTED: lldb-api :: commands/expression/completion-crash-invalid-iterator/TestInvalidIteratorCompletionCrash.py (1048 of 2074)
PASS: lldb-unit :: Utility/./UtilityTests/LogChannelEnabledTest.LogVerboseThread (1049 of 2074)
PASS: lldb-shell :: SymbolFile/DWARF/find-variable-file.cpp (1050 of 2074)
PASS: lldb-api :: macosx/version_zero/TestGetVersionZeroVersion.py (1051 of 2074)
PASS: lldb-unit :: Utility/./UtilityTests/SubsystemRAIITest.NormalSubsystem (1052 of 2074)
PASS: lldb-api :: commands/expression/import-std-module/vector-bool/TestVectorBoolFromStdModule.py (1053 of 2074)
PASS: lldb-unit :: UnwindAssembly/x86/./UnwindAssemblyx86Tests/Testx86AssemblyInspectionEngine.TestPopRBP (1054 of 2074)
PASS: lldb-unit :: Process/gdb-remote/./ProcessGdbRemoteTests/GDBRemoteClientBaseTest.SendContinueAndWait (1055 of 2074)
PASS: lldb-unit :: Symbol/./SymbolTests/TestTypeSystemClang.TestDisplayNameEmpty (1056 of 2074)
PASS: lldb-unit :: Utility/./UtilityTests/ScalarTest.Division (1057 of 2074)
PASS: lldb-unit :: Symbol/./SymbolTests/TestTypeSystemClang.AddMethodToObjCObjectType (1058 of 2074)
PASS: lldb-unit :: Symbol/./SymbolTests/SymbolsTest.TerminateLocateExecutableSymbolFileForUnknownExecutableAndUnknownSymbolFile (1059 of 2074)
PASS: lldb-api :: functionalities/thread/concurrent_events/TestConcurrentDelaySignalBreak.py (1060 of 2074)
PASS: lldb-unit :: Utility/./UtilityTests/StringListTest.CopyList (1061 of 2074)
PASS: lldb-unit :: Process/minidump/./LLDBMinidumpTests/MinidumpParserTest.GetMiscInfoWindows (1062 of 2074)
PASS: lldb-api :: commands/expression/options/TestExprOptions.py (1063 of 2074)
PASS: lldb-unit :: Utility/./UtilityTests/TimeoutTest.Format (1064 of 2074)
PASS: lldb-unit :: Utility/./UtilityTests/ProcessInstanceInfo.DumpTable_invalidUID (1065 of 2074)
PASS: lldb-unit :: Utility/./UtilityTests/ArchSpecTest.MergeFrom (1066 of 2074)
PASS: lldb-unit :: Utility/./UtilityTests/AnsiTerminal.Incomplete (1067 of 2074)
UNSUPPORTED: lldb-shell :: ScriptInterpreter/Lua/convenience_variables.test (1068 of 2074)
PASS: lldb-unit :: Utility/./UtilityTests/ProcessInstanceInfo.Dump (1069 of 2074)
PASS: lldb-shell :: SymbolFile/DWARF/debug-line-basic.s (1070 of 2074)
PASS: lldb-unit :: Thread/./ThreadTests/ThreadTest.GetPrivateStopInfo (1071 of 2074)
PASS: lldb-api :: lang/objc/modules-non-objc-target/TestObjCModulesNonObjCTarget.py (1072 of 2074)
PASS: lldb-api :: functionalities/inferior-crashing/TestInferiorCrashing.py (1073 of 2074)
PASS: lldb-api :: functionalities/gdb_remote_client/TestIOSSimulator.py (1074 of 2074)
PASS: lldb-api :: python_api/value/change_values/TestChangeValueAPI.py (1075 of 2074)
PASS: lldb-unit :: UnwindAssembly/x86/./UnwindAssemblyx86Tests/Testx86AssemblyInspectionEngine.TestPopR15 (1076 of 2074)
PASS: lldb-unit :: Utility/./UtilityTests/ArchSpecTest.TestParseMachCPUDashSubtypeTripleSimple (1077 of 2074)
PASS: lldb-api :: lang/cpp/char1632_t/TestChar1632T.py (1078 of 2074)
PASS: lldb-api :: commands/expression/import-std-module/list-dbg-info-content/TestDbgInfoContentListFromStdModule.py (1079 of 2074)
PASS: lldb-unit :: Process/gdb-remote/./ProcessGdbRemoteTests/GDBRemoteClientBaseTest.SendContinueAndAsyncSignal (1080 of 2074)
UNSUPPORTED: lldb-shell :: SymbolFile/NativePDB/ast-functions-msvc.cpp (1081 of 2074)
PASS: lldb-api :: functionalities/thread/concurrent_events/TestConcurrentTwoWatchpointsOneSignal.py (1082 of 2074)
PASS: lldb-unit :: Utility/./UtilityTests/BinaryStreamTest.PutSLEB128Zero (1083 of 2074)
PASS: lldb-shell :: SymbolFile/DWARF/debug_ranges_and_rnglists.test (1084 of 2074)
PASS: lldb-api :: commands/expression/pr35310/TestExprsBug35310.py (1085 of 2074)
PASS: lldb-shell :: SymbolFile/DWARF/debug-types-line-tables.s (1086 of 2074)
UNSUPPORTED: lldb-api :: functionalities/darwin_log/filter/regex/subsystem/TestDarwinLogFilterRegexSubsystem.py (1087 of 2074)
PASS: lldb-api :: lang/objc/objc_direct-methods/TestObjCDirectMethods.py (1088 of 2074)
PASS: lldb-unit :: Language/Highlighting/./HighlighterTests/HighlighterTest.DefaultHighlighterWithCursorOutOfBounds (1089 of 2074)
PASS: lldb-shell :: Settings/TestFrameFormatNoColor.test (1090 of 2074)
PASS: lldb-unit :: Language/Highlighting/./HighlighterTests/HighlighterTest.ClangTrailingBackslashMissingNewLine (1091 of 2074)
PASS: lldb-api :: macosx/find-dsym/deep-bundle/TestDeepBundle.py (1092 of 2074)
PASS: lldb-unit :: Process/gdb-remote/./ProcessGdbRemoteTests/GDBRemoteCommunicationServerTest.SendErrorResponse_ErrorNumber (1093 of 2074)
PASS: lldb-unit :: Utility/./UtilityTests/BinaryStreamTest.PutSLEB128NineBytes (1094 of 2074)
PASS: lldb-api :: functionalities/data-formatter/data-formatter-stl/libcxx/queue/TestDataFormatterLibcxxQueue.py (1095 of 2074)
PASS: lldb-api :: functionalities/data-formatter/typedef_array/TestTypedefArray.py (1096 of 2074)
PASS: lldb-api :: commands/expression/fixits/TestFixIts.py (1097 of 2074)
PASS: lldb-api :: lang/cpp/breakpoint_in_member_func_w_non_primitive_params/TestBreakpointInMemberFuncWNonPrimitiveParams.py (1098 of 2074)
PASS: lldb-api :: functionalities/plugins/command_plugin/TestPluginCommands.py (1099 of 2074)
PASS: lldb-shell :: SymbolFile/DWARF/DW_OP_piece-smaller-than-struct.s (1100 of 2074)
PASS: lldb-api :: functionalities/breakpoint/breakpoint_command/TestBreakpointCommand.py (1101 of 2074)
PASS: lldb-unit :: Host/./HostTests/FileActionTest.Open (1102 of 2074)
PASS: lldb-unit :: Utility/./UtilityTests/RecordReplayTest.InstrumentedFoo (1103 of 2074)
PASS: lldb-unit :: Symbol/./SymbolTests/TestTypeSystemClang.TestGetTypeClassTypeOf (1104 of 2074)
PASS: lldb-unit :: Utility/./UtilityTests/UserIDResolver.GetUserName (1105 of 2074)
PASS: lldb-api :: commands/frame/diagnose/virtual-method-call/TestDiagnoseDereferenceVirtualMethodCall.py (1106 of 2074)
PASS: lldb-unit :: Language/Highlighting/./HighlighterTests/HighlighterTest.ClangIdentifiers (1107 of 2074)
PASS: lldb-unit :: Utility/./UtilityTests/StringListTest.SplitIntoLines (1108 of 2074)
PASS: lldb-shell :: SymbolFile/NativePDB/bitfields.cpp (1109 of 2074)
PASS: lldb-unit :: UnwindAssembly/x86/./UnwindAssemblyx86Tests/Testx86AssemblyInspectionEngine.TestPopR12 (1110 of 2074)
PASS: lldb-unit :: Utility/./UtilityTests/Flags.AllClear (1111 of 2074)
PASS: lldb-unit :: Utility/./UtilityTests/StreamTeeTest.Constructor1Stream (1112 of 2074)
PASS: lldb-api :: lang/cpp/breakpoint-commands/TestCPPBreakpointCommands.py (1113 of 2074)
UNSUPPORTED: lldb-api :: lang/cpp/function-template-parameter-pack/TestFunctionTemplateParameterPack.py (1114 of 2074)
PASS: lldb-api :: functionalities/breakpoint/objc/TestObjCBreakpoints.py (1115 of 2074)
PASS: lldb-unit :: Target/./TargetTests/ExecutionContextTest.GetByteOrder (1116 of 2074)
PASS: lldb-unit :: Utility/./UtilityTests/RangeTest.ClearWithStarAddress (1117 of 2074)
UNSUPPORTED: lldb-api :: functionalities/data-formatter/data-formatter-stl/libstdcpp/vector/TestDataFormatterStdVector.py (1118 of 2074)
PASS: lldb-api :: commands/expression/call-function/TestCallStdStringFunction.py (1119 of 2074)
PASS: lldb-shell :: Settings/TestDisableColor.test (1120 of 2074)
PASS: lldb-unit :: Utility/./UtilityTests/DataExtractorTest.PeekData (1121 of 2074)
PASS: lldb-api :: commands/reproducer/invalid-args/TestInvalidArgsReproducer.py (1122 of 2074)
PASS: lldb-unit :: Utility/./UtilityTests/DeserializerTest.HasData (1123 of 2074)
PASS: lldb-api :: python_api/sbvalue_const_addrof/TestSBValueConstAddrOf.py (1124 of 2074)
PASS: lldb-api :: macosx/thread-names/TestInterruptThreadNames.py (1125 of 2074)
PASS: lldb-unit :: Utility/./UtilityTests/ConstStringTest.YAML (1126 of 2074)
PASS: lldb-shell :: ScriptInterpreter/Python/sb_address_exception.test (1127 of 2074)
PASS: lldb-unit :: Utility/./UtilityTests/StringListTest.Assignment (1128 of 2074)
PASS: lldb-api :: types/TestIntegerType.py (1129 of 2074)
PASS: lldb-shell :: ObjectFile/PECOFF/section-types.yaml (1130 of 2074)
PASS: lldb-api :: functionalities/thread/num_threads/TestNumThreads.py (1131 of 2074)
PASS: lldb-api :: lang/cpp/gmodules-templates/TestGModules.py (1132 of 2074)
PASS: lldb-unit :: Utility/./UtilityTests/ArgsTest.TestQuotedTrailingBackslash (1133 of 2074)
PASS: lldb-api :: functionalities/non-overlapping-index-variable-i/TestIndexVariable.py (1134 of 2074)
PASS: lldb-unit :: Utility/./UtilityTests/StringListTest.LongestCommonPrefix (1135 of 2074)
PASS: lldb-unit :: UnwindAssembly/x86/./UnwindAssemblyx86Tests/Testx86AssemblyInspectionEngine.TestPushRBPWithREX (1136 of 2074)
UNSUPPORTED: lldb-api :: functionalities/ubsan/user-expression/TestUbsanUserExpression.py (1137 of 2074)
PASS: lldb-unit :: UnwindAssembly/x86/./UnwindAssemblyx86Tests/Testx86AssemblyInspectionEngine.TestPushESI (1138 of 2074)
PASS: lldb-unit :: Host/./HostTests/FileSystemTest.GetByteSize (1139 of 2074)
PASS: lldb-unit :: Utility/./UtilityTests/StringListTest.JoinEmpty (1140 of 2074)
PASS: lldb-unit :: Utility/./UtilityTests/StreamTest.AddressRangeEmptyRange (1141 of 2074)
UNSUPPORTED: lldb-shell :: SymbolFile/PDB/pointers.test (1142 of 2074)
PASS: lldb-api :: lang/cpp/unicode-literals/TestUnicodeLiterals.py (1143 of 2074)
PASS: lldb-api :: commands/expression/context-object/TestContextObject.py (1144 of 2074)
PASS: lldb-unit :: DataFormatter/./LLDBFormatterTests/StringPrinterTests.CxxASCII (1145 of 2074)
PASS: lldb-shell :: SymbolFile/Breakpad/unwind-via-raSearch.test (1146 of 2074)
PASS: lldb-api :: functionalities/data-formatter/data-formatter-objc/nsindexpath/TestDataFormatterNSIndexPath.py (1147 of 2074)
PASS: lldb-api :: functionalities/thread/concurrent_events/TestConcurrentWatchpointDelayWatchpointOneBreakpoint.py (1148 of 2074)
PASS: lldb-api :: functionalities/data-formatter/data-formatter-ptr-to-array/TestPtrToArrayFormatting.py (1149 of 2074)
PASS: lldb-unit :: UnwindAssembly/x86/./UnwindAssemblyx86Tests/Testx86AssemblyInspectionEngine.Testi386IgnoredRegisters (1150 of 2074)
PASS: lldb-unit :: Utility/./UtilityTests/CompletionRequest.TryCompleteCurrentArgGood (1151 of 2074)
UNSUPPORTED: lldb-api :: iohandler/resize/TestIOHandlerResize.py (1152 of 2074)
PASS: lldb-unit :: Target/./TargetTests/ModuleCacheTest.GetAndPut (1153 of 2074)
PASS: lldb-unit :: Target/./TargetTests/ModuleCacheTest.GetAndPutStrangeHostname (1154 of 2074)
PASS: lldb-unit :: Symbol/./SymbolTests/TestClangASTImporter.CanImportInvalidType (1155 of 2074)
PASS: lldb-api :: commands/expression/persistent_ptr_update/TestPersistentPtrUpdate.py (1156 of 2074)
PASS: lldb-api :: commands/expression/import_base_class_when_class_has_derived_member/TestImportBaseClassWhenClassHasDerivedMember.py (1157 of 2074)
PASS: lldb-shell :: SymbolFile/DWARF/split-dwarf-multiple-cu.ll (1158 of 2074)
PASS: lldb-unit :: Utility/./UtilityTests/OptionsWithRawTest.UnterminatedQuote (1159 of 2074)
PASS: lldb-unit :: Utility/./UtilityTests/RegularExpression.Match (1160 of 2074)
PASS: lldb-api :: lang/cpp/unsigned_types/TestUnsignedTypes.py (1161 of 2074)
PASS: lldb-unit :: Host/./HostTests/FileSystemTest.MakeAbsolute (1162 of 2074)
PASS: lldb-unit :: Utility/./UtilityTests/NameMatchesTest.RegularExpression (1163 of 2074)
PASS: lldb-api :: commands/expression/call-function/TestCallBuiltinFunction.py (1164 of 2074)
PASS: lldb-api :: tools/lldb-server/TestGdbRemoteKill.py (1165 of 2074)
UNSUPPORTED: lldb-api :: arm/breakpoint-it/TestBreakpointIt.py (1166 of 2074)
PASS: lldb-unit :: Host/./HostTests/File.GetWaitableHandleFileno (1167 of 2074)
PASS: lldb-unit :: ScriptInterpreter/Python/./ScriptInterpreterPythonTests/PythonDataObjectsTest.TestGlobalNameResolutionWithDot (1168 of 2074)
PASS: lldb-unit :: Utility/./UtilityTests/StringExtractorTest.GetHexU8_InvalidHex (1169 of 2074)
PASS: lldb-api :: lang/cpp/function-qualifiers/TestCppFunctionQualifiers.py (1170 of 2074)
PASS: lldb-shell :: ObjectFile/ELF/compressed-sections.yaml (1171 of 2074)
PASS: lldb-unit :: Utility/./UtilityTests/StringExtractorTest.GetHexBytes_OddPair2 (1172 of 2074)
PASS: lldb-unit :: Utility/./UtilityTests/StringListTest.InsertStringAtIndexStart (1173 of 2074)
PASS: lldb-unit :: Expression/./ExpressionTests/DiagnosticManagerTest.GetStringPreserveOrder (1174 of 2074)
PASS: lldb-unit :: Process/gdb-remote/./ProcessGdbRemoteTests/GDBRemoteClientBaseTest.SendContinueDelegateStructuredDataReceipt (1175 of 2074)
PASS: lldb-unit :: UnwindAssembly/x86/./UnwindAssemblyx86Tests/Testx86AssemblyInspectionEngine.TestPopRBPWithREX (1176 of 2074)
PASS: lldb-unit :: Symbol/./SymbolTests/TestTypeSystemClang.TestGetEnumIntegerTypeBasicTypes (1177 of 2074)
UNSUPPORTED: lldb-api :: functionalities/tsan/thread_leak/TestTsanThreadLeak.py (1178 of 2074)
PASS: lldb-shell :: ObjectFile/Breakpad/sections.test (1179 of 2074)
PASS: lldb-shell :: ObjectFile/PECOFF/sections.yaml (1180 of 2074)
PASS: lldb-api :: lang/cpp/namespace/TestNamespace.py (1181 of 2074)
PASS: lldb-api :: python_api/value_var_update/TestValueVarUpdate.py (1182 of 2074)
PASS: lldb-api :: python_api/file_handle/TestFileHandle.py (1183 of 2074)
PASS: lldb-api :: commands/breakpoint/set/func-regex/TestBreakpointRegexError.py (1184 of 2074)
PASS: lldb-unit :: SymbolFile/NativePDB/./SymbolFileNativePDBTests/PDBFPOProgramToDWARFExpressionTests.MissingTargetRegister (1185 of 2074)
PASS: lldb-api :: lang/objc/objc-ivar-protocols/TestIvarProtocols.py (1186 of 2074)
PASS: lldb-shell :: ObjectFile/PECOFF/dep-modules.yaml (1187 of 2074)
PASS: lldb-api :: lang/cpp/covariant-return-types/TestCovariantReturnTypes.py (1188 of 2074)
PASS: lldb-api :: lang/objcxx/hide-runtime-values/TestObjCXXHideRuntimeValues.py (1189 of 2074)
PASS: lldb-shell :: ObjectFile/ELF/PT_LOAD.yaml (1190 of 2074)
PASS: lldb-api :: functionalities/thread/concurrent_events/TestConcurrentCrashWithBreak.py (1191 of 2074)
PASS: lldb-shell :: SymbolFile/DWARF/dir-separator-no-comp-dir-relative-name.s (1192 of 2074)
UNSUPPORTED: lldb-api :: lang/c/unicode/TestUnicodeSymbols.py (1193 of 2074)
PASS: lldb-unit :: Process/minidump/./LLDBMinidumpTests/MinidumpParserTest.GetMemory (1194 of 2074)
PASS: lldb-unit :: Utility/./UtilityTests/UriParserTest.Empty (1195 of 2074)
PASS: lldb-unit :: Utility/./UtilityTests/StringExtractorTest.GetHexU8_Underflow (1196 of 2074)
PASS: lldb-unit :: Utility/./UtilityTests/ScalarTest.ExtractBitfield (1197 of 2074)
PASS: lldb-api :: functionalities/data-formatter/builtin-formats/TestBuiltinFormats.py (1198 of 2074)
PASS: lldb-api :: functionalities/data-formatter/boolreference/TestFormattersBoolRefPtr.py (1199 of 2074)
PASS: lldb-api :: lang/cpp/overloaded-functions/TestOverloadedFunctions.py (1200 of 2074)
PASS: lldb-unit :: Host/./HostTests/FileSystemTest.FileAndDirectoryComponents (1201 of 2074)
PASS: lldb-unit :: Target/./TargetTests/RemoteAwarePlatformTest.TestResolveExecutabelOnClientByPlatform (1202 of 2074)
PASS: lldb-api :: functionalities/data-formatter/data-formatter-caching/TestDataFormatterCaching.py (1203 of 2074)
PASS: lldb-unit :: Utility/./UtilityTests/RangeTest.ContainsRange (1204 of 2074)
PASS: lldb-unit :: Utility/./UtilityTests/AnsiTerminal.AtEnd (1205 of 2074)
PASS: lldb-api :: commands/frame/diagnose/inheritance/TestDiagnoseInheritance.py (1206 of 2074)
PASS: lldb-api :: python_api/sbenvironment/TestSBEnvironment.py (1207 of 2074)
UNSUPPORTED: lldb-api :: functionalities/thread/multi_break/TestMultipleBreakpoints.py (1208 of 2074)
PASS: lldb-shell :: SymbolFile/NativePDB/ast-functions.cpp (1209 of 2074)
PASS: lldb-api :: commands/target/stop-hooks/TestStopHooks.py (1210 of 2074)
UNSUPPORTED: lldb-shell :: Unwind/unwind-plan-dwarf-dump.test (1211 of 2074)
PASS: lldb-shell :: Expr/TestTypeOfDeclTypeExpr.test (1212 of 2074)
PASS: lldb-unit :: Utility/./UtilityTests/Flags.AnySet (1213 of 2074)
PASS: lldb-unit :: Target/./TargetTests/ExecutionContextTest.GetByteOrderTarget (1214 of 2074)
PASS: lldb-api :: functionalities/unwind/zeroth_frame/TestZerothFrame.py (1215 of 2074)
PASS: lldb-shell :: Driver/TestSingleQuote.test (1216 of 2074)
PASS: lldb-api :: commands/expression/invalid-args/TestInvalidArgsExpression.py (1217 of 2074)
PASS: lldb-unit :: Language/Highlighting/./HighlighterTests/HighlighterTest.DefaultHighlighter (1218 of 2074)
PASS: lldb-api :: lang/cpp/class_types/TestClassTypesDisassembly.py (1219 of 2074)
PASS: lldb-shell :: ObjectFile/ELF/PT_LOAD-overlap.yaml (1220 of 2074)
UNSUPPORTED: lldb-shell :: Register/x86-zmm-read.test (1221 of 2074)
PASS: lldb-api :: lang/c/tls_globals/TestTlsGlobals.py (1222 of 2074)
PASS: lldb-unit :: ScriptInterpreter/Python/./ScriptInterpreterPythonTests/PythonDataObjectsTest.TestExceptions (1223 of 2074)
PASS: lldb-api :: lang/cpp/type_lookup/TestCppTypeLookup.py (1224 of 2074)
PASS: lldb-unit :: Host/./HostTests/MainLoopTest.DetectsEOF (1225 of 2074)
PASS: lldb-api :: functionalities/inferior-crashing/TestInferiorCrashingStep.py (1226 of 2074)
PASS: lldb-unit :: Utility/./UtilityTests/SerializationRountripTest.SerializeDeserializePodPointers (1227 of 2074)
PASS: lldb-shell :: Reproducer/TestSynchronous.test (1228 of 2074)
PASS: lldb-unit :: Expression/./ExpressionTests/CppModuleConfigurationTest.MissingLibCpp (1229 of 2074)
PASS: lldb-unit :: Utility/./UtilityTests/StructuredDataTest.ParseJSONFromFile (1230 of 2074)
PASS: lldb-api :: functionalities/load_unload/TestLoadUnload.py (1231 of 2074)
PASS: lldb-api :: lang/objc/objc-struct-return/TestObjCStructReturn.py (1232 of 2074)
PASS: lldb-unit :: Utility/./UtilityTests/StringExtractorTest.GetNameColonValueNoColon (1233 of 2074)
PASS: lldb-unit :: ScriptInterpreter/Python/./ScriptInterpreterPythonTests/PythonDataObjectsTest.TestPythonString (1234 of 2074)
PASS: lldb-api :: functionalities/breakpoint/breakpoint_command/TestRegexpBreakCommand.py (1235 of 2074)
PASS: lldb-api :: functionalities/thread/concurrent_events/TestConcurrentTwoBreakpointsOneSignal.py (1236 of 2074)
PASS: lldb-unit :: ScriptInterpreter/Python/./ScriptInterpreterPythonTests/PythonDataObjectsTest.TestPythonByteArray (1237 of 2074)
PASS: lldb-unit :: Utility/./UtilityTests/RangeTest.ContainsAddr (1238 of 2074)
PASS: lldb-unit :: Utility/./UtilityTests/NameMatchesTest.Equals (1239 of 2074)
PASS: lldb-unit :: Utility/./UtilityTests/RangeTest.LessThanInvalid (1240 of 2074)
PASS: lldb-unit :: Utility/./UtilityTests/StreamTest.ShiftOperatorStrings (1241 of 2074)
PASS: lldb-api :: functionalities/target-new-solib-notifications/TestModuleLoadedNotifys.py (1242 of 2074)
PASS: lldb-api :: lang/cpp/bool/TestCPPBool.py (1243 of 2074)
PASS: lldb-unit :: debugserver/./debugserverTests/RNBSocket.LoopBackConnectIPv4 (1244 of 2074)
PASS: lldb-shell :: SymbolFile/NativePDB/break-by-function.cpp (1245 of 2074)
PASS: lldb-api :: python_api/process/TestProcessAPI.py (1246 of 2074)
PASS: lldb-unit :: Utility/./UtilityTests/FileSpecTest.OperatorBool (1247 of 2074)
PASS: lldb-unit :: Utility/./UtilityTests/StreamTest.ChangingByteOrder (1248 of 2074)
PASS: lldb-api :: api/multiple-targets/TestMultipleTargets.py (1249 of 2074)
PASS: lldb-api :: commands/platform/process/list/TestProcessList.py (1250 of 2074)
PASS: lldb-unit :: Signals/./SignalsTests/UnixSignalsTest.GetInfo (1251 of 2074)
PASS: lldb-unit :: Utility/./UtilityTests/ArgsTest.TestAppendArg (1252 of 2074)
UNSUPPORTED: lldb-api :: tools/lldb-server/platform-process-connect/TestPlatformProcessConnect.py (1253 of 2074)
PASS: lldb-api :: functionalities/tail_call_frames/unambiguous_sequence/TestUnambiguousTailCalls.py (1254 of 2074)
PASS: lldb-shell :: SymbolFile/DWARF/debug_line-relative_path.s (1255 of 2074)
PASS: lldb-unit :: Expression/./ExpressionTests/CppModuleConfigurationTest.UnrelatedLibrary (1256 of 2074)
PASS: lldb-shell :: SymbolFile/DWARF/dwo-type-in-main-file.s (1257 of 2074)
PASS: lldb-unit :: tools/lldb-server/tests/./LLDBServerTests/TestBase.DebugserverEnv (1258 of 2074)
PASS: lldb-unit :: Utility/./UtilityTests/VMRange.ContainsAddr (1259 of 2074)
PASS: lldb-api :: commands/command/invalid-args/TestInvalidArgsCommand.py (1260 of 2074)
UNSUPPORTED: lldb-shell :: Register/x86-gp-write.test (1261 of 2074)
PASS: lldb-api :: commands/expression/anonymous-struct/TestCallUserAnonTypedef.py (1262 of 2074)
PASS: lldb-api :: lang/cpp/typedef/TestCppTypedef.py (1263 of 2074)
PASS: lldb-unit :: debugserver/./debugserverTests/RNBSocket.AnyListen (1264 of 2074)
PASS: lldb-api :: lang/c/const_variables/TestConstVariables.py (1265 of 2074)
UNSUPPORTED: lldb-api :: linux/mix-dwo-and-regular-objects/TestMixedDwarfBinary.py (1266 of 2074)
PASS: lldb-unit :: Language/Highlighting/./HighlighterTests/HighlighterTest.ClangComments (1267 of 2074)
UNSUPPORTED: lldb-api :: commands/register/register/intel_xtended_registers/TestMPXRegisters.py (1268 of 2074)
PASS: lldb-unit :: Utility/./UtilityTests/StreamTest.PutHex16ByteOrderLittle (1269 of 2074)
PASS: lldb-unit :: UnwindAssembly/x86/./UnwindAssemblyx86Tests/Testx86AssemblyInspectionEngine.TestPopR13 (1270 of 2074)
PASS: lldb-api :: python_api/formatters/TestFormattersSBAPI.py (1271 of 2074)
PASS: lldb-api :: commands/expression/save_jit_objects/TestSaveJITObjects.py (1272 of 2074)
PASS: lldb-shell :: Minidump/fb-dump.test (1273 of 2074)
PASS: lldb-unit :: Process/gdb-remote/./ProcessGdbRemoteTests/GDBRemoteCommunicationClientTest.SendStartTracePacket (1274 of 2074)
PASS: lldb-api :: sample_test/TestSampleInlineTest.py (1275 of 2074)
PASS: lldb-api :: functionalities/data-formatter/compactvectors/TestCompactVectors.py (1276 of 2074)
PASS: lldb-shell :: BuildScript/compiler-full-path.test (1277 of 2074)
PASS: lldb-api :: commands/expression/ir-interpreter-phi-nodes/TestIRInterpreterPHINodes.py (1278 of 2074)
PASS: lldb-api :: functionalities/postmortem/mach-core/TestMachCore.py (1279 of 2074)
PASS: lldb-unit :: Utility/./UtilityTests/StreamTeeTest.SetStreamAtIndexOutOfBounds (1280 of 2074)
PASS: lldb-unit :: UnwindAssembly/x86/./UnwindAssemblyx86Tests/Testx86AssemblyInspectionEngine.TestPush0 (1281 of 2074)
PASS: lldb-unit :: Editline/./EditlineTests/EditlineTestFixture.EditlineReceivesMultiLineText (1282 of 2074)
UNSUPPORTED: lldb-api :: benchmarks/continue/TestBenchmarkContinue.py (1283 of 2074)
PASS: lldb-unit :: Process/minidump/./LLDBMinidumpTests/MinidumpParserTest.MinidumpModuleOrder (1284 of 2074)
PASS: lldb-api :: types/TestFloatTypesExpr.py (1285 of 2074)
PASS: lldb-shell :: ScriptInterpreter/Python/eof.test (1286 of 2074)
UNSUPPORTED: lldb-shell :: ExecControl/StopHook/stop-hook-threads.test (1287 of 2074)
PASS: lldb-unit :: Expression/./ExpressionTests/DWARFExpression.DW_OP_convert (1288 of 2074)
PASS: lldb-api :: commands/command/script/import/rdar-12586188/TestRdar12586188.py (1289 of 2074)
PASS: lldb-unit :: Symbol/./SymbolTests/DWARFCallFrameInfoTest.Basic_dwarf4 (1290 of 2074)
PASS: lldb-unit :: Utility/./UtilityTests/ArchSpecTest.OperatorBool (1291 of 2074)
UNSUPPORTED: lldb-shell :: ScriptInterpreter/Lua/io.test (1292 of 2074)
PASS: lldb-unit :: API/./APITests/SBCommandInterpreterTest.MultiWordCommand (1293 of 2074)
PASS: lldb-shell :: Commands/command-regex-unalias.test (1294 of 2074)
PASS: lldb-api :: lang/cpp/operator-overload/TestOperatorOverload.py (1295 of 2074)
UNSUPPORTED: lldb-shell :: SymbolFile/target-symbols-add-unwind.test (1296 of 2074)
PASS: lldb-shell :: Heap/heap-cstr.test (1297 of 2074)
PASS: lldb-unit :: UnwindAssembly/x86/./UnwindAssemblyx86Tests/Testx86AssemblyInspectionEngine.TestPushEAX (1298 of 2074)
PASS: lldb-api :: api/check_public_api_headers/TestPublicAPIHeaders.py (1299 of 2074)
PASS: lldb-unit :: Utility/./UtilityTests/XcodeSDKTest.SDKSupportsSwift (1300 of 2074)
UNSUPPORTED: lldb-shell :: SymbolFile/PDB/function-level-linking.test (1301 of 2074)
PASS: lldb-unit :: Process/minidump/./LLDBMinidumpTests/MinidumpParserTest.GetMemoryRegionInfoFromMemory64List (1302 of 2074)
PASS: lldb-unit :: Utility/./UtilityTests/BinaryStreamTest.PutSLEB128FiveBytes (1303 of 2074)
PASS: lldb-api :: functionalities/data-formatter/data-formatter-smart-array/TestDataFormatterSmartArray.py (1304 of 2074)
PASS: lldb-api :: python_api/lldbutil/process/TestPrintStackTraces.py (1305 of 2074)
PASS: lldb-api :: python_api/exprpath_synthetic/TestExprPathSynthetic.py (1306 of 2074)
PASS: lldb-unit :: UnwindAssembly/x86/./UnwindAssemblyx86Tests/Testx86AssemblyInspectionEngine.TestReturnDetect (1307 of 2074)
PASS: lldb-unit :: Symbol/./SymbolTests/TestTypeSystemClang.TestGetBasicTypeFromEnum (1308 of 2074)
UNSUPPORTED: lldb-shell :: SymbolFile/dissassemble-entry-point.s (1309 of 2074)
PASS: lldb-shell :: SymbolFile/DWARF/module-ownership.mm (1310 of 2074)
PASS: lldb-unit :: Utility/./UtilityTests/ArgsTest.ReplaceArgumentAtIndexFarOutOfRange (1311 of 2074)
UNSUPPORTED: lldb-api :: functionalities/darwin_log/filter/exact_match/category/TestDarwinLogFilterMatchCategory.py (1312 of 2074)
PASS: lldb-shell :: Commands/command-target-modules-dump-sections.yaml (1313 of 2074)
PASS: lldb-unit :: Symbol/./SymbolTests/TestTypeSystemClang.TestIsClangType (1314 of 2074)
PASS: lldb-unit :: Utility/./UtilityTests/RangeTest.Constructor (1315 of 2074)
PASS: lldb-unit :: Process/gdb-remote/./ProcessGdbRemoteTests/GDBRemoteCommunicationServerTest.SendErrorResponse_UnimplementedError (1316 of 2074)
PASS: lldb-unit :: Utility/./UtilityTests/RangeTest.LessThan (1317 of 2074)
PASS: lldb-unit :: Utility/./UtilityTests/VMRange.ContainsRange (1318 of 2074)
PASS: lldb-unit :: Expression/./ExpressionTests/DWARFExpression.DW_OP_piece (1319 of 2074)
PASS: lldb-api :: functionalities/tail_call_frames/disambiguate_tail_call_seq/TestDisambiguateTailCallSeq.py (1320 of 2074)
PASS: lldb-api :: lang/cpp/global_operators/TestCppGlobalOperators.py (1321 of 2074)
PASS: lldb-unit :: Symbol/./SymbolTests/TestTypeSystemClang.TestRemoveFastQualifiers (1322 of 2074)
PASS: lldb-api :: functionalities/data-formatter/data-formatter-stl/libcxx/optional/TestDataFormatterLibcxxOptional.py (1323 of 2074)
PASS: lldb-api :: python_api/function_symbol/TestSymbolAPI.py (1324 of 2074)
PASS: lldb-unit :: Utility/./UtilityTests/DataExtractorTest.GetMaxU64 (1325 of 2074)
PASS: lldb-api :: functionalities/tail_call_frames/ambiguous_tail_call_seq2/TestAmbiguousTailCallSeq2.py (1326 of 2074)
PASS: lldb-api :: commands/expression/import-std-module/queue/TestQueueFromStdModule.py (1327 of 2074)
UNSUPPORTED: lldb-api :: iohandler/completion/TestIOHandlerCompletion.py (1328 of 2074)
PASS: lldb-api :: functionalities/data-formatter/data-formatter-cpp/TestDataFormatterCpp.py (1329 of 2074)
UNSUPPORTED: lldb-api :: functionalities/tsan/basic/TestTsanBasic.py (1330 of 2074)
PASS: lldb-api :: functionalities/gdb_remote_client/TestRestartBug.py (1331 of 2074)
PASS: lldb-api :: functionalities/data-formatter/data-formatter-objc/TestDataFormatterObjCPlain.py (1332 of 2074)
PASS: lldb-api :: lang/c/bitfields/TestBitfields.py (1333 of 2074)
PASS: lldb-unit :: Utility/./UtilityTests/SerializationRountripTest.SerializeDeserializeObjectPointer (1334 of 2074)
PASS: lldb-unit :: Host/./HostTests/MainLoopTest.TerminatesImmediately (1335 of 2074)
PASS: lldb-api :: lang/c/shared_lib_stripped_symbols/TestSharedLibStrippedSymbols.py (1336 of 2074)
PASS: lldb-api :: commands/platform/file/close/TestPlatformFileClose.py (1337 of 2074)
PASS: lldb-unit :: Utility/./UtilityTests/XcodeSDKTest.SDKSupportsModules (1338 of 2074)
PASS: lldb-unit :: Utility/./UtilityTests/LogChannelEnabledTest.LogThread (1339 of 2074)
PASS: lldb-api :: lang/c/stepping/TestThreadStepping.py (1340 of 2074)
PASS: lldb-unit :: Process/gdb-remote/./ProcessGdbRemoteTests/GDBRemoteCommunicationClientTest.TestPacketSpeedJSON (1341 of 2074)
PASS: lldb-unit :: Language/Highlighting/./HighlighterTests/HighlighterTest.ClangCursorPosBeforeOtherToken (1342 of 2074)
PASS: lldb-shell :: Quit/TestQuitExitCode30.test (1343 of 2074)
PASS: lldb-shell :: Minidump/Windows/Sigsegv/sigsegv.test (1344 of 2074)
PASS: lldb-unit :: Symbol/./SymbolTests/TestTypeSystemClang.TestRecordHasFields (1345 of 2074)
PASS: lldb-api :: functionalities/set-data/TestSetData.py (1346 of 2074)
PASS: lldb-api :: functionalities/thread/concurrent_events/TestConcurrentSignalWatch.py (1347 of 2074)
PASS: lldb-unit :: Signals/./SignalsTests/UnixSignalsTest.VersionChange (1348 of 2074)
PASS: lldb-unit :: ScriptInterpreter/Python/./ScriptInterpreterPythonTests/PythonDataObjectsTest.TestCallable (1349 of 2074)
PASS: lldb-shell :: Quit/TestQuitExitCode-30.test (1350 of 2074)
PASS: lldb-unit :: Process/gdb-remote/./ProcessGdbRemoteTests/GDBRemoteClientBaseTest.InterruptNoResponse (1351 of 2074)
PASS: lldb-shell :: Quit/TestQuitExitCodeHexA.test (1352 of 2074)
PASS: lldb-unit :: Process/./ProcessEventDataTests/ProcessEventDataTest.DoOnRemoval (1353 of 2074)
PASS: lldb-unit :: Utility/./UtilityTests/DataExtractorTest.GetBitfield (1354 of 2074)
PASS: lldb-unit :: ObjectFile/Breakpad/./ObjectFileBreakpadTests/StackCFIRecord.parse (1355 of 2074)
PASS: lldb-unit :: Utility/./UtilityTests/SharedCluster.ClusterManager (1356 of 2074)
PASS: lldb-unit :: SymbolFile/NativePDB/./SymbolFileNativePDBTests/PDBFPOProgramToDWARFExpressionTests.SingleAssignmentRegisterRef (1357 of 2074)
PASS: lldb-unit :: Process/gdb-remote/./ProcessGdbRemoteTests/GDBRemoteCommunicationClientTest.GetMemoryRegionInfo (1358 of 2074)
PASS: lldb-shell :: Breakpoint/jitbp_elf.test (1359 of 2074)
PASS: lldb-unit :: Utility/./UtilityTests/StringListTest.SplitIntoLinesEmpty (1360 of 2074)
PASS: lldb-unit :: Utility/./UtilityTests/ReproducerTest.SetCapture (1361 of 2074)
PASS: lldb-shell :: SymbolFile/NativePDB/ast-types.cpp (1362 of 2074)
PASS: lldb-unit :: Host/./HostTests/SocketTest.TCPGetAddress (1363 of 2074)
PASS: lldb-unit :: Utility/./UtilityTests/StringListTest.GetMaxStringLengthDecreasingSize (1364 of 2074)
PASS: lldb-unit :: Utility/./UtilityTests/UUIDTest.RelationalOperators (1365 of 2074)
PASS: lldb-unit :: Utility/./UtilityTests/StringListTest.PopBack (1366 of 2074)
PASS: lldb-api :: functionalities/pointer_num_children/TestPointerNumChildren.py (1367 of 2074)
PASS: lldb-unit :: Utility/./UtilityTests/LogTest.Unregister (1368 of 2074)
PASS: lldb-unit :: Utility/./UtilityTests/DataExtractorTest.GetCStr (1369 of 2074)
PASS: lldb-api :: python_api/sblaunchinfo/TestSBLaunchInfo.py (1370 of 2074)
PASS: lldb-api :: lang/cpp/class_static/TestStaticVariables.py (1371 of 2074)
PASS: lldb-unit :: Utility/./UtilityTests/BinaryStreamTest.PutSLEB128ThreeBytes (1372 of 2074)
PASS: lldb-unit :: Utility/./UtilityTests/BinaryStreamTest.PutULEB128SevenBytes (1373 of 2074)
PASS: lldb-shell :: ObjectFile/MachO/lc_build_version.yaml (1374 of 2074)
UNSUPPORTED: lldb-api :: functionalities/data-formatter/data-formatter-stl/libstdcpp/list/TestDataFormatterStdList.py (1375 of 2074)
PASS: lldb-unit :: Utility/./UtilityTests/ConstStringTest.format_provider (1376 of 2074)
PASS: lldb-unit :: Utility/./UtilityTests/CompletionRequest.TestCompletionOwnership (1377 of 2074)
PASS: lldb-api :: python_api/findvalue_duplist/TestSBFrameFindValue.py (1378 of 2074)
PASS: lldb-unit :: Target/./TargetTests/ModuleCacheTest.GetAndPutUuidExists (1379 of 2074)
PASS: lldb-unit :: Utility/./UtilityTests/StreamTest.AddressPrefixAndSuffix (1380 of 2074)
PASS: lldb-api :: functionalities/load_using_paths/TestLoadUsingPaths.py (1381 of 2074)
PASS: lldb-unit :: Utility/./UtilityTests/VMRange.Reset (1382 of 2074)
PASS: lldb-unit :: Platform/Android/./AdbClientTests/AdbClientTest.CreateByDeviceId (1383 of 2074)
PASS: lldb-unit :: Host/./HostTests/SocketTest.DecodeHostAndPort (1384 of 2074)
PASS: lldb-api :: commands/settings/TestSettings.py (1385 of 2074)
PASS: lldb-api :: python_api/symbol-context/two-files/TestSymbolContextTwoFiles.py (1386 of 2074)
PASS: lldb-unit :: Utility/./UtilityTests/StringExtractorTest.DecodeHexU8_Underflow (1387 of 2074)
PASS: lldb-api :: lang/objc/direct-dispatch-step/TestObjCDirectDispatchStepping.py (1388 of 2074)
PASS: lldb-unit :: Utility/./UtilityTests/GeneratorTest.Get (1389 of 2074)
PASS: lldb-unit :: Utility/./UtilityTests/UriParserTest.TypicalPortPathIPv4 (1390 of 2074)
PASS: lldb-api :: commands/target/dump-symtab-demangle/TestDumpSymtabDemangle.py (1391 of 2074)
PASS: lldb-unit :: Utility/./UtilityTests/StreamTeeTest.Constructor2Streams (1392 of 2074)
PASS: lldb-unit :: ObjectFile/Breakpad/./ObjectFileBreakpadTests/InfoRecord.parse (1393 of 2074)
PASS: lldb-api :: functionalities/process_crash_info/TestProcessCrashInfo.py (1394 of 2074)
PASS: lldb-unit :: Utility/./UtilityTests/RangeDataVector.FindEntryThatContains_Overlap (1395 of 2074)
PASS: lldb-shell :: SymbolFile/DWARF/debug_loc.s (1396 of 2074)
PASS: lldb-unit :: Symbol/./SymbolTests/TestTypeSystemClang.TestGetTypeClassTypeOfExpr (1397 of 2074)
PASS: lldb-shell :: Reproducer/TestVersionCheck.test (1398 of 2074)
PASS: lldb-api :: macosx/add-dsym/TestAddDsymMidExecutionCommand.py (1399 of 2074)
PASS: lldb-api :: functionalities/breakpoint/breakpoint_locations/TestBreakpointLocations.py (1400 of 2074)
PASS: lldb-unit :: Utility/./UtilityTests/TimerTest.CategoryTimes (1401 of 2074)
PASS: lldb-api :: functionalities/breakpoint/breakpoint_hit_count/TestBreakpointHitCount.py (1402 of 2074)
PASS: lldb-api :: commands/expression/import-std-module/vector-of-vectors/TestVectorOfVectorsFromStdModule.py (1403 of 2074)
PASS: lldb-api :: lang/cpp/accelerator-table/TestCPPAccelerator.py (1404 of 2074)
PASS: lldb-api :: functionalities/data-formatter/data-formatter-stl/libcxx/variant/TestDataFormatterLibcxxVariant.py (1405 of 2074)
PASS: lldb-api :: commands/target/basic/TestTargetCommand.py (1406 of 2074)
UNSUPPORTED: lldb-shell :: SymbolFile/NativePDB/local-variables.cpp (1407 of 2074)
PASS: lldb-api :: lang/objc/foundation/TestConstStrings.py (1408 of 2074)
PASS: lldb-unit :: Language/Highlighting/./HighlighterTests/HighlighterTest.Colons (1409 of 2074)
PASS: lldb-api :: lang/objcxx/cxx-bridged-po/TestObjCXXBridgedPO.py (1410 of 2074)
PASS: lldb-unit :: Utility/./UtilityTests/StreamTest.PutCString (1411 of 2074)
PASS: lldb-api :: lang/cpp/extern_c/TestExternCSymbols.py (1412 of 2074)
PASS: lldb-unit :: Symbol/./SymbolTests/DWARFCallFrameInfoTest.Basic_dwarf3 (1413 of 2074)
PASS: lldb-unit :: Utility/./UtilityTests/StringListTest.InsertStringAtIndexOutOfBounds (1414 of 2074)
PASS: lldb-api :: functionalities/postmortem/wow64_minidump/TestWow64MiniDump.py (1415 of 2074)
PASS: lldb-api :: functionalities/data-formatter/nsarraysynth/TestNSArraySynthetic.py (1416 of 2074)
PASS: lldb-unit :: Language/Highlighting/./HighlighterTests/HighlighterTest.ClangCursorPosAfterOtherToken (1417 of 2074)
PASS: lldb-unit :: Symbol/./SymbolTests/TestClangASTImporter.MetadataPropagationAfterCopying (1418 of 2074)
PASS: lldb-api :: functionalities/data-formatter/data-formatter-objc/TestDataFormatterObjCNSDate.py (1419 of 2074)
UNSUPPORTED: lldb-shell :: BuildScript/toolchain-clang-cl.test (1420 of 2074)
PASS: lldb-shell :: SymbolFile/DWARF/childless-compile-unit.s (1421 of 2074)
PASS: lldb-unit :: ScriptInterpreter/Python/./ScriptInterpreterPythonTests/PythonDataObjectsTest.TestBorrowedReferences (1422 of 2074)
PASS: lldb-unit :: Utility/./UtilityTests/DataExtractorTest.GetDoubleUnaligned (1423 of 2074)
PASS: lldb-unit :: Symbol/./SymbolTests/PostfixExpression.ToDWARF (1424 of 2074)
PASS: lldb-unit :: Utility/./UtilityTests/BinaryStreamTest.PutSLEB128MaxValue (1425 of 2074)
PASS: lldb-api :: functionalities/gdb_remote_client/TestWriteMemory.py (1426 of 2074)
PASS: lldb-unit :: Utility/./UtilityTests/StreamTest.PutHex64ByteOrderBig (1427 of 2074)
PASS: lldb-api :: lang/objc/modules-cache/TestClangModulesCache.py (1428 of 2074)
PASS: lldb-api :: commands/expression/cast_int_to_anonymous_enum/TestCastIntToAnonymousEnum.py (1429 of 2074)
PASS: lldb-unit :: Expression/./ExpressionTests/DiagnosticManagerTest.GetStringSeverityLabels (1430 of 2074)
PASS: lldb-unit :: Thread/./ThreadTests/ThreadTest.SetStopInfo (1431 of 2074)
PASS: lldb-unit :: Utility/./UtilityTests/UriParserTest.TypicalPortPathIPv6 (1432 of 2074)
PASS: lldb-unit :: Utility/./UtilityTests/StringListTest.InsertStringAtIndexStdString (1433 of 2074)
PASS: lldb-unit :: Utility/./UtilityTests/CompletionRequest.TryCompleteCurrentArgBad (1434 of 2074)
UNSUPPORTED: lldb-shell :: ScriptInterpreter/Lua/persistent_state.test (1435 of 2074)
PASS: lldb-shell :: SymbolFile/DWARF/anon_class_w_and_wo_export_symbols.ll (1436 of 2074)
PASS: lldb-unit :: Utility/./UtilityTests/ArgsTest.GetArgumentArrayRef (1437 of 2074)
PASS: lldb-unit :: Utility/./UtilityTests/LogChannelEnabledTest.log_options (1438 of 2074)
PASS: lldb-api :: functionalities/thread/concurrent_events/TestConcurrentTwoBreakpointsOneDelaySignal.py (1439 of 2074)
PASS: lldb-unit :: Utility/./UtilityTests/OptionsWithRawTest.QuotedSuffix (1440 of 2074)
UNSUPPORTED: lldb-api :: functionalities/darwin_log/filter/regex/activity/TestDarwinLogFilterRegexActivity.py (1441 of 2074)
PASS: lldb-unit :: Expression/./ExpressionTests/CppModuleConfigurationTest.Linux (1442 of 2074)
PASS: lldb-api :: functionalities/data-formatter/data-formatter-stl/libcxx/unique_ptr/TestDataFormatterLibcxxUniquePtr.py (1443 of 2074)
PASS: lldb-shell :: Breakpoint/debug_rnglist_basic.test (1444 of 2074)
PASS: lldb-shell :: ScriptInterpreter/None/none.test (1445 of 2074)
PASS: lldb-unit :: Utility/./UtilityTests/StreamTest.PutBytesAsRawHex8ToBigEndian (1446 of 2074)
PASS: lldb-shell :: Settings/TestSettingsSet.test (1447 of 2074)
PASS: lldb-api :: functionalities/data-formatter/stringprinter/TestStringPrinter.py (1448 of 2074)
PASS: lldb-api :: functionalities/breakpoint/hardware_breakpoints/hardware_breakpoint_on_multiple_threads/TestHWBreakMultiThread.py (1449 of 2074)
PASS: lldb-api :: tools/lldb-server/commandline/TestStubReverseConnect.py (1450 of 2074)
PASS: lldb-unit :: Utility/./UtilityTests/StringExtractorTest.GetHexBytesAvail_OddPair2 (1451 of 2074)
PASS: lldb-unit :: UnwindAssembly/x86/./UnwindAssemblyx86Tests/Testx86AssemblyInspectionEngine.TestPushRBP (1452 of 2074)
PASS: lldb-shell :: SymbolFile/DWARF/dwarf5_locations.s (1453 of 2074)
UNSUPPORTED: lldb-api :: tools/lldb-server/TestGdbRemoteAuxvSupport.py (1454 of 2074)
PASS: lldb-unit :: Process/minidump/./LLDBMinidumpTests/MinidumpParserTest.MinidumpDuplicateModuleMinAddress (1455 of 2074)
PASS: lldb-shell :: SymbolFile/DWARF/find-basic-function.cpp (1456 of 2074)
PASS: lldb-api :: commands/expression/calculator_mode/TestCalculatorMode.py (1457 of 2074)
PASS: lldb-unit :: Signals/./SignalsTests/UnixSignalsTest.Iteration (1458 of 2074)
PASS: lldb-shell :: ObjectFile/ELF/build-id-case.yaml (1459 of 2074)
PASS: lldb-unit :: Host/./HostTests/NativeProcessProtocolTest.ReadMemoryWithoutTrap (1460 of 2074)
PASS: lldb-unit :: Host/./HostTests/SocketTest.UDPConnect (1461 of 2074)
PASS: lldb-unit :: Utility/./UtilityTests/Flags.AllSet (1462 of 2074)
PASS: lldb-unit :: Process/gdb-remote/./ProcessGdbRemoteTests/GDBRemoteCommunicationClientTest.GetModulesInfo_UUID20 (1463 of 2074)
PASS: lldb-unit :: Host/./HostTests/Host.WaitStatusFormat (1464 of 2074)
PASS: lldb-unit :: Host/./HostTests/ConnectionFileDescriptorTest.TCPGetURIv6 (1465 of 2074)
PASS: lldb-api :: tools/lldb-vscode/coreFile/TestVSCode_coreFile.py (1466 of 2074)
UNSUPPORTED: lldb-api :: functionalities/tsan/global_location/TestTsanGlobalLocation.py (1467 of 2074)
UNSUPPORTED: lldb-shell :: Register/x86-64-xmm16-read.test (1468 of 2074)
PASS: lldb-unit :: Expression/./ExpressionTests/DiagnosticManagerTest.GetStringMultipleDiags (1469 of 2074)
PASS: lldb-unit :: Utility/./UtilityTests/ScalarTest.SetValueFromCString (1470 of 2074)
PASS: lldb-shell :: SymbolFile/DWARF/DW_OP_piece-struct.s (1471 of 2074)
PASS: lldb-api :: tools/lldb-server/commandline/TestStubSetSID.py (1472 of 2074)
PASS: lldb-api :: functionalities/thread/concurrent_events/TestConcurrentSignalBreak.py (1473 of 2074)
UNSUPPORTED: lldb-api :: functionalities/longjmp/TestLongjmp.py (1474 of 2074)
PASS: lldb-api :: functionalities/inferior-crashing/recursive-inferior/TestRecursiveInferior.py (1475 of 2074)
PASS: lldb-api :: functionalities/thread/concurrent_events/TestConcurrentBreakpointDelayBreakpointOneSignal.py (1476 of 2074)
PASS: lldb-api :: commands/register/register/register_command/TestRegisters.py (1477 of 2074)
UNSUPPORTED: lldb-api :: terminal/TestEditline.py (1478 of 2074)
PASS: lldb-shell :: Settings/TestFrameFormatColor.test (1479 of 2074)
PASS: lldb-api :: functionalities/mtc/simple/TestMTCSimple.py (1480 of 2074)
PASS: lldb-api :: commands/watchpoints/watchpoint_size/TestWatchpointSizes.py (1481 of 2074)
PASS: lldb-unit :: Utility/./UtilityTests/DataExtractorTest.GetMaxU64_unchecked (1482 of 2074)
PASS: lldb-shell :: ObjectFile/ELF/minidebuginfo-corrupt-xz.yaml (1483 of 2074)
UNSUPPORTED: lldb-api :: functionalities/ptr_refs/TestPtrRefs.py (1484 of 2074)
UNSUPPORTED: lldb-api :: functionalities/ubsan/basic/TestUbsanBasic.py (1485 of 2074)
PASS: lldb-api :: functionalities/type_lookup/TestTypeLookup.py (1486 of 2074)
PASS: lldb-api :: lang/objc/objc++/TestObjCXX.py (1487 of 2074)
UNSUPPORTED: lldb-api :: tools/lldb-server/TestGdbRemote_vContThreads.py (1488 of 2074)
PASS: lldb-api :: commands/watchpoints/step_over_watchpoint/TestStepOverWatchpoint.py (1489 of 2074)
PASS: lldb-api :: lang/objc/radar-9691614/TestObjCMethodReturningBOOL.py (1490 of 2074)
PASS: lldb-shell :: SymbolFile/DWARF/debug-types-basic.test (1491 of 2074)
PASS: lldb-unit :: Process/minidump/./LLDBMinidumpTests/MinidumpParserTest.GetArchitecture (1492 of 2074)
PASS: lldb-api :: python_api/name_lookup/TestNameLookup.py (1493 of 2074)
PASS: lldb-shell :: Quit/TestQuitExitCodeTooManyArgs.test (1494 of 2074)
PASS: lldb-shell :: Breakpoint/dummy-target.test (1495 of 2074)
PASS: lldb-unit :: Utility/./UtilityTests/ScalarTest.Comparison (1496 of 2074)
PASS: lldb-unit :: UnwindAssembly/x86/./UnwindAssemblyx86Tests/Testx86AssemblyInspectionEngine.TestSpArithx86_64Augmented (1497 of 2074)
UNSUPPORTED: lldb-api :: commands/expression/multiline-navigation/TestMultilineNavigation.py (1498 of 2074)
PASS: lldb-unit :: Utility/./UtilityTests/UriParserTest.BadPort2 (1499 of 2074)
PASS: lldb-api :: functionalities/data-formatter/data-formatter-objc/TestDataFormatterObjCCF.py (1500 of 2074)
PASS: lldb-api :: commands/expression/ignore-artificial-constructors/TestIgnoreArtificialConstructors.py (1501 of 2074)
PASS: lldb-shell :: SymbolFile/Breakpad/unwind-via-stack-win-no-memory-info.yaml (1502 of 2074)
UNSUPPORTED: lldb-api :: python_api/event/TestEvents.py (1503 of 2074)
PASS: lldb-unit :: UnwindAssembly/x86/./UnwindAssemblyx86Tests/Testx86AssemblyInspectionEngine.TestPushR14 (1504 of 2074)
PASS: lldb-shell :: ScriptInterpreter/None/import_module.test (1505 of 2074)
PASS: lldb-unit :: Expression/./ExpressionTests/CppModuleConfigurationTest.UnknownLibCppFile (1506 of 2074)
PASS: lldb-api :: functionalities/breakpoint/cpp_exception/TestCPPExceptionBreakpoint.py (1507 of 2074)
PASS: lldb-unit :: Process/gdb-remote/./ProcessGdbRemoteTests/GDBRemoteCommunicationClientTest.SendGetDataPacket (1508 of 2074)
PASS: lldb-unit :: Utility/./UtilityTests/SerializationRountripTest.SerializeDeserializeCStringArray (1509 of 2074)
PASS: lldb-unit :: Language/CPlusPlus/./LanguageCPlusPlusTests/CPlusPlusLanguage.FindAlternateFunctionManglings (1510 of 2074)
PASS: lldb-unit :: Utility/./UtilityTests/StringListTest.GetMaxStringLengthEmpty (1511 of 2074)
PASS: lldb-api :: lang/cpp/incomplete-types/TestCppIncompleteTypes.py (1512 of 2074)
PASS: lldb-shell :: ObjectFile/ELF/gnu-debuglink.yaml (1513 of 2074)
PASS: lldb-api :: commands/expression/timeout/TestCallWithTimeout.py (1514 of 2074)
PASS: lldb-unit :: ScriptInterpreter/Python/./ScriptInterpreterPythonTests/PythonDataObjectsTest.TestPythonBoolean (1515 of 2074)
PASS: lldb-unit :: Breakpoint/./LLDBBreakpointTests/BreakpointIDTest.StringIsBreakpointName (1516 of 2074)
PASS: lldb-unit :: Utility/./UtilityTests/SubsystemRAIITest.SubsystemWithErrorFailure (1517 of 2074)
PASS: lldb-api :: functionalities/data-formatter/data-formatter-globals/TestDataFormatterGlobals.py (1518 of 2074)
PASS: lldb-unit :: Target/./TargetTests/MemoryRegionInfoTest.Formatv (1519 of 2074)
PASS: lldb-api :: python_api/watchpoint/TestWatchpointIgnoreCount.py (1520 of 2074)
PASS: lldb-api :: functionalities/postmortem/netbsd-core/TestNetBSDCore.py (1521 of 2074)
PASS: lldb-api :: lang/cpp/gmodules/TestWithModuleDebugging.py (1522 of 2074)
PASS: lldb-unit :: Symbol/./SymbolTests/TestClangASTImporter.DeportTypeTagDecl (1523 of 2074)
PASS: lldb-unit :: ScriptInterpreter/Python/./ScriptInterpreterPythonTests/PythonDataObjectsTest.TestPythonListManipulation (1524 of 2074)
PASS: lldb-api :: commands/log/invalid-args/TestInvalidArgsLog.py (1525 of 2074)
PASS: lldb-shell :: SymbolFile/NativePDB/ast-methods.cpp (1526 of 2074)
PASS: lldb-unit :: Utility/./UtilityTests/StreamTeeTest.Assignment (1527 of 2074)
PASS: lldb-api :: commands/expression/xvalue/TestXValuePrinting.py (1528 of 2074)
PASS: lldb-unit :: Process/minidump/./LLDBMinidumpTests/MinidumpParserTest.GetLinuxProcStatus_no_stream (1529 of 2074)
PASS: lldb-api :: commands/thread/select/TestThreadSelect.py (1530 of 2074)
PASS: lldb-shell :: SymbolFile/DWARF/DW_AT_loclists_base.s (1531 of 2074)
PASS: lldb-shell :: Reproducer/Functionalities/TestImageList.test (1532 of 2074)
PASS: lldb-api :: commands/expression/no-deadlock/TestExprDoesntBlock.py (1533 of 2074)
PASS: lldb-api :: commands/expression/formatters/TestFormatters.py (1534 of 2074)
PASS: lldb-api :: functionalities/gdb_remote_client/TestRecognizeBreakpoint.py (1535 of 2074)
PASS: lldb-shell :: ObjectFile/PECOFF/uuid.yaml (1536 of 2074)
PASS: lldb-unit :: Utility/./UtilityTests/StringExtractorTest.GetHexBytes_FullString (1537 of 2074)
PASS: lldb-shell :: SymbolFile/DWARF/debug_loc_and_loclists.s (1538 of 2074)
PASS: lldb-api :: commands/expression/import-std-module/basic/TestImportStdModule.py (1539 of 2074)
PASS: lldb-api :: lang/objc/objc-static-method/TestObjCStaticMethod.py (1540 of 2074)
PASS: lldb-unit :: Core/./LLDBCoreTests/MangledTest.EmptyForInvalidName (1541 of 2074)
PASS: lldb-api :: functionalities/data-formatter/vector-types/TestVectorTypesFormatting.py (1542 of 2074)
PASS: lldb-api :: types/TestShortTypeExpr.py (1543 of 2074)
PASS: lldb-unit :: Utility/./UtilityTests/DataExtractorTest.UncommonAddressSize (1544 of 2074)
UNSUPPORTED: lldb-api :: functionalities/darwin_log/filter/exact_match/message/TestDarwinLogFilterMatchMessage.py (1545 of 2074)
PASS: lldb-unit :: Utility/./UtilityTests/StreamTest.PutBytesAsRawHex8ToMixedEndian (1546 of 2074)
PASS: lldb-unit :: UnwindAssembly/x86/./UnwindAssemblyx86Tests/Testx86AssemblyInspectionEngine.TestPushECX (1547 of 2074)
PASS: lldb-api :: functionalities/data-formatter/hexcaps/TestDataFormatterHexCaps.py (1548 of 2074)
PASS: lldb-api :: linux/builtin_trap/TestBuiltinTrap.py (1549 of 2074)
PASS: lldb-api :: lang/cpp/namespace_conflicts/TestNamespaceConflicts.py (1550 of 2074)
PASS: lldb-shell :: SymbolFile/DWARF/find-variable-dwo.cpp (1551 of 2074)
PASS: lldb-shell :: SymbolFile/NativePDB/nested-types.cpp (1552 of 2074)
UNSUPPORTED: lldb-api :: functionalities/darwin_log/filter/exact_match/subsystem/TestDarwinLogFilterMatchSubsystem.py (1553 of 2074)
UNSUPPORTED: lldb-shell :: Register/arm-fp-read.test (1554 of 2074)
PASS: lldb-api :: functionalities/tail_call_frames/disambiguate_paths_to_common_sink/TestDisambiguatePathsToCommonSink.py (1555 of 2074)
PASS: lldb-api :: commands/target/modules/search-paths/insert/TestTargetModulesSearchpathsInsert.py (1556 of 2074)
PASS: lldb-unit :: ScriptInterpreter/Python/./ScriptInterpreterPythonTests/PythonDataObjectsTest.TestInstanceNameResolutionNoDot (1557 of 2074)
PASS: lldb-unit :: SymbolFile/DWARF/./SymbolFileDWARFTests/SymbolFileDWARFTests.TestAbbrevInvalidNULLTag (1558 of 2074)
PASS: lldb-unit :: Utility/./UtilityTests/VMRange.IsValid (1559 of 2074)
PASS: lldb-api :: functionalities/tail_call_frames/thread_step_out_message/TestArtificialFrameStepOutMessage.py (1560 of 2074)
PASS: lldb-shell :: ObjectFile/wasm/embedded-debug-sections.yaml (1561 of 2074)
PASS: lldb-unit :: Utility/./UtilityTests/DataExtractorTest.GetFloatUnaligned (1562 of 2074)
PASS: lldb-api :: types/TestRecursiveTypes.py (1563 of 2074)
PASS: lldb-api :: functionalities/completion/TestCompletion.py (1564 of 2074)
UNSUPPORTED: lldb-api :: commands/register/register/intel_xtended_registers/mpx_bound_violation/TestBoundViolation.py (1565 of 2074)
PASS: lldb-unit :: Host/./HostTests/NativeProcessProtocolTest.ReadCStringFromMemory (1566 of 2074)
XFAIL: lldb-shell :: Unwind/prefer-debug-over-eh-frame.test (1567 of 2074)
PASS: lldb-unit :: Host/./HostTests/MainLoopTest.UnmonitoredSignal (1568 of 2074)
PASS: lldb-unit :: debugserver/./debugserverTests/JSON.Parse (1569 of 2074)
PASS: lldb-shell :: SymbolFile/Breakpad/line-table.test (1570 of 2074)
PASS: lldb-shell :: SymbolFile/DWARF/find-function-regex.cpp (1571 of 2074)
PASS: lldb-api :: lang/cpp/static_methods/TestCPPStaticMethods.py (1572 of 2074)
PASS: lldb-unit :: UnwindAssembly/x86/./UnwindAssemblyx86Tests/Testx86AssemblyInspectionEngine.TestPushExtended (1573 of 2074)
PASS: lldb-unit :: Utility/./UtilityTests/BinaryStreamTest.PutSLEB128OneByte (1574 of 2074)
PASS: lldb-unit :: Symbol/./SymbolTests/TestTypeSystemClang.TestUnifyAccessSpecifiers (1575 of 2074)
PASS: lldb-api :: commands/process/attach/TestProcessAttach.py (1576 of 2074)
PASS: lldb-unit :: Language/Highlighting/./HighlighterTests/HighlighterTest.ClangTrailingBackslashWithWhitespace (1577 of 2074)
PASS: lldb-api :: commands/apropos/with-process/TestAproposWithProcess.py (1578 of 2074)
PASS: lldb-shell :: ObjectFile/ELF/netbsd-core-amd64.test (1579 of 2074)
PASS: lldb-unit :: Expression/./ExpressionTests/DiagnosticManagerTest.PutString (1580 of 2074)
PASS: lldb-unit :: Utility/./UtilityTests/ScalarTest.Getters (1581 of 2074)
UNSUPPORTED: lldb-api :: functionalities/darwin_log/filter/exact_match/activity/TestDarwinLogFilterMatchActivity.py (1582 of 2074)
PASS: lldb-unit :: Utility/./UtilityTests/StringExtractorTest.GetHexU8_Underflow2_NoEof (1583 of 2074)
UNSUPPORTED: lldb-api :: functionalities/data-formatter/data-formatter-stl/libstdcpp/iterator/TestDataFormatterStdIterator.py (1584 of 2074)
PASS: lldb-unit :: Utility/./UtilityTests/StringListTest.CopyListSingle (1585 of 2074)
PASS: lldb-unit :: Utility/./UtilityTests/DataExtractorTest.GetCStrUnterminated (1586 of 2074)
PASS: lldb-unit :: Utility/./UtilityTests/RangeDataVector.FindEntryIndexesThatContain (1587 of 2074)
PASS: lldb-api :: commands/frame/diagnose/dereference-argument/TestDiagnoseDereferenceArgument.py (1588 of 2074)
PASS: lldb-api :: lang/c/blocks/TestBlocks.py (1589 of 2074)
PASS: lldb-unit :: UnwindAssembly/x86/./UnwindAssemblyx86Tests/Testx86AssemblyInspectionEngine.TestPushEDI (1590 of 2074)
UNSUPPORTED: lldb-shell :: Process/Windows/exception_access_violation.cpp (1591 of 2074)
PASS: lldb-api :: lang/cpp/function_refs/TestFunctionRefs.py (1592 of 2074)
PASS: lldb-unit :: Utility/./UtilityTests/ListenerTest.GetEventWait (1593 of 2074)
PASS: lldb-unit :: Utility/./UtilityTests/StringExtractorTest.GetHexU8_Underflow_NoEof (1594 of 2074)
PASS: lldb-api :: functionalities/breakpoint/global_constructor/TestBreakpointInGlobalConstructor.py (1595 of 2074)
PASS: lldb-unit :: SymbolFile/DWARF/./SymbolFileDWARFTests/SymbolFileDWARFTests.ParseArangesNonzeroSegmentSize (1596 of 2074)
PASS: lldb-api :: commands/expression/persistent_types/TestNestedPersistentTypes.py (1597 of 2074)
PASS: lldb-api :: functionalities/tail_call_frames/cross_object/TestCrossObjectTailCalls.py (1598 of 2074)
PASS: lldb-shell :: SymbolFile/DWARF/debug-names-compressed.cpp (1599 of 2074)
UNSUPPORTED: lldb-shell :: Register/x86-gp-read.test (1600 of 2074)
PASS: lldb-unit :: UnwindAssembly/x86/./UnwindAssemblyx86Tests/Testx86AssemblyInspectionEngine.TestSpillRegToStackViaMOVi386 (1601 of 2074)
PASS: lldb-unit :: Utility/./UtilityTests/UriParserTest.BracketedHostnamePort (1602 of 2074)
PASS: lldb-api :: lang/objc/exceptions/TestObjCExceptions.py (1603 of 2074)
PASS: lldb-api :: lang/objcxx/class-name-clash/TestNameClash.py (1604 of 2074)
PASS: lldb-unit :: Utility/./UtilityTests/DataExtractorTest.GetULEB128_bit63 (1605 of 2074)
PASS: lldb-shell :: ExecControl/StopHook/stop-hook.test (1606 of 2074)
PASS: lldb-shell :: Reproducer/TestGDBRemoteRepro.test (1607 of 2074)
PASS: lldb-unit :: Language/CPlusPlus/./LanguageCPlusPlusTests/CPlusPlusLanguage.MethodNameParsing (1608 of 2074)
PASS: lldb-api :: commands/watchpoints/watchpoint_commands/command/TestWatchpointCommandPython.py (1609 of 2074)
PASS: lldb-unit :: SymbolFile/NativePDB/./SymbolFileNativePDBTests/PDBFPOProgramToDWARFExpressionTests.UnknownOp (1610 of 2074)
PASS: lldb-api :: functionalities/tail_call_frames/ambiguous_tail_call_seq1/TestAmbiguousTailCallSeq1.py (1611 of 2074)
PASS: lldb-unit :: Utility/./UtilityTests/FileSpecTest.AppendPathComponent (1612 of 2074)
PASS: lldb-shell :: SymbolFile/NativePDB/source-list.cpp (1613 of 2074)
PASS: lldb-api :: lang/c/find_struct_type/TestFindStructTypes.py (1614 of 2074)
PASS: lldb-unit :: Utility/./UtilityTests/AnsiTerminal.WhiteSpace (1615 of 2074)
PASS: lldb-unit :: Utility/./UtilityTests/TimerTest.CategoryTimesNested (1616 of 2074)
UNSUPPORTED: lldb-api :: lang/c/typedef/Testtypedef.py (1617 of 2074)
PASS: lldb-api :: lang/objc/foundation/TestObjCMethods.py (1618 of 2074)
PASS: lldb-api :: lang/cpp/lambdas/TestLambdas.py (1619 of 2074)
PASS: lldb-api :: macosx/find-dsym/bundle-with-dot-in-filename/TestBundleWithDotInFilename.py (1620 of 2074)
PASS: lldb-api :: lang/c/strings/TestCStrings.py (1621 of 2074)
PASS: lldb-shell :: Commands/command-disassemble.s (1622 of 2074)
PASS: lldb-unit :: Utility/./UtilityTests/FileSpecTest.EqualDotsWindows (1623 of 2074)
PASS: lldb-unit :: Utility/./UtilityTests/ArgsTest.Yaml (1624 of 2074)
UNSUPPORTED: lldb-shell :: Watchpoint/netbsd-nouserdbregs.test (1625 of 2074)
PASS: lldb-api :: tools/lldb-vscode/breakpoint/TestVSCode_setExceptionBreakpoints.py (1626 of 2074)
PASS: lldb-unit :: Utility/./UtilityTests/StringListTest.ShiftStdString (1627 of 2074)
PASS: lldb-api :: lang/objc/objc-baseclass-sbtype/TestObjCBaseClassSBType.py (1628 of 2074)
PASS: lldb-unit :: SymbolFile/NativePDB/./SymbolFileNativePDBTests/PDBFPOProgramToDWARFExpressionTests.UnresolvedRegisterAssignmentReference (1629 of 2074)
PASS: lldb-shell :: SymbolFile/DWARF/split-dwarf-inlining.cpp (1630 of 2074)
PASS: lldb-api :: commands/expression/import-std-module/shared_ptr-dbg-info-content/TestSharedPtrDbgInfoContentFromStdModule.py (1631 of 2074)
PASS: lldb-api :: functionalities/thread/concurrent_events/TestConcurrentDelaySignalWatch.py (1632 of 2074)
PASS: lldb-unit :: Process/gdb-remote/./ProcessGdbRemoteTests/GDBRemoteCommunicationClientTest.WriteRegisterNoSuffix (1633 of 2074)
PASS: lldb-api :: commands/frame/language/TestGuessLanguage.py (1634 of 2074)
PASS: lldb-unit :: Symbol/./SymbolTests/TestClangASTImporter.MetadataPropagationIndirectImport (1635 of 2074)
UNSUPPORTED: lldb-api :: tools/lldb-server/thread-name/TestGdbRemoteThreadName.py (1636 of 2074)
PASS: lldb-api :: functionalities/postmortem/minidump/TestMiniDump.py (1637 of 2074)
PASS: lldb-unit :: Utility/./UtilityTests/FileSpecTest.FileAndDirectoryComponents (1638 of 2074)
UNSUPPORTED: lldb-api :: functionalities/darwin_log/format/TestDarwinLogMessageFormat.py (1639 of 2074)
PASS: lldb-unit :: Utility/./UtilityTests/RecordReplayTest.InstrumentedBarRef (1640 of 2074)
PASS: lldb-api :: commands/expression/import-std-module/weak_ptr/TestWeakPtrFromStdModule.py (1641 of 2074)
PASS: lldb-api :: functionalities/lazy-loading/TestLazyLoading.py (1642 of 2074)
PASS: lldb-unit :: Utility/./UtilityTests/ScalarTest.GetBytes (1643 of 2074)
PASS: lldb-unit :: SymbolFile/NativePDB/./SymbolFileNativePDBTests/PDBFPOProgramToDWARFExpressionTests.MultipleDependentAssignments (1644 of 2074)
PASS: lldb-unit :: Utility/./UtilityTests/BinaryStreamTest.PutULEB128EightBytes (1645 of 2074)
PASS: lldb-api :: functionalities/data-formatter/data-formatter-stl/libcxx/iterator/TestDataFormatterLibccIterator.py (1646 of 2074)
PASS: lldb-unit :: Utility/./UtilityTests/StreamTeeTest.AppendStream (1647 of 2074)
PASS: lldb-unit :: Utility/./UtilityTests/StatusTest.ErrorCodeConstructor (1648 of 2074)
PASS: lldb-unit :: Host/./HostTests/FileSystemTest.OpenErrno (1649 of 2074)
PASS: lldb-unit :: Utility/./UtilityTests/StreamTeeTest.SetStreamAtIndexOverwrite (1650 of 2074)
PASS: lldb-unit :: Utility/./UtilityTests/StreamTest.AddressRangeSize (1651 of 2074)
PASS: lldb-api :: commands/log/basic/TestLogging.py (1652 of 2074)
PASS: lldb-unit :: Utility/./UtilityTests/StreamTeeTest.Write (1653 of 2074)
PASS: lldb-unit :: Utility/./UtilityTests/BinaryStreamTest.PutSLEB128SevenBytes (1654 of 2074)
PASS: lldb-unit :: Host/./HostTests/MainLoopTest.ReadObject (1655 of 2074)
PASS: lldb-unit :: Symbol/./SymbolTests/Type.CompilerContextPattern (1656 of 2074)
PASS: lldb-api :: commands/expression/import-std-module/weak_ptr-dbg-info-content/TestDbgInfoContentWeakPtrFromStdModule.py (1657 of 2074)
PASS: lldb-unit :: Process/minidump/./LLDBMinidumpTests/MinidumpParserTest.GetFilteredModuleList (1658 of 2074)
PASS: lldb-unit :: Host/./HostTests/FileSystemTest.EnumerateDirectory (1659 of 2074)
PASS: lldb-api :: arm/emulation/TestEmulations.py (1660 of 2074)
PASS: lldb-unit :: Utility/./UtilityTests/Predicate.WaitForValueNotEqualTo (1661 of 2074)
PASS: lldb-api :: functionalities/data-formatter/data-formatter-skip-summary/TestDataFormatterSkipSummary.py (1662 of 2074)
PASS: lldb-unit :: Expression/./ExpressionTests/DiagnosticManagerTest.AppendMessageNoDiag (1663 of 2074)
PASS: lldb-unit :: UnwindAssembly/x86/./UnwindAssemblyx86Tests/Testx86AssemblyInspectionEngine.TestSimple64bitFrameFunction (1664 of 2074)
PASS: lldb-unit :: Utility/./UtilityTests/BroadcasterTest.EventTypeHasListeners (1665 of 2074)
PASS: lldb-unit :: Core/./LLDBCoreTests/MangledTest.ResultForBlockInvocation (1666 of 2074)
UNSUPPORTED: lldb-api :: benchmarks/libcxxmap/TestBenchmarkLibcxxMap.py (1667 of 2074)
PASS: lldb-unit :: Host/./HostTests/HostInfoTest.GetAugmentedArchSpec (1668 of 2074)
FAIL: lldb-shell :: ObjectFile/PECOFF/export-dllfunc.yaml (1669 of 2074)
******************** TEST 'lldb-shell :: ObjectFile/PECOFF/export-dllfunc.yaml' FAILED ********************
Script:
--
: 'RUN: at line 2';   /Users/buildslave/jenkins/workspace/lldb-cmake-sanitized/lldb-build/bin/yaml2obj < /Users/buildslave/jenkins/workspace/lldb-cmake-sanitized/llvm-project/lldb/test/Shell/ObjectFile/PECOFF/export-dllfunc.yaml > /Users/buildslave/jenkins/workspace/lldb-cmake-sanitized/lldb-build/tools/lldb/test/ObjectFile/PECOFF/Output/export-dllfunc.yaml.tmp.obj
: 'RUN: at line 4';   /Users/buildslave/jenkins/workspace/lldb-cmake-sanitized/lldb-build/bin/lld-link /machine:x64 /out:/Users/buildslave/jenkins/workspace/lldb-cmake-sanitized/lldb-build/tools/lldb/test/ObjectFile/PECOFF/Output/export-dllfunc.yaml.tmp.dll /noentry /nodefaultlib /debug /dll /Users/buildslave/jenkins/workspace/lldb-cmake-sanitized/lldb-build/tools/lldb/test/ObjectFile/PECOFF/Output/export-dllfunc.yaml.tmp.obj /export:DllFunc
: 'RUN: at line 6';   /Users/buildslave/jenkins/workspace/lldb-cmake-sanitized/lldb-build/bin/lldb-test object-file /Users/buildslave/jenkins/workspace/lldb-cmake-sanitized/lldb-build/tools/lldb/test/ObjectFile/PECOFF/Output/export-dllfunc.yaml.tmp.dll | /Users/buildslave/jenkins/workspace/lldb-cmake-sanitized/lldb-build/bin/FileCheck -check-prefix=BASIC-CHECK /Users/buildslave/jenkins/workspace/lldb-cmake-sanitized/llvm-project/lldb/test/Shell/ObjectFile/PECOFF/export-dllfunc.yaml
: 'RUN: at line 7';   /Users/buildslave/jenkins/workspace/lldb-cmake-sanitized/lldb-build/bin/lldb-test object-file -dep-modules /Users/buildslave/jenkins/workspace/lldb-cmake-sanitized/lldb-build/tools/lldb/test/ObjectFile/PECOFF/Output/export-dllfunc.yaml.tmp.dll | /Users/buildslave/jenkins/workspace/lldb-cmake-sanitized/lldb-build/bin/FileCheck -check-prefix=DEPS /Users/buildslave/jenkins/workspace/lldb-cmake-sanitized/llvm-project/lldb/test/Shell/ObjectFile/PECOFF/export-dllfunc.yaml
--
Exit Code: 134

Hide Details

Command Output (stderr): -- /Users/buildslave/jenkins/workspace/lldb-cmake-sanitized/host-compiler/bin/../include/c++/v1/vector:1553:12: runtime error: reference binding to null pointer of type 'llvm::pdb::PSHashRecord' SUMMARY: UndefinedBehaviorSanitizer: undefined-behavior /Users/buildslave/jenkins/workspace/lldb-cmake-sanitized/host-compiler/bin/../include/c++/v1/vector:1553:12 in /Users/buildslave/jenkins/workspace/lldb-cmake-sanitized/host-compiler/bin/../include/c++/v1/vector:1553: runtime error: reference binding to null pointer of type 'llvm::pdb::PSHashRecord' SUMMARY: UndefinedBehaviorSanitizer: undefined-behavior /Users/buildslave/jenkins/workspace/lldb-cmake-sanitized/host-compiler/bin/../include/c++/v1/vector:1553 in /Users/buildslave/jenkins/workspace/lldb-cmake-sanitized/host-compiler/bin/../include/c++/v1/vector:1553: runtime error: reference binding to null pointer of type 'llvm::pdb::PSHashRecord' PLEASE submit a bug report to https://bugs.llvm.org/ and include the crash backtrace. SUMMARY: UndefinedBehaviorSanitizer: undefined-behavior /Users/buildslave/jenkins/workspace/lldb-cmake-sanitized/host-compiler/bin/../include/c++/v1/vector:1553 in /Users/buildslave/jenkins/workspace/lldb-cmake-sanitized/host-compiler/bin/../include/c++/v1/vector:1553: runtime error: reference binding to null pointer of type 'llvm::pdb::PSHashRecord' SUMMARY: UndefinedBehaviorSanitizer: undefined-behavior /Users/buildslave/jenkins/workspace/lldb-cmake-sanitized/host-compiler/bin/../include/c++/v1/vector:1553 in /Users/buildslave/jenkins/workspace/lldb-cmake-sanitized/host-compiler/bin/../include/c++/v1/vector:1553: runtime error: reference binding to null pointer of type 'llvm::pdb::PSHashRecord' SUMMARY: UndefinedBehaviorSanitizer: undefined-behavior /Users/buildslave/jenkins/workspace/lldb-cmake-sanitized/host-compiler/bin/../include/c++/v1/vector:1553 in /Users/buildslave/jenkins/workspace/lldb-cmake-sanitized/host-compiler/bin/../include/c++/v1/vector:1553: runtime error: reference binding to null pointer of type 'llvm::pdb::PSHashRecord' SUMMARY: UndefinedBehaviorSanitizer: undefined-behavior /Users/buildslave/jenkins/workspace/lldb-cmake-sanitized/host-compiler/bin/../include/c++/v1/vector:1553 in /Users/buildslave/jenkins/workspace/lldb-cmake-sanitized/host-compiler/bin/../include/c++/v1/vector:1553: runtime error: reference binding to null pointer of type 'llvm::pdb::PSHashRecord' SUMMARY: UndefinedBehaviorSanitizer: undefined-behavior /Users/buildslave/jenkins/workspace/lldb-cmake-sanitized/host-compiler/bin/../include/c++/v1/vector:1553 in /Users/buildslave/jenkins/workspace/lldb-cmake-sanitized/host-compiler/bin/../include/c++/v1/vector:1553: runtime error: reference binding to null pointer of type 'llvm::pdb::PSHashRecord' SUMMARY: UndefinedBehaviorSanitizer: undefined-behavior /Users/buildslave/jenkins/workspace/lldb-cmake-sanitized/host-compiler/bin/../include/c++/v1/vector:1553 in /Users/buildslave/jenkins/workspace/lldb-cmake-sanitized/host-compiler/bin/../include/c++/v1/vector:1553: runtime error: reference binding to null pointer of type 'llvm::pdb::PSHashRecord' SUMMARY: UndefinedBehaviorSanitizer: undefined-behavior /Users/buildslave/jenkins/workspace/lldb-cmake-sanitized/host-compiler/bin/../include/c++/v1/vector:1553 in /Users/buildslave/jenkins/workspace/lldb-cmake-sanitized/host-compiler/bin/../include/c++/v1/vector:1553: runtime error: reference binding to null pointer of type 'llvm::pdb::PSHashRecord' SUMMARY: UndefinedBehaviorSanitizer: undefined-behavior /Users/buildslave/jenkins/workspace/lldb-cmake-sanitized/host-compiler/bin/../include/c++/v1/vector:1553 in /Users/buildslave/jenkins/workspace/lldb-cmake-sanitized/host-compiler/bin/../include/c++/v1/vector:1553: runtime error: reference binding to null pointer of type 'llvm::pdb::PSHashRecord' SUMMARY: UndefinedBehaviorSanitizer: undefined-behavior /Users/buildslave/jenkins/workspace/lldb-cmake-sanitized/host-compiler/bin/../include/c++/v1/vector:1553 in /Users/buildslave/jenkins/workspace/lldb-cmake-sanitized/host-compiler/bin/../include/c++/v1/vector:1553: runtime error: reference binding to null pointer of type 'llvm::pdb::PSHashRecord' SUMMARY: UndefinedBehaviorSanitizer: undefined-behavior /Users/buildslave/jenkins/workspace/lldb-cmake-sanitized/host-compiler/bin/../include/c++/v1/vector:1553 in /Users/buildslave/jenkins/workspace/lldb-cmake-sanitized/host-compiler/bin/../include/c++/v1/vector:1553: runtime error: reference binding to null pointer of type 'llvm::pdb::PSHashRecord' SUMMARY: UndefinedBehaviorSanitizer: undefined-behavior /Users/buildslave/jenkins/workspace/lldb-cmake-sanitized/host-compiler/bin/../include/c++/v1/vector:1553 in /Users/buildslave/jenkins/workspace/lldb-cmake-sanitized/host-compiler/bin/../include/c++/v1/vector:1553: runtime error: reference binding to null pointer of type 'llvm::pdb::PSHashRecord' SUMMARY: UndefinedBehaviorSanitizer: undefined-behavior /Users/buildslave/jenkins/workspace/lldb-cmake-sanitized/host-compiler/bin/../include/c++/v1/vector:1553 in /Users/buildslave/jenkins/workspace/lldb-cmake-sanitized/lldb-build/tools/lldb/test/ObjectFile/PECOFF/Output/export-dllfunc.yaml.script: line 4: 41686 Abort trap: 6 /Users/buildslave/jenkins/workspace/lldb-cmake-sanitized/lldb-build/bin/lld-link /machine:x64 /out:/Users/buildslave/jenkins/workspace/lldb-cmake-sanitized/lldb-build/tools/lldb/test/ObjectFile/PECOFF/Output/export-dllfunc.yaml.tmp.dll /noentry /nodefaultlib /debug /dll /Users/buildslave/jenkins/workspace/lldb-cmake-sanitized/lldb-build/tools/lldb/test/ObjectFile/PECOFF/Output/export-dllfunc.yaml.tmp.obj /export:DllFunc

Hide Details

--

Hide Details

******************** UNSUPPORTED: lldb-api :: functionalities/tsan/thread_numbers/TestTsanThreadNumbers.py (1670 of 2074) PASS: lldb-unit :: Utility/./UtilityTests/ArchSpecTest.TestParseMachCPUDashSubtypeTripleExtra (1671 of 2074) PASS: lldb-unit :: Utility/./UtilityTests/BinaryStreamTest.PutULEB128TwoBytes (1672 of 2074) PASS: lldb-unit :: Symbol/./SymbolTests/TestTypeSystemClang.TestFunctionTemplateConstruction (1673 of 2074) PASS: lldb-api :: functionalities/data-formatter/data-formatter-advanced/TestDataFormatterAdv.py (1674 of 2074) PASS: lldb-api :: functionalities/gdb_remote_client/TestqOffsets.py (1675 of 2074) UNSUPPORTED: lldb-api :: functionalities/asan/TestMemoryHistory.py (1676 of 2074) UNSUPPORTED: lldb-api :: functionalities/gdb_remote_client/TestWasm.py (1677 of 2074) PASS: lldb-shell :: SymbolFile/DWARF/debug_loclists-dwo.s (1678 of 2074) PASS: lldb-shell :: SymbolFile/DWARF/dwarf5-partial-index.cpp (1679 of 2074) UNSUPPORTED: lldb-api :: api/multiple-debuggers/TestMultipleDebuggers.py (1680 of 2074) PASS: lldb-api :: functionalities/inferior-assert/TestInferiorAssert.py (1681 of 2074) PASS: lldb-unit :: Utility/./UtilityTests/StringLexerTest.GetUnlexed (1682 of 2074) PASS: lldb-shell :: SymbolFile/DWARF/compilercontext.ll (1683 of 2074) PASS: lldb-api :: functionalities/inline-stepping/TestInlineStepping.py (1684 of 2074) PASS: lldb-unit :: Utility/./UtilityTests/StreamTest.AddressNoSuffix (1685 of 2074) PASS: lldb-unit :: ScriptInterpreter/Python/./ScriptInterpreterPythonTests/PythonDataObjectsTest.TestPythonTupleSize (1686 of 2074) PASS: lldb-api :: commands/process/attach-resume/TestAttachResume.py (1687 of 2074) PASS: lldb-unit :: Utility/./UtilityTests/StringExtractorTest.InitMisc (1688 of 2074) PASS: lldb-api :: functionalities/data-formatter/data-formatter-synth/TestDataFormatterSynth.py (1689 of 2074) PASS: lldb-api :: lang/objc/ivar-IMP/TestObjCiVarIMP.py (1690 of 2074) UNSUPPORTED: lldb-api :: functionalities/tty/TestTerminal.py (1691 of 2074) PASS: lldb-api :: lang/cpp/llvm-style/TestLLVMStyle.py (1692 of 2074) PASS: lldb-api :: functionalities/archives/TestBSDArchives.py (1693 of 2074) PASS: lldb-unit :: UnwindAssembly/x86/./UnwindAssemblyx86Tests/Testx86AssemblyInspectionEngine.TestStackRealignMSVC_i386 (1694 of 2074) PASS: lldb-api :: commands/expression/rdar44436068/Test128BitsInteger.py (1695 of 2074) PASS: lldb-api :: commands/watchpoints/multiple_hits/TestMultipleHits.py (1696 of 2074) PASS: lldb-api :: sample_test/TestSampleTest.py (1697 of 2074) PASS: lldb-api :: python_api/lldbutil/iter/TestRegistersIterator.py (1698 of 2074) PASS: lldb-shell :: Breakpoint/split-dwarf5-debug-stroffsets.test (1699 of 2074) PASS: lldb-unit :: Target/./TargetTests/MCBasedABI.MapRegisterName (1700 of 2074) PASS: lldb-api :: functionalities/data-formatter/var-in-aggregate-misuse/TestVarInAggregateMisuse.py (1701 of 2074) UNSUPPORTED: lldb-api :: benchmarks/frame_variable/TestFrameVariableResponse.py (1702 of 2074) PASS: lldb-api :: functionalities/thread/concurrent_events/TestConcurrentManyCrash.py (1703 of 2074) PASS: lldb-unit :: Utility/./UtilityTests/NameMatchesTest.EndsWith (1704 of 2074) PASS: lldb-api :: functionalities/thread/exit_during_break/TestExitDuringBreak.py (1705 of 2074) PASS: lldb-unit :: Host/./HostTests/SocketAddressTest.Set (1706 of 2074) PASS: lldb-api :: functionalities/data-formatter/data-formatter-enum-format/TestDataFormatterEnumFormat.py (1707 of 2074) PASS: lldb-unit :: Process/gdb-remote/./ProcessGdbRemoteTests/GDBRemoteCommunicationTest.ReadPacket_checksum (1708 of 2074) PASS: lldb-api :: lang/objc/modules-auto-import/TestModulesAutoImport.py (1709 of 2074) PASS: lldb-api :: lang/cpp/namespace/TestNamespaceLookup.py (1710 of 2074) PASS: lldb-unit :: ScriptInterpreter/Python/./ScriptInterpreterPythonTests/PythonDataObjectsTest.TestPythonCallableInvoke (1711 of 2074) PASS: lldb-api :: commands/settings/quoting/TestQuoting.py (1712 of 2074) PASS: lldb-unit :: Utility/./UtilityTests/RangeTest.SetRangeBase (1713 of 2074) PASS: lldb-api :: commands/expression/expr-in-syscall/TestExpressionInSyscall.py (1714 of 2074) PASS: lldb-unit :: Utility/./UtilityTests/FileSpecTest.EqualSeparator (1715 of 2074) PASS: lldb-shell :: ObjectFile/ELF/aarch64-relocations.yaml (1716 of 2074) PASS: lldb-api :: lang/objc/foundation/TestObjCMethodsNSArray.py (1717 of 2074) PASS: lldb-unit :: UnwindAssembly/x86/./UnwindAssemblyx86Tests/Testx86AssemblyInspectionEngine.TestPopR14 (1718 of 2074) PASS: lldb-unit :: Utility/./UtilityTests/XcodeSDKTest.FindXcodeContentsDirectoryInPath (1719 of 2074) PASS: lldb-unit :: Utility/./UtilityTests/AnsiTerminal.Unknown (1720 of 2074) PASS: lldb-unit :: Utility/./UtilityTests/UriParserTest.BracketedHostnameWithPortIPv6 (1721 of 2074) PASS: lldb-shell :: Commands/command-disassemble-process.yaml (1722 of 2074) UNSUPPORTED: lldb-shell :: ScriptInterpreter/Lua/breakpoint_callback.test (1723 of 2074) PASS: lldb-api :: python_api/process/io/TestProcessIO.py (1724 of 2074) PASS: lldb-api :: python_api/signals/TestSignalsAPI.py (1725 of 2074) PASS: lldb-unit :: Symbol/./SymbolTests/TestTypeSystemClang.TestDisplayName (1726 of 2074) PASS: lldb-unit :: UnwindAssembly/x86/./UnwindAssemblyx86Tests/Testx86AssemblyInspectionEngine.TestLEAVE (1727 of 2074) PASS: lldb-unit :: Utility/./UtilityTests/ArgsTest.ReplaceArgumentAtIndexShort (1728 of 2074) PASS: lldb-unit :: Utility/./UtilityTests/ScalarTest.RightShiftOperator (1729 of 2074) PASS: lldb-shell :: Commands/command-script-import.test (1730 of 2074) PASS: lldb-shell :: Driver/TestPositionalArgs.test (1731 of 2074) UNSUPPORTED: lldb-shell :: SymbolFile/PDB/vbases.test (1732 of 2074) PASS: lldb-shell :: SymbolFile/DWARF/inline-function-address.ll (1733 of 2074) PASS: lldb-api :: macosx/duplicate-archive-members/TestDuplicateMembers.py (1734 of 2074) PASS: lldb-api :: functionalities/data-formatter/data-formatter-objc/TestDataFormatterObjCKVO.py (1735 of 2074) PASS: lldb-api :: lang/c/forward/TestForwardDeclaration.py (1736 of 2074) PASS: lldb-api :: tools/lldb-server/TestGdbRemoteExpeditedRegisters.py (1737 of 2074) UNSUPPORTED: lldb-shell :: SymbolFile/DWARF/DW_TAG_GNU_call_site-DW_AT_low_pc.s (1738 of 2074) PASS: lldb-api :: functionalities/thread/concurrent_events/TestConcurrentCrashWithWatchpointBreakpointSignal.py (1739 of 2074) PASS: lldb-unit :: Utility/./UtilityTests/ArgsTest.TestSingleArg (1740 of 2074) PASS: lldb-api :: commands/target/create-no-such-arch/TestNoSuchArch.py (1741 of 2074) PASS: lldb-api :: macosx/thread_suspend/TestInternalThreadSuspension.py (1742 of 2074) PASS: lldb-api :: functionalities/data-formatter/refpointer-recursion/TestDataFormatterRefPtrRecursion.py (1743 of 2074) PASS: lldb-shell :: ObjectFile/PECOFF/basic-info-arm64.yaml (1744 of 2074) PASS: lldb-unit :: Core/./LLDBCoreTests/MangledTest.ResultForValidName (1745 of 2074) PASS: lldb-unit :: Utility/./UtilityTests/RangeTest.SlideZero (1746 of 2074) PASS: lldb-unit :: Utility/./UtilityTests/StreamTest.PutRawBytesToMixedEndian (1747 of 2074) PASS: lldb-unit :: ObjectFile/Breakpad/./ObjectFileBreakpadTests/PublicRecord.parse (1748 of 2074) PASS: lldb-unit :: Utility/./UtilityTests/ArchSpecTest.Compatibility (1749 of 2074) PASS: lldb-unit :: Utility/./UtilityTests/StreamTest.PutHex64ByteOrderLittle (1750 of 2074) PASS: lldb-unit :: Core/./LLDBCoreTests/RichManglingContextTest.IPDRealloc (1751 of 2074) UNSUPPORTED: lldb-api :: lang/objc/modules-app-update/TestClangModulesAppUpdate.py (1752 of 2074) PASS: lldb-api :: functionalities/data-formatter/data-formatter-stl/libcxx/function/TestLibCxxFunction.py (1753 of 2074) PASS: lldb-unit :: Utility/./UtilityTests/RangeTest.Copy (1754 of 2074) PASS: lldb-api :: lang/objc/foundation/TestSymbolTable.py (1755 of 2074) PASS: lldb-unit :: Utility/./UtilityTests/VMRange.Clear (1756 of 2074) PASS: lldb-unit :: Utility/./UtilityTests/RangeTest.NotEqual (1757 of 2074) PASS: lldb-unit :: Core/./LLDBCoreTests/SourceFileCache.FindSourceFileFound (1758 of 2074) PASS: lldb-api :: commands/expression/import-std-module/sysroot/TestStdModuleSysroot.py (1759 of 2074) PASS: lldb-unit :: ScriptInterpreter/Python/./ScriptInterpreterPythonTests/PythonDataObjectsTest.TestPythonIntegerToStructuredInteger (1760 of 2074) PASS: lldb-unit :: Symbol/./SymbolTests/TestTypeSystemClang.TestOwningModule (1761 of 2074) PASS: lldb-unit :: debugserver/./debugserverTests/RNBSocket.LoopBackListenIPv6 (1762 of 2074) PASS: lldb-unit :: ScriptInterpreter/Python/./ScriptInterpreterPythonTests/PythonDataObjectsTest.TestPythonListValueEquality (1763 of 2074) PASS: lldb-api :: lang/objc/objc-builtin-types/TestObjCBuiltinTypes.py (1764 of 2074) PASS: lldb-unit :: Utility/./UtilityTests/StringLexerTest.PutBack (1765 of 2074) PASS: lldb-unit :: Utility/./UtilityTests/ArchSpecTest.TripleComponentsWereSpecified (1766 of 2074) PASS: lldb-api :: functionalities/dynamic_value_child_count/TestDynamicValueChildCount.py (1767 of 2074) PASS: lldb-api :: functionalities/unwind/noreturn/TestNoreturnUnwind.py (1768 of 2074) PASS: lldb-api :: commands/expression/import-std-module/no-std-module/TestMissingStdModule.py (1769 of 2074) PASS: lldb-unit :: Symbol/./SymbolTests/TestClangASTImporter.CopyDeclTagDecl (1770 of 2074) PASS: lldb-unit :: UnwindAssembly/x86/./UnwindAssemblyx86Tests/Testx86AssemblyInspectionEngine.TestPushR12 (1771 of 2074) PASS: lldb-shell :: SymbolFile/DWARF/debug_rnglists.s (1772 of 2074) PASS: lldb-unit :: UnwindAssembly/x86/./UnwindAssemblyx86Tests/Testx86AssemblyInspectionEngine.Test64bitFramelessSmallStackFrame (1773 of 2074) PASS: lldb-api :: commands/expression/radar_8638051/Test8638051.py (1774 of 2074) UNSUPPORTED: lldb-shell :: SymbolFile/PDB/func-symbols.test (1775 of 2074) PASS: lldb-unit :: Utility/./UtilityTests/CompletionRequest.DuplicateFiltering (1776 of 2074) PASS: lldb-unit :: Utility/./UtilityTests/RangeTest.ContainsRangeStartingFromZero (1777 of 2074) PASS: lldb-api :: macosx/find-app-in-bundle/TestFindAppInBundle.py (1778 of 2074) PASS: lldb-api :: functionalities/signal/raise/TestRaise.py (1779 of 2074) PASS: lldb-api :: functionalities/thread/concurrent_events/TestConcurrentSignalDelayBreak.py (1780 of 2074) PASS: lldb-api :: lang/cpp/std-function-step-into-callable/TestStdFunctionStepIntoCallable.py (1781 of 2074) PASS: lldb-unit :: Symbol/./SymbolTests/TestClangASTImporter.DeportDeclTagDecl (1782 of 2074) PASS: lldb-unit :: Utility/./UtilityTests/XcodeSDKTest.GetCanonicalNameAndConstruct (1783 of 2074) UNSUPPORTED: lldb-shell :: Register/x86-ymm-read.test (1784 of 2074) PASS: lldb-api :: functionalities/breakpoint/breakpoint_by_line_and_column/TestBreakpointByLineAndColumn.py (1785 of 2074) PASS: lldb-api :: commands/expression/context-object-objc/TestContextObjectObjc.py (1786 of 2074) PASS: lldb-unit :: Utility/./UtilityTests/StreamTest.AddressEmptyPrefix (1787 of 2074) PASS: lldb-unit :: Utility/./UtilityTests/ArgsTest.ReplaceArgumentAtIndexEqual (1788 of 2074) PASS: lldb-unit :: Utility/./UtilityTests/LogChannelTest.Enable (1789 of 2074) PASS: lldb-shell :: SymbolFile/DWARF/dwp.s (1790 of 2074) PASS: lldb-shell :: Breakpoint/split-dwarf-5-addrbase.test (1791 of 2074) PASS: lldb-unit :: Process/gdb-remote/./ProcessGdbRemoteTests/GDBRemoteCommunicationClientTest.SaveRestoreRegistersNoSuffix (1792 of 2074) PASS: lldb-api :: lang/cpp/dynamic-value/TestCppValueCast.py (1793 of 2074) PASS: lldb-unit :: Utility/./UtilityTests/StringListTest.AppendList (1794 of 2074) PASS: lldb-api :: lang/objc/real-definition/TestRealDefinition.py (1795 of 2074) PASS: lldb-api :: functionalities/breakpoint/require_hw_breakpoints/TestRequireHWBreakpoints.py (1796 of 2074) PASS: lldb-unit :: ObjectFile/ELF/./ObjectFileELFTests/ObjectFileELFTest.GetModuleSpecifications_EarlySectionHeaders (1797 of 2074) PASS: lldb-unit :: Utility/./UtilityTests/StreamTeeTest.GetStreamAtIndexOutOfBoundsEmpty (1798 of 2074) UNSUPPORTED: lldb-api :: functionalities/data-formatter/data-formatter-stl/libstdcpp/tuple/TestDataFormatterStdTuple.py (1799 of 2074) PASS: lldb-api :: types/TestCharTypeExpr.py (1800 of 2074) PASS: lldb-unit :: Utility/./UtilityTests/StringListTest.JoinThree (1801 of 2074) UNSUPPORTED: lldb-api :: functionalities/breakpoint/breakpoint_in_delayslot/TestAvoidBreakpointInDelaySlot.py (1802 of 2074) PASS: lldb-unit :: Utility/./UtilityTests/StringListTest.GetMaxStringLengthEqualSize (1803 of 2074) PASS: lldb-api :: functionalities/data-formatter/data-formatter-stl/libcxx/map/TestDataFormatterLibccMap.py (1804 of 2074) PASS: lldb-shell :: SymbolFile/DWARF/DW_TAG_basic_type_DW_ATE_UTF_nonC.ll (1805 of 2074) PASS: lldb-unit :: Utility/./UtilityTests/BinaryStreamTest.PutULEB128SixBytes (1806 of 2074) PASS: lldb-unit :: Process/gdb-remote/./ProcessGdbRemoteTests/GDBRemoteCommunicationServerTest.SendErrorResponse_ErrorList (1807 of 2074) PASS: lldb-api :: commands/expression/import_builtin_fileid/TestImportBuiltinFileID.py (1808 of 2074) PASS: lldb-unit :: Utility/./UtilityTests/ArgsTest.ReplaceArgumentAtIndexLonger (1809 of 2074) PASS: lldb-unit :: Utility/./UtilityTests/FileSpecTest.PrependPathComponent (1810 of 2074) PASS: lldb-api :: functionalities/data-formatter/data-formatter-categories/TestDataFormatterCategories.py (1811 of 2074) PASS: lldb-api :: functionalities/breakpoint/inlined_breakpoints/TestInlinedBreakpoints.py (1812 of 2074) PASS: lldb-api :: commands/settings/use_source_cache/TestUseSourceCache.py (1813 of 2074) PASS: lldb-unit :: Expression/./ExpressionTests/DWARFExpression.DW_OP_stack_value (1814 of 2074) PASS: lldb-unit :: Host/./HostTests/FileSystemTest.EmptyTest (1815 of 2074) PASS: lldb-unit :: Utility/./UtilityTests/StringLexerTest.Peek (1816 of 2074) PASS: lldb-shell :: Quit/TestQuitExitCodeNonInt.test (1817 of 2074) PASS: lldb-unit :: Host/./HostTests/ProcessLaunchInfoTest.Constructor (1818 of 2074) UNSUPPORTED: lldb-shell :: ObjectFile/ELF/minidebuginfo-no-lzma.yaml (1819 of 2074) PASS: lldb-shell :: Reproducer/TestReuseDirectory.test (1820 of 2074) PASS: lldb-api :: python_api/function_symbol/TestDisasmAPI.py (1821 of 2074) PASS: lldb-shell :: SymbolFile/NativePDB/global-classes.cpp (1822 of 2074) PASS: lldb-unit :: Process/minidump/./LLDBMinidumpTests/MinidumpParserTest.GetMemoryRegionInfo (1823 of 2074) XFAIL: lldb-shell :: Register/x86-64-write.test (1824 of 2074) PASS: lldb-api :: functionalities/avoids-fd-leak/TestFdLeak.py (1825 of 2074) PASS: lldb-shell :: ObjectFile/Breakpad/discontiguous-sections.test (1826 of 2074) UNSUPPORTED: lldb-api :: commands/expression/call-restarts/TestCallThatRestarts.py (1827 of 2074) PASS: lldb-unit :: Utility/./UtilityTests/OptionsWithRawTest.EmptySuffixSingleWhitespace (1828 of 2074) PASS: lldb-shell :: Reproducer/TestRelativePath.test (1829 of 2074) UNSUPPORTED: lldb-shell :: Register/x86-zmm-write.test (1830 of 2074) PASS: lldb-api :: commands/watchpoints/watchpoint_commands/TestWatchpointCommands.py (1831 of 2074) PASS: lldb-api :: functionalities/data-formatter/dump_dynamic/TestDumpDynamic.py (1832 of 2074) PASS: lldb-unit :: Utility/./UtilityTests/StructuredDataTest.StringDump (1833 of 2074) PASS: lldb-unit :: Utility/./UtilityTests/GeneratorTest.Create (1834 of 2074) PASS: lldb-api :: commands/watchpoints/watchpoint_commands/command/TestWatchpointCommandLLDB.py (1835 of 2074) PASS: lldb-unit :: Interpreter/./InterpreterTests/CompletionTest.DirCompletionUsername (1836 of 2074) PASS: lldb-unit :: UnwindAssembly/x86/./UnwindAssemblyx86Tests/Testx86AssemblyInspectionEngine.TestPushEBX (1837 of 2074) PASS: lldb-unit :: Utility/./UtilityTests/PassiveReplayTest.InstrumentedBarPtr (1838 of 2074) PASS: lldb-unit :: Utility/./UtilityTests/ProcessInstanceInfo.DumpTable (1839 of 2074) PASS: lldb-api :: commands/expression/issue_11588/Test11588.py (1840 of 2074) PASS: lldb-unit :: Utility/./UtilityTests/StringLexerTest.NextIf (1841 of 2074) PASS: lldb-unit :: Process/minidump/./LLDBMinidumpTests/MinidumpParserTest.GetThreadContext_x86_64 (1842 of 2074) UNSUPPORTED: lldb-shell :: SymbolFile/NativePDB/typedefs.cpp (1843 of 2074) PASS: lldb-unit :: Process/gdb-remote/./ProcessGdbRemoteTests/GDBRemoteCommunicationClientTest.GetModulesInfo (1844 of 2074) PASS: lldb-unit :: ScriptInterpreter/Python/./ScriptInterpreterPythonTests/PythonDataObjectsTest.TestPythonBytes (1845 of 2074) PASS: lldb-shell :: ObjectFile/PECOFF/invalid-export-table.yaml (1846 of 2074) UNSUPPORTED: lldb-shell :: Breakpoint/case-insensitive.test (1847 of 2074) PASS: lldb-unit :: ScriptInterpreter/Python/./ScriptInterpreterPythonTests/PythonDataObjectsTest.TestPythonTupleInitializerList2 (1848 of 2074) PASS: lldb-api :: functionalities/process_group/TestChangeProcessGroup.py (1849 of 2074) PASS: lldb-api :: functionalities/data-formatter/user-format-vs-summary/TestUserFormatVsSummary.py (1850 of 2074) PASS: lldb-shell :: SymbolFile/NativePDB/globals-bss.cpp (1851 of 2074) PASS: lldb-api :: commands/version/TestVersion.py (1852 of 2074) PASS: lldb-unit :: Utility/./UtilityTests/ArgsTest.TestSingleArgWithQuotedSpace (1853 of 2074) PASS: lldb-shell :: SymbolFile/DWARF/DW_AT_low_pc-addrx.s (1854 of 2074) PASS: lldb-unit :: ScriptInterpreter/Python/./ScriptInterpreterPythonTests/PythonDataObjectsTest.TestPythonStringToStr (1855 of 2074) PASS: lldb-unit :: UnwindAssembly/x86/./UnwindAssemblyx86Tests/Testx86AssemblyInspectionEngine.Test32BitOnlyInstruction (1856 of 2074) PASS: lldb-api :: functionalities/thread/concurrent_events/TestConcurrentDelayedCrashWithBreakpointSignal.py (1857 of 2074) PASS: lldb-unit :: ScriptInterpreter/Python/./ScriptInterpreterPythonTests/PythonDataObjectsTest.TestGlobalNameResolutionNoDot (1858 of 2074) PASS: lldb-api :: functionalities/data-formatter/data-formatter-objc/TestDataFormatterObjCNSError.py (1859 of 2074) PASS: lldb-unit :: Symbol/./SymbolTests/PostfixExpression.ParseFPOProgram (1860 of 2074) UNSUPPORTED: lldb-api :: functionalities/data-formatter/data-formatter-stl/libstdcpp/vbool/TestDataFormatterStdVBool.py (1861 of 2074) PASS: lldb-unit :: Utility/./UtilityTests/StringListTest.CopyListEmpty (1862 of 2074) PASS: lldb-api :: commands/expression/diagnostics/TestExprDiagnostics.py (1863 of 2074) PASS: lldb-unit :: SymbolFile/DWARF/./SymbolFileDWARFTests/SymbolFileDWARFTests.TestAbbrevMissingTerminator (1864 of 2074) PASS: lldb-shell :: Settings/TestStopCommandSourceOnError.test (1865 of 2074) PASS: lldb-unit :: Utility/./UtilityTests/ArchSpecTest.TestSetTriple (1866 of 2074) PASS: lldb-shell :: Settings/TestEchoCommands.test (1867 of 2074) PASS: lldb-unit :: Utility/./UtilityTests/StreamTest.PutHex32ByteOrderBig (1868 of 2074) UNSUPPORTED: lldb-shell :: Expr/TestIRMemoryMapWindows.test (1869 of 2074) PASS: lldb-unit :: Utility/./UtilityTests/UriParserTest.BracketedHostname (1870 of 2074) PASS: lldb-unit :: Expression/./ExpressionTests/DiagnosticManagerTest.PutStringSeverities (1871 of 2074) PASS: lldb-api :: python_api/sbdata/TestSBData.py (1872 of 2074) PASS: lldb-unit :: Language/Highlighting/./HighlighterTests/HighlighterTest.ClangPPDirectives (1873 of 2074) PASS: lldb-shell :: ObjectFile/MachO/lc_build_version_notools.yaml (1874 of 2074) PASS: lldb-unit :: Symbol/./SymbolTests/TestClangASTImporter.CompleteFwdDeclWithOtherOrigin (1875 of 2074) PASS: lldb-api :: commands/frame/diagnose/complicated-expression/TestComplicatedExpression.py (1876 of 2074) PASS: lldb-unit :: ScriptInterpreter/Python/./ScriptInterpreterPythonTests/PythonDataObjectsTest.TestExtractingUInt64ThroughStructuredData (1877 of 2074) PASS: lldb-api :: tools/lldb-server/register-reading/TestGdbRemoteGPacket.py (1878 of 2074) PASS: lldb-api :: types/TestIntegerTypeExpr.py (1879 of 2074) PASS: lldb-api :: functionalities/show_location/TestShowLocationDwarf5.py (1880 of 2074) PASS: lldb-api :: functionalities/gdb_remote_client/TestPlatformClient.py (1881 of 2074) PASS: lldb-unit :: Utility/./UtilityTests/UriParserTest.SchemeHostSeparator4 (1882 of 2074) PASS: lldb-api :: python_api/sbstructureddata/TestStructuredDataAPI.py (1883 of 2074) PASS: lldb-unit :: Utility/./UtilityTests/FileSpecTest.GetPath (1884 of 2074) PASS: lldb-api :: tools/lldb-vscode/variables/TestVSCode_variables.py (1885 of 2074) PASS: lldb-unit :: Utility/./UtilityTests/StringExtractorTest.DecodeHexU8_Underflow2 (1886 of 2074) UNSUPPORTED: lldb-api :: functionalities/thread/create_during_step/TestCreateDuringStep.py (1887 of 2074) PASS: lldb-shell :: SymbolFile/DWARF/find-basic-namespace.cpp (1888 of 2074) PASS: lldb-unit :: Expression/./ExpressionTests/CppModuleConfigurationTest.Sysroot (1889 of 2074) PASS: lldb-api :: python_api/lldbutil/iter/TestLLDBIterator.py (1890 of 2074) PASS: lldb-unit :: UnwindAssembly/x86/./UnwindAssemblyx86Tests/Testx86AssemblyInspectionEngine.TestPopRBX (1891 of 2074) PASS: lldb-unit :: Utility/./UtilityTests/UriParserTest.MinimalPortPath (1892 of 2074) PASS: lldb-unit :: Utility/./UtilityTests/ProcessInstanceInfoMatch.Name (1893 of 2074) PASS: lldb-unit :: Utility/./UtilityTests/ArchSpecTest.YAML (1894 of 2074) PASS: lldb-api :: tools/lldb-vscode/console/TestVSCode_console.py (1895 of 2074) PASS: lldb-unit :: Utility/./UtilityTests/StreamTest.AddressSuffix (1896 of 2074) PASS: lldb-shell :: SymbolFile/DWARF/find-method-local-struct.cpp (1897 of 2074) PASS: lldb-api :: functionalities/data-formatter/data-formatter-objc/TestDataFormatterObjCNSContainer.py (1898 of 2074) PASS: lldb-unit :: UnwindAssembly/x86/./UnwindAssemblyx86Tests/Testx86AssemblyInspectionEngine.TestPushImm (1899 of 2074) PASS: lldb-unit :: Utility/./UtilityTests/RangeTest.DoesAdjoinOrIntersect (1900 of 2074) PASS: lldb-unit :: Utility/./UtilityTests/StringListTest.AppendStringStdString (1901 of 2074) PASS: lldb-api :: functionalities/data-formatter/data-formatter-script/TestDataFormatterScript.py (1902 of 2074) PASS: lldb-unit :: UnwindAssembly/x86/./UnwindAssemblyx86Tests/Testx86AssemblyInspectionEngine.TestSimplex86_64Augmented (1903 of 2074) PASS: lldb-unit :: ScriptInterpreter/Python/./ScriptInterpreterPythonTests/PythonDataObjectsTest.TestPythonFile (1904 of 2074) PASS: lldb-api :: python_api/interpreter/TestRunCommandInterpreterAPI.py (1905 of 2074) PASS: lldb-api :: functionalities/object-file/TestImageListMultiArchitecture.py (1906 of 2074) PASS: lldb-api :: macosx/order/TestOrderFile.py (1907 of 2074) PASS: lldb-api :: lang/cpp/this_class_type_mixing/TestThisClassTypeMixing.py (1908 of 2074) PASS: lldb-shell :: SymbolFile/Breakpad/line-table-edgecases.test (1909 of 2074) PASS: lldb-unit :: Utility/./UtilityTests/RangeTest.ContainsAddrInvalid (1910 of 2074) PASS: lldb-unit :: Utility/./UtilityTests/SerializationRountripTest.SerializeDeserializeCStringArrayNullptrElem (1911 of 2074) PASS: lldb-api :: lang/objc/modules-hash-mismatch/TestClangModulesHashMismatch.py (1912 of 2074) PASS: lldb-api :: functionalities/step_scripted/TestStepScripted.py (1913 of 2074) PASS: lldb-api :: lang/objc/orderedset/TestOrderedSet.py (1914 of 2074) PASS: lldb-api :: tools/lldb-vscode/step/TestVSCode_step.py (1915 of 2074) PASS: lldb-unit :: SymbolFile/DWARF/./SymbolFileDWARFTests/SymbolFileDWARFTests.TestAbbrevOrder1Start5 (1916 of 2074) PASS: lldb-unit :: Process/minidump/./LLDBMinidumpTests/RegisterContextMinidump.ConvertMinidumpContext_x86_32 (1917 of 2074) PASS: lldb-api :: functionalities/thread/ignore_suspended/TestIgnoreSuspendedThread.py (1918 of 2074) PASS: lldb-api :: functionalities/gdb_remote_client/TestJLink6Armv7RegisterDefinition.py (1919 of 2074) PASS: lldb-shell :: ObjectFile/ELF/PT_TLS-overlap-PT_LOAD.yaml (1920 of 2074) PASS: lldb-api :: macosx/dyld-trie-symbols/TestDyldTrieSymbols.py (1921 of 2074) PASS: lldb-shell :: SymbolFile/DWARF/debug_ranges.s (1922 of 2074) PASS: lldb-shell :: Minidump/dump-all.test (1923 of 2074) PASS: lldb-unit :: tools/lldb-server/tests/./LLDBServerTests/TestBase.LaunchModePreservesEnvironment (1924 of 2074) PASS: lldb-api :: functionalities/data-formatter/data-formatter-named-summaries/TestDataFormatterNamedSummaries.py (1925 of 2074) PASS: lldb-shell :: Settings/TestSettingsWrite.test (1926 of 2074) PASS: lldb-unit :: Interpreter/./InterpreterTests/OptionArgParserTest.toChar (1927 of 2074) PASS: lldb-unit :: Utility/./UtilityTests/StreamTest.ShiftOperatorPtr (1928 of 2074) PASS: lldb-unit :: UnwindAssembly/x86/./UnwindAssemblyx86Tests/Testx86AssemblyInspectionEngine.TestCALLNextInsn (1929 of 2074) PASS: lldb-api :: lang/cpp/auto/TestCPPAuto.py (1930 of 2074) PASS: lldb-api :: functionalities/return-value/TestReturnValue.py (1931 of 2074) PASS: lldb-api :: functionalities/thread/step_until/TestStepUntil.py (1932 of 2074) PASS: lldb-api :: commands/platform/basic/TestPlatformPython.py (1933 of 2074) UNSUPPORTED: lldb-shell :: ScriptInterpreter/Lua/quit.test (1934 of 2074) UNSUPPORTED: lldb-api :: functionalities/breakpoint/breakpoint_callback_command_source/TestBreakpointCallbackCommandSource.py (1935 of 2074) PASS: lldb-api :: functionalities/data-formatter/language_category_updates/TestDataFormatterLanguageCategoryUpdates.py (1936 of 2074) PASS: lldb-shell :: Minidump/breakpad-symbols.test (1937 of 2074) PASS: lldb-api :: python_api/sbtype_typeclass/TestSBTypeTypeClass.py (1938 of 2074) UNSUPPORTED: lldb-api :: benchmarks/libcxxlist/TestBenchmarkLibcxxList.py (1939 of 2074) UNSUPPORTED: lldb-api :: functionalities/exec/TestExec.py (1940 of 2074) PASS: lldb-unit :: Process/gdb-remote/./ProcessGdbRemoteTests/GDBRemoteCommunicationClientTest.GetModulesInfoInvalidResponse (1941 of 2074) PASS: lldb-unit :: Host/./HostTests/NativeProcessProtocolTest.SetBreakpointFailRead (1942 of 2074) PASS: lldb-unit :: Utility/./UtilityTests/RangeTest.ContainsEndInclusiveInvalid (1943 of 2074) PASS: lldb-api :: lang/c/shared_lib/TestSharedLib.py (1944 of 2074) PASS: lldb-api :: functionalities/data-formatter/data-formatter-objc/cmtime/TestDataFormatterCMTime.py (1945 of 2074) PASS: lldb-api :: lang/objcxx/objcxx-ivar-vector/TestIvarVector.py (1946 of 2074) PASS: lldb-unit :: ObjectFile/PECOFF/./ObjectFilePECOFFTests/PECallFrameInfoTest.Frame_reg_eh (1947 of 2074) PASS: lldb-api :: functionalities/thread/jump/TestThreadJump.py (1948 of 2074) PASS: lldb-api :: api/listeners/TestListener.py (1949 of 2074) PASS: lldb-unit :: UnwindAssembly/x86/./UnwindAssemblyx86Tests/Testx86AssemblyInspectionEngine.TestSimple32bitFrameFunction (1950 of 2074) UNSUPPORTED: lldb-api :: lang/objc/foundation/TestFoundationDisassembly.py (1951 of 2074) UNSUPPORTED: lldb-api :: tools/lldb-vscode/completions/TestVSCode_completions.py (1952 of 2074) UNSUPPORTED: lldb-api :: functionalities/asan/TestReportData.py (1953 of 2074) PASS: lldb-unit :: SymbolFile/DWARF/./SymbolFileDWARFTests/XcodeSDKModuleTests.TestModuleGetXcodeSDK (1954 of 2074) PASS: lldb-api :: functionalities/thread/backtrace_all/TestBacktraceAll.py (1955 of 2074) PASS: lldb-api :: python_api/value/linked_list/TestValueAPILinkedList.py (1956 of 2074) PASS: lldb-unit :: Utility/./UtilityTests/StringListTest.ShiftCString (1957 of 2074) UNSUPPORTED: lldb-api :: functionalities/signal/handle-segv/TestHandleSegv.py (1958 of 2074) PASS: lldb-api :: commands/expression/import-std-module/list/TestListFromStdModule.py (1959 of 2074) PASS: lldb-api :: lang/objc/objc-stepping/TestObjCStepping.py (1960 of 2074) PASS: lldb-unit :: DataFormatter/./LLDBFormatterTests/StringPrinterTests.SwiftUTF8 (1961 of 2074) PASS: lldb-shell :: ObjectFile/PECOFF/basic-info-arm.yaml (1962 of 2074) PASS: lldb-unit :: Utility/./UtilityTests/OptionsWithRawTest.TerminatedQuote (1963 of 2074) PASS: lldb-unit :: ObjectFile/ELF/./ObjectFileELFTests/ObjectFileELFTest.SectionsResolveConsistently (1964 of 2074) PASS: lldb-unit :: Utility/./UtilityTests/VASprintfTest.BufferResize (1965 of 2074) PASS: lldb-shell :: SymbolFile/DWARF/find-inline-method.s (1966 of 2074) PASS: lldb-unit :: Process/minidump/./LLDBMinidumpTests/MinidumpParserTest.GetThreadContext_x86_32 (1967 of 2074) PASS: lldb-unit :: Process/minidump/./LLDBMinidumpTests/MinidumpParserTest.GetPidWow64 (1968 of 2074) PASS: lldb-shell :: SymbolFile/DWARF/debug_loc-aslr.s (1969 of 2074) PASS: lldb-api :: commands/platform/file/read/TestPlatformFileRead.py (1970 of 2074) PASS: lldb-unit :: Utility/./UtilityTests/StreamTest.PutMaxHex64ByteOrderBig (1971 of 2074) PASS: lldb-api :: functionalities/tail_call_frames/inlining_and_tail_calls/TestInliningAndTailCalls.py (1972 of 2074) PASS: lldb-api :: functionalities/data-formatter/ostypeformatting/TestFormattersOsType.py (1973 of 2074) PASS: lldb-api :: commands/expression/import-std-module/vector-dbg-info-content/TestDbgInfoContentVectorFromStdModule.py (1974 of 2074) PASS: lldb-unit :: Utility/./UtilityTests/ArgsTest.DoubleQuotedItem (1975 of 2074) PASS: lldb-unit :: Utility/./UtilityTests/ArgsTest.TestQuotedUnknownEscape (1976 of 2074) PASS: lldb-unit :: ScriptInterpreter/Python/./ScriptInterpreterPythonTests/PythonDataObjectsTest.TestDictionaryResolutionWithDot (1977 of 2074) PASS: lldb-shell :: SymbolFile/DWARF/static_scope.s (1978 of 2074) PASS: lldb-api :: functionalities/gdb_remote_client/TestTargetXMLArch.py (1979 of 2074) PASS: lldb-api :: python_api/symbol-context/TestSymbolContext.py (1980 of 2074) PASS: lldb-unit :: Utility/./UtilityTests/RangeTest.Clear (1981 of 2074) PASS: lldb-api :: functionalities/data-formatter/nsdictionarysynth/TestNSDictionarySynthetic.py (1982 of 2074) PASS: lldb-unit :: Symbol/./SymbolTests/TestTypeSystemClang.TestBuiltinTypeForEncodingAndBitSize (1983 of 2074) UNSUPPORTED: lldb-api :: tools/lldb-server/TestGdbRemoteModuleInfo.py (1984 of 2074) PASS: lldb-api :: lang/objc/modules-inline-functions/TestModulesInlineFunctions.py (1985 of 2074) PASS: lldb-api :: functionalities/backticks/TestBackticksWithoutATarget.py (1986 of 2074) PASS: lldb-api :: commands/expression/import-std-module/shared_ptr/TestSharedPtrFromStdModule.py (1987 of 2074) PASS: lldb-api :: functionalities/thread/crash_during_step/TestCrashDuringStep.py (1988 of 2074) PASS: lldb-shell :: SymbolFile/DWARF/find-qualified-variable.cpp (1989 of 2074) PASS: lldb-api :: types/TestDoubleTypesExpr.py (1990 of 2074) UNSUPPORTED: lldb-shell :: Register/x86-64-gp-write.test (1991 of 2074) PASS: lldb-api :: commands/expression/import-std-module/unique_ptr/TestUniquePtrFromStdModule.py (1992 of 2074) PASS: lldb-unit :: Utility/./UtilityTests/Flags.Reset (1993 of 2074) PASS: lldb-unit :: ScriptInterpreter/Python/./ScriptInterpreterPythonTests/PythonDataObjectsTest.TestPythonDictionaryManipulation (1994 of 2074) PASS: lldb-api :: functionalities/data-formatter/data-formatter-stl/libcxx/forward_list/TestDataFormatterLibcxxForwardList.py (1995 of 2074) PASS: lldb-shell :: ObjectFile/ELF/section-overlap.yaml (1996 of 2074) PASS: lldb-unit :: Expression/./ExpressionTests/CppModuleConfigurationTest.Xcode (1997 of 2074) PASS: lldb-api :: lang/objc/objc-foundation-dictionary-empty/TestNSDictionary0.py (1998 of 2074) PASS: lldb-unit :: Symbol/./SymbolTests/TestTypeSystemClang.TestGetTypeClassNested (1999 of 2074) PASS: lldb-shell :: Quit/TestQuitExitCodeHex0.test (2000 of 2074) UNSUPPORTED: lldb-api :: functionalities/thread/break_after_join/TestBreakAfterJoin.py (2001 of 2074) PASS: lldb-unit :: Utility/./UtilityTests/UriParserTest.SchemeHostSeparator3 (2002 of 2074) PASS: lldb-shell :: SymbolFile/DWARF/clang-ast-from-dwarf-unamed-and-anon-structs.cpp (2003 of 2074) PASS: lldb-api :: functionalities/thread/concurrent_events/TestConcurrentTwoBreakpointThreads.py (2004 of 2074) PASS: lldb-unit :: Utility/./UtilityTests/StateTest.Formatv (2005 of 2074) PASS: lldb-api :: functionalities/thread/concurrent_events/TestConcurrentTwoWatchpointThreads.py (2006 of 2074) UNSUPPORTED: lldb-api :: functionalities/darwin_log/filter/regex/message/TestDarwinLogFilterRegexMessage.py (2007 of 2074) PASS: lldb-unit :: UnwindAssembly/x86/./UnwindAssemblyx86Tests/Testx86AssemblyInspectionEngine.TestSubESP (2008 of 2074) PASS: lldb-unit :: Utility/./UtilityTests/ArgsTest.GetQuotedCommandString (2009 of 2074) PASS: lldb-api :: functionalities/var_path/TestVarPath.py (2010 of 2074) PASS: lldb-unit :: ScriptInterpreter/Python/./ScriptInterpreterPythonTests/PythonDataObjectsTest.TestObjectAttributes (2011 of 2074) PASS: lldb-unit :: Utility/./UtilityTests/ArgsTest.TestMultipleArgs (2012 of 2074) PASS: lldb-api :: functionalities/breakpoint/breakpoint_ignore_count/TestBreakpointIgnoreCount.py (2013 of 2074) PASS: lldb-unit :: Process/gdb-remote/./ProcessGdbRemoteTests/GDBRemoteCommunicationClientTest.GetQOffsets (2014 of 2074) PASS: lldb-api :: commands/expression/import-std-module/deque-basic/TestDequeFromStdModule.py (2015 of 2074) PASS: lldb-unit :: Utility/./UtilityTests/StringExtractorTest.GetHexU8_Extra_NoEof (2016 of 2074) PASS: lldb-unit :: Process/minidump/./LLDBMinidumpTests/RegisterContextMinidump.CheckRegisterContextMinidump_ARM (2017 of 2074) PASS: lldb-shell :: Driver/TestCore.test (2018 of 2074) PASS: lldb-unit :: Host/./HostTests/SocketTest.TCPGetConnectURI (2019 of 2074) UNSUPPORTED: lldb-shell :: Register/x86-ymm-write.test (2020 of 2074) PASS: lldb-shell :: SymbolFile/symbol-binding.test (2021 of 2074) PASS: lldb-api :: functionalities/data-formatter/data-formatter-objc/nsstring/TestDataFormatterNSString.py (2022 of 2074) PASS: lldb-unit :: Utility/./UtilityTests/OptionsWithRawTest.WhitespaceInput (2023 of 2074) PASS: lldb-api :: python_api/value/empty_class/TestValueAPIEmptyClass.py (2024 of 2074) PASS: lldb-unit :: SymbolFile/DWARF/./SymbolFileDWARFTests/SymbolFileDWARFTests.TestAbbrevValidAttrNullForm (2025 of 2074) PASS: lldb-api :: lang/c/set_values/TestSetValues.py (2026 of 2074) PASS: lldb-unit :: Utility/./UtilityTests/BroadcasterTest.BroadcastEvent (2027 of 2074) PASS: lldb-shell :: Driver/LocalLLDBInit.test (2028 of 2074) PASS: lldb-api :: tools/lldb-vscode/launch/TestVSCode_launch.py (2029 of 2074) PASS: lldb-api :: types/TestLongTypes.py (2030 of 2074) PASS: lldb-shell :: Reproducer/Modules/TestModuleCXX.test (2031 of 2074) PASS: lldb-api :: commands/command/delete/TestCommandDelete.py (2032 of 2074) PASS: lldb-api :: functionalities/multiword-commands/TestMultiWordCommands.py (2033 of 2074) UNSUPPORTED: lldb-shell :: SymbolFile/PDB/expressions.test (2034 of 2074) PASS: lldb-unit :: ObjectFile/Breakpad/./ObjectFileBreakpadTests/StackWinRecord.parse (2035 of 2074) PASS: lldb-unit :: Expression/./ExpressionTests/CppModuleConfigurationTest.AmbiguousLibCpp (2036 of 2074) PASS: lldb-unit :: Utility/./UtilityTests/RangeDataVector.CustomSort (2037 of 2074) PASS: lldb-api :: commands/watchpoints/hello_watchpoint/TestMyFirstWatchpoint.py (2038 of 2074) PASS: lldb-unit :: Expression/./ExpressionTests/DWARFExpression.DW_OP_pick (2039 of 2074) PASS: lldb-unit :: ScriptInterpreter/Python/./ScriptInterpreterPythonTests/PythonDataObjectsTest.TestPythonDictionaryValueEquality (2040 of 2074) PASS: lldb-api :: commands/watchpoints/watchpoint_disable/TestWatchpointDisable.py (2041 of 2074) PASS: lldb-unit :: UnwindAssembly/x86/./UnwindAssemblyx86Tests/Testx86AssemblyInspectionEngine.TestStackRealign32BitDisp_x86_64 (2042 of 2074) PASS: lldb-unit :: Utility/./UtilityTests/DataExtractorTest.GetSLEB128_bit63 (2043 of 2074) PASS: lldb-api :: functionalities/data-formatter/data-formatter-stl/libcxx/bitset/TestDataFormatterLibcxxBitset.py (2044 of 2074) PASS: lldb-unit :: Utility/./UtilityTests/StringExtractorTest.DecodeHexU8_InvalidHex2 (2045 of 2074) PASS: lldb-api :: commands/command/script_alias/TestCommandScriptAlias.py (2046 of 2074) PASS: lldb-api :: functionalities/thread/exit_during_expression/TestExitDuringExpression.py (2047 of 2074) PASS: lldb-unit :: Utility/./UtilityTests/RangeTest.SizeTypes (2048 of 2074) PASS: lldb-unit :: ObjectFile/Breakpad/./ObjectFileBreakpadTests/Record.classify (2049 of 2074) PASS: lldb-api :: functionalities/data-formatter/ptr_ref_typedef/TestPtrRef2Typedef.py (2050 of 2074) PASS: lldb-shell :: Minidump/memory-region.yaml (2051 of 2074) PASS: lldb-unit :: Utility/./UtilityTests/UserIDResolver.GetGroupName (2052 of 2074) PASS: lldb-unit :: Target/./TargetTests/PathMappingListTest.RemapRoot (2053 of 2074) PASS: lldb-api :: functionalities/data-formatter/setvaluefromcstring/TestSetValueFromCString.py (2054 of 2074) PASS: lldb-unit :: Utility/./UtilityTests/RegularExpression.Empty (2055 of 2074) PASS: lldb-unit :: SymbolFile/NativePDB/./SymbolFileNativePDBTests/PDBFPOProgramToDWARFExpressionTests.InvalidAssignmentMultiple (2056 of 2074) PASS: lldb-api :: functionalities/breakpoint/breakpoint_ids/TestBreakpointIDs.py (2057 of 2074) PASS: lldb-api :: lang/objc/print-obj/TestPrintObj.py (2058 of 2074) PASS: lldb-api :: commands/expression/argument_passing_restrictions/TestArgumentPassingRestrictions.py (2059 of 2074) UNSUPPORTED: lldb-api :: benchmarks/expression/TestRepeatedExprs.py (2060 of 2074) PASS: lldb-unit :: Utility/./UtilityTests/StreamTest.PutHex16ByteOrderBig (2061 of 2074) PASS: lldb-api :: functionalities/data-formatter/data-formatter-stl/libstdcpp/unique_ptr/invalid/TestDataFormatterInvalidStdUniquePtr.py (2062 of 2074) PASS: lldb-unit :: SymbolFile/DWARF/./SymbolFileDWARFTests/SymbolFileDWARFTests.TestAbbrevOrder1Start1 (2063 of 2074) PASS: lldb-api :: lang/cpp/dynamic-value/TestDynamicValue.py (2064 of 2074) PASS: lldb-api :: lang/cpp/frame-var-anon-unions/TestFrameVariableAnonymousUnions.py (2065 of 2074) PASS: lldb-shell :: SymbolFile/DWARF/debug-types-signature-loop.s (2066 of 2074) PASS: lldb-unit :: Target/./TargetTests/PathMappingListTest.AbsoluteTests (2067 of 2074) PASS: lldb-unit :: Utility/./UtilityTests/StringExtractorTest.DecodeHexU8_Extra (2068 of 2074) PASS: lldb-unit :: Utility/./UtilityTests/DataExtractorTest.GetCStrAtNullOffset (2069 of 2074) PASS: lldb-unit :: Language/Highlighting/./HighlighterTests/HighlighterTest.ClangUnterminatedString (2070 of 2074) PASS: lldb-unit :: Utility/./UtilityTests/StreamTest.PutCStringWithStringRef (2071 of 2074) PASS: lldb-api :: python_api/class_members/TestSBTypeClassMembers.py (2072 of 2074) PASS: lldb-api :: functionalities/recursion/TestValueObjectRecursion.py (2073 of 2074) PASS: lldb-api :: tools/lldb-server/TestGdbRemoteThreadsInStopReply.py (2074 of 2074) Slowest Tests: -------------------------------------------------------------------------- 350.20s: lldb-api :: tools/lldb-server/TestLldbGdbServer.py 258.98s: lldb-api :: lang/cpp/enum_types/TestCPP11EnumTypes.py 243.29s: lldb-api :: api/multithreaded/TestMultithreaded.py 241.36s: lldb-api :: tools/lldb-server/TestGdbRemoteThreadsInStopReply.py 207.10s: lldb-api :: lang/objc/hidden-ivars/TestHiddenIvars.py 201.07s: lldb-api :: lang/objc/foundation/TestObjCMethods.py 183.50s: lldb-api :: lang/objc/objc-new-syntax/TestObjCNewSyntaxLiteral.py 143.59s: lldb-api :: lang/objc/exceptions/TestObjCExceptions.py 142.98s: lldb-api :: types/TestLongTypesExpr.py 141.58s: lldb-api :: lang/cpp/namespace/TestNamespaceLookup.py 134.61s: lldb-api :: lang/objc/real-definition/TestRealDefinition.py 118.30s: lldb-api :: tools/lldb-server/TestGdbRemote_qThreadStopInfo.py 111.40s: lldb-api :: lang/objc/foundation/TestObjCMethodsNSError.py 108.76s: lldb-api :: lang/objc/foundation/TestObjCMethodsString.py 103.66s: lldb-api :: lang/objc/objc-new-syntax/TestObjCNewSyntaxArray.py 101.82s: lldb-api :: lang/objc/objc-new-syntax/TestObjCNewSyntaxDictionary.py 97.43s: lldb-api :: lang/objc/forward-decl/TestForwardDecl.py 91.42s: lldb-api :: functionalities/gdb_remote_client/TestWasm.py 89.25s: lldb-api :: commands/settings/TestSettings.py 87.47s: lldb-api :: functionalities/data-formatter/compactvectors/TestCompactVectors.py

Hide Details

Tests Times: -------------------------------------------------------------------------- [ Range ] :: [ Percentage ] :: [ Count ] -------------------------------------------------------------------------- [340s,360s) :: [ ] :: [ 1/2074] [320s,340s) :: [ ] :: [ 0/2074] [300s,320s) :: [ ] :: [ 0/2074] [280s,300s) :: [ ] :: [ 0/2074] [260s,280s) :: [ ] :: [ 1/2074] [240s,260s) :: [ ] :: [ 2/2074] [220s,240s) :: [ ] :: [ 0/2074] [200s,220s) :: [ ] :: [ 2/2074] [180s,200s) :: [ ] :: [ 1/2074] [160s,180s) :: [ ] :: [ 0/2074] [140s,160s) :: [ ] :: [ 3/2074] [120s,140s) :: [ ] :: [ 2/2074] [100s,120s) :: [ ] :: [ 5/2074] [ 80s,100s) :: [ ] :: [ 5/2074] [ 60s, 80s) :: [ ] :: [ 19/2074] [ 40s, 60s) :: [* ] :: [ 57/2074] [ 20s, 40s) :: [** ] :: [ 148/2074] [ 0s, 20s) :: [*********************************** ] :: [1828/2074] -------------------------------------------------------------------------- ******************** Failed Tests (2): lldb-shell :: SymbolFile/DWARF/limit-debug-info.s lldb-shell :: ObjectFile/PECOFF/export-dllfunc.yaml

Hide Details

Hide Details

Testing Time: 4300.95s Unsupported : 180 Passed : 1886 Expectedly Failed: 6 Failed : 2 FAILED: tools/lldb/test/CMakeFiles/check-lldb-lit cd /Users/buildslave/jenkins/workspace/lldb-cmake-sanitized/lldb-build/tools/lldb/test && /usr/local/Frameworks/Python.framework/Versions/3.7/bin/python3.7 /Users/buildslave/jenkins/workspace/lldb-cmake-sanitized/lldb-build/./bin/llvm-lit -v --time-tests --shuffle --xunit-xml-output=/Users/buildslave/jenkins/workspace/lldb-cmake-sanitized/test/results.xml -v -j 4 --timeout 1200 /Users/buildslave/jenkins/workspace/lldb-cmake-sanitized/lldb-build/tools/lldb/test ninja: build stopped: subcommand failed. Command failed: Command '['/usr/bin/env', 'TERM=vt100', '/usr/local/bin/ninja', '-v', 'check-lldb']' returned non-zero exit status 1. Command: ['/usr/bin/env', 'TERM=vt100', '/usr/local/bin/ninja', '-v', 'check-lldb'] [Pipeline] } [Pipeline] // timeout [Pipeline] } [Pipeline] // stage [Pipeline] stage [Pipeline] { (Declarative: Post Actions) [Pipeline] scanForIssues [Clang (LLVM based)] Sleeping for 5 seconds due to JENKINS-32191... [Clang (LLVM based)] Parsing console log (workspace: '/Users/buildslave/jenkins/workspace/lldb-cmake-sanitized') [Clang (LLVM based)] Successfully parsed console log [Clang (LLVM based)] -> found 4 issues (skipped 27 duplicates) [Clang (LLVM based)] Post processing issues on 'green-dragon-23' with source code encoding 'UTF-8' [Clang (LLVM based)] Creating SCM blamer to obtain author and commit information for affected files [Clang (LLVM based)] Creating SCM miner to obtain statistics for affected repository files [Clang (LLVM based)] Resolving file names for all issues in source directory '/Users/buildslave/jenkins/workspace/lldb-cmake-sanitized' [Clang (LLVM based)] -> resolved paths in source directory (2 found, 0 not found) [Clang (LLVM based)] Resolving module names from module definitions (build.xml, pom.xml, or Manifest.mf files) [Clang (LLVM based)] -> resolved module names for 4 issues [Clang (LLVM based)] Resolving package names (or namespaces) by parsing the affected files [Clang (LLVM based)] -> resolved package names of 2 affected files [Clang (LLVM based)] No filter has been set, publishing all 4 issues [Clang (LLVM based)] Creating fingerprints for all affected code blocks to track issues over different builds [Clang (LLVM based)] -> created fingerprints for 4 issues (skipped 0 issues) [Clang (LLVM based)] Copying affected files to Jenkins' build folder '/Users/Shared/Jenkins/Home/jobs/lldb-cmake-sanitized/builds/1611/files-with-issues' [Clang (LLVM based)] -> 2 copied, 0 not in workspace, 0 not-found, 0 with I/O error [Pipeline] junit Recording test results [Pipeline] } [Pipeline] // stage [Pipeline] } [Pipeline] // withEnv [Pipeline] } [Pipeline] // node [Pipeline] End of Pipeline ERROR: script returned exit code 1 Finished: FAILURE