FailedConsole Output

Started by upstream project "clang-stage2-Rthinlto" build number 3738
originally caused by:
 Started by upstream project "clang-stage2-Rthinlto_relay" build number 5577
 originally caused by:
  Started by upstream project "clang-stage1-RA" build number 17732
  originally caused by:
   Started by an SCM change
   Started by an SCM change
   Started by an SCM change
   Started by an SCM change
   Started by an SCM change
   Started by an SCM change
   Started by an SCM change
  Started by upstream project "clang-stage1-RA" build number 17733
  originally caused by:
   Started by an SCM change
   Started by an SCM change
   Started by an SCM change
   Started by an SCM change
   Started by an SCM change
   Started by an SCM change
   Started by an SCM change
   Started by an SCM change
   Started by an SCM change
   Started by an SCM change
   Started by an SCM change
   Started by an SCM change
   Started by an SCM change
  Started by upstream project "clang-stage1-RA" build number 17734
  originally caused by:
   Started by an SCM change
   Started by an SCM change
   Started by an SCM change
   Started by an SCM change
   Started by an SCM change
   Started by an SCM change
   Started by an SCM change
   Started by an SCM change
   Started by an SCM change
   Started by an SCM change
  Started by upstream project "clang-stage1-RA" build number 17735
  originally caused by:
   Started by an SCM change
   Started by an SCM change
   Started by an SCM change
   Started by an SCM change
   Started by an SCM change
   Started by an SCM change
   Started by an SCM change
   Started by an SCM change
  Started by upstream project "clang-stage1-RA" build number 17736
  originally caused by:
   Started by an SCM change
   Started by an SCM change
   Started by an SCM change
   Started by an SCM change
   Started by an SCM change
   Started by an SCM change
   Started by an SCM change
  Started by upstream project "clang-stage1-RA" build number 17737
  originally caused by:
   Started by an SCM change
   Started by an SCM change
   Started by an SCM change
   Started by an SCM change
   Started by an SCM change
   Started by an SCM change
   Started by an SCM change
   Started by an SCM change
   Started by an SCM change
   Started by an SCM change
   Started by an SCM change
   Started by an SCM change
   Started by an SCM change
  Started by upstream project "clang-stage1-RA" build number 17738
  originally caused by:
   Started by an SCM change
   Started by an SCM change
   Started by an SCM change
   Started by an SCM change
   Started by an SCM change
   Started by an SCM change
   Started by an SCM change
   Started by an SCM change
   Started by an SCM change
   Started by an SCM change
   Started by an SCM change
   Started by an SCM change
   Started by an SCM change
  Started by upstream project "clang-stage1-RA" build number 17739
  originally caused by:
   Started by an SCM change
   Started by an SCM change
   Started by an SCM change
   Started by an SCM change
   Started by an SCM change
   Started by an SCM change
   Started by an SCM change
   Started by an SCM change
   Started by an SCM change
   Started by an SCM change
   Started by an SCM change
   Started by an SCM change
Running as SYSTEM
Building remotely on green-dragon-10 (Zorg 10.15.5 Xcode11.5 10.15 Xcode11 MacMini) in workspace /Users/buildslave/jenkins/workspace/clang-3.4-debuginfo-statistics
The recommended git tool is: NONE
No credentials specified
Cloning the remote Git repository
Cloning repository http://labmaster3.local/git/llvm-project.git
 > git init /Users/buildslave/jenkins/workspace/clang-3.4-debuginfo-statistics/src/clang-3.4 # timeout=10
Fetching upstream changes from http://labmaster3.local/git/llvm-project.git
 > git --version # timeout=10
 > git --version # 'git version 2.24.3 (Apple Git-128)'
 > git fetch --tags --force --progress -- http://labmaster3.local/git/llvm-project.git +refs/heads/*:refs/remotes/origin/* # timeout=10
 > git config remote.origin.url http://labmaster3.local/git/llvm-project.git # timeout=10
 > git config --add remote.origin.fetch +refs/heads/*:refs/remotes/origin/* # timeout=10
Avoid second fetch
 > git rev-parse refs/remotes/origin/release/3.4.x^{commit} # timeout=10
Checking out Revision d13f57a1a1a1cc23c97bf5b99b89f28f8b8c1149 (refs/remotes/origin/release/3.4.x)
 > git config core.sparsecheckout # timeout=10
 > git checkout -f d13f57a1a1a1cc23c97bf5b99b89f28f8b8c1149 # timeout=10
Commit message: "Merging r201843"
 > git rev-list --no-walk d13f57a1a1a1cc23c97bf5b99b89f28f8b8c1149 # timeout=10
New run name is 'rlast_good_build.properties not found-b4597'
[clang-3.4-debuginfo-statistics] $ /bin/sh -xe /var/folders/09/r4vw4v8n5kb67jl66zvlbljw0000gn/T/jenkins17545054242644797409.sh
+ set -u
+ '[' false = true ']'
+ export
export BUILD_DISPLAY_NAME="rlast_good_build.properties not found-b4597"
export BUILD_ID="4597"
export BUILD_NUMBER="4597"
export BUILD_TAG="jenkins-clang-3.4-debuginfo-statistics-4597"
export BUILD_TYPE="Release"
export BUILD_URL="http://green.lab.llvm.org/green/job/clang-3.4-debuginfo-statistics/4597/"
export CLEAN="false"
export EXECUTOR_NUMBER="0"
export GIT_BRANCH="origin/release/3.4.x"
export GIT_CHECKOUT_DIR="src/clang-3.4"
export GIT_COMMIT="d13f57a1a1a1cc23c97bf5b99b89f28f8b8c1149"
export GIT_PREVIOUS_COMMIT="d13f57a1a1a1cc23c97bf5b99b89f28f8b8c1149"
export GIT_PREVIOUS_SUCCESSFUL_COMMIT="d13f57a1a1a1cc23c97bf5b99b89f28f8b8c1149"
export GIT_URL="http://labmaster3.local/git/llvm-project.git"
export HOME="/Users/buildslave"
export HUDSON_COOKIE="b2791799-d0a0-4838-8225-1ddbda58696e"
export HUDSON_HOME="/Users/Shared/Jenkins/Home"
export HUDSON_SERVER_COOKIE="1dff93d58cb5d6cc"
export HUDSON_URL="http://green.lab.llvm.org/green/"
export JAVA_MAIN_CLASS_79247="hudson.remoting.Launcher"
export JENKINS_HOME="/Users/Shared/Jenkins/Home"
export JENKINS_SERVER_COOKIE="1dff93d58cb5d6cc"
export JENKINS_URL="http://green.lab.llvm.org/green/"
export JOB_BASE_NAME="clang-3.4-debuginfo-statistics"
export JOB_DISPLAY_URL="http://green.lab.llvm.org/green/job/clang-3.4-debuginfo-statistics/display/redirect"
export JOB_NAME="clang-3.4-debuginfo-statistics"
export JOB_URL="http://green.lab.llvm.org/green/job/clang-3.4-debuginfo-statistics/"
export LNT_URL="http://104.154.54.203/db_default/submitRun"
export LOGNAME="buildslave"
export NODE_LABELS="10.15 10.15.5 MacMini Xcode11 Xcode11.5 Zorg green-dragon-10"
export NODE_NAME="green-dragon-10"
export OLDPWD
export PATH="/usr/local/bin:/usr/local/sbin:/usr/bin:/bin:/usr/sbin:/sbin"
export PWD="/Users/buildslave/jenkins/workspace/clang-3.4-debuginfo-statistics"
export PYTHONHTTPSVERIFY="0"
export RUN_ARTIFACTS_DISPLAY_URL="http://green.lab.llvm.org/green/job/clang-3.4-debuginfo-statistics/4597/display/redirect?page=artifacts"
export RUN_CHANGES_DISPLAY_URL="http://green.lab.llvm.org/green/job/clang-3.4-debuginfo-statistics/4597/display/redirect?page=changes"
export RUN_DISPLAY_URL="http://green.lab.llvm.org/green/job/clang-3.4-debuginfo-statistics/4597/display/redirect"
export RUN_TESTS_DISPLAY_URL="http://green.lab.llvm.org/green/job/clang-3.4-debuginfo-statistics/4597/display/redirect?page=tests"
export SCRIPT_PATH="/opt/llvm/zorg/zorg/jenkins/"
export SHAREDSPACE_SCM_URL="NONE"
export SHELL="/bin/bash"
export SHLVL="2"
export SSH_CLIENT="10.1.1.15 51072 22"
export SSH_CONNECTION="10.1.1.15 51072 10.1.1.108 22"
export TMPDIR="/var/folders/09/r4vw4v8n5kb67jl66zvlbljw0000gn/T/"
export USER="buildslave"
export WORKSPACE="/Users/buildslave/jenkins/workspace/clang-3.4-debuginfo-statistics"
export WORKSPACE_TMP="/Users/buildslave/jenkins/workspace/clang-3.4-debuginfo-statistics@tmp"
export __CF_USER_TEXT_ENCODING="0x1F5:0x0:0x0"
+ curl -sfvO http://labmaster2.local/artifacts/clang-stage1-RA/last_good_build.properties
*   Trying 10.1.1.12...
* TCP_NODELAY set
* Connected to labmaster2.local (10.1.1.12) port 80 (#0)
> GET /artifacts/clang-stage1-RA/last_good_build.properties HTTP/1.1
> Host: labmaster2.local
> User-Agent: curl/7.64.1
> Accept: */*
> 
< HTTP/1.1 200 OK
< Server: nginx/1.12.2
< Date: Thu, 14 Jan 2021 14:55:05 GMT
< Content-Type: application/octet-stream
< Content-Length: 125
< Last-Modified: Thu, 14 Jan 2021 14:34:03 GMT
< Connection: keep-alive
< ETag: "6000565b-7d"
< Accept-Ranges: bytes
< 
{ [125 bytes data]
* Connection #0 to host labmaster2.local left intact
* Closing connection 0
+ . last_good_build.properties
++ LLVM_REV=
++ GIT_DISTANCE=377010
++ GIT_SHA=6abbba3fca9f
++ ARTIFACT=clang-stage1-RA/clang-d377010-g6abbba3fca9f-t17752-b17752.tar.gz
+ LLVM_REV=377010
+ export ARTIFACT=clang-stage1-RA/clang-d377010-g6abbba3fca9f-t17752-b17752.tar.gz
+ ARTIFACT=clang-stage1-RA/clang-d377010-g6abbba3fca9f-t17752-b17752.tar.gz
+ python /opt/llvm/zorg/zorg/jenkins//monorepo_build.py fetch
Fetching Compiler

Hide Details

@@@ Fetching Compiler @@@ GETting http://labmaster2.local/artifacts//clang-stage1-RA/clang-d377010-g6abbba3fca9f-t17752-b17752.tar.gz to /Users/buildslave/jenkins/workspace/clang-3.4-debuginfo-statistics/host-compiler.tar.gz ... done. Decompressing... cd /Users/buildslave/jenkins/workspace/clang-3.4-debuginfo-statistics/host-compiler/ 'tar' 'zxf' '../host-compiler.tar.gz' FATAL: command execution failed java.io.EOFException at java.io.ObjectInputStream$PeekInputStream.readFully(ObjectInputStream.java:2797) at java.io.ObjectInputStream$BlockDataInputStream.readShort(ObjectInputStream.java:3272) at java.io.ObjectInputStream.readStreamHeader(ObjectInputStream.java:932) at java.io.ObjectInputStream.<init>(ObjectInputStream.java:394) at hudson.remoting.ObjectInputStreamEx.<init>(ObjectInputStreamEx.java:49) at hudson.remoting.Command.readFrom(Command.java:142) at hudson.remoting.Command.readFrom(Command.java:128) at hudson.remoting.AbstractSynchronousByteArrayCommandTransport.read(AbstractSynchronousByteArrayCommandTransport.java:35) at hudson.remoting.SynchronousCommandTransport$ReaderThread.run(SynchronousCommandTransport.java:63) Caused: java.io.IOException: Unexpected termination of the channel at hudson.remoting.SynchronousCommandTransport$ReaderThread.run(SynchronousCommandTransport.java:77) Caused: java.io.IOException: Backing channel 'green-dragon-10' is disconnected. at hudson.remoting.RemoteInvocationHandler.channelOrFail(RemoteInvocationHandler.java:216) at hudson.remoting.RemoteInvocationHandler.invoke(RemoteInvocationHandler.java:286) at com.sun.proxy.$Proxy101.isAlive(Unknown Source) at hudson.Launcher$RemoteLauncher$ProcImpl.isAlive(Launcher.java:1211) at hudson.Launcher$RemoteLauncher$ProcImpl.join(Launcher.java:1203) at hudson.tasks.CommandInterpreter.join(CommandInterpreter.java:194) at hudson.tasks.CommandInterpreter.perform(CommandInterpreter.java:144) at hudson.tasks.CommandInterpreter.perform(CommandInterpreter.java:91) at hudson.tasks.BuildStepMonitor$1.perform(BuildStepMonitor.java:20) at hudson.model.AbstractBuild$AbstractBuildExecution.perform(AbstractBuild.java:741) at hudson.model.Build$BuildExecution.build(Build.java:206) at hudson.model.Build$BuildExecution.doRun(Build.java:163) at hudson.model.AbstractBuild$AbstractBuildExecution.run(AbstractBuild.java:504) at hudson.model.Run.execute(Run.java:1894) at hudson.model.FreeStyleBuild.run(FreeStyleBuild.java:43) at hudson.model.ResourceController.execute(ResourceController.java:97) at hudson.model.Executor.run(Executor.java:428) FATAL: Unable to delete script file /var/folders/09/r4vw4v8n5kb67jl66zvlbljw0000gn/T/jenkins17545054242644797409.sh java.io.EOFException at java.io.ObjectInputStream$PeekInputStream.readFully(ObjectInputStream.java:2797) at java.io.ObjectInputStream$BlockDataInputStream.readShort(ObjectInputStream.java:3272) at java.io.ObjectInputStream.readStreamHeader(ObjectInputStream.java:932) at java.io.ObjectInputStream.<init>(ObjectInputStream.java:394) at hudson.remoting.ObjectInputStreamEx.<init>(ObjectInputStreamEx.java:49) at hudson.remoting.Command.readFrom(Command.java:142) at hudson.remoting.Command.readFrom(Command.java:128) at hudson.remoting.AbstractSynchronousByteArrayCommandTransport.read(AbstractSynchronousByteArrayCommandTransport.java:35) at hudson.remoting.SynchronousCommandTransport$ReaderThread.run(SynchronousCommandTransport.java:63) Caused: java.io.IOException: Unexpected termination of the channel at hudson.remoting.SynchronousCommandTransport$ReaderThread.run(SynchronousCommandTransport.java:77) Caused: hudson.remoting.ChannelClosedException: Channel "hudson.remoting.Channel@5b78367c:green-dragon-10": Remote call on green-dragon-10 failed. The channel is closing down or has closed down at hudson.remoting.Channel.call(Channel.java:994) at hudson.FilePath.act(FilePath.java:1070) at hudson.FilePath.act(FilePath.java:1059) at hudson.FilePath.delete(FilePath.java:1582) at hudson.tasks.CommandInterpreter.perform(CommandInterpreter.java:162) at hudson.tasks.CommandInterpreter.perform(CommandInterpreter.java:91) at hudson.tasks.BuildStepMonitor$1.perform(BuildStepMonitor.java:20) at hudson.model.AbstractBuild$AbstractBuildExecution.perform(AbstractBuild.java:741) at hudson.model.Build$BuildExecution.build(Build.java:206) at hudson.model.Build$BuildExecution.doRun(Build.java:163) at hudson.model.AbstractBuild$AbstractBuildExecution.run(AbstractBuild.java:504) at hudson.model.Run.execute(Run.java:1894) at hudson.model.FreeStyleBuild.run(FreeStyleBuild.java:43) at hudson.model.ResourceController.execute(ResourceController.java:97) at hudson.model.Executor.run(Executor.java:428) Build step 'Execute shell' marked build as failure Failed to evaluate name macro:org.jenkinsci.plugins.tokenmacro.MacroEvaluationException: Workspace is not accessible Sending e-mails to: lldb@group.apple.com Returning node parameter for green-dragon-10 Triggering a new build of Zombie Detector (FAIL OK) Finished: FAILURE