FailedConsole Output

Skipping 12,520 KB.. Full Log
ins/workspace/clang-stage1-RA/clang-build/tools/clang/runtime/compiler-rt-bins/test/fuzzer/X86_64DefaultDarwinConfig/Output/minimize_two_crashes.test.tmp/result 2>&1 | FileCheck /Users/buildslave/jenkins/workspace/clang-stage1-RA/llvm-project/compiler-rt/test/fuzzer/minimize_two_crashes.test --check-prefix=VERIFY
--
Exit Code: 2

Hide Details

Command Output (stderr): -- FileCheck error: '<stdin>' is empty. FileCheck command line: FileCheck /Users/buildslave/jenkins/workspace/clang-stage1-RA/llvm-project/compiler-rt/test/fuzzer/minimize_two_crashes.test

Hide Details

--

Hide Details

******************** FAIL: libFuzzer :: null-deref.test (2949 of 2991) ******************** TEST 'libFuzzer :: null-deref.test' FAILED ******************** Script: -- : 'RUN: at line 1'; /Users/buildslave/jenkins/workspace/clang-stage1-RA/clang-build/./bin/clang --driver-mode=g++ -O2 -gline-tables-only -fsanitize=address,fuzzer -I/Users/buildslave/jenkins/workspace/clang-stage1-RA/llvm-project/compiler-rt/lib/fuzzer -arch x86_64 -stdlib=libc++ -mmacosx-version-min=10.9 -isysroot /Applications/Xcode.app/Contents/Developer/Platforms/MacOSX.platform/Developer/SDKs/MacOSX10.14.sdk /Users/buildslave/jenkins/workspace/clang-stage1-RA/llvm-project/compiler-rt/test/fuzzer/NullDerefTest.cpp -o /Users/buildslave/jenkins/workspace/clang-stage1-RA/clang-build/tools/clang/runtime/compiler-rt-bins/test/fuzzer/X86_64DefaultDarwinConfig/Output/null-deref.test.tmp-NullDerefTest : 'RUN: at line 3'; not /Users/buildslave/jenkins/workspace/clang-stage1-RA/clang-build/tools/clang/runtime/compiler-rt-bins/test/fuzzer/X86_64DefaultDarwinConfig/Output/null-deref.test.tmp-NullDerefTest 2>&1 | FileCheck /Users/buildslave/jenkins/workspace/clang-stage1-RA/llvm-project/compiler-rt/test/fuzzer/null-deref.test --check-prefix=NullDerefTest : 'RUN: at line 4'; not /Users/buildslave/jenkins/workspace/clang-stage1-RA/clang-build/tools/clang/runtime/compiler-rt-bins/test/fuzzer/X86_64DefaultDarwinConfig/Output/null-deref.test.tmp-NullDerefTest -close_fd_mask=3 2>&1 | FileCheck /Users/buildslave/jenkins/workspace/clang-stage1-RA/llvm-project/compiler-rt/test/fuzzer/null-deref.test --check-prefix=NullDerefTest : 'RUN: at line 7'; not /Users/buildslave/jenkins/workspace/clang-stage1-RA/clang-build/tools/clang/runtime/compiler-rt-bins/test/fuzzer/X86_64DefaultDarwinConfig/Output/null-deref.test.tmp-NullDerefTest -artifact_prefix=ZZZ 2>&1 | FileCheck /Users/buildslave/jenkins/workspace/clang-stage1-RA/llvm-project/compiler-rt/test/fuzzer/null-deref.test --check-prefix=NullDerefTestPrefix : 'RUN: at line 9'; not /Users/buildslave/jenkins/workspace/clang-stage1-RA/clang-build/tools/clang/runtime/compiler-rt-bins/test/fuzzer/X86_64DefaultDarwinConfig/Output/null-deref.test.tmp-NullDerefTest -artifact_prefix=ZZZ -exact_artifact_path=FOOBAR 2>&1 | FileCheck /Users/buildslave/jenkins/workspace/clang-stage1-RA/llvm-project/compiler-rt/test/fuzzer/null-deref.test --check-prefix=NullDerefTestExactPath -- Exit Code: 137

Hide Details

Command Output (stderr): -- /Users/buildslave/jenkins/workspace/clang-stage1-RA/clang-build/tools/clang/runtime/compiler-rt-bins/test/fuzzer/X86_64DefaultDarwinConfig/Output/null-deref.test.script: line 5: 42607 Broken pipe: 13 not /Users/buildslave/jenkins/workspace/clang-stage1-RA/clang-build/tools/clang/runtime/compiler-rt-bins/test/fuzzer/X86_64DefaultDarwinConfig/Output/null-deref.test.tmp-NullDerefTest 2>&1 42608 Killed: 9 | FileCheck /Users/buildslave/jenkins/workspace/clang-stage1-RA/llvm-project/compiler-rt/test/fuzzer/null-deref.test --check-prefix=NullDerefTest

Hide Details

--

Hide Details

******************** UNSUPPORTED: libFuzzer :: only-some-bytes-fork.test (2950 of 2991) UNSUPPORTED: libFuzzer :: only-some-bytes.test (2951 of 2991) FAIL: libFuzzer :: null-deref-on-empty.test (2952 of 2991) ******************** TEST 'libFuzzer :: null-deref-on-empty.test' FAILED ******************** Script: -- : 'RUN: at line 1'; /Users/buildslave/jenkins/workspace/clang-stage1-RA/clang-build/./bin/clang --driver-mode=g++ -O2 -gline-tables-only -fsanitize=address,fuzzer -I/Users/buildslave/jenkins/workspace/clang-stage1-RA/llvm-project/compiler-rt/lib/fuzzer -arch x86_64 -stdlib=libc++ -mmacosx-version-min=10.9 -isysroot /Applications/Xcode.app/Contents/Developer/Platforms/MacOSX.platform/Developer/SDKs/MacOSX10.14.sdk /Users/buildslave/jenkins/workspace/clang-stage1-RA/llvm-project/compiler-rt/test/fuzzer/NullDerefOnEmptyTest.cpp -o /Users/buildslave/jenkins/workspace/clang-stage1-RA/clang-build/tools/clang/runtime/compiler-rt-bins/test/fuzzer/X86_64DefaultDarwinConfig/Output/null-deref-on-empty.test.tmp-NullDerefOnEmptyTest : 'RUN: at line 3'; not /Users/buildslave/jenkins/workspace/clang-stage1-RA/clang-build/tools/clang/runtime/compiler-rt-bins/test/fuzzer/X86_64DefaultDarwinConfig/Output/null-deref-on-empty.test.tmp-NullDerefOnEmptyTest -print_final_stats=1 2>&1 | FileCheck /Users/buildslave/jenkins/workspace/clang-stage1-RA/llvm-project/compiler-rt/test/fuzzer/null-deref-on-empty.test --check-prefix=NULL_DEREF_ON_EMPTY -- Exit Code: 137

Hide Details

Command Output (stderr): -- /Users/buildslave/jenkins/workspace/clang-stage1-RA/clang-build/tools/clang/runtime/compiler-rt-bins/test/fuzzer/X86_64DefaultDarwinConfig/Output/null-deref-on-empty.test.script: line 2: 42615 Broken pipe: 13 not /Users/buildslave/jenkins/workspace/clang-stage1-RA/clang-build/tools/clang/runtime/compiler-rt-bins/test/fuzzer/X86_64DefaultDarwinConfig/Output/null-deref-on-empty.test.tmp-NullDerefOnEmptyTest -print_final_stats=1 2>&1 42616 Killed: 9 | FileCheck /Users/buildslave/jenkins/workspace/clang-stage1-RA/llvm-project/compiler-rt/test/fuzzer/null-deref-on-empty.test --check-prefix=NULL_DEREF_ON_EMPTY

Hide Details

--

Hide Details

******************** UNSUPPORTED: libFuzzer :: print-func.test (2953 of 2991) FAIL: libFuzzer :: overwrite-input.test (2954 of 2991) ******************** TEST 'libFuzzer :: overwrite-input.test' FAILED ******************** Script: -- : 'RUN: at line 1'; /Users/buildslave/jenkins/workspace/clang-stage1-RA/clang-build/./bin/clang --driver-mode=g++ -O2 -gline-tables-only -fsanitize=address,fuzzer -I/Users/buildslave/jenkins/workspace/clang-stage1-RA/llvm-project/compiler-rt/lib/fuzzer -arch x86_64 -stdlib=libc++ -mmacosx-version-min=10.9 -isysroot /Applications/Xcode.app/Contents/Developer/Platforms/MacOSX.platform/Developer/SDKs/MacOSX10.14.sdk /Users/buildslave/jenkins/workspace/clang-stage1-RA/llvm-project/compiler-rt/test/fuzzer/OverwriteInputTest.cpp -o /Users/buildslave/jenkins/workspace/clang-stage1-RA/clang-build/tools/clang/runtime/compiler-rt-bins/test/fuzzer/X86_64DefaultDarwinConfig/Output/overwrite-input.test.tmp-OverwriteInputTest : 'RUN: at line 2'; not /Users/buildslave/jenkins/workspace/clang-stage1-RA/clang-build/tools/clang/runtime/compiler-rt-bins/test/fuzzer/X86_64DefaultDarwinConfig/Output/overwrite-input.test.tmp-OverwriteInputTest 2>&1 | FileCheck /Users/buildslave/jenkins/workspace/clang-stage1-RA/llvm-project/compiler-rt/test/fuzzer/overwrite-input.test -- Exit Code: 137

Hide Details

Command Output (stderr): -- /Users/buildslave/jenkins/workspace/clang-stage1-RA/clang-build/tools/clang/runtime/compiler-rt-bins/test/fuzzer/X86_64DefaultDarwinConfig/Output/overwrite-input.test.script: line 2: 42623 Broken pipe: 13 not /Users/buildslave/jenkins/workspace/clang-stage1-RA/clang-build/tools/clang/runtime/compiler-rt-bins/test/fuzzer/X86_64DefaultDarwinConfig/Output/overwrite-input.test.tmp-OverwriteInputTest 2>&1 42624 Killed: 9 | FileCheck /Users/buildslave/jenkins/workspace/clang-stage1-RA/llvm-project/compiler-rt/test/fuzzer/overwrite-input.test

Hide Details

--

Hide Details

******************** FAIL: libFuzzer :: recommended-dictionary.test (2955 of 2991) ******************** TEST 'libFuzzer :: recommended-dictionary.test' FAILED ******************** Script: -- : 'RUN: at line 2'; /Users/buildslave/jenkins/workspace/clang-stage1-RA/clang-build/./bin/clang --driver-mode=g++ -O2 -gline-tables-only -fsanitize=address,fuzzer -I/Users/buildslave/jenkins/workspace/clang-stage1-RA/llvm-project/compiler-rt/lib/fuzzer -arch x86_64 -stdlib=libc++ -mmacosx-version-min=10.9 -isysroot /Applications/Xcode.app/Contents/Developer/Platforms/MacOSX.platform/Developer/SDKs/MacOSX10.14.sdk /Users/buildslave/jenkins/workspace/clang-stage1-RA/llvm-project/compiler-rt/test/fuzzer/RepeatedMemcmp.cpp -o /Users/buildslave/jenkins/workspace/clang-stage1-RA/clang-build/tools/clang/runtime/compiler-rt-bins/test/fuzzer/X86_64DefaultDarwinConfig/Output/recommended-dictionary.test.tmp-RepeatedMemcmp : 'RUN: at line 3'; /Users/buildslave/jenkins/workspace/clang-stage1-RA/clang-build/tools/clang/runtime/compiler-rt-bins/test/fuzzer/X86_64DefaultDarwinConfig/Output/recommended-dictionary.test.tmp-RepeatedMemcmp -seed=11 -runs=100000 -max_len=20 2>&1 | FileCheck /Users/buildslave/jenkins/workspace/clang-stage1-RA/llvm-project/compiler-rt/test/fuzzer/recommended-dictionary.test --check-prefix=RECOMMENDED_DICT -- Exit Code: 137

Hide Details

Command Output (stderr): -- /Users/buildslave/jenkins/workspace/clang-stage1-RA/clang-build/tools/clang/runtime/compiler-rt-bins/test/fuzzer/X86_64DefaultDarwinConfig/Output/recommended-dictionary.test.script: line 2: 42631 Broken pipe: 13 /Users/buildslave/jenkins/workspace/clang-stage1-RA/clang-build/tools/clang/runtime/compiler-rt-bins/test/fuzzer/X86_64DefaultDarwinConfig/Output/recommended-dictionary.test.tmp-RepeatedMemcmp -seed=11 -runs=100000 -max_len=20 2>&1 42632 Killed: 9 | FileCheck /Users/buildslave/jenkins/workspace/clang-stage1-RA/llvm-project/compiler-rt/test/fuzzer/recommended-dictionary.test --check-prefix=RECOMMENDED_DICT

Hide Details

--

Hide Details

******************** FAIL: libFuzzer :: reduce_inputs.test (2956 of 2991) ******************** TEST 'libFuzzer :: reduce_inputs.test' FAILED ******************** Script: -- : 'RUN: at line 3'; rm -rf /Users/buildslave/jenkins/workspace/clang-stage1-RA/clang-build/tools/clang/runtime/compiler-rt-bins/test/fuzzer/X86_64DefaultDarwinConfig/Output/reduce_inputs.test.tmp/C : 'RUN: at line 4'; mkdir -p /Users/buildslave/jenkins/workspace/clang-stage1-RA/clang-build/tools/clang/runtime/compiler-rt-bins/test/fuzzer/X86_64DefaultDarwinConfig/Output/reduce_inputs.test.tmp/C : 'RUN: at line 5'; /Users/buildslave/jenkins/workspace/clang-stage1-RA/clang-build/./bin/clang --driver-mode=g++ -O2 -gline-tables-only -fsanitize=address,fuzzer -I/Users/buildslave/jenkins/workspace/clang-stage1-RA/llvm-project/compiler-rt/lib/fuzzer -arch x86_64 -stdlib=libc++ -mmacosx-version-min=10.9 -isysroot /Applications/Xcode.app/Contents/Developer/Platforms/MacOSX.platform/Developer/SDKs/MacOSX10.14.sdk /Users/buildslave/jenkins/workspace/clang-stage1-RA/llvm-project/compiler-rt/test/fuzzer/ShrinkControlFlowSimpleTest.cpp -o /Users/buildslave/jenkins/workspace/clang-stage1-RA/clang-build/tools/clang/runtime/compiler-rt-bins/test/fuzzer/X86_64DefaultDarwinConfig/Output/reduce_inputs.test.tmp-ShrinkControlFlowSimpleTest : 'RUN: at line 6'; /Users/buildslave/jenkins/workspace/clang-stage1-RA/clang-build/./bin/clang --driver-mode=g++ -O2 -gline-tables-only -fsanitize=address,fuzzer -I/Users/buildslave/jenkins/workspace/clang-stage1-RA/llvm-project/compiler-rt/lib/fuzzer -arch x86_64 -stdlib=libc++ -mmacosx-version-min=10.9 -isysroot /Applications/Xcode.app/Contents/Developer/Platforms/MacOSX.platform/Developer/SDKs/MacOSX10.14.sdk /Users/buildslave/jenkins/workspace/clang-stage1-RA/llvm-project/compiler-rt/test/fuzzer/ShrinkControlFlowTest.cpp -o /Users/buildslave/jenkins/workspace/clang-stage1-RA/clang-build/tools/clang/runtime/compiler-rt-bins/test/fuzzer/X86_64DefaultDarwinConfig/Output/reduce_inputs.test.tmp-ShrinkControlFlowTest : 'RUN: at line 7'; /Users/buildslave/jenkins/workspace/clang-stage1-RA/clang-build/tools/clang/runtime/compiler-rt-bins/test/fuzzer/X86_64DefaultDarwinConfig/Output/reduce_inputs.test.tmp-ShrinkControlFlowSimpleTest -exit_on_item=0eb8e4ed029b774d80f2b66408203801cb982a60 -runs=1000000 /Users/buildslave/jenkins/workspace/clang-stage1-RA/clang-build/tools/clang/runtime/compiler-rt-bins/test/fuzzer/X86_64DefaultDarwinConfig/Output/reduce_inputs.test.tmp/C 2>&1 | FileCheck /Users/buildslave/jenkins/workspace/clang-stage1-RA/llvm-project/compiler-rt/test/fuzzer/reduce_inputs.test : 'RUN: at line 11'; /Users/buildslave/jenkins/workspace/clang-stage1-RA/clang-build/tools/clang/runtime/compiler-rt-bins/test/fuzzer/X86_64DefaultDarwinConfig/Output/reduce_inputs.test.tmp-ShrinkControlFlowSimpleTest -runs=0 /Users/buildslave/jenkins/workspace/clang-stage1-RA/clang-build/tools/clang/runtime/compiler-rt-bins/test/fuzzer/X86_64DefaultDarwinConfig/Output/reduce_inputs.test.tmp/C 2>&1 | FileCheck /Users/buildslave/jenkins/workspace/clang-stage1-RA/llvm-project/compiler-rt/test/fuzzer/reduce_inputs.test --check-prefix=COUNT : 'RUN: at line 15'; /Users/buildslave/jenkins/workspace/clang-stage1-RA/clang-build/tools/clang/runtime/compiler-rt-bins/test/fuzzer/X86_64DefaultDarwinConfig/Output/reduce_inputs.test.tmp-ShrinkControlFlowTest -exit_on_item=0eb8e4ed029b774d80f2b66408203801cb982a60 -seed=42 -runs=1000000 2>&1 | FileCheck /Users/buildslave/jenkins/workspace/clang-stage1-RA/llvm-project/compiler-rt/test/fuzzer/reduce_inputs.test -- Exit Code: 137

Hide Details

Command Output (stderr): -- /Users/buildslave/jenkins/workspace/clang-stage1-RA/clang-build/tools/clang/runtime/compiler-rt-bins/test/fuzzer/X86_64DefaultDarwinConfig/Output/reduce_inputs.test.script: line 7: 42645 Broken pipe: 13 /Users/buildslave/jenkins/workspace/clang-stage1-RA/clang-build/tools/clang/runtime/compiler-rt-bins/test/fuzzer/X86_64DefaultDarwinConfig/Output/reduce_inputs.test.tmp-ShrinkControlFlowSimpleTest -exit_on_item=0eb8e4ed029b774d80f2b66408203801cb982a60 -runs=1000000 /Users/buildslave/jenkins/workspace/clang-stage1-RA/clang-build/tools/clang/runtime/compiler-rt-bins/test/fuzzer/X86_64DefaultDarwinConfig/Output/reduce_inputs.test.tmp/C 2>&1 42646 Killed: 9 | FileCheck /Users/buildslave/jenkins/workspace/clang-stage1-RA/llvm-project/compiler-rt/test/fuzzer/reduce_inputs.test

Hide Details

--

Hide Details

******************** FAIL: libFuzzer :: read-binary.test (2957 of 2991) ******************** TEST 'libFuzzer :: read-binary.test' FAILED ******************** Script: -- : 'RUN: at line 4'; echo -e "Hello\r\nWorld\r" > /Users/buildslave/jenkins/workspace/clang-stage1-RA/clang-build/tools/clang/runtime/compiler-rt-bins/test/fuzzer/X86_64DefaultDarwinConfig/Output/read-binary.test.tmp-testcase : 'RUN: at line 5'; /Users/buildslave/jenkins/workspace/clang-stage1-RA/clang-build/./bin/clang --driver-mode=g++ -O2 -gline-tables-only -fsanitize=address,fuzzer -I/Users/buildslave/jenkins/workspace/clang-stage1-RA/llvm-project/compiler-rt/lib/fuzzer -arch x86_64 -stdlib=libc++ -mmacosx-version-min=10.9 -isysroot /Applications/Xcode.app/Contents/Developer/Platforms/MacOSX.platform/Developer/SDKs/MacOSX10.14.sdk /Users/buildslave/jenkins/workspace/clang-stage1-RA/llvm-project/compiler-rt/test/fuzzer/ReadBinaryTest.cpp -o /Users/buildslave/jenkins/workspace/clang-stage1-RA/clang-build/tools/clang/runtime/compiler-rt-bins/test/fuzzer/X86_64DefaultDarwinConfig/Output/read-binary.test.tmp-fuzzer : 'RUN: at line 6'; /Users/buildslave/jenkins/workspace/clang-stage1-RA/clang-build/tools/clang/runtime/compiler-rt-bins/test/fuzzer/X86_64DefaultDarwinConfig/Output/read-binary.test.tmp-fuzzer /Users/buildslave/jenkins/workspace/clang-stage1-RA/clang-build/tools/clang/runtime/compiler-rt-bins/test/fuzzer/X86_64DefaultDarwinConfig/Output/read-binary.test.tmp-testcase | FileCheck /Users/buildslave/jenkins/workspace/clang-stage1-RA/llvm-project/compiler-rt/test/fuzzer/read-binary.test -- Exit Code: 137

Hide Details

Command Output (stderr): -- INFO: Seed: 2556028542 INFO: Loaded 1 modules (70 inline 8-bit counters): 70 [0x10d26bb38, 0x10d26bb7e), INFO: Loaded 1 PC tables (70 PCs): 70 [0x10d26bb80,0x10d26bfe0), /Users/buildslave/jenkins/workspace/clang-stage1-RA/clang-build/tools/clang/runtime/compiler-rt-bins/test/fuzzer/X86_64DefaultDarwinConfig/Output/read-binary.test.tmp-fuzzer: Running 1 inputs 1 time(s) each. Running: /Users/buildslave/jenkins/workspace/clang-stage1-RA/clang-build/tools/clang/runtime/compiler-rt-bins/test/fuzzer/X86_64DefaultDarwinConfig/Output/read-binary.test.tmp-testcase Executed /Users/buildslave/jenkins/workspace/clang-stage1-RA/clang-build/tools/clang/runtime/compiler-rt-bins/test/fuzzer/X86_64DefaultDarwinConfig/Output/read-binary.test.tmp-testcase in 0 ms *** *** NOTE: fuzzing was not performed, you have only *** executed the target code on a fixed set of inputs. *** /Users/buildslave/jenkins/workspace/clang-stage1-RA/clang-build/tools/clang/runtime/compiler-rt-bins/test/fuzzer/X86_64DefaultDarwinConfig/Output/read-binary.test.script: line 3: 42651 Broken pipe: 13 /Users/buildslave/jenkins/workspace/clang-stage1-RA/clang-build/tools/clang/runtime/compiler-rt-bins/test/fuzzer/X86_64DefaultDarwinConfig/Output/read-binary.test.tmp-fuzzer /Users/buildslave/jenkins/workspace/clang-stage1-RA/clang-build/tools/clang/runtime/compiler-rt-bins/test/fuzzer/X86_64DefaultDarwinConfig/Output/read-binary.test.tmp-testcase 42652 Killed: 9 | FileCheck /Users/buildslave/jenkins/workspace/clang-stage1-RA/llvm-project/compiler-rt/test/fuzzer/read-binary.test

Hide Details

--

Hide Details

******************** FAIL: libFuzzer :: reload.test (2958 of 2991) ******************** TEST 'libFuzzer :: reload.test' FAILED ******************** Script: -- : 'RUN: at line 1'; /Users/buildslave/jenkins/workspace/clang-stage1-RA/clang-build/./bin/clang --driver-mode=g++ -O2 -gline-tables-only -fsanitize=address,fuzzer -I/Users/buildslave/jenkins/workspace/clang-stage1-RA/llvm-project/compiler-rt/lib/fuzzer -arch x86_64 -stdlib=libc++ -mmacosx-version-min=10.9 -isysroot /Applications/Xcode.app/Contents/Developer/Platforms/MacOSX.platform/Developer/SDKs/MacOSX10.14.sdk /Users/buildslave/jenkins/workspace/clang-stage1-RA/llvm-project/compiler-rt/test/fuzzer/ReloadTest.cpp -o /Users/buildslave/jenkins/workspace/clang-stage1-RA/clang-build/tools/clang/runtime/compiler-rt-bins/test/fuzzer/X86_64DefaultDarwinConfig/Output/reload.test.tmp-ReloadTest : 'RUN: at line 2'; not /Users/buildslave/jenkins/workspace/clang-stage1-RA/clang-build/tools/clang/runtime/compiler-rt-bins/test/fuzzer/X86_64DefaultDarwinConfig/Output/reload.test.tmp-ReloadTest -max_len=10000 -seed=1 -timeout=15 -len_control=0 -exact_artifact_path=/Users/buildslave/jenkins/workspace/clang-stage1-RA/clang-build/tools/clang/runtime/compiler-rt-bins/test/fuzzer/X86_64DefaultDarwinConfig/Output/reload.test.tmp.crash 2>&1 | FileCheck /Users/buildslave/jenkins/workspace/clang-stage1-RA/llvm-project/compiler-rt/test/fuzzer/reload.test : 'RUN: at line 6'; not /Users/buildslave/jenkins/workspace/clang-stage1-RA/clang-build/tools/clang/runtime/compiler-rt-bins/test/fuzzer/X86_64DefaultDarwinConfig/Output/reload.test.tmp-ReloadTest /Users/buildslave/jenkins/workspace/clang-stage1-RA/clang-build/tools/clang/runtime/compiler-rt-bins/test/fuzzer/X86_64DefaultDarwinConfig/Output/reload.test.tmp.crash 2>&1 | FileCheck /Users/buildslave/jenkins/workspace/clang-stage1-RA/llvm-project/compiler-rt/test/fuzzer/reload.test --check-prefix=ARTIFACT : 'RUN: at line 12'; echo z >> /Users/buildslave/jenkins/workspace/clang-stage1-RA/clang-build/tools/clang/runtime/compiler-rt-bins/test/fuzzer/X86_64DefaultDarwinConfig/Output/reload.test.tmp.crash : 'RUN: at line 13'; /Users/buildslave/jenkins/workspace/clang-stage1-RA/clang-build/tools/clang/runtime/compiler-rt-bins/test/fuzzer/X86_64DefaultDarwinConfig/Output/reload.test.tmp-ReloadTest /Users/buildslave/jenkins/workspace/clang-stage1-RA/clang-build/tools/clang/runtime/compiler-rt-bins/test/fuzzer/X86_64DefaultDarwinConfig/Output/reload.test.tmp.crash -- Exit Code: 137

Hide Details

Command Output (stderr): -- /Users/buildslave/jenkins/workspace/clang-stage1-RA/clang-build/tools/clang/runtime/compiler-rt-bins/test/fuzzer/X86_64DefaultDarwinConfig/Output/reload.test.script: line 5: 42660 Broken pipe: 13 not /Users/buildslave/jenkins/workspace/clang-stage1-RA/clang-build/tools/clang/runtime/compiler-rt-bins/test/fuzzer/X86_64DefaultDarwinConfig/Output/reload.test.tmp-ReloadTest -max_len=10000 -seed=1 -timeout=15 -len_control=0 -exact_artifact_path=/Users/buildslave/jenkins/workspace/clang-stage1-RA/clang-build/tools/clang/runtime/compiler-rt-bins/test/fuzzer/X86_64DefaultDarwinConfig/Output/reload.test.tmp.crash 2>&1 42661 Killed: 9 | FileCheck /Users/buildslave/jenkins/workspace/clang-stage1-RA/llvm-project/compiler-rt/test/fuzzer/reload.test

Hide Details

--

Hide Details

******************** FAIL: libFuzzer :: repeated-bytes.test (2959 of 2991) ******************** TEST 'libFuzzer :: repeated-bytes.test' FAILED ******************** Script: -- : 'RUN: at line 1'; /Users/buildslave/jenkins/workspace/clang-stage1-RA/clang-build/./bin/clang --driver-mode=g++ -O2 -gline-tables-only -fsanitize=address,fuzzer -I/Users/buildslave/jenkins/workspace/clang-stage1-RA/llvm-project/compiler-rt/lib/fuzzer -arch x86_64 -stdlib=libc++ -mmacosx-version-min=10.9 -isysroot /Applications/Xcode.app/Contents/Developer/Platforms/MacOSX.platform/Developer/SDKs/MacOSX10.14.sdk /Users/buildslave/jenkins/workspace/clang-stage1-RA/llvm-project/compiler-rt/test/fuzzer/RepeatedBytesTest.cpp -o /Users/buildslave/jenkins/workspace/clang-stage1-RA/clang-build/tools/clang/runtime/compiler-rt-bins/test/fuzzer/X86_64DefaultDarwinConfig/Output/repeated-bytes.test.tmp-RepeatedBytesTest : 'RUN: at line 3'; not /Users/buildslave/jenkins/workspace/clang-stage1-RA/clang-build/tools/clang/runtime/compiler-rt-bins/test/fuzzer/X86_64DefaultDarwinConfig/Output/repeated-bytes.test.tmp-RepeatedBytesTest -seed=1 -runs=1000000 2>&1 | FileCheck /Users/buildslave/jenkins/workspace/clang-stage1-RA/llvm-project/compiler-rt/test/fuzzer/repeated-bytes.test -- Exit Code: 137

Hide Details

Command Output (stderr): -- /Users/buildslave/jenkins/workspace/clang-stage1-RA/clang-build/tools/clang/runtime/compiler-rt-bins/test/fuzzer/X86_64DefaultDarwinConfig/Output/repeated-bytes.test.script: line 2: 42668 Broken pipe: 13 not /Users/buildslave/jenkins/workspace/clang-stage1-RA/clang-build/tools/clang/runtime/compiler-rt-bins/test/fuzzer/X86_64DefaultDarwinConfig/Output/repeated-bytes.test.tmp-RepeatedBytesTest -seed=1 -runs=1000000 2>&1 42669 Killed: 9 | FileCheck /Users/buildslave/jenkins/workspace/clang-stage1-RA/llvm-project/compiler-rt/test/fuzzer/repeated-bytes.test

Hide Details

--

Hide Details

******************** FAIL: libFuzzer :: shrink.test (2960 of 2991) ******************** TEST 'libFuzzer :: shrink.test' FAILED ******************** Script: -- : 'RUN: at line 1'; /Users/buildslave/jenkins/workspace/clang-stage1-RA/clang-build/./bin/clang --driver-mode=g++ -O2 -gline-tables-only -fsanitize=address,fuzzer -I/Users/buildslave/jenkins/workspace/clang-stage1-RA/llvm-project/compiler-rt/lib/fuzzer -arch x86_64 -stdlib=libc++ -mmacosx-version-min=10.9 -isysroot /Applications/Xcode.app/Contents/Developer/Platforms/MacOSX.platform/Developer/SDKs/MacOSX10.14.sdk /Users/buildslave/jenkins/workspace/clang-stage1-RA/llvm-project/compiler-rt/test/fuzzer/ShrinkControlFlowTest.cpp -o /Users/buildslave/jenkins/workspace/clang-stage1-RA/clang-build/tools/clang/runtime/compiler-rt-bins/test/fuzzer/X86_64DefaultDarwinConfig/Output/shrink.test.tmp-ShrinkControlFlowTest : 'RUN: at line 2'; /Users/buildslave/jenkins/workspace/clang-stage1-RA/clang-build/./bin/clang --driver-mode=g++ -O2 -gline-tables-only -fsanitize=address,fuzzer -I/Users/buildslave/jenkins/workspace/clang-stage1-RA/llvm-project/compiler-rt/lib/fuzzer -arch x86_64 -stdlib=libc++ -mmacosx-version-min=10.9 -isysroot /Applications/Xcode.app/Contents/Developer/Platforms/MacOSX.platform/Developer/SDKs/MacOSX10.14.sdk /Users/buildslave/jenkins/workspace/clang-stage1-RA/llvm-project/compiler-rt/test/fuzzer/ShrinkValueProfileTest.cpp -o /Users/buildslave/jenkins/workspace/clang-stage1-RA/clang-build/tools/clang/runtime/compiler-rt-bins/test/fuzzer/X86_64DefaultDarwinConfig/Output/shrink.test.tmp-ShrinkValueProfileTest : 'RUN: at line 3'; /Users/buildslave/jenkins/workspace/clang-stage1-RA/clang-build/tools/clang/runtime/compiler-rt-bins/test/fuzzer/X86_64DefaultDarwinConfig/Output/shrink.test.tmp-ShrinkControlFlowTest -seed=1 -exit_on_item=0eb8e4ed029b774d80f2b66408203801cb982a60 -runs=2000000 -shrink=1 -reduce_inputs=0 2>&1 | FileCheck /Users/buildslave/jenkins/workspace/clang-stage1-RA/llvm-project/compiler-rt/test/fuzzer/shrink.test --check-prefix=SHRINK1 : 'RUN: at line 5'; /Users/buildslave/jenkins/workspace/clang-stage1-RA/clang-build/tools/clang/runtime/compiler-rt-bins/test/fuzzer/X86_64DefaultDarwinConfig/Output/shrink.test.tmp-ShrinkControlFlowTest -seed=1 -exit_on_item=0eb8e4ed029b774d80f2b66408203801cb982a60 -runs=1000000 -shrink=0 -reduce_inputs=0 -max_len=64 2>&1 | FileCheck /Users/buildslave/jenkins/workspace/clang-stage1-RA/llvm-project/compiler-rt/test/fuzzer/shrink.test --check-prefix=SHRINK0 : 'RUN: at line 6'; /Users/buildslave/jenkins/workspace/clang-stage1-RA/clang-build/tools/clang/runtime/compiler-rt-bins/test/fuzzer/X86_64DefaultDarwinConfig/Output/shrink.test.tmp-ShrinkValueProfileTest -seed=1 -exit_on_item=aea2e3923af219a8956f626558ef32f30a914ebc -runs=100000 -shrink=1 -reduce_inputs=0 -use_value_profile=1 2>&1 | FileCheck /Users/buildslave/jenkins/workspace/clang-stage1-RA/llvm-project/compiler-rt/test/fuzzer/shrink.test --check-prefix=SHRINK1_VP -- Exit Code: 137

Hide Details

Command Output (stderr): -- /Users/buildslave/jenkins/workspace/clang-stage1-RA/clang-build/tools/clang/runtime/compiler-rt-bins/test/fuzzer/X86_64DefaultDarwinConfig/Output/shrink.test.script: line 5: 42680 Broken pipe: 13 /Users/buildslave/jenkins/workspace/clang-stage1-RA/clang-build/tools/clang/runtime/compiler-rt-bins/test/fuzzer/X86_64DefaultDarwinConfig/Output/shrink.test.tmp-ShrinkControlFlowTest -seed=1 -exit_on_item=0eb8e4ed029b774d80f2b66408203801cb982a60 -runs=2000000 -shrink=1 -reduce_inputs=0 2>&1 42681 Killed: 9 | FileCheck /Users/buildslave/jenkins/workspace/clang-stage1-RA/llvm-project/compiler-rt/test/fuzzer/shrink.test --check-prefix=SHRINK1

Hide Details

--

Hide Details

******************** UNSUPPORTED: libFuzzer :: sigint.test (2961 of 2991) UNSUPPORTED: libFuzzer :: sigusr.test (2962 of 2991) UNSUPPORTED: libFuzzer :: simple-cmp.test (2963 of 2991) FAIL: libFuzzer :: seed_inputs.test (2964 of 2991) ******************** TEST 'libFuzzer :: seed_inputs.test' FAILED ******************** Script: -- : 'RUN: at line 4'; /Users/buildslave/jenkins/workspace/clang-stage1-RA/clang-build/./bin/clang --driver-mode=g++ -O2 -gline-tables-only -fsanitize=address,fuzzer -I/Users/buildslave/jenkins/workspace/clang-stage1-RA/llvm-project/compiler-rt/lib/fuzzer -arch x86_64 -stdlib=libc++ -mmacosx-version-min=10.9 -isysroot /Applications/Xcode.app/Contents/Developer/Platforms/MacOSX.platform/Developer/SDKs/MacOSX10.14.sdk /Users/buildslave/jenkins/workspace/clang-stage1-RA/llvm-project/compiler-rt/test/fuzzer/SimpleTest.cpp -o /Users/buildslave/jenkins/workspace/clang-stage1-RA/clang-build/tools/clang/runtime/compiler-rt-bins/test/fuzzer/X86_64DefaultDarwinConfig/Output/seed_inputs.test.tmp-SimpleTest : 'RUN: at line 7'; echo -n "/Users/buildslave/jenkins/workspace/clang-stage1-RA/clang-build/tools/clang/runtime/compiler-rt-bins/test/fuzzer/X86_64DefaultDarwinConfig/Output/seed_inputs.test.tmp-SimpleTest" > /Users/buildslave/jenkins/workspace/clang-stage1-RA/clang-build/tools/clang/runtime/compiler-rt-bins/test/fuzzer/X86_64DefaultDarwinConfig/Output/seed_inputs.test.tmp.seed-inputs : 'RUN: at line 9'; /Users/buildslave/jenkins/workspace/clang-stage1-RA/clang-build/tools/clang/runtime/compiler-rt-bins/test/fuzzer/X86_64DefaultDarwinConfig/Output/seed_inputs.test.tmp-SimpleTest -runs=1 -seed_inputs=@/Users/buildslave/jenkins/workspace/clang-stage1-RA/clang-build/tools/clang/runtime/compiler-rt-bins/test/fuzzer/X86_64DefaultDarwinConfig/Output/seed_inputs.test.tmp.seed-inputs 2>&1 | FileCheck /Users/buildslave/jenkins/workspace/clang-stage1-RA/llvm-project/compiler-rt/test/fuzzer/seed_inputs.test --check-prefix=USE-1 : 'RUN: at line 10'; /Users/buildslave/jenkins/workspace/clang-stage1-RA/clang-build/tools/clang/runtime/compiler-rt-bins/test/fuzzer/X86_64DefaultDarwinConfig/Output/seed_inputs.test.tmp-SimpleTest -runs=1 -seed_inputs=/Users/buildslave/jenkins/workspace/clang-stage1-RA/clang-build/tools/clang/runtime/compiler-rt-bins/test/fuzzer/X86_64DefaultDarwinConfig/Output/seed_inputs.test.tmp-SimpleTest 2>&1 | FileCheck /Users/buildslave/jenkins/workspace/clang-stage1-RA/llvm-project/compiler-rt/test/fuzzer/seed_inputs.test --check-prefix=USE-1 : 'RUN: at line 13'; echo -n "/Users/buildslave/jenkins/workspace/clang-stage1-RA/clang-build/tools/clang/runtime/compiler-rt-bins/test/fuzzer/X86_64DefaultDarwinConfig/Output/seed_inputs.test.tmp-SimpleTest,/Users/buildslave/jenkins/workspace/clang-stage1-RA/clang-build/tools/clang/runtime/compiler-rt-bins/test/fuzzer/X86_64DefaultDarwinConfig/Output/seed_inputs.test.tmp-SimpleTest" > /Users/buildslave/jenkins/workspace/clang-stage1-RA/clang-build/tools/clang/runtime/compiler-rt-bins/test/fuzzer/X86_64DefaultDarwinConfig/Output/seed_inputs.test.tmp.seed-inputs : 'RUN: at line 14'; /Users/buildslave/jenkins/workspace/clang-stage1-RA/clang-build/tools/clang/runtime/compiler-rt-bins/test/fuzzer/X86_64DefaultDarwinConfig/Output/seed_inputs.test.tmp-SimpleTest -runs=1 -seed_inputs=@/Users/buildslave/jenkins/workspace/clang-stage1-RA/clang-build/tools/clang/runtime/compiler-rt-bins/test/fuzzer/X86_64DefaultDarwinConfig/Output/seed_inputs.test.tmp.seed-inputs 2>&1 | FileCheck /Users/buildslave/jenkins/workspace/clang-stage1-RA/llvm-project/compiler-rt/test/fuzzer/seed_inputs.test --check-prefix=USE-2 : 'RUN: at line 15'; /Users/buildslave/jenkins/workspace/clang-stage1-RA/clang-build/tools/clang/runtime/compiler-rt-bins/test/fuzzer/X86_64DefaultDarwinConfig/Output/seed_inputs.test.tmp-SimpleTest -runs=1 -seed_inputs=/Users/buildslave/jenkins/workspace/clang-stage1-RA/clang-build/tools/clang/runtime/compiler-rt-bins/test/fuzzer/X86_64DefaultDarwinConfig/Output/seed_inputs.test.tmp-SimpleTest,/Users/buildslave/jenkins/workspace/clang-stage1-RA/clang-build/tools/clang/runtime/compiler-rt-bins/test/fuzzer/X86_64DefaultDarwinConfig/Output/seed_inputs.test.tmp-SimpleTest 2>&1 | FileCheck /Users/buildslave/jenkins/workspace/clang-stage1-RA/llvm-project/compiler-rt/test/fuzzer/seed_inputs.test --check-prefix=USE-2 : 'RUN: at line 18'; echo -n "/Users/buildslave/jenkins/workspace/clang-stage1-RA/clang-build/tools/clang/runtime/compiler-rt-bins/test/fuzzer/X86_64DefaultDarwinConfig/Output/seed_inputs.test.tmp-SimpleTest,/Users/buildslave/jenkins/workspace/clang-stage1-RA/clang-build/tools/clang/runtime/compiler-rt-bins/test/fuzzer/X86_64DefaultDarwinConfig/Output/seed_inputs.test.tmp-SimpleTest,nonexistent-file," > /Users/buildslave/jenkins/workspace/clang-stage1-RA/clang-build/tools/clang/runtime/compiler-rt-bins/test/fuzzer/X86_64DefaultDarwinConfig/Output/seed_inputs.test.tmp.seed-inputs : 'RUN: at line 19'; /Users/buildslave/jenkins/workspace/clang-stage1-RA/clang-build/tools/clang/runtime/compiler-rt-bins/test/fuzzer/X86_64DefaultDarwinConfig/Output/seed_inputs.test.tmp-SimpleTest -runs=1 -seed_inputs=@/Users/buildslave/jenkins/workspace/clang-stage1-RA/clang-build/tools/clang/runtime/compiler-rt-bins/test/fuzzer/X86_64DefaultDarwinConfig/Output/seed_inputs.test.tmp.seed-inputs 2>&1 | FileCheck /Users/buildslave/jenkins/workspace/clang-stage1-RA/llvm-project/compiler-rt/test/fuzzer/seed_inputs.test --check-prefix=USE-2 : 'RUN: at line 20'; /Users/buildslave/jenkins/workspace/clang-stage1-RA/clang-build/tools/clang/runtime/compiler-rt-bins/test/fuzzer/X86_64DefaultDarwinConfig/Output/seed_inputs.test.tmp-SimpleTest -runs=1 -seed_inputs=/Users/buildslave/jenkins/workspace/clang-stage1-RA/clang-build/tools/clang/runtime/compiler-rt-bins/test/fuzzer/X86_64DefaultDarwinConfig/Output/seed_inputs.test.tmp-SimpleTest,/Users/buildslave/jenkins/workspace/clang-stage1-RA/clang-build/tools/clang/runtime/compiler-rt-bins/test/fuzzer/X86_64DefaultDarwinConfig/Output/seed_inputs.test.tmp-SimpleTest,nonexistent-file, 2>&1 | FileCheck /Users/buildslave/jenkins/workspace/clang-stage1-RA/llvm-project/compiler-rt/test/fuzzer/seed_inputs.test --check-prefix=USE-2 : 'RUN: at line 24'; not /Users/buildslave/jenkins/workspace/clang-stage1-RA/clang-build/tools/clang/runtime/compiler-rt-bins/test/fuzzer/X86_64DefaultDarwinConfig/Output/seed_inputs.test.tmp-SimpleTest -runs=1 -seed_inputs=@nonexistent-file 2>&1 | FileCheck /Users/buildslave/jenkins/workspace/clang-stage1-RA/llvm-project/compiler-rt/test/fuzzer/seed_inputs.test --check-prefix=EMPTY : 'RUN: at line 25'; echo -n "" > /Users/buildslave/jenkins/workspace/clang-stage1-RA/clang-build/tools/clang/runtime/compiler-rt-bins/test/fuzzer/X86_64DefaultDarwinConfig/Output/seed_inputs.test.tmp.seed-inputs : 'RUN: at line 26'; not /Users/buildslave/jenkins/workspace/clang-stage1-RA/clang-build/tools/clang/runtime/compiler-rt-bins/test/fuzzer/X86_64DefaultDarwinConfig/Output/seed_inputs.test.tmp-SimpleTest -runs=1 -seed_inputs=@/Users/buildslave/jenkins/workspace/clang-stage1-RA/clang-build/tools/clang/runtime/compiler-rt-bins/test/fuzzer/X86_64DefaultDarwinConfig/Output/seed_inputs.test.tmp.seed-inputs 2>&1 | FileCheck /Users/buildslave/jenkins/workspace/clang-stage1-RA/llvm-project/compiler-rt/test/fuzzer/seed_inputs.test --check-prefix=EMPTY : 'RUN: at line 27'; not /Users/buildslave/jenkins/workspace/clang-stage1-RA/clang-build/tools/clang/runtime/compiler-rt-bins/test/fuzzer/X86_64DefaultDarwinConfig/Output/seed_inputs.test.tmp-SimpleTest -runs=1 -seed_inputs= 2>&1 | FileCheck /Users/buildslave/jenkins/workspace/clang-stage1-RA/llvm-project/compiler-rt/test/fuzzer/seed_inputs.test --check-prefix=EMPTY -- Exit Code: 137

Hide Details

Command Output (stderr): -- /Users/buildslave/jenkins/workspace/clang-stage1-RA/clang-build/tools/clang/runtime/compiler-rt-bins/test/fuzzer/X86_64DefaultDarwinConfig/Output/seed_inputs.test.script: line 14: 42687 Broken pipe: 13 /Users/buildslave/jenkins/workspace/clang-stage1-RA/clang-build/tools/clang/runtime/compiler-rt-bins/test/fuzzer/X86_64DefaultDarwinConfig/Output/seed_inputs.test.tmp-SimpleTest -runs=1 -seed_inputs=@/Users/buildslave/jenkins/workspace/clang-stage1-RA/clang-build/tools/clang/runtime/compiler-rt-bins/test/fuzzer/X86_64DefaultDarwinConfig/Output/seed_inputs.test.tmp.seed-inputs 2>&1 42688 Killed: 9 | FileCheck /Users/buildslave/jenkins/workspace/clang-stage1-RA/llvm-project/compiler-rt/test/fuzzer/seed_inputs.test --check-prefix=USE-1

Hide Details

--

Hide Details

******************** FAIL: libFuzzer :: standalone.test (2965 of 2991) ******************** TEST 'libFuzzer :: standalone.test' FAILED ******************** Script: -- : 'RUN: at line 1'; /Users/buildslave/jenkins/workspace/clang-stage1-RA/clang-build/./bin/clang -O2 -gline-tables-only -fsanitize=address -I/Users/buildslave/jenkins/workspace/clang-stage1-RA/llvm-project/compiler-rt/lib/fuzzer -arch x86_64 -stdlib=libc++ -mmacosx-version-min=10.9 -isysroot /Applications/Xcode.app/Contents/Developer/Platforms/MacOSX.platform/Developer/SDKs/MacOSX10.14.sdk /Users/buildslave/jenkins/workspace/clang-stage1-RA/llvm-project/compiler-rt/lib/fuzzer/standalone/StandaloneFuzzTargetMain.c -c -o /Users/buildslave/jenkins/workspace/clang-stage1-RA/clang-build/tools/clang/runtime/compiler-rt-bins/test/fuzzer/X86_64DefaultDarwinConfig/Output/standalone.test.tmp_1.o : 'RUN: at line 2'; /Users/buildslave/jenkins/workspace/clang-stage1-RA/clang-build/./bin/clang --driver-mode=g++ -O2 -gline-tables-only -fsanitize=address -I/Users/buildslave/jenkins/workspace/clang-stage1-RA/llvm-project/compiler-rt/lib/fuzzer -arch x86_64 -stdlib=libc++ -mmacosx-version-min=10.9 -isysroot /Applications/Xcode.app/Contents/Developer/Platforms/MacOSX.platform/Developer/SDKs/MacOSX10.14.sdk /Users/buildslave/jenkins/workspace/clang-stage1-RA/llvm-project/compiler-rt/test/fuzzer/InitializeTest.cpp -c -o /Users/buildslave/jenkins/workspace/clang-stage1-RA/clang-build/tools/clang/runtime/compiler-rt-bins/test/fuzzer/X86_64DefaultDarwinConfig/Output/standalone.test.tmp_2.o : 'RUN: at line 4'; /Users/buildslave/jenkins/workspace/clang-stage1-RA/clang-build/./bin/clang --driver-mode=g++ -O2 -gline-tables-only -fsanitize=address -I/Users/buildslave/jenkins/workspace/clang-stage1-RA/llvm-project/compiler-rt/lib/fuzzer -arch x86_64 -stdlib=libc++ -mmacosx-version-min=10.9 -isysroot /Applications/Xcode.app/Contents/Developer/Platforms/MacOSX.platform/Developer/SDKs/MacOSX10.14.sdk /Users/buildslave/jenkins/workspace/clang-stage1-RA/clang-build/tools/clang/runtime/compiler-rt-bins/test/fuzzer/X86_64DefaultDarwinConfig/Output/standalone.test.tmp_1.o /Users/buildslave/jenkins/workspace/clang-stage1-RA/clang-build/tools/clang/runtime/compiler-rt-bins/test/fuzzer/X86_64DefaultDarwinConfig/Output/standalone.test.tmp_2.o -o /Users/buildslave/jenkins/workspace/clang-stage1-RA/clang-build/tools/clang/runtime/compiler-rt-bins/test/fuzzer/X86_64DefaultDarwinConfig/Output/standalone.test.tmp-StandaloneInitializeTest : 'RUN: at line 5'; /Users/buildslave/jenkins/workspace/clang-stage1-RA/clang-build/tools/clang/runtime/compiler-rt-bins/test/fuzzer/X86_64DefaultDarwinConfig/Output/standalone.test.tmp-StandaloneInitializeTest /Users/buildslave/jenkins/workspace/clang-stage1-RA/llvm-project/compiler-rt/test/fuzzer/hi.txt /Users/buildslave/jenkins/workspace/clang-stage1-RA/llvm-project/compiler-rt/test/fuzzer/dict1.txt 2>&1 | FileCheck /Users/buildslave/jenkins/workspace/clang-stage1-RA/llvm-project/compiler-rt/test/fuzzer/standalone.test -- Exit Code: 137

Hide Details

Command Output (stderr): -- /Users/buildslave/jenkins/workspace/clang-stage1-RA/clang-build/tools/clang/runtime/compiler-rt-bins/test/fuzzer/X86_64DefaultDarwinConfig/Output/standalone.test.script: line 4: 42694 Broken pipe: 13 /Users/buildslave/jenkins/workspace/clang-stage1-RA/clang-build/tools/clang/runtime/compiler-rt-bins/test/fuzzer/X86_64DefaultDarwinConfig/Output/standalone.test.tmp-StandaloneInitializeTest /Users/buildslave/jenkins/workspace/clang-stage1-RA/llvm-project/compiler-rt/test/fuzzer/hi.txt /Users/buildslave/jenkins/workspace/clang-stage1-RA/llvm-project/compiler-rt/test/fuzzer/dict1.txt 2>&1 42695 Killed: 9 | FileCheck /Users/buildslave/jenkins/workspace/clang-stage1-RA/llvm-project/compiler-rt/test/fuzzer/standalone.test

Hide Details

--

Hide Details

******************** FAIL: libFuzzer :: strcmp.test (2966 of 2991) ******************** TEST 'libFuzzer :: strcmp.test' FAILED ******************** Script: -- : 'RUN: at line 2'; /Users/buildslave/jenkins/workspace/clang-stage1-RA/clang-build/./bin/clang --driver-mode=g++ -O2 -gline-tables-only -fsanitize=address,fuzzer -I/Users/buildslave/jenkins/workspace/clang-stage1-RA/llvm-project/compiler-rt/lib/fuzzer -arch x86_64 -stdlib=libc++ -mmacosx-version-min=10.9 -isysroot /Applications/Xcode.app/Contents/Developer/Platforms/MacOSX.platform/Developer/SDKs/MacOSX10.14.sdk /Users/buildslave/jenkins/workspace/clang-stage1-RA/llvm-project/compiler-rt/test/fuzzer/StrcmpTest.cpp -o /Users/buildslave/jenkins/workspace/clang-stage1-RA/clang-build/tools/clang/runtime/compiler-rt-bins/test/fuzzer/X86_64DefaultDarwinConfig/Output/strcmp.test.tmp-StrcmpTest : 'RUN: at line 3'; not /Users/buildslave/jenkins/workspace/clang-stage1-RA/clang-build/tools/clang/runtime/compiler-rt-bins/test/fuzzer/X86_64DefaultDarwinConfig/Output/strcmp.test.tmp-StrcmpTest -seed=1 -runs=2000000 2>&1 | FileCheck /Users/buildslave/jenkins/workspace/clang-stage1-RA/llvm-project/compiler-rt/test/fuzzer/strcmp.test -- Exit Code: 137

Hide Details

Command Output (stderr): -- /Users/buildslave/jenkins/workspace/clang-stage1-RA/clang-build/tools/clang/runtime/compiler-rt-bins/test/fuzzer/X86_64DefaultDarwinConfig/Output/strcmp.test.script: line 2: 42701 Broken pipe: 13 not /Users/buildslave/jenkins/workspace/clang-stage1-RA/clang-build/tools/clang/runtime/compiler-rt-bins/test/fuzzer/X86_64DefaultDarwinConfig/Output/strcmp.test.tmp-StrcmpTest -seed=1 -runs=2000000 2>&1 42702 Killed: 9 | FileCheck /Users/buildslave/jenkins/workspace/clang-stage1-RA/llvm-project/compiler-rt/test/fuzzer/strcmp.test

Hide Details

--

Hide Details

******************** FAIL: libFuzzer :: simple.test (2967 of 2991) ******************** TEST 'libFuzzer :: simple.test' FAILED ******************** Script: -- : 'RUN: at line 2'; /Users/buildslave/jenkins/workspace/clang-stage1-RA/clang-build/./bin/clang --driver-mode=g++ -O2 -gline-tables-only -fsanitize=address,fuzzer -I/Users/buildslave/jenkins/workspace/clang-stage1-RA/llvm-project/compiler-rt/lib/fuzzer -arch x86_64 -stdlib=libc++ -mmacosx-version-min=10.9 -isysroot /Applications/Xcode.app/Contents/Developer/Platforms/MacOSX.platform/Developer/SDKs/MacOSX10.14.sdk /Users/buildslave/jenkins/workspace/clang-stage1-RA/llvm-project/compiler-rt/test/fuzzer/SimpleTest.cpp -o /Users/buildslave/jenkins/workspace/clang-stage1-RA/clang-build/tools/clang/runtime/compiler-rt-bins/test/fuzzer/X86_64DefaultDarwinConfig/Output/simple.test.tmp-SimpleTest : 'RUN: at line 4'; not /Users/buildslave/jenkins/workspace/clang-stage1-RA/clang-build/tools/clang/runtime/compiler-rt-bins/test/fuzzer/X86_64DefaultDarwinConfig/Output/simple.test.tmp-SimpleTest 2>&1 | FileCheck /Users/buildslave/jenkins/workspace/clang-stage1-RA/llvm-project/compiler-rt/test/fuzzer/simple.test : 'RUN: at line 7'; not /Users/buildslave/jenkins/workspace/clang-stage1-RA/clang-build/tools/clang/runtime/compiler-rt-bins/test/fuzzer/X86_64DefaultDarwinConfig/Output/simple.test.tmp-SimpleTest -only_ascii=1 2>&1 -- Exit Code: 137

Hide Details

Command Output (stderr): -- /Users/buildslave/jenkins/workspace/clang-stage1-RA/clang-build/tools/clang/runtime/compiler-rt-bins/test/fuzzer/X86_64DefaultDarwinConfig/Output/simple.test.script: line 3: 42709 Broken pipe: 13 not /Users/buildslave/jenkins/workspace/clang-stage1-RA/clang-build/tools/clang/runtime/compiler-rt-bins/test/fuzzer/X86_64DefaultDarwinConfig/Output/simple.test.tmp-SimpleTest 2>&1 42710 Killed: 9 | FileCheck /Users/buildslave/jenkins/workspace/clang-stage1-RA/llvm-project/compiler-rt/test/fuzzer/simple.test

Hide Details

--

Hide Details

******************** FAIL: libFuzzer :: strncmp.test (2968 of 2991) ******************** TEST 'libFuzzer :: strncmp.test' FAILED ******************** Script: -- : 'RUN: at line 2'; /Users/buildslave/jenkins/workspace/clang-stage1-RA/clang-build/./bin/clang --driver-mode=g++ -O2 -gline-tables-only -fsanitize=address,fuzzer -I/Users/buildslave/jenkins/workspace/clang-stage1-RA/llvm-project/compiler-rt/lib/fuzzer -arch x86_64 -stdlib=libc++ -mmacosx-version-min=10.9 -isysroot /Applications/Xcode.app/Contents/Developer/Platforms/MacOSX.platform/Developer/SDKs/MacOSX10.14.sdk /Users/buildslave/jenkins/workspace/clang-stage1-RA/llvm-project/compiler-rt/test/fuzzer/StrncmpTest.cpp -o /Users/buildslave/jenkins/workspace/clang-stage1-RA/clang-build/tools/clang/runtime/compiler-rt-bins/test/fuzzer/X86_64DefaultDarwinConfig/Output/strncmp.test.tmp-StrncmpTest : 'RUN: at line 3'; not /Users/buildslave/jenkins/workspace/clang-stage1-RA/clang-build/tools/clang/runtime/compiler-rt-bins/test/fuzzer/X86_64DefaultDarwinConfig/Output/strncmp.test.tmp-StrncmpTest -seed=2 -runs=10000000 2>&1 | FileCheck /Users/buildslave/jenkins/workspace/clang-stage1-RA/llvm-project/compiler-rt/test/fuzzer/strncmp.test -- Exit Code: 137

Hide Details

Command Output (stderr): -- /Users/buildslave/jenkins/workspace/clang-stage1-RA/clang-build/tools/clang/runtime/compiler-rt-bins/test/fuzzer/X86_64DefaultDarwinConfig/Output/strncmp.test.script: line 2: 42719 Broken pipe: 13 not /Users/buildslave/jenkins/workspace/clang-stage1-RA/clang-build/tools/clang/runtime/compiler-rt-bins/test/fuzzer/X86_64DefaultDarwinConfig/Output/strncmp.test.tmp-StrncmpTest -seed=2 -runs=10000000 2>&1 42720 Killed: 9 | FileCheck /Users/buildslave/jenkins/workspace/clang-stage1-RA/llvm-project/compiler-rt/test/fuzzer/strncmp.test

Hide Details

--

Hide Details

******************** PASS: libFuzzer :: strncmp-oob.test (2969 of 2991) FAIL: libFuzzer :: strstr.test (2970 of 2991) ******************** TEST 'libFuzzer :: strstr.test' FAILED ******************** Script: -- : 'RUN: at line 2'; /Users/buildslave/jenkins/workspace/clang-stage1-RA/clang-build/./bin/clang --driver-mode=g++ -O2 -gline-tables-only -fsanitize=address,fuzzer -I/Users/buildslave/jenkins/workspace/clang-stage1-RA/llvm-project/compiler-rt/lib/fuzzer -arch x86_64 -stdlib=libc++ -mmacosx-version-min=10.9 -isysroot /Applications/Xcode.app/Contents/Developer/Platforms/MacOSX.platform/Developer/SDKs/MacOSX10.14.sdk /Users/buildslave/jenkins/workspace/clang-stage1-RA/llvm-project/compiler-rt/test/fuzzer/StrstrTest.cpp -o /Users/buildslave/jenkins/workspace/clang-stage1-RA/clang-build/tools/clang/runtime/compiler-rt-bins/test/fuzzer/X86_64DefaultDarwinConfig/Output/strstr.test.tmp-StrstrTest : 'RUN: at line 3'; not /Users/buildslave/jenkins/workspace/clang-stage1-RA/clang-build/tools/clang/runtime/compiler-rt-bins/test/fuzzer/X86_64DefaultDarwinConfig/Output/strstr.test.tmp-StrstrTest -seed=1 -runs=2000000 2>&1 | FileCheck /Users/buildslave/jenkins/workspace/clang-stage1-RA/llvm-project/compiler-rt/test/fuzzer/strstr.test -- Exit Code: 137

Hide Details

Command Output (stderr): -- /Users/buildslave/jenkins/workspace/clang-stage1-RA/clang-build/tools/clang/runtime/compiler-rt-bins/test/fuzzer/X86_64DefaultDarwinConfig/Output/strstr.test.script: line 2: 42741 Broken pipe: 13 not /Users/buildslave/jenkins/workspace/clang-stage1-RA/clang-build/tools/clang/runtime/compiler-rt-bins/test/fuzzer/X86_64DefaultDarwinConfig/Output/strstr.test.tmp-StrstrTest -seed=1 -runs=2000000 2>&1 42742 Killed: 9 | FileCheck /Users/buildslave/jenkins/workspace/clang-stage1-RA/llvm-project/compiler-rt/test/fuzzer/strstr.test

Hide Details

--

Hide Details

******************** FAIL: libFuzzer :: swap-cmp.test (2971 of 2991) ******************** TEST 'libFuzzer :: swap-cmp.test' FAILED ******************** Script: -- : 'RUN: at line 1'; /Users/buildslave/jenkins/workspace/clang-stage1-RA/clang-build/./bin/clang --driver-mode=g++ -O2 -gline-tables-only -fsanitize=address,fuzzer -I/Users/buildslave/jenkins/workspace/clang-stage1-RA/llvm-project/compiler-rt/lib/fuzzer -arch x86_64 -stdlib=libc++ -mmacosx-version-min=10.9 -isysroot /Applications/Xcode.app/Contents/Developer/Platforms/MacOSX.platform/Developer/SDKs/MacOSX10.14.sdk /Users/buildslave/jenkins/workspace/clang-stage1-RA/llvm-project/compiler-rt/test/fuzzer/SwapCmpTest.cpp -o /Users/buildslave/jenkins/workspace/clang-stage1-RA/clang-build/tools/clang/runtime/compiler-rt-bins/test/fuzzer/X86_64DefaultDarwinConfig/Output/swap-cmp.test.tmp-SwapCmpTest : 'RUN: at line 3'; not /Users/buildslave/jenkins/workspace/clang-stage1-RA/clang-build/tools/clang/runtime/compiler-rt-bins/test/fuzzer/X86_64DefaultDarwinConfig/Output/swap-cmp.test.tmp-SwapCmpTest -seed=1 -runs=10000000 2>&1 | FileCheck /Users/buildslave/jenkins/workspace/clang-stage1-RA/llvm-project/compiler-rt/test/fuzzer/swap-cmp.test -- Exit Code: 137

Hide Details

Command Output (stderr): -- /Users/buildslave/jenkins/workspace/clang-stage1-RA/clang-build/tools/clang/runtime/compiler-rt-bins/test/fuzzer/X86_64DefaultDarwinConfig/Output/swap-cmp.test.script: line 2: 42747 Killed: 9 not /Users/buildslave/jenkins/workspace/clang-stage1-RA/clang-build/tools/clang/runtime/compiler-rt-bins/test/fuzzer/X86_64DefaultDarwinConfig/Output/swap-cmp.test.tmp-SwapCmpTest -seed=1 -runs=10000000 2>&1 42748 | FileCheck /Users/buildslave/jenkins/workspace/clang-stage1-RA/llvm-project/compiler-rt/test/fuzzer/swap-cmp.test

Hide Details

--

Hide Details

******************** FAIL: libFuzzer :: three-bytes.test (2972 of 2991) ******************** TEST 'libFuzzer :: three-bytes.test' FAILED ******************** Script: -- : 'RUN: at line 2'; /Users/buildslave/jenkins/workspace/clang-stage1-RA/clang-build/./bin/clang --driver-mode=g++ -O2 -gline-tables-only -fsanitize=address,fuzzer -I/Users/buildslave/jenkins/workspace/clang-stage1-RA/llvm-project/compiler-rt/lib/fuzzer -arch x86_64 -stdlib=libc++ -mmacosx-version-min=10.9 -isysroot /Applications/Xcode.app/Contents/Developer/Platforms/MacOSX.platform/Developer/SDKs/MacOSX10.14.sdk /Users/buildslave/jenkins/workspace/clang-stage1-RA/llvm-project/compiler-rt/test/fuzzer/ThreeBytes.cpp -o /Users/buildslave/jenkins/workspace/clang-stage1-RA/clang-build/tools/clang/runtime/compiler-rt-bins/test/fuzzer/X86_64DefaultDarwinConfig/Output/three-bytes.test.tmp : 'RUN: at line 4'; /Users/buildslave/jenkins/workspace/clang-stage1-RA/clang-build/tools/clang/runtime/compiler-rt-bins/test/fuzzer/X86_64DefaultDarwinConfig/Output/three-bytes.test.tmp -seed=1 -runs=30000 : 'RUN: at line 5'; not /Users/buildslave/jenkins/workspace/clang-stage1-RA/clang-build/tools/clang/runtime/compiler-rt-bins/test/fuzzer/X86_64DefaultDarwinConfig/Output/three-bytes.test.tmp -seed=1 -runs=1000000 -use_value_profile=2 2>&1 | FileCheck /Users/buildslave/jenkins/workspace/clang-stage1-RA/llvm-project/compiler-rt/test/fuzzer/three-bytes.test -- Exit Code: 137

Hide Details

Command Output (stderr): -- /Users/buildslave/jenkins/workspace/clang-stage1-RA/clang-build/tools/clang/runtime/compiler-rt-bins/test/fuzzer/X86_64DefaultDarwinConfig/Output/three-bytes.test.script: line 3: 42757 Killed: 9 /Users/buildslave/jenkins/workspace/clang-stage1-RA/clang-build/tools/clang/runtime/compiler-rt-bins/test/fuzzer/X86_64DefaultDarwinConfig/Output/three-bytes.test.tmp -seed=1 -runs=30000

Hide Details

--

Hide Details

******************** UNSUPPORTED: libFuzzer :: trace-malloc-2.test (2973 of 2991) UNSUPPORTED: libFuzzer :: trace-malloc-threaded.test (2974 of 2991) UNSUPPORTED: libFuzzer :: trace-malloc-unbalanced.test (2975 of 2991) PASS: libFuzzer :: symbolize-deadlock.test (2976 of 2991) FAIL: libFuzzer :: ulimit.test (2977 of 2991) ******************** TEST 'libFuzzer :: ulimit.test' FAILED ******************** Script: -- : 'RUN: at line 3'; /Users/buildslave/jenkins/workspace/clang-stage1-RA/clang-build/./bin/clang --driver-mode=g++ -O2 -gline-tables-only -fsanitize=address,fuzzer -I/Users/buildslave/jenkins/workspace/clang-stage1-RA/llvm-project/compiler-rt/lib/fuzzer -arch x86_64 -stdlib=libc++ -mmacosx-version-min=10.9 -isysroot /Applications/Xcode.app/Contents/Developer/Platforms/MacOSX.platform/Developer/SDKs/MacOSX10.14.sdk /Users/buildslave/jenkins/workspace/clang-stage1-RA/llvm-project/compiler-rt/test/fuzzer/SimpleTest.cpp -o /Users/buildslave/jenkins/workspace/clang-stage1-RA/clang-build/tools/clang/runtime/compiler-rt-bins/test/fuzzer/X86_64DefaultDarwinConfig/Output/ulimit.test.tmp-SimpleTest : 'RUN: at line 4'; ulimit -s 1000 : 'RUN: at line 5'; not /Users/buildslave/jenkins/workspace/clang-stage1-RA/clang-build/tools/clang/runtime/compiler-rt-bins/test/fuzzer/X86_64DefaultDarwinConfig/Output/ulimit.test.tmp-SimpleTest -- Exit Code: 137

Hide Details

Command Output (stderr): -- /Users/buildslave/jenkins/workspace/clang-stage1-RA/clang-build/tools/clang/runtime/compiler-rt-bins/test/fuzzer/X86_64DefaultDarwinConfig/Output/ulimit.test.script: line 3: 42773 Killed: 9 /Users/buildslave/jenkins/workspace/clang-stage1-RA/clang-build/./bin/clang --driver-mode=g++ -O2 -gline-tables-only -fsanitize=address,fuzzer -I/Users/buildslave/jenkins/workspace/clang-stage1-RA/llvm-project/compiler-rt/lib/fuzzer -arch x86_64 -stdlib=libc++ -mmacosx-version-min=10.9 -isysroot /Applications/Xcode.app/Contents/Developer/Platforms/MacOSX.platform/Developer/SDKs/MacOSX10.14.sdk /Users/buildslave/jenkins/workspace/clang-stage1-RA/llvm-project/compiler-rt/test/fuzzer/SimpleTest.cpp -o /Users/buildslave/jenkins/workspace/clang-stage1-RA/clang-build/tools/clang/runtime/compiler-rt-bins/test/fuzzer/X86_64DefaultDarwinConfig/Output/ulimit.test.tmp-SimpleTest

Hide Details

--

Hide Details

******************** FAIL: libFuzzer :: trace-malloc.test (2978 of 2991) ******************** TEST 'libFuzzer :: trace-malloc.test' FAILED ******************** Script: -- : 'RUN: at line 1'; /Users/buildslave/jenkins/workspace/clang-stage1-RA/clang-build/./bin/clang --driver-mode=g++ -O2 -gline-tables-only -fsanitize=address,fuzzer -I/Users/buildslave/jenkins/workspace/clang-stage1-RA/llvm-project/compiler-rt/lib/fuzzer -arch x86_64 -stdlib=libc++ -mmacosx-version-min=10.9 -isysroot /Applications/Xcode.app/Contents/Developer/Platforms/MacOSX.platform/Developer/SDKs/MacOSX10.14.sdk /Users/buildslave/jenkins/workspace/clang-stage1-RA/llvm-project/compiler-rt/test/fuzzer/TraceMallocTest.cpp -o /Users/buildslave/jenkins/workspace/clang-stage1-RA/clang-build/tools/clang/runtime/compiler-rt-bins/test/fuzzer/X86_64DefaultDarwinConfig/Output/trace-malloc.test.tmp-TraceMallocTest : 'RUN: at line 3'; /Users/buildslave/jenkins/workspace/clang-stage1-RA/clang-build/tools/clang/runtime/compiler-rt-bins/test/fuzzer/X86_64DefaultDarwinConfig/Output/trace-malloc.test.tmp-TraceMallocTest -seed=1 -trace_malloc=1 -runs=10000 2>&1 | FileCheck /Users/buildslave/jenkins/workspace/clang-stage1-RA/llvm-project/compiler-rt/test/fuzzer/trace-malloc.test -- Exit Code: 137

Hide Details

Command Output (stderr): -- /Users/buildslave/jenkins/workspace/clang-stage1-RA/clang-build/tools/clang/runtime/compiler-rt-bins/test/fuzzer/X86_64DefaultDarwinConfig/Output/trace-malloc.test.script: line 2: 42771 Broken pipe: 13 /Users/buildslave/jenkins/workspace/clang-stage1-RA/clang-build/tools/clang/runtime/compiler-rt-bins/test/fuzzer/X86_64DefaultDarwinConfig/Output/trace-malloc.test.tmp-TraceMallocTest -seed=1 -trace_malloc=1 -runs=10000 2>&1 42772 Killed: 9 | FileCheck /Users/buildslave/jenkins/workspace/clang-stage1-RA/llvm-project/compiler-rt/test/fuzzer/trace-malloc.test

Hide Details

--

Hide Details

******************** FAIL: libFuzzer :: value-profile-cmp2.test (2979 of 2991) ******************** TEST 'libFuzzer :: value-profile-cmp2.test' FAILED ******************** Script: -- : 'RUN: at line 5'; /Users/buildslave/jenkins/workspace/clang-stage1-RA/clang-build/./bin/clang --driver-mode=g++ -O2 -gline-tables-only -fsanitize=address,fuzzer -I/Users/buildslave/jenkins/workspace/clang-stage1-RA/llvm-project/compiler-rt/lib/fuzzer -arch x86_64 -stdlib=libc++ -mmacosx-version-min=10.9 -isysroot /Applications/Xcode.app/Contents/Developer/Platforms/MacOSX.platform/Developer/SDKs/MacOSX10.14.sdk -fno-sanitize=address /Users/buildslave/jenkins/workspace/clang-stage1-RA/llvm-project/compiler-rt/test/fuzzer/SimpleHashTest.cpp -o /Users/buildslave/jenkins/workspace/clang-stage1-RA/clang-build/tools/clang/runtime/compiler-rt-bins/test/fuzzer/X86_64DefaultDarwinConfig/Output/value-profile-cmp2.test.tmp-SimpleHashTest : 'RUN: at line 6'; not /Users/buildslave/jenkins/workspace/clang-stage1-RA/clang-build/tools/clang/runtime/compiler-rt-bins/test/fuzzer/X86_64DefaultDarwinConfig/Output/value-profile-cmp2.test.tmp-SimpleHashTest -seed=1 -use_cmp=0 -use_value_profile=1 -runs=100000000 -max_len=64 2>&1 | FileCheck /Users/buildslave/jenkins/workspace/clang-stage1-RA/llvm-project/compiler-rt/test/fuzzer/value-profile-cmp2.test -- Exit Code: 137

Hide Details

Command Output (stderr): -- /Users/buildslave/jenkins/workspace/clang-stage1-RA/clang-build/tools/clang/runtime/compiler-rt-bins/test/fuzzer/X86_64DefaultDarwinConfig/Output/value-profile-cmp2.test.script: line 2: 42787 Broken pipe: 13 not /Users/buildslave/jenkins/workspace/clang-stage1-RA/clang-build/tools/clang/runtime/compiler-rt-bins/test/fuzzer/X86_64DefaultDarwinConfig/Output/value-profile-cmp2.test.tmp-SimpleHashTest -seed=1 -use_cmp=0 -use_value_profile=1 -runs=100000000 -max_len=64 2>&1 42788 Killed: 9 | FileCheck /Users/buildslave/jenkins/workspace/clang-stage1-RA/llvm-project/compiler-rt/test/fuzzer/value-profile-cmp2.test

Hide Details

--

Hide Details

******************** FAIL: libFuzzer :: value-profile-cmp.test (2980 of 2991) ******************** TEST 'libFuzzer :: value-profile-cmp.test' FAILED ******************** Script: -- : 'RUN: at line 3'; /Users/buildslave/jenkins/workspace/clang-stage1-RA/clang-build/./bin/clang --driver-mode=g++ -O2 -gline-tables-only -fsanitize=address,fuzzer -I/Users/buildslave/jenkins/workspace/clang-stage1-RA/llvm-project/compiler-rt/lib/fuzzer -arch x86_64 -stdlib=libc++ -mmacosx-version-min=10.9 -isysroot /Applications/Xcode.app/Contents/Developer/Platforms/MacOSX.platform/Developer/SDKs/MacOSX10.14.sdk /Users/buildslave/jenkins/workspace/clang-stage1-RA/llvm-project/compiler-rt/test/fuzzer/SimpleCmpTest.cpp -o /Users/buildslave/jenkins/workspace/clang-stage1-RA/clang-build/tools/clang/runtime/compiler-rt-bins/test/fuzzer/X86_64DefaultDarwinConfig/Output/value-profile-cmp.test.tmp-SimpleCmpTest : 'RUN: at line 4'; not /Users/buildslave/jenkins/workspace/clang-stage1-RA/clang-build/tools/clang/runtime/compiler-rt-bins/test/fuzzer/X86_64DefaultDarwinConfig/Output/value-profile-cmp.test.tmp-SimpleCmpTest -seed=1 -use_cmp=0 -use_value_profile=1 -runs=100000000 2>&1 | FileCheck /Users/buildslave/jenkins/workspace/clang-stage1-RA/llvm-project/compiler-rt/test/fuzzer/value-profile-cmp.test -- Exit Code: 137

Hide Details

Command Output (stderr): -- /Users/buildslave/jenkins/workspace/clang-stage1-RA/llvm-project/compiler-rt/test/fuzzer/SimpleCmpTest.cpp:42:19: warning: format specifies type 'ssize_t' (aka 'long') but the argument has type 'uint64_t' (aka 'unsigned long long') [-Wformat] Size, x, y, z, a); ^ /Users/buildslave/jenkins/workspace/clang-stage1-RA/llvm-project/compiler-rt/test/fuzzer/SimpleCmpTest.cpp:42:22: warning: format specifies type 'ssize_t' (aka 'long') but the argument has type 'int64_t' (aka 'long long') [-Wformat] Size, x, y, z, a); ^ 2 warnings generated. /Users/buildslave/jenkins/workspace/clang-stage1-RA/clang-build/tools/clang/runtime/compiler-rt-bins/test/fuzzer/X86_64DefaultDarwinConfig/Output/value-profile-cmp.test.script: line 2: 42784 Broken pipe: 13 not /Users/buildslave/jenkins/workspace/clang-stage1-RA/clang-build/tools/clang/runtime/compiler-rt-bins/test/fuzzer/X86_64DefaultDarwinConfig/Output/value-profile-cmp.test.tmp-SimpleCmpTest -seed=1 -use_cmp=0 -use_value_profile=1 -runs=100000000 2>&1 42785 Killed: 9 | FileCheck /Users/buildslave/jenkins/workspace/clang-stage1-RA/llvm-project/compiler-rt/test/fuzzer/value-profile-cmp.test

Hide Details

--

Hide Details

******************** FAIL: libFuzzer :: value-profile-cmp3.test (2981 of 2991) ******************** TEST 'libFuzzer :: value-profile-cmp3.test' FAILED ******************** Script: -- : 'RUN: at line 3'; /Users/buildslave/jenkins/workspace/clang-stage1-RA/clang-build/./bin/clang --driver-mode=g++ -O2 -gline-tables-only -fsanitize=address,fuzzer -I/Users/buildslave/jenkins/workspace/clang-stage1-RA/llvm-project/compiler-rt/lib/fuzzer -arch x86_64 -stdlib=libc++ -mmacosx-version-min=10.9 -isysroot /Applications/Xcode.app/Contents/Developer/Platforms/MacOSX.platform/Developer/SDKs/MacOSX10.14.sdk /Users/buildslave/jenkins/workspace/clang-stage1-RA/llvm-project/compiler-rt/test/fuzzer/AbsNegAndConstantTest.cpp -o /Users/buildslave/jenkins/workspace/clang-stage1-RA/clang-build/tools/clang/runtime/compiler-rt-bins/test/fuzzer/X86_64DefaultDarwinConfig/Output/value-profile-cmp3.test.tmp-AbsNegAndConstantTest : 'RUN: at line 4'; not /Users/buildslave/jenkins/workspace/clang-stage1-RA/clang-build/tools/clang/runtime/compiler-rt-bins/test/fuzzer/X86_64DefaultDarwinConfig/Output/value-profile-cmp3.test.tmp-AbsNegAndConstantTest -seed=1 -use_cmp=0 -use_value_profile=1 -runs=100000000 2>&1 | FileCheck /Users/buildslave/jenkins/workspace/clang-stage1-RA/llvm-project/compiler-rt/test/fuzzer/value-profile-cmp3.test -- Exit Code: 137

Hide Details

Command Output (stderr): -- /Users/buildslave/jenkins/workspace/clang-stage1-RA/clang-build/tools/clang/runtime/compiler-rt-bins/test/fuzzer/X86_64DefaultDarwinConfig/Output/value-profile-cmp3.test.script: line 2: 42802 Broken pipe: 13 not /Users/buildslave/jenkins/workspace/clang-stage1-RA/clang-build/tools/clang/runtime/compiler-rt-bins/test/fuzzer/X86_64DefaultDarwinConfig/Output/value-profile-cmp3.test.tmp-AbsNegAndConstantTest -seed=1 -use_cmp=0 -use_value_profile=1 -runs=100000000 2>&1 42803 Killed: 9 | FileCheck /Users/buildslave/jenkins/workspace/clang-stage1-RA/llvm-project/compiler-rt/test/fuzzer/value-profile-cmp3.test

Hide Details

--

Hide Details

******************** FAIL: libFuzzer :: value-profile-cmp4.test (2982 of 2991) ******************** TEST 'libFuzzer :: value-profile-cmp4.test' FAILED ******************** Script: -- : 'RUN: at line 2'; /Users/buildslave/jenkins/workspace/clang-stage1-RA/clang-build/./bin/clang --driver-mode=g++ -O2 -gline-tables-only -fsanitize=address,fuzzer -I/Users/buildslave/jenkins/workspace/clang-stage1-RA/llvm-project/compiler-rt/lib/fuzzer -arch x86_64 -stdlib=libc++ -mmacosx-version-min=10.9 -isysroot /Applications/Xcode.app/Contents/Developer/Platforms/MacOSX.platform/Developer/SDKs/MacOSX10.14.sdk /Users/buildslave/jenkins/workspace/clang-stage1-RA/llvm-project/compiler-rt/test/fuzzer/AbsNegAndConstant64Test.cpp -o /Users/buildslave/jenkins/workspace/clang-stage1-RA/clang-build/tools/clang/runtime/compiler-rt-bins/test/fuzzer/X86_64DefaultDarwinConfig/Output/value-profile-cmp4.test.tmp-AbsNegAndConstant64Test : 'RUN: at line 3'; not /Users/buildslave/jenkins/workspace/clang-stage1-RA/clang-build/tools/clang/runtime/compiler-rt-bins/test/fuzzer/X86_64DefaultDarwinConfig/Output/value-profile-cmp4.test.tmp-AbsNegAndConstant64Test -seed=1 -use_cmp=0 -use_value_profile=1 -runs=100000000 2>&1 | FileCheck /Users/buildslave/jenkins/workspace/clang-stage1-RA/llvm-project/compiler-rt/test/fuzzer/value-profile-cmp4.test -- Exit Code: 137

Hide Details

Command Output (stderr): -- /Users/buildslave/jenkins/workspace/clang-stage1-RA/llvm-project/compiler-rt/test/fuzzer/AbsNegAndConstant64Test.cpp:20:69: warning: format specifies type 'unsigned long' but the argument has type 'int64_t' (aka 'long long') [-Wformat] printf("BINGO; Found the target, exiting; x = 0x%lx y 0x%lx\n", x, y); ~~~ ^ %llx /Users/buildslave/jenkins/workspace/clang-stage1-RA/llvm-project/compiler-rt/test/fuzzer/AbsNegAndConstant64Test.cpp:20:72: warning: format specifies type 'unsigned long' but the argument has type 'uint64_t' (aka 'unsigned long long') [-Wformat] printf("BINGO; Found the target, exiting; x = 0x%lx y 0x%lx\n", x, y); ~~~ ^ %llx 2 warnings generated. /Users/buildslave/jenkins/workspace/clang-stage1-RA/clang-build/tools/clang/runtime/compiler-rt-bins/test/fuzzer/X86_64DefaultDarwinConfig/Output/value-profile-cmp4.test.script: line 2: 42805 Broken pipe: 13 not /Users/buildslave/jenkins/workspace/clang-stage1-RA/clang-build/tools/clang/runtime/compiler-rt-bins/test/fuzzer/X86_64DefaultDarwinConfig/Output/value-profile-cmp4.test.tmp-AbsNegAndConstant64Test -seed=1 -use_cmp=0 -use_value_profile=1 -runs=100000000 2>&1 42806 Killed: 9 | FileCheck /Users/buildslave/jenkins/workspace/clang-stage1-RA/llvm-project/compiler-rt/test/fuzzer/value-profile-cmp4.test

Hide Details

--

Hide Details

******************** FAIL: libFuzzer :: value-profile-load.test (2983 of 2991) ******************** TEST 'libFuzzer :: value-profile-load.test' FAILED ******************** Script: -- : 'RUN: at line 2'; /Users/buildslave/jenkins/workspace/clang-stage1-RA/clang-build/./bin/clang --driver-mode=g++ -O2 -gline-tables-only -fsanitize=address,fuzzer -I/Users/buildslave/jenkins/workspace/clang-stage1-RA/llvm-project/compiler-rt/lib/fuzzer -arch x86_64 -stdlib=libc++ -mmacosx-version-min=10.9 -isysroot /Applications/Xcode.app/Contents/Developer/Platforms/MacOSX.platform/Developer/SDKs/MacOSX10.14.sdk /Users/buildslave/jenkins/workspace/clang-stage1-RA/llvm-project/compiler-rt/test/fuzzer/LoadTest.cpp -fsanitize-coverage=trace-gep -o /Users/buildslave/jenkins/workspace/clang-stage1-RA/clang-build/tools/clang/runtime/compiler-rt-bins/test/fuzzer/X86_64DefaultDarwinConfig/Output/value-profile-load.test.tmp-LoadTest : 'RUN: at line 3'; not /Users/buildslave/jenkins/workspace/clang-stage1-RA/clang-build/tools/clang/runtime/compiler-rt-bins/test/fuzzer/X86_64DefaultDarwinConfig/Output/value-profile-load.test.tmp-LoadTest -seed=2 -use_cmp=0 -use_value_profile=1 -runs=20000000 2>&1 | FileCheck /Users/buildslave/jenkins/workspace/clang-stage1-RA/llvm-project/compiler-rt/test/fuzzer/value-profile-load.test -- Exit Code: 137

Hide Details

Command Output (stderr): -- /Users/buildslave/jenkins/workspace/clang-stage1-RA/clang-build/tools/clang/runtime/compiler-rt-bins/test/fuzzer/X86_64DefaultDarwinConfig/Output/value-profile-load.test.script: line 2: 42820 Killed: 9 not /Users/buildslave/jenkins/workspace/clang-stage1-RA/clang-build/tools/clang/runtime/compiler-rt-bins/test/fuzzer/X86_64DefaultDarwinConfig/Output/value-profile-load.test.tmp-LoadTest -seed=2 -use_cmp=0 -use_value_profile=1 -runs=20000000 2>&1 42821 | FileCheck /Users/buildslave/jenkins/workspace/clang-stage1-RA/llvm-project/compiler-rt/test/fuzzer/value-profile-load.test

Hide Details

--

Hide Details

******************** FAIL: libFuzzer :: value-profile-div.test (2984 of 2991) ******************** TEST 'libFuzzer :: value-profile-div.test' FAILED ******************** Script: -- : 'RUN: at line 4'; /Users/buildslave/jenkins/workspace/clang-stage1-RA/clang-build/./bin/clang --driver-mode=g++ -O2 -gline-tables-only -fsanitize=address,fuzzer -I/Users/buildslave/jenkins/workspace/clang-stage1-RA/llvm-project/compiler-rt/lib/fuzzer -arch x86_64 -stdlib=libc++ -mmacosx-version-min=10.9 -isysroot /Applications/Xcode.app/Contents/Developer/Platforms/MacOSX.platform/Developer/SDKs/MacOSX10.14.sdk /Users/buildslave/jenkins/workspace/clang-stage1-RA/llvm-project/compiler-rt/test/fuzzer/DivTest.cpp -fsanitize-coverage=trace-div -o /Users/buildslave/jenkins/workspace/clang-stage1-RA/clang-build/tools/clang/runtime/compiler-rt-bins/test/fuzzer/X86_64DefaultDarwinConfig/Output/value-profile-div.test.tmp-DivTest : 'RUN: at line 5'; not /Users/buildslave/jenkins/workspace/clang-stage1-RA/clang-build/tools/clang/runtime/compiler-rt-bins/test/fuzzer/X86_64DefaultDarwinConfig/Output/value-profile-div.test.tmp-DivTest -seed=1 -use_value_profile=1 -runs=10000000 2>&1 | FileCheck /Users/buildslave/jenkins/workspace/clang-stage1-RA/llvm-project/compiler-rt/test/fuzzer/value-profile-div.test -- Exit Code: 137

Hide Details

Command Output (stderr): -- /Users/buildslave/jenkins/workspace/clang-stage1-RA/clang-build/tools/clang/runtime/compiler-rt-bins/test/fuzzer/X86_64DefaultDarwinConfig/Output/value-profile-div.test.script: line 2: 42818 Broken pipe: 13 not /Users/buildslave/jenkins/workspace/clang-stage1-RA/clang-build/tools/clang/runtime/compiler-rt-bins/test/fuzzer/X86_64DefaultDarwinConfig/Output/value-profile-div.test.tmp-DivTest -seed=1 -use_value_profile=1 -runs=10000000 2>&1 42819 Killed: 9 | FileCheck /Users/buildslave/jenkins/workspace/clang-stage1-RA/llvm-project/compiler-rt/test/fuzzer/value-profile-div.test

Hide Details

--

Hide Details

******************** FAIL: libFuzzer :: value-profile-mem.test (2985 of 2991) ******************** TEST 'libFuzzer :: value-profile-mem.test' FAILED ******************** Script: -- : 'RUN: at line 5'; /Users/buildslave/jenkins/workspace/clang-stage1-RA/clang-build/./bin/clang --driver-mode=g++ -O2 -gline-tables-only -fsanitize=address,fuzzer -I/Users/buildslave/jenkins/workspace/clang-stage1-RA/llvm-project/compiler-rt/lib/fuzzer -arch x86_64 -stdlib=libc++ -mmacosx-version-min=10.9 -isysroot /Applications/Xcode.app/Contents/Developer/Platforms/MacOSX.platform/Developer/SDKs/MacOSX10.14.sdk /Users/buildslave/jenkins/workspace/clang-stage1-RA/llvm-project/compiler-rt/test/fuzzer/SingleMemcmpTest.cpp -o /Users/buildslave/jenkins/workspace/clang-stage1-RA/clang-build/tools/clang/runtime/compiler-rt-bins/test/fuzzer/X86_64DefaultDarwinConfig/Output/value-profile-mem.test.tmp-SingleMemcmpTest -fno-sanitize-coverage=trace-cmp : 'RUN: at line 6'; not /Users/buildslave/jenkins/workspace/clang-stage1-RA/clang-build/tools/clang/runtime/compiler-rt-bins/test/fuzzer/X86_64DefaultDarwinConfig/Output/value-profile-mem.test.tmp-SingleMemcmpTest -seed=1 -use_cmp=0 -use_value_profile=1 -runs=10000000 2>&1 | FileCheck /Users/buildslave/jenkins/workspace/clang-stage1-RA/llvm-project/compiler-rt/test/fuzzer/value-profile-mem.test -- Exit Code: 137

Hide Details

Command Output (stderr): -- /Users/buildslave/jenkins/workspace/clang-stage1-RA/clang-build/tools/clang/runtime/compiler-rt-bins/test/fuzzer/X86_64DefaultDarwinConfig/Output/value-profile-mem.test.script: line 2: 42831 Broken pipe: 13 not /Users/buildslave/jenkins/workspace/clang-stage1-RA/clang-build/tools/clang/runtime/compiler-rt-bins/test/fuzzer/X86_64DefaultDarwinConfig/Output/value-profile-mem.test.tmp-SingleMemcmpTest -seed=1 -use_cmp=0 -use_value_profile=1 -runs=10000000 2>&1 42832 Killed: 9 | FileCheck /Users/buildslave/jenkins/workspace/clang-stage1-RA/llvm-project/compiler-rt/test/fuzzer/value-profile-mem.test

Hide Details

--

Hide Details

******************** FAIL: libFuzzer :: value-profile-strcmp.test (2986 of 2991) ******************** TEST 'libFuzzer :: value-profile-strcmp.test' FAILED ******************** Script: -- : 'RUN: at line 4'; /Users/buildslave/jenkins/workspace/clang-stage1-RA/clang-build/./bin/clang --driver-mode=g++ -O2 -gline-tables-only -fsanitize=address,fuzzer -I/Users/buildslave/jenkins/workspace/clang-stage1-RA/llvm-project/compiler-rt/lib/fuzzer -arch x86_64 -stdlib=libc++ -mmacosx-version-min=10.9 -isysroot /Applications/Xcode.app/Contents/Developer/Platforms/MacOSX.platform/Developer/SDKs/MacOSX10.14.sdk /Users/buildslave/jenkins/workspace/clang-stage1-RA/llvm-project/compiler-rt/test/fuzzer/SingleStrcmpTest.cpp -o /Users/buildslave/jenkins/workspace/clang-stage1-RA/clang-build/tools/clang/runtime/compiler-rt-bins/test/fuzzer/X86_64DefaultDarwinConfig/Output/value-profile-strcmp.test.tmp-SingleStrcmpTest : 'RUN: at line 5'; not /Users/buildslave/jenkins/workspace/clang-stage1-RA/clang-build/tools/clang/runtime/compiler-rt-bins/test/fuzzer/X86_64DefaultDarwinConfig/Output/value-profile-strcmp.test.tmp-SingleStrcmpTest -seed=1 -use_cmp=0 -use_value_profile=1 -runs=10000000 2>&1 | FileCheck /Users/buildslave/jenkins/workspace/clang-stage1-RA/llvm-project/compiler-rt/test/fuzzer/value-profile-strcmp.test -- Exit Code: 137

Hide Details

Command Output (stderr): -- /Users/buildslave/jenkins/workspace/clang-stage1-RA/clang-build/tools/clang/runtime/compiler-rt-bins/test/fuzzer/X86_64DefaultDarwinConfig/Output/value-profile-strcmp.test.script: line 2: 42839 Broken pipe: 13 not /Users/buildslave/jenkins/workspace/clang-stage1-RA/clang-build/tools/clang/runtime/compiler-rt-bins/test/fuzzer/X86_64DefaultDarwinConfig/Output/value-profile-strcmp.test.tmp-SingleStrcmpTest -seed=1 -use_cmp=0 -use_value_profile=1 -runs=10000000 2>&1 42840 Killed: 9 | FileCheck /Users/buildslave/jenkins/workspace/clang-stage1-RA/llvm-project/compiler-rt/test/fuzzer/value-profile-strcmp.test

Hide Details

--

Hide Details

******************** FAIL: libFuzzer :: value-profile-strncmp.test (2987 of 2991) ******************** TEST 'libFuzzer :: value-profile-strncmp.test' FAILED ******************** Script: -- : 'RUN: at line 3'; /Users/buildslave/jenkins/workspace/clang-stage1-RA/clang-build/./bin/clang --driver-mode=g++ -O2 -gline-tables-only -fsanitize=address,fuzzer -I/Users/buildslave/jenkins/workspace/clang-stage1-RA/llvm-project/compiler-rt/lib/fuzzer -arch x86_64 -stdlib=libc++ -mmacosx-version-min=10.9 -isysroot /Applications/Xcode.app/Contents/Developer/Platforms/MacOSX.platform/Developer/SDKs/MacOSX10.14.sdk /Users/buildslave/jenkins/workspace/clang-stage1-RA/llvm-project/compiler-rt/test/fuzzer/SingleStrncmpTest.cpp -o /Users/buildslave/jenkins/workspace/clang-stage1-RA/clang-build/tools/clang/runtime/compiler-rt-bins/test/fuzzer/X86_64DefaultDarwinConfig/Output/value-profile-strncmp.test.tmp-SingleStrncmpTest : 'RUN: at line 4'; not /Users/buildslave/jenkins/workspace/clang-stage1-RA/clang-build/tools/clang/runtime/compiler-rt-bins/test/fuzzer/X86_64DefaultDarwinConfig/Output/value-profile-strncmp.test.tmp-SingleStrncmpTest -seed=1 -use_cmp=0 -use_value_profile=1 -runs=100000000 2>&1 | FileCheck /Users/buildslave/jenkins/workspace/clang-stage1-RA/llvm-project/compiler-rt/test/fuzzer/value-profile-strncmp.test -- Exit Code: 137

Hide Details

Command Output (stderr): -- /Users/buildslave/jenkins/workspace/clang-stage1-RA/clang-build/tools/clang/runtime/compiler-rt-bins/test/fuzzer/X86_64DefaultDarwinConfig/Output/value-profile-strncmp.test.script: line 2: 42847 Broken pipe: 13 not /Users/buildslave/jenkins/workspace/clang-stage1-RA/clang-build/tools/clang/runtime/compiler-rt-bins/test/fuzzer/X86_64DefaultDarwinConfig/Output/value-profile-strncmp.test.tmp-SingleStrncmpTest -seed=1 -use_cmp=0 -use_value_profile=1 -runs=100000000 2>&1 42848 Killed: 9 | FileCheck /Users/buildslave/jenkins/workspace/clang-stage1-RA/llvm-project/compiler-rt/test/fuzzer/value-profile-strncmp.test

Hide Details

--

Hide Details

******************** FAIL: libFuzzer :: value-profile-set.test (2988 of 2991) ******************** TEST 'libFuzzer :: value-profile-set.test' FAILED ******************** Script: -- : 'RUN: at line 3'; /Users/buildslave/jenkins/workspace/clang-stage1-RA/clang-build/./bin/clang --driver-mode=g++ -O2 -gline-tables-only -fsanitize=address,fuzzer -I/Users/buildslave/jenkins/workspace/clang-stage1-RA/llvm-project/compiler-rt/lib/fuzzer -arch x86_64 -stdlib=libc++ -mmacosx-version-min=10.9 -isysroot /Applications/Xcode.app/Contents/Developer/Platforms/MacOSX.platform/Developer/SDKs/MacOSX10.14.sdk /Users/buildslave/jenkins/workspace/clang-stage1-RA/llvm-project/compiler-rt/test/fuzzer/FourIndependentBranchesTest.cpp -o /Users/buildslave/jenkins/workspace/clang-stage1-RA/clang-build/tools/clang/runtime/compiler-rt-bins/test/fuzzer/X86_64DefaultDarwinConfig/Output/value-profile-set.test.tmp-FourIndependentBranchesTest : 'RUN: at line 4'; not /Users/buildslave/jenkins/workspace/clang-stage1-RA/clang-build/tools/clang/runtime/compiler-rt-bins/test/fuzzer/X86_64DefaultDarwinConfig/Output/value-profile-set.test.tmp-FourIndependentBranchesTest -seed=1 -use_cmp=0 -use_value_profile=1 -runs=100000000 2>&1 | FileCheck /Users/buildslave/jenkins/workspace/clang-stage1-RA/llvm-project/compiler-rt/test/fuzzer/value-profile-set.test -- Exit Code: 137

Hide Details

Command Output (stderr): -- /Users/buildslave/jenkins/workspace/clang-stage1-RA/clang-build/tools/clang/runtime/compiler-rt-bins/test/fuzzer/X86_64DefaultDarwinConfig/Output/value-profile-set.test.script: line 2: 42860 Broken pipe: 13 not /Users/buildslave/jenkins/workspace/clang-stage1-RA/clang-build/tools/clang/runtime/compiler-rt-bins/test/fuzzer/X86_64DefaultDarwinConfig/Output/value-profile-set.test.tmp-FourIndependentBranchesTest -seed=1 -use_cmp=0 -use_value_profile=1 -runs=100000000 2>&1 42861 Killed: 9 | FileCheck /Users/buildslave/jenkins/workspace/clang-stage1-RA/llvm-project/compiler-rt/test/fuzzer/value-profile-set.test

Hide Details

--

Hide Details

******************** UNSUPPORTED: libFuzzer :: windows-opt-ref.test (2989 of 2991) FAIL: libFuzzer :: value-profile-switch.test (2990 of 2991) ******************** TEST 'libFuzzer :: value-profile-switch.test' FAILED ******************** Script: -- : 'RUN: at line 3'; /Users/buildslave/jenkins/workspace/clang-stage1-RA/clang-build/./bin/clang --driver-mode=g++ -O2 -gline-tables-only -fsanitize=address,fuzzer -I/Users/buildslave/jenkins/workspace/clang-stage1-RA/llvm-project/compiler-rt/lib/fuzzer -arch x86_64 -stdlib=libc++ -mmacosx-version-min=10.9 -isysroot /Applications/Xcode.app/Contents/Developer/Platforms/MacOSX.platform/Developer/SDKs/MacOSX10.14.sdk /Users/buildslave/jenkins/workspace/clang-stage1-RA/llvm-project/compiler-rt/test/fuzzer/SwitchTest.cpp -o /Users/buildslave/jenkins/workspace/clang-stage1-RA/clang-build/tools/clang/runtime/compiler-rt-bins/test/fuzzer/X86_64DefaultDarwinConfig/Output/value-profile-switch.test.tmp-SwitchTest : 'RUN: at line 4'; /Users/buildslave/jenkins/workspace/clang-stage1-RA/clang-build/./bin/clang --driver-mode=g++ -O2 -gline-tables-only -fsanitize=address,fuzzer -I/Users/buildslave/jenkins/workspace/clang-stage1-RA/llvm-project/compiler-rt/lib/fuzzer -arch x86_64 -stdlib=libc++ -mmacosx-version-min=10.9 -isysroot /Applications/Xcode.app/Contents/Developer/Platforms/MacOSX.platform/Developer/SDKs/MacOSX10.14.sdk /Users/buildslave/jenkins/workspace/clang-stage1-RA/llvm-project/compiler-rt/test/fuzzer/Switch2Test.cpp -o /Users/buildslave/jenkins/workspace/clang-stage1-RA/clang-build/tools/clang/runtime/compiler-rt-bins/test/fuzzer/X86_64DefaultDarwinConfig/Output/value-profile-switch.test.tmp-Switch2Test : 'RUN: at line 5'; /Users/buildslave/jenkins/workspace/clang-stage1-RA/clang-build/./bin/clang --driver-mode=g++ -O2 -gline-tables-only -fsanitize=address,fuzzer -I/Users/buildslave/jenkins/workspace/clang-stage1-RA/llvm-project/compiler-rt/lib/fuzzer -arch x86_64 -stdlib=libc++ -mmacosx-version-min=10.9 -isysroot /Applications/Xcode.app/Contents/Developer/Platforms/MacOSX.platform/Developer/SDKs/MacOSX10.14.sdk /Users/buildslave/jenkins/workspace/clang-stage1-RA/llvm-project/compiler-rt/test/fuzzer/Switch3Test.cpp -o /Users/buildslave/jenkins/workspace/clang-stage1-RA/clang-build/tools/clang/runtime/compiler-rt-bins/test/fuzzer/X86_64DefaultDarwinConfig/Output/value-profile-switch.test.tmp-Switch3Test : 'RUN: at line 6'; not /Users/buildslave/jenkins/workspace/clang-stage1-RA/clang-build/tools/clang/runtime/compiler-rt-bins/test/fuzzer/X86_64DefaultDarwinConfig/Output/value-profile-switch.test.tmp-SwitchTest -use_cmp=0 -use_value_profile=1 -runs=100000000 -seed=1 2>&1 | FileCheck /Users/buildslave/jenkins/workspace/clang-stage1-RA/llvm-project/compiler-rt/test/fuzzer/value-profile-switch.test : 'RUN: at line 7'; not /Users/buildslave/jenkins/workspace/clang-stage1-RA/clang-build/tools/clang/runtime/compiler-rt-bins/test/fuzzer/X86_64DefaultDarwinConfig/Output/value-profile-switch.test.tmp-Switch2Test -use_cmp=0 -use_value_profile=1 -runs=100000000 -seed=1 2>&1 | FileCheck /Users/buildslave/jenkins/workspace/clang-stage1-RA/llvm-project/compiler-rt/test/fuzzer/value-profile-switch.test : 'RUN: at line 8'; not /Users/buildslave/jenkins/workspace/clang-stage1-RA/clang-build/tools/clang/runtime/compiler-rt-bins/test/fuzzer/X86_64DefaultDarwinConfig/Output/value-profile-switch.test.tmp-Switch3Test -use_cmp=0 -use_value_profile=1 -runs=100000000 -seed=1 2>&1 -- Exit Code: 137

Hide Details

Command Output (stderr): -- /Users/buildslave/jenkins/workspace/clang-stage1-RA/clang-build/tools/clang/runtime/compiler-rt-bins/test/fuzzer/X86_64DefaultDarwinConfig/Output/value-profile-switch.test.script: line 6: 42870 Broken pipe: 13 not /Users/buildslave/jenkins/workspace/clang-stage1-RA/clang-build/tools/clang/runtime/compiler-rt-bins/test/fuzzer/X86_64DefaultDarwinConfig/Output/value-profile-switch.test.tmp-SwitchTest -use_cmp=0 -use_value_profile=1 -runs=100000000 -seed=1 2>&1 42871 Killed: 9 | FileCheck /Users/buildslave/jenkins/workspace/clang-stage1-RA/llvm-project/compiler-rt/test/fuzzer/value-profile-switch.test

Hide Details

--

Hide Details

******************** PASS: libFuzzer :: large.test (2991 of 2991) ******************** Failing Tests (954): AddressSanitizer-x86_64-darwin :: TestCases/memset_test.cpp AddressSanitizer-x86_64-darwin :: TestCases/printf-1.c AddressSanitizer-x86_64-darwin :: TestCases/printf-2.c AddressSanitizer-x86_64-darwin :: TestCases/printf-3.c AddressSanitizer-x86_64-darwin :: TestCases/printf-4.c AddressSanitizer-x86_64-darwin :: TestCases/printf-5.c AddressSanitizer-x86_64-darwin :: TestCases/realloc.cpp AddressSanitizer-x86_64-darwin :: TestCases/sanity_check_pure_c.c AddressSanitizer-x86_64-darwin :: TestCases/scariness_score_test.cpp AddressSanitizer-x86_64-darwin :: TestCases/set_shadow_test.c AddressSanitizer-x86_64-darwin :: TestCases/sleep_before_dying.c AddressSanitizer-x86_64-darwin :: TestCases/small_memcpy_test.cpp AddressSanitizer-x86_64-darwin :: TestCases/speculative_load.cpp AddressSanitizer-x86_64-darwin :: TestCases/speculative_load2.cpp AddressSanitizer-x86_64-darwin :: TestCases/stack-buffer-overflow-with-position.cpp AddressSanitizer-x86_64-darwin :: TestCases/stack-buffer-overflow.cpp AddressSanitizer-x86_64-darwin :: TestCases/stack-frame-demangle.cpp AddressSanitizer-x86_64-darwin :: TestCases/stack-oob-frames.cpp AddressSanitizer-x86_64-darwin :: TestCases/strcat-overlap.cpp AddressSanitizer-x86_64-darwin :: TestCases/strcat_strict.c AddressSanitizer-x86_64-darwin :: TestCases/strchr_strict.c AddressSanitizer-x86_64-darwin :: TestCases/strcmp_strict.c AddressSanitizer-x86_64-darwin :: TestCases/strcpy-overlap.cpp AddressSanitizer-x86_64-darwin :: TestCases/strcspn-1.c AddressSanitizer-x86_64-darwin :: TestCases/strip_path_prefix.c AddressSanitizer-x86_64-darwin :: TestCases/strncasecmp_strict.c AddressSanitizer-x86_64-darwin :: TestCases/strncat-overlap.cpp AddressSanitizer-x86_64-darwin :: TestCases/strncat_strict.c AddressSanitizer-x86_64-darwin :: TestCases/strncmp_strict.c AddressSanitizer-x86_64-darwin :: TestCases/strncpy-overflow.cpp AddressSanitizer-x86_64-darwin :: TestCases/strncpy-overlap.cpp AddressSanitizer-x86_64-darwin :: TestCases/strpbrk-2.c AddressSanitizer-x86_64-darwin :: TestCases/strpbrk_strict.c AddressSanitizer-x86_64-darwin :: TestCases/strspn-1.c AddressSanitizer-x86_64-darwin :: TestCases/strspn-2.c AddressSanitizer-x86_64-darwin :: TestCases/strspn_strict.c AddressSanitizer-x86_64-darwin :: TestCases/strstr-2.c AddressSanitizer-x86_64-darwin :: TestCases/strstr_strict.c AddressSanitizer-x86_64-darwin :: TestCases/strtok.c AddressSanitizer-x86_64-darwin :: TestCases/strtol_strict.c AddressSanitizer-x86_64-darwin :: TestCases/strtoll_strict.c AddressSanitizer-x86_64-darwin :: TestCases/suppressions-exec-relative-location.cpp AddressSanitizer-x86_64-darwin :: TestCases/suppressions-interceptor.cpp AddressSanitizer-x86_64-darwin :: TestCases/suppressions-library.cpp AddressSanitizer-x86_64-darwin :: TestCases/time_interceptor.cpp AddressSanitizer-x86_64-darwin :: TestCases/unaligned_loads_and_stores.cpp AddressSanitizer-x86_64-darwin :: TestCases/use-after-delete.cpp AddressSanitizer-x86_64-darwin :: TestCases/use-after-free-right.cpp AddressSanitizer-x86_64-darwin :: TestCases/use-after-free.cpp AddressSanitizer-x86_64-darwin :: TestCases/use-after-poison.cpp AddressSanitizer-x86_64-darwin :: TestCases/use-after-scope-capture.cpp AddressSanitizer-x86_64-darwin :: TestCases/use-after-scope-dtor-order.cpp AddressSanitizer-x86_64-darwin :: TestCases/use-after-scope-goto.cpp AddressSanitizer-x86_64-darwin :: TestCases/use-after-scope-if.cpp AddressSanitizer-x86_64-darwin :: TestCases/use-after-scope-inlined.cpp AddressSanitizer-x86_64-darwin :: TestCases/use-after-scope-loop-bug.cpp AddressSanitizer-x86_64-darwin :: TestCases/use-after-scope-loop-removed.cpp AddressSanitizer-x86_64-darwin :: TestCases/use-after-scope-loop.cpp AddressSanitizer-x86_64-darwin :: TestCases/use-after-scope-temp.cpp AddressSanitizer-x86_64-darwin :: TestCases/use-after-scope-temp2.cpp AddressSanitizer-x86_64-darwin :: TestCases/use-after-scope-types.cpp AddressSanitizer-x86_64-darwin :: TestCases/use-after-scope.cpp AddressSanitizer-x86_64-darwin :: TestCases/verbose-log-path_test.cpp AddressSanitizer-x86_64-darwin :: TestCases/vla_chrome_testcase.cpp AddressSanitizer-x86_64-darwin :: TestCases/vla_condition_overflow.cpp AddressSanitizer-x86_64-darwin :: TestCases/vla_loop_overfow.cpp AddressSanitizer-x86_64-darwin :: TestCases/zero_page_pc.cpp Builtins :: TestCases/Darwin/os_version_check_test.c Builtins :: TestCases/Darwin/os_version_check_test_no_core_foundation.c Builtins-x86_64-darwin :: absvdi2_test.c Builtins-x86_64-darwin :: addvdi3_test.c Builtins-x86_64-darwin :: addvsi3_test.c Builtins-x86_64-darwin :: addvti3_test.c Builtins-x86_64-darwin :: ashldi3_test.c Builtins-x86_64-darwin :: ashrdi3_test.c Builtins-x86_64-darwin :: ashrti3_test.c Builtins-x86_64-darwin :: bswapdi2_test.c Builtins-x86_64-darwin :: bswapsi2_test.c Builtins-x86_64-darwin :: clear_cache_test.c Builtins-x86_64-darwin :: clzdi2_test.c Builtins-x86_64-darwin :: clzsi2_test.c Builtins-x86_64-darwin :: clzti2_test.c Builtins-x86_64-darwin :: cmpdi2_test.c Builtins-x86_64-darwin :: comparedf2_test.c Builtins-x86_64-darwin :: comparesf2_test.c Builtins-x86_64-darwin :: compiler_rt_logb_test.c Builtins-x86_64-darwin :: compiler_rt_logbf_test.c Builtins-x86_64-darwin :: ctzdi2_test.c Builtins-x86_64-darwin :: ctzsi2_test.c Builtins-x86_64-darwin :: ctzti2_test.c Builtins-x86_64-darwin :: divdc3_test.c Builtins-x86_64-darwin :: divdf3_test.c Builtins-x86_64-darwin :: divmodsi4_test.c Builtins-x86_64-darwin :: divsc3_test.c Builtins-x86_64-darwin :: divsf3_test.c Builtins-x86_64-darwin :: divtc3_test.c Builtins-x86_64-darwin :: divti3_test.c Builtins-x86_64-darwin :: divxc3_test.c Builtins-x86_64-darwin :: enable_execute_stack_test.c Builtins-x86_64-darwin :: extenddftf2_test.c Builtins-x86_64-darwin :: extendhfsf2_test.c Builtins-x86_64-darwin :: extendsftf2_test.c Builtins-x86_64-darwin :: ffsdi2_test.c Builtins-x86_64-darwin :: ffssi2_test.c Builtins-x86_64-darwin :: ffsti2_test.c Builtins-x86_64-darwin :: fixdfti_test.c Builtins-x86_64-darwin :: fixtfsi_test.c Builtins-x86_64-darwin :: fixtfti_test.c Builtins-x86_64-darwin :: fixunsdfdi_test.c Builtins-x86_64-darwin :: fixunsdfsi_test.c Builtins-x86_64-darwin :: fixunsdfti_test.c Builtins-x86_64-darwin :: fixunssfdi_test.c Builtins-x86_64-darwin :: fixunssfsi_test.c Builtins-x86_64-darwin :: fixunssfti_test.c Builtins-x86_64-darwin :: fixunstfdi_test.c Builtins-x86_64-darwin :: fixunstfsi_test.c Builtins-x86_64-darwin :: fixunstfti_test.c Builtins-x86_64-darwin :: fixunsxfdi_test.c Builtins-x86_64-darwin :: fixunsxfsi_test.c Builtins-x86_64-darwin :: fixunsxfti_test.c Builtins-x86_64-darwin :: fixxfdi_test.c Builtins-x86_64-darwin :: fixxfti_test.c Builtins-x86_64-darwin :: floatdisf_test.c Builtins-x86_64-darwin :: floatditf_test.c Builtins-x86_64-darwin :: floatdixf_test.c Builtins-x86_64-darwin :: floattidf_test.c Builtins-x86_64-darwin :: floattisf_test.c Builtins-x86_64-darwin :: floattitf_test.c Builtins-x86_64-darwin :: floattixf_test.c Builtins-x86_64-darwin :: floatundisf_test.c Builtins-x86_64-darwin :: floatunditf_test.c Builtins-x86_64-darwin :: floatundixf_test.c Builtins-x86_64-darwin :: floatunsitf_test.c Builtins-x86_64-darwin :: floatuntidf_test.c Builtins-x86_64-darwin :: floatuntisf_test.c Builtins-x86_64-darwin :: floatuntitf_test.c Builtins-x86_64-darwin :: floatuntixf_test.c Builtins-x86_64-darwin :: gttf2_test.c Builtins-x86_64-darwin :: letf2_test.c Builtins-x86_64-darwin :: lshrdi3_test.c Builtins-x86_64-darwin :: modsi3_test.c Builtins-x86_64-darwin :: modti3_test.c Builtins-x86_64-darwin :: muldi3_test.c Builtins-x86_64-darwin :: mulodi4_test.c Builtins-x86_64-darwin :: muloti4_test.c Builtins-x86_64-darwin :: mulsc3_test.c Builtins-x86_64-darwin :: mulvti3_test.c Builtins-x86_64-darwin :: mulxc3_test.c Builtins-x86_64-darwin :: negti2_test.c Builtins-x86_64-darwin :: netf2_test.c Builtins-x86_64-darwin :: paritydi2_test.c Builtins-x86_64-darwin :: popcountti2_test.c Builtins-x86_64-darwin :: powixf2_test.c Builtins-x86_64-darwin :: subvti3_test.c Builtins-x86_64-darwin :: udivmoddi4_test.c Builtins-x86_64-darwin :: umoddi3_test.c LLVMFuzzer-Unittest :: ./Fuzzer-x86_64-Test/FuzzerCommand.SetOutput LeakSanitizer-AddressSanitizer-x86_64 :: TestCases/disabler.c LeakSanitizer-AddressSanitizer-x86_64 :: TestCases/ignore_object.c LeakSanitizer-AddressSanitizer-x86_64 :: TestCases/ignore_object_errors.cpp LeakSanitizer-AddressSanitizer-x86_64 :: TestCases/leak_check_at_exit.cpp LeakSanitizer-AddressSanitizer-x86_64 :: TestCases/many_tls_keys_thread.cpp LeakSanitizer-AddressSanitizer-x86_64 :: TestCases/suppressions_default.cpp LeakSanitizer-AddressSanitizer-x86_64 :: TestCases/suppressions_file.cpp LeakSanitizer-AddressSanitizer-x86_64 :: TestCases/use_poisoned_asan.cpp LeakSanitizer-AddressSanitizer-x86_64 :: TestCases/use_registers.cpp LeakSanitizer-AddressSanitizer-x86_64 :: TestCases/use_stacks.cpp LeakSanitizer-AddressSanitizer-x86_64 :: TestCases/use_stacks_threaded.cpp LeakSanitizer-Standalone-x86_64 :: TestCases/default_options.cpp LeakSanitizer-Standalone-x86_64 :: TestCases/disabler.c LeakSanitizer-Standalone-x86_64 :: TestCases/disabler.cpp LeakSanitizer-Standalone-x86_64 :: TestCases/do_leak_check_override.cpp LeakSanitizer-Standalone-x86_64 :: TestCases/high_allocator_contention.cpp LeakSanitizer-Standalone-x86_64 :: TestCases/ignore_object.c LeakSanitizer-Standalone-x86_64 :: TestCases/leak_check_at_exit.cpp LeakSanitizer-Standalone-x86_64 :: TestCases/new_array_with_dtor_0.cpp LeakSanitizer-Standalone-x86_64 :: TestCases/print_suppressions.cpp LeakSanitizer-Standalone-x86_64 :: TestCases/register_root_region.cpp LeakSanitizer-Standalone-x86_64 :: TestCases/swapcontext.cpp LeakSanitizer-Standalone-x86_64 :: TestCases/use_after_return.cpp LeakSanitizer-Standalone-x86_64 :: TestCases/use_globals_initialized.cpp LeakSanitizer-Standalone-x86_64 :: TestCases/use_globals_uninitialized.cpp LeakSanitizer-Standalone-x86_64 :: TestCases/use_registers.cpp LeakSanitizer-Standalone-x86_64 :: TestCases/use_stacks.cpp LeakSanitizer-Standalone-x86_64 :: TestCases/use_stacks_threaded.cpp Profile-x86_64 :: ContinuousSyncMode/basic.c Profile-x86_64 :: ContinuousSyncMode/darwin-proof-of-concept.c Profile-x86_64 :: ContinuousSyncMode/multiple-DSOs.c Profile-x86_64 :: ContinuousSyncMode/online-merging.c Profile-x86_64 :: ContinuousSyncMode/set-file-object.c Profile-x86_64 :: Posix/instrprof-dlopen-dlclose-gcov.test Profile-x86_64 :: Posix/instrprof-dlopen.test Profile-x86_64 :: Posix/instrprof-dynamic-two-shared.test Profile-x86_64 :: Posix/instrprof-gcov-execlp.test Profile-x86_64 :: Posix/instrprof-gcov-parallel.test Profile-x86_64 :: Posix/instrprof-get-filename-merge-mode.c Profile-x86_64 :: Posix/instrprof-shared.test Profile-x86_64 :: Posix/instrprof-value-prof-shared.test Profile-x86_64 :: Posix/instrprof-visibility.cpp Profile-x86_64 :: coverage-inline.cpp Profile-x86_64 :: gcc-flag-compatibility.test Profile-x86_64 :: infinite_loop.c Profile-x86_64 :: instrprof-basic.c Profile-x86_64 :: instrprof-darwin-dead-strip.c Profile-x86_64 :: instrprof-dump.c Profile-x86_64 :: instrprof-gcov-__gcov_flush-multiple.test Profile-x86_64 :: instrprof-hostname.c Profile-x86_64 :: instrprof-icall-promo.test Profile-x86_64 :: instrprof-merge-match.test Profile-x86_64 :: instrprof-merge.c Profile-x86_64 :: instrprof-merging.cpp Profile-x86_64 :: instrprof-override-filename-then-reset-default.c Profile-x86_64 :: instrprof-override-filename-with-env.c Profile-x86_64 :: instrprof-override-filename.c Profile-x86_64 :: instrprof-reset-counters.c Profile-x86_64 :: instrprof-set-file-object-merging.c Profile-x86_64 :: instrprof-set-file-object.c Profile-x86_64 :: instrprof-set-filename-then-reset-default.c Profile-x86_64 :: instrprof-set-filename.c Profile-x86_64 :: instrprof-value-prof-evict.test Profile-x86_64 :: instrprof-value-prof-reset.c Profile-x86_64 :: instrprof-value-prof.c Profile-x86_64 :: instrprof-value-prof.test Profile-x86_64 :: instrprof-version-mismatch.c Profile-x86_64 :: instrprof-without-libc.c Profile-x86_64 :: instrprof-write-file-atexit-explicitly.c Profile-x86_64 :: instrprof-write-file-only.c Profile-x86_64 :: instrprof-write-file.c Profile-x86_64 :: runtime_infinite.c SanitizerCommon-Unit :: ./Sanitizer-x86_64-Test/DeadlockDetector.MultipleEpochsTest SanitizerCommon-Unit :: ./Sanitizer-x86_64-Test/FileSizes/SanitizerCommonFileTest.ReadFileToVector/5 SanitizerCommon-Unit :: ./Sanitizer-x86_64-Test/FileSizes/SanitizerCommonFileTest.ReadFileToVectorHalf/4 SanitizerCommon-Unit :: ./Sanitizer-x86_64-Test/SanitizerCommon.HandleSignalMode SanitizerCommon-Unit :: ./Sanitizer-x86_64-Test/SanitizerCommon.IntFlags SanitizerCommon-Unit :: ./Sanitizer-x86_64-Test/SanitizerCommon.StackDepotReverseMap SanitizerCommon-asan-x86_64-Darwin :: Darwin/fputs_puts_null.cpp SanitizerCommon-asan-x86_64-Darwin :: Darwin/malloc_zone.cpp SanitizerCommon-asan-x86_64-Darwin :: Darwin/print-stack-trace-in-code-loaded-after-fork.cpp SanitizerCommon-asan-x86_64-Darwin :: Darwin/print-stack-trace.cpp SanitizerCommon-asan-x86_64-Darwin :: Darwin/symbolizer-function-offset-atos.cpp SanitizerCommon-asan-x86_64-Darwin :: Posix/dedup_token_length_test.cpp SanitizerCommon-asan-x86_64-Darwin :: Posix/dump_instruction_bytes.cpp SanitizerCommon-asan-x86_64-Darwin :: Posix/feof_fileno_ferror.cpp SanitizerCommon-asan-x86_64-Darwin :: Posix/fgetc_ungetc_getc.cpp SanitizerCommon-asan-x86_64-Darwin :: Posix/fpe.cpp SanitizerCommon-asan-x86_64-Darwin :: Posix/getpw_getgr.cpp SanitizerCommon-asan-x86_64-Darwin :: Posix/illegal_read_test.cpp SanitizerCommon-asan-x86_64-Darwin :: Posix/illegal_write_test.cpp SanitizerCommon-asan-x86_64-Darwin :: Posix/posix_memalign-alignment.cpp SanitizerCommon-asan-x86_64-Darwin :: Posix/sanitizer_set_death_callback_test.cpp SanitizerCommon-asan-x86_64-Darwin :: Posix/sanitizer_set_report_fd_test.cpp SanitizerCommon-asan-x86_64-Darwin :: Posix/setvbuf.cpp SanitizerCommon-asan-x86_64-Darwin :: Posix/sysctl.cpp SanitizerCommon-asan-x86_64-Darwin :: allocator_returns_null.cpp SanitizerCommon-asan-x86_64-Darwin :: ctype.c SanitizerCommon-asan-x86_64-Darwin :: get_module_and_offset_for_pc.cpp SanitizerCommon-asan-x86_64-Darwin :: malloc_hook.cpp SanitizerCommon-asan-x86_64-Darwin :: max_allocation_size.cpp SanitizerCommon-asan-x86_64-Darwin :: sanitizer_coverage_inline8bit_counter.cpp SanitizerCommon-asan-x86_64-Darwin :: sanitizer_coverage_no_prune.cpp SanitizerCommon-asan-x86_64-Darwin :: sanitizer_coverage_stack_depth.cpp SanitizerCommon-asan-x86_64-Darwin :: sanitizer_coverage_trace_pc_guard.cpp SanitizerCommon-asan-x86_64-Darwin :: symbolize_pc.cpp SanitizerCommon-asan-x86_64-Darwin :: symbolize_stack.cpp SanitizerCommon-lsan-x86_64-Darwin :: Darwin/fputs_puts_null.cpp SanitizerCommon-lsan-x86_64-Darwin :: Darwin/malloc_zone.cpp SanitizerCommon-lsan-x86_64-Darwin :: Darwin/print-stack-trace.cpp SanitizerCommon-lsan-x86_64-Darwin :: Darwin/symbolizer-function-offset-atos.cpp SanitizerCommon-lsan-x86_64-Darwin :: Posix/arc4random.cpp SanitizerCommon-lsan-x86_64-Darwin :: Posix/devname.cpp SanitizerCommon-lsan-x86_64-Darwin :: Posix/devname_r.cpp SanitizerCommon-lsan-x86_64-Darwin :: Posix/dump_instruction_bytes.cpp SanitizerCommon-lsan-x86_64-Darwin :: Posix/feof_fileno_ferror.cpp SanitizerCommon-lsan-x86_64-Darwin :: Posix/fgets.cpp SanitizerCommon-lsan-x86_64-Darwin :: Posix/fpe.cpp SanitizerCommon-lsan-x86_64-Darwin :: Posix/fputc_putc_putchar.cpp SanitizerCommon-lsan-x86_64-Darwin :: Posix/fputs_puts.cpp SanitizerCommon-lsan-x86_64-Darwin :: Posix/getmntinfo.cpp SanitizerCommon-lsan-x86_64-Darwin :: Posix/getpass.cpp SanitizerCommon-lsan-x86_64-Darwin :: Posix/getpw_getgr.cpp SanitizerCommon-lsan-x86_64-Darwin :: Posix/getusershell.cpp SanitizerCommon-lsan-x86_64-Darwin :: Posix/illegal_read_test.cpp SanitizerCommon-lsan-x86_64-Darwin :: Posix/illegal_write_test.cpp SanitizerCommon-lsan-x86_64-Darwin :: Posix/lstat.cpp SanitizerCommon-lsan-x86_64-Darwin :: Posix/popen.cpp SanitizerCommon-lsan-x86_64-Darwin :: Posix/posix_memalign-alignment.cpp SanitizerCommon-lsan-x86_64-Darwin :: Posix/putc_putchar_unlocked.cpp SanitizerCommon-lsan-x86_64-Darwin :: Posix/sanitizer_set_report_fd_test.cpp SanitizerCommon-lsan-x86_64-Darwin :: Posix/setvbuf.cpp SanitizerCommon-lsan-x86_64-Darwin :: Posix/strlcat.cpp SanitizerCommon-lsan-x86_64-Darwin :: Posix/strlcpy.cpp SanitizerCommon-lsan-x86_64-Darwin :: Posix/sysctl.cpp SanitizerCommon-lsan-x86_64-Darwin :: allocator_returns_null.cpp SanitizerCommon-lsan-x86_64-Darwin :: ctype.c SanitizerCommon-lsan-x86_64-Darwin :: get_module_and_offset_for_pc.cpp SanitizerCommon-lsan-x86_64-Darwin :: malloc_hook.cpp SanitizerCommon-lsan-x86_64-Darwin :: max_allocation_size.cpp SanitizerCommon-lsan-x86_64-Darwin :: options-help.cpp SanitizerCommon-lsan-x86_64-Darwin :: options-include.cpp SanitizerCommon-lsan-x86_64-Darwin :: sanitizer_coverage_inline8bit_counter.cpp SanitizerCommon-lsan-x86_64-Darwin :: sanitizer_coverage_no_prune.cpp SanitizerCommon-lsan-x86_64-Darwin :: sanitizer_coverage_stack_depth.cpp SanitizerCommon-lsan-x86_64-Darwin :: sanitizer_coverage_trace_pc_guard.cpp SanitizerCommon-lsan-x86_64-Darwin :: symbolize_debug_argv.cpp SanitizerCommon-lsan-x86_64-Darwin :: symbolize_pc.cpp SanitizerCommon-lsan-x86_64-Darwin :: wcrtomb.c SanitizerCommon-tsan-x86_64-Darwin :: Darwin/fputs_puts_null.cpp SanitizerCommon-tsan-x86_64-Darwin :: Darwin/malloc_zone.cpp SanitizerCommon-tsan-x86_64-Darwin :: Darwin/print-stack-trace-in-code-loaded-after-fork.cpp SanitizerCommon-tsan-x86_64-Darwin :: Darwin/print-stack-trace.cpp SanitizerCommon-tsan-x86_64-Darwin :: Posix/arc4random.cpp SanitizerCommon-tsan-x86_64-Darwin :: Posix/devname.cpp SanitizerCommon-tsan-x86_64-Darwin :: Posix/devname_r.cpp SanitizerCommon-tsan-x86_64-Darwin :: Posix/dump_instruction_bytes.cpp SanitizerCommon-tsan-x86_64-Darwin :: Posix/fgetc_ungetc_getc.cpp SanitizerCommon-tsan-x86_64-Darwin :: Posix/fgetln.cpp SanitizerCommon-tsan-x86_64-Darwin :: Posix/fgets.cpp SanitizerCommon-tsan-x86_64-Darwin :: Posix/fpe.cpp SanitizerCommon-tsan-x86_64-Darwin :: Posix/fputc_putc_putchar.cpp SanitizerCommon-tsan-x86_64-Darwin :: Posix/fputs_puts.cpp SanitizerCommon-tsan-x86_64-Darwin :: Posix/getc_unlocked.cpp SanitizerCommon-tsan-x86_64-Darwin :: Posix/getmntinfo.cpp SanitizerCommon-tsan-x86_64-Darwin :: Posix/getpass.cpp SanitizerCommon-tsan-x86_64-Darwin :: Posix/getusershell.cpp SanitizerCommon-tsan-x86_64-Darwin :: Posix/illegal_read_test.cpp SanitizerCommon-tsan-x86_64-Darwin :: Posix/illegal_write_test.cpp SanitizerCommon-tsan-x86_64-Darwin :: Posix/popen.cpp SanitizerCommon-tsan-x86_64-Darwin :: Posix/posix_memalign-alignment.cpp SanitizerCommon-tsan-x86_64-Darwin :: Posix/putc_putchar_unlocked.cpp SanitizerCommon-tsan-x86_64-Darwin :: Posix/sanitizer_set_death_callback_test.cpp SanitizerCommon-tsan-x86_64-Darwin :: Posix/sanitizer_set_report_fd_test.cpp SanitizerCommon-tsan-x86_64-Darwin :: Posix/setvbuf.cpp SanitizerCommon-tsan-x86_64-Darwin :: Posix/sysctl.cpp SanitizerCommon-tsan-x86_64-Darwin :: allocator_returns_null.cpp SanitizerCommon-tsan-x86_64-Darwin :: ctype.c SanitizerCommon-tsan-x86_64-Darwin :: get_module_and_offset_for_pc.cpp SanitizerCommon-tsan-x86_64-Darwin :: malloc_hook.cpp SanitizerCommon-tsan-x86_64-Darwin :: max_allocation_size.cpp SanitizerCommon-tsan-x86_64-Darwin :: onprint.cpp SanitizerCommon-tsan-x86_64-Darwin :: sanitizer_coverage_inline8bit_counter.cpp SanitizerCommon-tsan-x86_64-Darwin :: sanitizer_coverage_no_prune.cpp SanitizerCommon-tsan-x86_64-Darwin :: sanitizer_coverage_stack_depth.cpp SanitizerCommon-tsan-x86_64-Darwin :: symbolize_pc.cpp SanitizerCommon-tsan-x86_64-Darwin :: symbolize_stack.cpp SanitizerCommon-ubsan-x86_64-Darwin :: Darwin/fputs_puts_null.cpp SanitizerCommon-ubsan-x86_64-Darwin :: Darwin/print-stack-trace-in-code-loaded-after-fork.cpp SanitizerCommon-ubsan-x86_64-Darwin :: Darwin/print-stack-trace.cpp SanitizerCommon-ubsan-x86_64-Darwin :: Posix/access.cpp SanitizerCommon-ubsan-x86_64-Darwin :: Posix/arc4random.cpp SanitizerCommon-ubsan-x86_64-Darwin :: Posix/dedup_token_length_test.cpp SanitizerCommon-ubsan-x86_64-Darwin :: Posix/devname.cpp SanitizerCommon-ubsan-x86_64-Darwin :: Posix/devname_r.cpp SanitizerCommon-ubsan-x86_64-Darwin :: Posix/dump_instruction_bytes.cpp SanitizerCommon-ubsan-x86_64-Darwin :: Posix/fgetln.cpp SanitizerCommon-ubsan-x86_64-Darwin :: Posix/fpe.cpp SanitizerCommon-ubsan-x86_64-Darwin :: Posix/fputc_putc_putchar.cpp SanitizerCommon-ubsan-x86_64-Darwin :: Posix/fputs_puts.cpp SanitizerCommon-ubsan-x86_64-Darwin :: Posix/getmntinfo.cpp SanitizerCommon-ubsan-x86_64-Darwin :: Posix/getpass.cpp SanitizerCommon-ubsan-x86_64-Darwin :: Posix/getusershell.cpp SanitizerCommon-ubsan-x86_64-Darwin :: Posix/illegal_read_test.cpp SanitizerCommon-ubsan-x86_64-Darwin :: Posix/illegal_write_test.cpp SanitizerCommon-ubsan-x86_64-Darwin :: Posix/popen.cpp SanitizerCommon-ubsan-x86_64-Darwin :: Posix/putc_putchar_unlocked.cpp SanitizerCommon-ubsan-x86_64-Darwin :: Posix/readlinkat.c SanitizerCommon-ubsan-x86_64-Darwin :: Posix/sanitizer_set_report_fd_test.cpp SanitizerCommon-ubsan-x86_64-Darwin :: Posix/setvbuf.cpp SanitizerCommon-ubsan-x86_64-Darwin :: Posix/strlcat.cpp SanitizerCommon-ubsan-x86_64-Darwin :: Posix/sysctl.cpp SanitizerCommon-ubsan-x86_64-Darwin :: ctype.c SanitizerCommon-ubsan-x86_64-Darwin :: get_module_and_offset_for_pc.cpp SanitizerCommon-ubsan-x86_64-Darwin :: options-help.cpp SanitizerCommon-ubsan-x86_64-Darwin :: options-include.cpp SanitizerCommon-ubsan-x86_64-Darwin :: printf-ldbl.c SanitizerCommon-ubsan-x86_64-Darwin :: pthread_mutexattr_get.cpp SanitizerCommon-ubsan-x86_64-Darwin :: sanitizer_coverage_inline8bit_counter.cpp SanitizerCommon-ubsan-x86_64-Darwin :: sanitizer_coverage_stack_depth.cpp SanitizerCommon-ubsan-x86_64-Darwin :: strnlen.c SanitizerCommon-ubsan-x86_64-Darwin :: symbolize_debug_argv.cpp SanitizerCommon-ubsan-x86_64-Darwin :: symbolize_pc.cpp SanitizerCommon-ubsan-x86_64-Darwin :: symbolize_stack.cpp SanitizerCommon-ubsan-x86_64-Darwin :: wcrtomb.c ThreadSanitizer-x86_64 :: Darwin/dlopen.cpp ThreadSanitizer-x86_64 :: Darwin/external-ignore-noninstrumented.cpp ThreadSanitizer-x86_64 :: Darwin/external-swift-debugging.cpp ThreadSanitizer-x86_64 :: Darwin/external.cpp ThreadSanitizer-x86_64 :: Darwin/gcd-sync-block-copy.mm ThreadSanitizer-x86_64 :: Darwin/libcxx-call-once.mm ThreadSanitizer-x86_64 :: Darwin/libcxx-future.mm ThreadSanitizer-x86_64 :: Darwin/libcxx-shared-ptr-recursive.mm ThreadSanitizer-x86_64 :: Darwin/libcxx-shared-ptr-stress.mm ThreadSanitizer-x86_64 :: Darwin/libcxx-shared-ptr.mm ThreadSanitizer-x86_64 :: Darwin/mach_vm_allocate.c ThreadSanitizer-x86_64 :: Darwin/malloc-stack-logging.cpp ThreadSanitizer-x86_64 :: Darwin/malloc_size.mm ThreadSanitizer-x86_64 :: Darwin/no_call_setenv_in_symbolize.cpp ThreadSanitizer-x86_64 :: Darwin/norace-objcxx-run-time.mm ThreadSanitizer-x86_64 :: Darwin/objc-double-property.mm ThreadSanitizer-x86_64 :: Darwin/objc-simple.mm ThreadSanitizer-x86_64 :: Darwin/objc-synchronize-cycle-tagged.mm ThreadSanitizer-x86_64 :: Darwin/objc-synchronize-tagged.mm ThreadSanitizer-x86_64 :: Darwin/objc-synchronize.mm ThreadSanitizer-x86_64 :: Darwin/os_unfair_lock.c ThreadSanitizer-x86_64 :: Darwin/osatomics-add.mm ThreadSanitizer-x86_64 :: Darwin/osatomics-bitops.mm ThreadSanitizer-x86_64 :: Darwin/osatomics-list.mm ThreadSanitizer-x86_64 :: Darwin/osspinlock-norace.cpp ThreadSanitizer-x86_64 :: Darwin/realloc-zero.cpp ThreadSanitizer-x86_64 :: Darwin/signals-blocked.cpp ThreadSanitizer-x86_64 :: Darwin/symbolizer-dladdr.cpp ThreadSanitizer-x86_64 :: Darwin/xpc-cancel.mm ThreadSanitizer-x86_64 :: Darwin/xpc-race.mm ThreadSanitizer-x86_64 :: Darwin/xpc.mm ThreadSanitizer-x86_64 :: aligned_vs_unaligned_race.cpp ThreadSanitizer-x86_64 :: annotate_happens_before.cpp ThreadSanitizer-x86_64 :: atexit.cpp ThreadSanitizer-x86_64 :: atexit2.cpp ThreadSanitizer-x86_64 :: atexit3.cpp ThreadSanitizer-x86_64 :: atomic_free.cpp ThreadSanitizer-x86_64 :: atomic_hle.cpp ThreadSanitizer-x86_64 :: atomic_norace.cpp ThreadSanitizer-x86_64 :: bench_shadow_flush.cpp ThreadSanitizer-x86_64 :: benign_race.cpp ThreadSanitizer-x86_64 :: blacklist.cpp ThreadSanitizer-x86_64 :: blacklist2.cpp ThreadSanitizer-x86_64 :: cond.c ThreadSanitizer-x86_64 :: cond_cancel.c ThreadSanitizer-x86_64 :: cond_destruction.cpp ThreadSanitizer-x86_64 :: custom_mutex0.cpp ThreadSanitizer-x86_64 :: custom_mutex1.cpp ThreadSanitizer-x86_64 :: custom_mutex4.cpp ThreadSanitizer-x86_64 :: custom_mutex5.cpp ThreadSanitizer-x86_64 :: cxa_guard_acquire.cpp ThreadSanitizer-x86_64 :: debug_locate.cpp ThreadSanitizer-x86_64 :: debugging.cpp ThreadSanitizer-x86_64 :: deep_stack1.cpp ThreadSanitizer-x86_64 :: default_options.cpp ThreadSanitizer-x86_64 :: dlclose.cpp ThreadSanitizer-x86_64 :: dtls.c ThreadSanitizer-x86_64 :: exceptions.cpp ThreadSanitizer-x86_64 :: fd_close_norace.cpp ThreadSanitizer-x86_64 :: fd_close_norace2.cpp ThreadSanitizer-x86_64 :: fd_dup_norace.cpp ThreadSanitizer-x86_64 :: fd_dup_norace2.cpp ThreadSanitizer-x86_64 :: fd_pipe_norace.cpp ThreadSanitizer-x86_64 :: fd_socket_connect_norace.cpp ThreadSanitizer-x86_64 :: fd_socket_norace.cpp ThreadSanitizer-x86_64 :: fd_socketpair_norace.cpp ThreadSanitizer-x86_64 :: fiber_asm.cpp ThreadSanitizer-x86_64 :: fiber_from_thread.cpp ThreadSanitizer-x86_64 :: fiber_longjmp.cpp ThreadSanitizer-x86_64 :: fiber_simple.cpp ThreadSanitizer-x86_64 :: fiber_two_threads.cpp ThreadSanitizer-x86_64 :: fork_multithreaded.cpp ThreadSanitizer-x86_64 :: fork_multithreaded3.cpp ThreadSanitizer-x86_64 :: global_race.cpp ThreadSanitizer-x86_64 :: global_race2.cpp ThreadSanitizer-x86_64 :: global_race3.cpp ThreadSanitizer-x86_64 :: ignore_free.cpp ThreadSanitizer-x86_64 :: ignore_malloc.cpp ThreadSanitizer-x86_64 :: ignore_race.cpp ThreadSanitizer-x86_64 :: ignored-interceptors-mmap.cpp ThreadSanitizer-x86_64 :: interface_atomic_test.c ThreadSanitizer-x86_64 :: java_alloc.cpp ThreadSanitizer-x86_64 :: java_finalizer.cpp ThreadSanitizer-x86_64 :: java_find.cpp ThreadSanitizer-x86_64 :: java_heap_init.cpp ThreadSanitizer-x86_64 :: java_lock.cpp ThreadSanitizer-x86_64 :: java_lock_move.cpp ThreadSanitizer-x86_64 :: java_lock_rec.cpp ThreadSanitizer-x86_64 :: java_move_overlap.cpp ThreadSanitizer-x86_64 :: java_race_pc.cpp ThreadSanitizer-x86_64 :: java_rwlock.cpp ThreadSanitizer-x86_64 :: java_symbolization.cpp ThreadSanitizer-x86_64 :: java_symbolization_legacy.cpp ThreadSanitizer-x86_64 :: java_volatile.cpp ThreadSanitizer-x86_64 :: large_malloc_meta.cpp ThreadSanitizer-x86_64 :: libcxx/std_shared_ptr.cpp ThreadSanitizer-x86_64 :: libdispatch/after.c ThreadSanitizer-x86_64 :: libdispatch/apply.c ThreadSanitizer-x86_64 :: libdispatch/async-norace.c ThreadSanitizer-x86_64 :: libdispatch/async-race.c ThreadSanitizer-x86_64 :: libdispatch/barrier-race.c ThreadSanitizer-x86_64 :: libdispatch/barrier.c ThreadSanitizer-x86_64 :: libdispatch/blocks.c ThreadSanitizer-x86_64 :: libdispatch/data.c ThreadSanitizer-x86_64 :: libdispatch/dispatch_main.c ThreadSanitizer-x86_64 :: libdispatch/dispatch_once_deadlock.c ThreadSanitizer-x86_64 :: libdispatch/fd.c ThreadSanitizer-x86_64 :: libdispatch/groups-destructor.cpp ThreadSanitizer-x86_64 :: libdispatch/groups-leave.c ThreadSanitizer-x86_64 :: libdispatch/groups-norace.c ThreadSanitizer-x86_64 :: libdispatch/groups-stress.c ThreadSanitizer-x86_64 :: libdispatch/io-barrier.c ThreadSanitizer-x86_64 :: libdispatch/io-cleanup.c ThreadSanitizer-x86_64 :: libdispatch/io.c ThreadSanitizer-x86_64 :: libdispatch/once.c ThreadSanitizer-x86_64 :: libdispatch/semaphore-norace.c ThreadSanitizer-x86_64 :: libdispatch/serial-queue-norace.c ThreadSanitizer-x86_64 :: libdispatch/source-cancel.c ThreadSanitizer-x86_64 :: libdispatch/source-cancel2.c ThreadSanitizer-x86_64 :: libdispatch/source-event.c ThreadSanitizer-x86_64 :: libdispatch/source-event2.c ThreadSanitizer-x86_64 :: libdispatch/source-registration.c ThreadSanitizer-x86_64 :: libdispatch/source-registration2.c ThreadSanitizer-x86_64 :: libdispatch/source-serial.c ThreadSanitizer-x86_64 :: libdispatch/suspend.c ThreadSanitizer-x86_64 :: libdispatch/sync-block-copy.cpp ThreadSanitizer-x86_64 :: libdispatch/sync-norace.c ThreadSanitizer-x86_64 :: libdispatch/target-queue-norace.c ThreadSanitizer-x86_64 :: longjmp.cpp ThreadSanitizer-x86_64 :: longjmp2.cpp ThreadSanitizer-x86_64 :: longjmp4.cpp ThreadSanitizer-x86_64 :: lots_of_threads.c ThreadSanitizer-x86_64 :: mmap_large.cpp ThreadSanitizer-x86_64 :: mmap_stress.cpp ThreadSanitizer-x86_64 :: mutex_annotations.cpp ThreadSanitizer-x86_64 :: mutex_cycle2.c ThreadSanitizer-x86_64 :: mutex_cycle_long.c ThreadSanitizer-x86_64 :: mutex_destroy_locked.cpp ThreadSanitizer-x86_64 :: mutex_destroy_locked2.cpp ThreadSanitizer-x86_64 :: mutex_lock_destroyed.cpp ThreadSanitizer-x86_64 :: mutexset1.cpp ThreadSanitizer-x86_64 :: mutexset2.cpp ThreadSanitizer-x86_64 :: mutexset3.cpp ThreadSanitizer-x86_64 :: mutexset4.cpp ThreadSanitizer-x86_64 :: mutexset5.cpp ThreadSanitizer-x86_64 :: mutexset6.cpp ThreadSanitizer-x86_64 :: printf-1.c ThreadSanitizer-x86_64 :: pthread_atfork_deadlock2.c ThreadSanitizer-x86_64 :: pthread_key.cpp ThreadSanitizer-x86_64 :: race_on_mutex.c ThreadSanitizer-x86_64 :: race_on_speculative_load.cpp ThreadSanitizer-x86_64 :: race_stress.cpp ThreadSanitizer-x86_64 :: real_deadlock_detector_stress_test.cpp ThreadSanitizer-x86_64 :: restore_stack.cpp ThreadSanitizer-x86_64 :: setuid.c ThreadSanitizer-x86_64 :: signal_block.cpp ThreadSanitizer-x86_64 :: signal_cond.cpp ThreadSanitizer-x86_64 :: signal_longjmp.cpp ThreadSanitizer-x86_64 :: signal_malloc.cpp ThreadSanitizer-x86_64 :: signal_pause.cpp ThreadSanitizer-x86_64 :: signal_write.cpp ThreadSanitizer-x86_64 :: sigsuspend.cpp ThreadSanitizer-x86_64 :: simple_race.cpp ThreadSanitizer-x86_64 :: simple_stack.c ThreadSanitizer-x86_64 :: simple_stack2.cpp ThreadSanitizer-x86_64 :: sleep_sync.cpp ThreadSanitizer-x86_64 :: stack_race2.cpp ThreadSanitizer-x86_64 :: stack_sync_reuse.cpp ThreadSanitizer-x86_64 :: static_init1.cpp ThreadSanitizer-x86_64 :: static_init2.cpp ThreadSanitizer-x86_64 :: static_init4.cpp ThreadSanitizer-x86_64 :: static_init5.cpp ThreadSanitizer-x86_64 :: static_init6.cpp ThreadSanitizer-x86_64 :: suppressions_race2.cpp ThreadSanitizer-x86_64 :: thread_detach.c ThreadSanitizer-x86_64 :: thread_detach2.c ThreadSanitizer-x86_64 :: thread_end_with_ignore.cpp ThreadSanitizer-x86_64 :: thread_end_with_ignore3.cpp ThreadSanitizer-x86_64 :: thread_exit.c ThreadSanitizer-x86_64 :: thread_leak.c ThreadSanitizer-x86_64 :: thread_leak2.c ThreadSanitizer-x86_64 :: thread_leak4.c ThreadSanitizer-x86_64 :: tls_race2.cpp ThreadSanitizer-x86_64 :: tsan-vs-gvn.cpp ThreadSanitizer-x86_64 :: unaligned_norace.cpp ThreadSanitizer-x86_64 :: vfork.cpp ThreadSanitizer-x86_64 :: virtual_inheritance_compile_bug.cpp ThreadSanitizer-x86_64 :: vptr_benign_race.cpp ThreadSanitizer-x86_64 :: vptr_harmful_race2.cpp ThreadSanitizer-x86_64 :: write_in_reader_lock.cpp UBSan-AddressSanitizer-x86_64 :: TestCases/Float/cast-overflow.cpp UBSan-AddressSanitizer-x86_64 :: TestCases/ImplicitConversion/integer-arithmetic-value-change.c UBSan-AddressSanitizer-x86_64 :: TestCases/ImplicitConversion/integer-conversion-incdec.c UBSan-AddressSanitizer-x86_64 :: TestCases/ImplicitConversion/integer-conversion.c UBSan-AddressSanitizer-x86_64 :: TestCases/ImplicitConversion/integer-sign-change-blacklist.c UBSan-AddressSanitizer-x86_64 :: TestCases/ImplicitConversion/integer-sign-change-incdec.c UBSan-AddressSanitizer-x86_64 :: TestCases/ImplicitConversion/integer-sign-change-summary.cpp UBSan-AddressSanitizer-x86_64 :: TestCases/ImplicitConversion/integer-sign-change.c UBSan-AddressSanitizer-x86_64 :: TestCases/ImplicitConversion/integer-truncation.c UBSan-AddressSanitizer-x86_64 :: TestCases/ImplicitConversion/signed-integer-truncation-blacklist.c UBSan-AddressSanitizer-x86_64 :: TestCases/ImplicitConversion/signed-integer-truncation-incdec.c UBSan-AddressSanitizer-x86_64 :: TestCases/ImplicitConversion/signed-integer-truncation-or-sign-change-blacklist.c UBSan-AddressSanitizer-x86_64 :: TestCases/ImplicitConversion/signed-integer-truncation-or-sign-change-summary.cpp UBSan-AddressSanitizer-x86_64 :: TestCases/ImplicitConversion/signed-integer-truncation-summary.cpp UBSan-AddressSanitizer-x86_64 :: TestCases/ImplicitConversion/signed-integer-truncation.c UBSan-AddressSanitizer-x86_64 :: TestCases/ImplicitConversion/unsigned-integer-truncation-blacklist.c UBSan-AddressSanitizer-x86_64 :: TestCases/ImplicitConversion/unsigned-integer-truncation-summary.cpp UBSan-AddressSanitizer-x86_64 :: TestCases/ImplicitConversion/unsigned-integer-truncation.c UBSan-AddressSanitizer-x86_64 :: TestCases/Integer/add-overflow.cpp UBSan-AddressSanitizer-x86_64 :: TestCases/Integer/div-overflow.cpp UBSan-AddressSanitizer-x86_64 :: TestCases/Integer/div-zero.cpp UBSan-AddressSanitizer-x86_64 :: TestCases/Integer/incdec-overflow.cpp UBSan-AddressSanitizer-x86_64 :: TestCases/Integer/mul-overflow.cpp UBSan-AddressSanitizer-x86_64 :: TestCases/Integer/negate-overflow.cpp UBSan-AddressSanitizer-x86_64 :: TestCases/Integer/no-recover.cpp UBSan-AddressSanitizer-x86_64 :: TestCases/Integer/shift.cpp UBSan-AddressSanitizer-x86_64 :: TestCases/Integer/sub-overflow.cpp UBSan-AddressSanitizer-x86_64 :: TestCases/Integer/summary.cpp UBSan-AddressSanitizer-x86_64 :: TestCases/Integer/suppressions.cpp UBSan-AddressSanitizer-x86_64 :: TestCases/Integer/uadd-overflow.cpp UBSan-AddressSanitizer-x86_64 :: TestCases/Integer/uincdec-overflow.cpp UBSan-AddressSanitizer-x86_64 :: TestCases/Integer/umul-overflow.cpp UBSan-AddressSanitizer-x86_64 :: TestCases/Integer/usub-overflow.cpp UBSan-AddressSanitizer-x86_64 :: TestCases/Misc/bool.cpp UBSan-AddressSanitizer-x86_64 :: TestCases/Misc/bool.m UBSan-AddressSanitizer-x86_64 :: TestCases/Misc/bounds.cpp UBSan-AddressSanitizer-x86_64 :: TestCases/Misc/builtins.cpp UBSan-AddressSanitizer-x86_64 :: TestCases/Misc/deduplication.cpp UBSan-AddressSanitizer-x86_64 :: TestCases/Misc/enum.cpp UBSan-AddressSanitizer-x86_64 :: TestCases/Misc/log-path_test.cpp UBSan-AddressSanitizer-x86_64 :: TestCases/Misc/missing_return.cpp UBSan-AddressSanitizer-x86_64 :: TestCases/Misc/monitor.cpp UBSan-AddressSanitizer-x86_64 :: TestCases/Misc/nonnull-arg.cpp UBSan-AddressSanitizer-x86_64 :: TestCases/Misc/nonnull.cpp UBSan-AddressSanitizer-x86_64 :: TestCases/Misc/nullability.c UBSan-AddressSanitizer-x86_64 :: TestCases/Misc/print_summary.c UBSan-AddressSanitizer-x86_64 :: TestCases/Misc/unreachable.cpp UBSan-AddressSanitizer-x86_64 :: TestCases/Misc/vla.c UBSan-AddressSanitizer-x86_64 :: TestCases/Pointer/alignment-assumption-attribute-align_value-on-lvalue.cpp UBSan-AddressSanitizer-x86_64 :: TestCases/Pointer/alignment-assumption-attribute-align_value-on-paramvar.cpp UBSan-AddressSanitizer-x86_64 :: TestCases/Pointer/alignment-assumption-attribute-alloc_align-on-function-variable.cpp UBSan-AddressSanitizer-x86_64 :: TestCases/Pointer/alignment-assumption-attribute-alloc_align-on-function.cpp UBSan-AddressSanitizer-x86_64 :: TestCases/Pointer/alignment-assumption-attribute-assume_aligned-on-function-two-params.cpp UBSan-AddressSanitizer-x86_64 :: TestCases/Pointer/alignment-assumption-attribute-assume_aligned-on-function.cpp UBSan-AddressSanitizer-x86_64 :: TestCases/Pointer/alignment-assumption-blacklist.cpp UBSan-AddressSanitizer-x86_64 :: TestCases/Pointer/alignment-assumption-builtin_assume_aligned-three-params-variable.cpp UBSan-AddressSanitizer-x86_64 :: TestCases/Pointer/alignment-assumption-builtin_assume_aligned-three-params.cpp UBSan-AddressSanitizer-x86_64 :: TestCases/Pointer/alignment-assumption-builtin_assume_aligned-two-params.cpp UBSan-AddressSanitizer-x86_64 :: TestCases/Pointer/alignment-assumption-openmp.cpp UBSan-AddressSanitizer-x86_64 :: TestCases/Pointer/alignment-assumption-summary.cpp UBSan-AddressSanitizer-x86_64 :: TestCases/Pointer/index-overflow.cpp UBSan-AddressSanitizer-x86_64 :: TestCases/Pointer/nullptr-and-nonzero-offset-constants.cpp UBSan-AddressSanitizer-x86_64 :: TestCases/Pointer/nullptr-and-nonzero-offset-summary.cpp UBSan-AddressSanitizer-x86_64 :: TestCases/Pointer/nullptr-and-nonzero-offset-variable.cpp UBSan-AddressSanitizer-x86_64 :: TestCases/Pointer/unsigned-index-expression.cpp UBSan-AddressSanitizer-x86_64 :: TestCases/TypeCheck/Function/function.cpp UBSan-AddressSanitizer-x86_64 :: TestCases/TypeCheck/PR33221.cpp UBSan-AddressSanitizer-x86_64 :: TestCases/TypeCheck/misaligned.cpp UBSan-AddressSanitizer-x86_64 :: TestCases/TypeCheck/null.cpp UBSan-AddressSanitizer-x86_64 :: TestCases/TypeCheck/vptr-corrupted-vtable-itanium.cpp UBSan-AddressSanitizer-x86_64 :: TestCases/TypeCheck/vptr-non-unique-typeinfo.cpp UBSan-AddressSanitizer-x86_64 :: TestCases/TypeCheck/vptr-virtual-base-construction.cpp UBSan-AddressSanitizer-x86_64 :: TestCases/TypeCheck/vptr-virtual-base.cpp UBSan-AddressSanitizer-x86_64 :: TestCases/TypeCheck/vptr.cpp UBSan-Minimal-x86_64 :: TestCases/alignment-assumption.c UBSan-Minimal-x86_64 :: TestCases/implicit-integer-sign-change.c UBSan-Minimal-x86_64 :: TestCases/implicit-signed-integer-truncation-or-sign-change.c UBSan-Minimal-x86_64 :: TestCases/implicit-signed-integer-truncation.c UBSan-Minimal-x86_64 :: TestCases/implicit-unsigned-integer-truncation.c UBSan-Minimal-x86_64 :: TestCases/nullptr-and-nonzero-offset.c UBSan-Minimal-x86_64 :: TestCases/recover-dedup-limit.cpp UBSan-Minimal-x86_64 :: TestCases/recover-dedup.cpp UBSan-Minimal-x86_64 :: TestCases/uadd-overflow.cpp UBSan-Standalone-x86_64 :: TestCases/Float/cast-overflow.cpp UBSan-Standalone-x86_64 :: TestCases/ImplicitConversion/integer-arithmetic-value-change.c UBSan-Standalone-x86_64 :: TestCases/ImplicitConversion/integer-conversion-incdec.c UBSan-Standalone-x86_64 :: TestCases/ImplicitConversion/integer-conversion.c UBSan-Standalone-x86_64 :: TestCases/ImplicitConversion/integer-sign-change-blacklist.c UBSan-Standalone-x86_64 :: TestCases/ImplicitConversion/integer-sign-change-incdec.c UBSan-Standalone-x86_64 :: TestCases/ImplicitConversion/integer-sign-change.c UBSan-Standalone-x86_64 :: TestCases/ImplicitConversion/integer-truncation.c UBSan-Standalone-x86_64 :: TestCases/ImplicitConversion/signed-integer-truncation-blacklist.c UBSan-Standalone-x86_64 :: TestCases/ImplicitConversion/signed-integer-truncation-incdec.c UBSan-Standalone-x86_64 :: TestCases/ImplicitConversion/signed-integer-truncation-or-sign-change-blacklist.c UBSan-Standalone-x86_64 :: TestCases/ImplicitConversion/signed-integer-truncation.c UBSan-Standalone-x86_64 :: TestCases/ImplicitConversion/unsigned-integer-truncation-blacklist.c UBSan-Standalone-x86_64 :: TestCases/ImplicitConversion/unsigned-integer-truncation.c UBSan-Standalone-x86_64 :: TestCases/Integer/add-overflow.cpp UBSan-Standalone-x86_64 :: TestCases/Integer/div-overflow.cpp UBSan-Standalone-x86_64 :: TestCases/Integer/div-zero.cpp UBSan-Standalone-x86_64 :: TestCases/Integer/incdec-overflow.cpp UBSan-Standalone-x86_64 :: TestCases/Integer/mul-overflow.cpp UBSan-Standalone-x86_64 :: TestCases/Integer/negate-overflow.cpp UBSan-Standalone-x86_64 :: TestCases/Integer/no-recover.cpp UBSan-Standalone-x86_64 :: TestCases/Integer/shift.cpp UBSan-Standalone-x86_64 :: TestCases/Integer/sub-overflow.cpp UBSan-Standalone-x86_64 :: TestCases/Integer/suppressions.cpp UBSan-Standalone-x86_64 :: TestCases/Integer/uadd-overflow.cpp UBSan-Standalone-x86_64 :: TestCases/Integer/uincdec-overflow.cpp UBSan-Standalone-x86_64 :: TestCases/Integer/umul-overflow.cpp UBSan-Standalone-x86_64 :: TestCases/Integer/usub-overflow.cpp UBSan-Standalone-x86_64 :: TestCases/Misc/bool.cpp UBSan-Standalone-x86_64 :: TestCases/Misc/bool.m UBSan-Standalone-x86_64 :: TestCases/Misc/bounds.cpp UBSan-Standalone-x86_64 :: TestCases/Misc/builtins.cpp UBSan-Standalone-x86_64 :: TestCases/Misc/coverage-levels.cpp UBSan-Standalone-x86_64 :: TestCases/Misc/deduplication.cpp UBSan-Standalone-x86_64 :: TestCases/Misc/enum.cpp UBSan-Standalone-x86_64 :: TestCases/Misc/log-path_test.cpp UBSan-Standalone-x86_64 :: TestCases/Misc/missing_return.cpp UBSan-Standalone-x86_64 :: TestCases/Misc/nonnull-arg.cpp UBSan-Standalone-x86_64 :: TestCases/Misc/nonnull.cpp UBSan-Standalone-x86_64 :: TestCases/Misc/nullability.c UBSan-Standalone-x86_64 :: TestCases/Misc/print_summary.c UBSan-Standalone-x86_64 :: TestCases/Misc/unreachable.cpp UBSan-Standalone-x86_64 :: TestCases/Misc/vla.c UBSan-Standalone-x86_64 :: TestCases/Pointer/alignment-assumption-attribute-align_value-on-lvalue.cpp UBSan-Standalone-x86_64 :: TestCases/Pointer/alignment-assumption-attribute-align_value-on-paramvar.cpp UBSan-Standalone-x86_64 :: TestCases/Pointer/alignment-assumption-attribute-alloc_align-on-function-variable.cpp UBSan-Standalone-x86_64 :: TestCases/Pointer/alignment-assumption-attribute-alloc_align-on-function.cpp UBSan-Standalone-x86_64 :: TestCases/Pointer/alignment-assumption-attribute-assume_aligned-on-function-two-params.cpp UBSan-Standalone-x86_64 :: TestCases/Pointer/alignment-assumption-attribute-assume_aligned-on-function.cpp UBSan-Standalone-x86_64 :: TestCases/Pointer/alignment-assumption-blacklist.cpp UBSan-Standalone-x86_64 :: TestCases/Pointer/alignment-assumption-builtin_assume_aligned-three-params-variable.cpp UBSan-Standalone-x86_64 :: TestCases/Pointer/alignment-assumption-builtin_assume_aligned-three-params.cpp UBSan-Standalone-x86_64 :: TestCases/Pointer/alignment-assumption-builtin_assume_aligned-two-params.cpp UBSan-Standalone-x86_64 :: TestCases/Pointer/alignment-assumption-openmp.cpp UBSan-Standalone-x86_64 :: TestCases/Pointer/index-overflow.cpp UBSan-Standalone-x86_64 :: TestCases/Pointer/nullptr-and-nonzero-offset-constants.cpp UBSan-Standalone-x86_64 :: TestCases/Pointer/nullptr-and-nonzero-offset-variable.cpp UBSan-Standalone-x86_64 :: TestCases/Pointer/unsigned-index-expression.cpp UBSan-Standalone-x86_64 :: TestCases/TypeCheck/Function/function.cpp UBSan-Standalone-x86_64 :: TestCases/TypeCheck/PR33221.cpp UBSan-Standalone-x86_64 :: TestCases/TypeCheck/misaligned.cpp UBSan-Standalone-x86_64 :: TestCases/TypeCheck/null.cpp UBSan-Standalone-x86_64 :: TestCases/TypeCheck/vptr-corrupted-vtable-itanium.cpp UBSan-Standalone-x86_64 :: TestCases/TypeCheck/vptr-non-unique-typeinfo.cpp UBSan-Standalone-x86_64 :: TestCases/TypeCheck/vptr-virtual-base-construction.cpp UBSan-Standalone-x86_64 :: TestCases/TypeCheck/vptr-virtual-base.cpp UBSan-Standalone-x86_64 :: TestCases/TypeCheck/vptr.cpp UBSan-StandaloneStatic-x86_64 :: TestCases/Float/cast-overflow.cpp UBSan-StandaloneStatic-x86_64 :: TestCases/ImplicitConversion/integer-arithmetic-value-change.c UBSan-StandaloneStatic-x86_64 :: TestCases/ImplicitConversion/integer-conversion-incdec.c UBSan-StandaloneStatic-x86_64 :: TestCases/ImplicitConversion/integer-conversion.c UBSan-StandaloneStatic-x86_64 :: TestCases/ImplicitConversion/integer-sign-change-blacklist.c UBSan-StandaloneStatic-x86_64 :: TestCases/ImplicitConversion/integer-sign-change-incdec.c UBSan-StandaloneStatic-x86_64 :: TestCases/ImplicitConversion/integer-sign-change.c UBSan-StandaloneStatic-x86_64 :: TestCases/ImplicitConversion/integer-truncation.c UBSan-StandaloneStatic-x86_64 :: TestCases/ImplicitConversion/signed-integer-truncation-blacklist.c UBSan-StandaloneStatic-x86_64 :: TestCases/ImplicitConversion/signed-integer-truncation-incdec.c UBSan-StandaloneStatic-x86_64 :: TestCases/ImplicitConversion/signed-integer-truncation-or-sign-change-blacklist.c UBSan-StandaloneStatic-x86_64 :: TestCases/ImplicitConversion/signed-integer-truncation.c UBSan-StandaloneStatic-x86_64 :: TestCases/ImplicitConversion/unsigned-integer-truncation-blacklist.c UBSan-StandaloneStatic-x86_64 :: TestCases/ImplicitConversion/unsigned-integer-truncation.c UBSan-StandaloneStatic-x86_64 :: TestCases/Integer/add-overflow.cpp UBSan-StandaloneStatic-x86_64 :: TestCases/Integer/div-zero.cpp UBSan-StandaloneStatic-x86_64 :: TestCases/Integer/incdec-overflow.cpp UBSan-StandaloneStatic-x86_64 :: TestCases/Integer/mul-overflow.cpp UBSan-StandaloneStatic-x86_64 :: TestCases/Integer/negate-overflow.cpp UBSan-StandaloneStatic-x86_64 :: TestCases/Integer/no-recover.cpp UBSan-StandaloneStatic-x86_64 :: TestCases/Integer/shift.cpp UBSan-StandaloneStatic-x86_64 :: TestCases/Integer/sub-overflow.cpp UBSan-StandaloneStatic-x86_64 :: TestCases/Integer/suppressions.cpp UBSan-StandaloneStatic-x86_64 :: TestCases/Integer/uadd-overflow.cpp UBSan-StandaloneStatic-x86_64 :: TestCases/Integer/uincdec-overflow.cpp UBSan-StandaloneStatic-x86_64 :: TestCases/Integer/umul-overflow.cpp UBSan-StandaloneStatic-x86_64 :: TestCases/Integer/usub-overflow.cpp UBSan-StandaloneStatic-x86_64 :: TestCases/Misc/bool.cpp UBSan-StandaloneStatic-x86_64 :: TestCases/Misc/bool.m UBSan-StandaloneStatic-x86_64 :: TestCases/Misc/bounds.cpp UBSan-StandaloneStatic-x86_64 :: TestCases/Misc/builtins.cpp UBSan-StandaloneStatic-x86_64 :: TestCases/Misc/deduplication.cpp UBSan-StandaloneStatic-x86_64 :: TestCases/Misc/enum.cpp UBSan-StandaloneStatic-x86_64 :: TestCases/Misc/log-path_test.cpp UBSan-StandaloneStatic-x86_64 :: TestCases/Misc/missing_return.cpp UBSan-StandaloneStatic-x86_64 :: TestCases/Misc/monitor.cpp UBSan-StandaloneStatic-x86_64 :: TestCases/Misc/nonnull-arg.cpp UBSan-StandaloneStatic-x86_64 :: TestCases/Misc/nonnull.cpp UBSan-StandaloneStatic-x86_64 :: TestCases/Misc/nullability.c UBSan-StandaloneStatic-x86_64 :: TestCases/Misc/print_summary.c UBSan-StandaloneStatic-x86_64 :: TestCases/Misc/unreachable.cpp UBSan-StandaloneStatic-x86_64 :: TestCases/Misc/vla.c UBSan-StandaloneStatic-x86_64 :: TestCases/Pointer/alignment-assumption-attribute-align_value-on-lvalue.cpp UBSan-StandaloneStatic-x86_64 :: TestCases/Pointer/alignment-assumption-attribute-align_value-on-paramvar.cpp UBSan-StandaloneStatic-x86_64 :: TestCases/Pointer/alignment-assumption-attribute-alloc_align-on-function-variable.cpp UBSan-StandaloneStatic-x86_64 :: TestCases/Pointer/alignment-assumption-attribute-alloc_align-on-function.cpp UBSan-StandaloneStatic-x86_64 :: TestCases/Pointer/alignment-assumption-attribute-assume_aligned-on-function-two-params.cpp UBSan-StandaloneStatic-x86_64 :: TestCases/Pointer/alignment-assumption-attribute-assume_aligned-on-function.cpp UBSan-StandaloneStatic-x86_64 :: TestCases/Pointer/alignment-assumption-blacklist.cpp UBSan-StandaloneStatic-x86_64 :: TestCases/Pointer/alignment-assumption-builtin_assume_aligned-three-params-variable.cpp UBSan-StandaloneStatic-x86_64 :: TestCases/Pointer/alignment-assumption-builtin_assume_aligned-three-params.cpp UBSan-StandaloneStatic-x86_64 :: TestCases/Pointer/alignment-assumption-builtin_assume_aligned-two-params.cpp UBSan-StandaloneStatic-x86_64 :: TestCases/Pointer/alignment-assumption-openmp.cpp UBSan-StandaloneStatic-x86_64 :: TestCases/Pointer/index-overflow.cpp UBSan-StandaloneStatic-x86_64 :: TestCases/Pointer/nullptr-and-nonzero-offset-constants.cpp UBSan-StandaloneStatic-x86_64 :: TestCases/Pointer/nullptr-and-nonzero-offset-variable.cpp UBSan-StandaloneStatic-x86_64 :: TestCases/TypeCheck/Function/function.cpp UBSan-StandaloneStatic-x86_64 :: TestCases/TypeCheck/PR33221.cpp UBSan-StandaloneStatic-x86_64 :: TestCases/TypeCheck/misaligned.cpp UBSan-StandaloneStatic-x86_64 :: TestCases/TypeCheck/null.cpp UBSan-StandaloneStatic-x86_64 :: TestCases/TypeCheck/vptr-corrupted-vtable-itanium.cpp UBSan-StandaloneStatic-x86_64 :: TestCases/TypeCheck/vptr-non-unique-typeinfo.cpp UBSan-StandaloneStatic-x86_64 :: TestCases/TypeCheck/vptr-virtual-base-construction.cpp UBSan-StandaloneStatic-x86_64 :: TestCases/TypeCheck/vptr-virtual-base.cpp UBSan-StandaloneStatic-x86_64 :: TestCases/TypeCheck/vptr.cpp UBSan-ThreadSanitizer-x86_64 :: TestCases/Float/cast-overflow.cpp UBSan-ThreadSanitizer-x86_64 :: TestCases/ImplicitConversion/integer-arithmetic-value-change.c UBSan-ThreadSanitizer-x86_64 :: TestCases/ImplicitConversion/integer-conversion-incdec.c UBSan-ThreadSanitizer-x86_64 :: TestCases/ImplicitConversion/integer-conversion.c UBSan-ThreadSanitizer-x86_64 :: TestCases/ImplicitConversion/integer-sign-change-blacklist.c UBSan-ThreadSanitizer-x86_64 :: TestCases/ImplicitConversion/integer-sign-change-incdec.c UBSan-ThreadSanitizer-x86_64 :: TestCases/ImplicitConversion/integer-sign-change-summary.cpp UBSan-ThreadSanitizer-x86_64 :: TestCases/ImplicitConversion/integer-sign-change.c UBSan-ThreadSanitizer-x86_64 :: TestCases/ImplicitConversion/integer-truncation.c UBSan-ThreadSanitizer-x86_64 :: TestCases/ImplicitConversion/signed-integer-truncation-blacklist.c UBSan-ThreadSanitizer-x86_64 :: TestCases/ImplicitConversion/signed-integer-truncation-incdec.c UBSan-ThreadSanitizer-x86_64 :: TestCases/ImplicitConversion/signed-integer-truncation-or-sign-change-blacklist.c UBSan-ThreadSanitizer-x86_64 :: TestCases/ImplicitConversion/signed-integer-truncation-or-sign-change-summary.cpp UBSan-ThreadSanitizer-x86_64 :: TestCases/ImplicitConversion/signed-integer-truncation-summary.cpp UBSan-ThreadSanitizer-x86_64 :: TestCases/ImplicitConversion/signed-integer-truncation.c UBSan-ThreadSanitizer-x86_64 :: TestCases/ImplicitConversion/unsigned-integer-truncation-blacklist.c UBSan-ThreadSanitizer-x86_64 :: TestCases/ImplicitConversion/unsigned-integer-truncation-summary.cpp UBSan-ThreadSanitizer-x86_64 :: TestCases/ImplicitConversion/unsigned-integer-truncation.c UBSan-ThreadSanitizer-x86_64 :: TestCases/Integer/add-overflow.cpp UBSan-ThreadSanitizer-x86_64 :: TestCases/Integer/div-overflow.cpp UBSan-ThreadSanitizer-x86_64 :: TestCases/Integer/div-zero.cpp UBSan-ThreadSanitizer-x86_64 :: TestCases/Integer/incdec-overflow.cpp UBSan-ThreadSanitizer-x86_64 :: TestCases/Integer/mul-overflow.cpp UBSan-ThreadSanitizer-x86_64 :: TestCases/Integer/negate-overflow.cpp UBSan-ThreadSanitizer-x86_64 :: TestCases/Integer/no-recover.cpp UBSan-ThreadSanitizer-x86_64 :: TestCases/Integer/shift.cpp UBSan-ThreadSanitizer-x86_64 :: TestCases/Integer/sub-overflow.cpp UBSan-ThreadSanitizer-x86_64 :: TestCases/Integer/uadd-overflow.cpp UBSan-ThreadSanitizer-x86_64 :: TestCases/Integer/uincdec-overflow.cpp UBSan-ThreadSanitizer-x86_64 :: TestCases/Misc/bool.cpp UBSan-ThreadSanitizer-x86_64 :: TestCases/Misc/missing_return.cpp UBSan-ThreadSanitizer-x86_64 :: TestCases/Misc/nonnull-arg.cpp UBSan-ThreadSanitizer-x86_64 :: TestCases/Misc/nonnull.cpp UBSan-ThreadSanitizer-x86_64 :: TestCases/Misc/nullability.c UBSan-ThreadSanitizer-x86_64 :: TestCases/Misc/print_summary.c UBSan-ThreadSanitizer-x86_64 :: TestCases/Misc/unreachable.cpp UBSan-ThreadSanitizer-x86_64 :: TestCases/Misc/vla.c UBSan-ThreadSanitizer-x86_64 :: TestCases/Pointer/alignment-assumption-attribute-align_value-on-lvalue.cpp UBSan-ThreadSanitizer-x86_64 :: TestCases/Pointer/alignment-assumption-attribute-align_value-on-paramvar.cpp UBSan-ThreadSanitizer-x86_64 :: TestCases/Pointer/alignment-assumption-attribute-alloc_align-on-function-variable.cpp UBSan-ThreadSanitizer-x86_64 :: TestCases/Pointer/alignment-assumption-attribute-alloc_align-on-function.cpp UBSan-ThreadSanitizer-x86_64 :: TestCases/Pointer/alignment-assumption-attribute-assume_aligned-on-function-two-params.cpp UBSan-ThreadSanitizer-x86_64 :: TestCases/Pointer/alignment-assumption-attribute-assume_aligned-on-function.cpp UBSan-ThreadSanitizer-x86_64 :: TestCases/Pointer/alignment-assumption-blacklist.cpp UBSan-ThreadSanitizer-x86_64 :: TestCases/Pointer/alignment-assumption-builtin_assume_aligned-three-params-variable.cpp UBSan-ThreadSanitizer-x86_64 :: TestCases/Pointer/alignment-assumption-builtin_assume_aligned-three-params.cpp UBSan-ThreadSanitizer-x86_64 :: TestCases/Pointer/alignment-assumption-builtin_assume_aligned-two-params.cpp UBSan-ThreadSanitizer-x86_64 :: TestCases/Pointer/alignment-assumption-openmp.cpp UBSan-ThreadSanitizer-x86_64 :: TestCases/Pointer/alignment-assumption-summary.cpp UBSan-ThreadSanitizer-x86_64 :: TestCases/Pointer/index-overflow.cpp UBSan-ThreadSanitizer-x86_64 :: TestCases/Pointer/nullptr-and-nonzero-offset-constants.cpp UBSan-ThreadSanitizer-x86_64 :: TestCases/Pointer/nullptr-and-nonzero-offset-summary.cpp UBSan-ThreadSanitizer-x86_64 :: TestCases/Pointer/nullptr-and-nonzero-offset-variable.cpp UBSan-ThreadSanitizer-x86_64 :: TestCases/Pointer/unsigned-index-expression.cpp UBSan-ThreadSanitizer-x86_64 :: TestCases/TypeCheck/Function/function.cpp UBSan-ThreadSanitizer-x86_64 :: TestCases/TypeCheck/PR33221.cpp UBSan-ThreadSanitizer-x86_64 :: TestCases/TypeCheck/misaligned.cpp UBSan-ThreadSanitizer-x86_64 :: TestCases/TypeCheck/null.cpp UBSan-ThreadSanitizer-x86_64 :: TestCases/TypeCheck/vptr-corrupted-vtable-itanium.cpp UBSan-ThreadSanitizer-x86_64 :: TestCases/TypeCheck/vptr-non-unique-typeinfo.cpp UBSan-ThreadSanitizer-x86_64 :: TestCases/TypeCheck/vptr-virtual-base.cpp UBSan-ThreadSanitizer-x86_64 :: TestCases/TypeCheck/vptr.cpp cfi-devirt-x86_64 :: anon-namespace.cpp cfi-devirt-x86_64 :: bad-cast.cpp cfi-devirt-x86_64 :: base-derived-destructor.cpp cfi-devirt-x86_64 :: create-derivers.test cfi-devirt-x86_64 :: cross-dso-diagnostic.cpp cfi-devirt-x86_64 :: icall/bad-signature.c cfi-devirt-x86_64 :: mfcall.cpp cfi-devirt-x86_64 :: multiple-inheritance.cpp cfi-devirt-x86_64 :: multiple-inheritance2.cpp cfi-devirt-x86_64 :: nvcall.cpp cfi-devirt-x86_64 :: overwrite.cpp cfi-devirt-x86_64 :: simple-fail.cpp cfi-devirt-x86_64 :: target_uninstrumented.cpp cfi-devirt-x86_64 :: vdtor.cpp cfi-standalone-x86_64 :: anon-namespace.cpp cfi-standalone-x86_64 :: bad-cast.cpp cfi-standalone-x86_64 :: bad-split.cpp cfi-standalone-x86_64 :: base-derived-destructor.cpp cfi-standalone-x86_64 :: create-derivers.test cfi-standalone-x86_64 :: cross-dso-diagnostic.cpp cfi-standalone-x86_64 :: icall/bad-signature.c cfi-standalone-x86_64 :: mfcall.cpp cfi-standalone-x86_64 :: multiple-inheritance.cpp cfi-standalone-x86_64 :: multiple-inheritance2.cpp cfi-standalone-x86_64 :: nvcall.cpp cfi-standalone-x86_64 :: overwrite.cpp cfi-standalone-x86_64 :: simple-fail.cpp cfi-standalone-x86_64 :: stats.cpp cfi-standalone-x86_64 :: target_uninstrumented.cpp cfi-standalone-x86_64 :: vdtor.cpp libFuzzer :: acquire-crash-state.test libFuzzer :: bogus-initialize.test libFuzzer :: buffer-overflow-on-input.test libFuzzer :: caller-callee.test libFuzzer :: counters.test libFuzzer :: coverage.test libFuzzer :: cxxstring.test libFuzzer :: dead-stripping.test libFuzzer :: deprecated-instrumentation.test libFuzzer :: dso.test libFuzzer :: exit-report.test libFuzzer :: exit_on_src_pos.test libFuzzer :: fuzzer-alignment-assumption.test libFuzzer :: fuzzer-customcrossover.test libFuzzer :: fuzzer-custommutator.test libFuzzer :: fuzzer-dict.test libFuzzer :: fuzzer-dirs.test libFuzzer :: fuzzer-fdmask.test libFuzzer :: fuzzer-finalstats.test libFuzzer :: fuzzer-flags.test libFuzzer :: fuzzer-implicit-integer-sign-change.test libFuzzer :: fuzzer-implicit-signed-integer-truncation-or-sign-change.test libFuzzer :: fuzzer-implicit-signed-integer-truncation.test libFuzzer :: fuzzer-implicit-unsigned-integer-truncation.test libFuzzer :: fuzzer-oom.test libFuzzer :: fuzzer-printcovpcs.test libFuzzer :: fuzzer-runs.test libFuzzer :: fuzzer-seed.test libFuzzer :: fuzzer-segv.test libFuzzer :: fuzzer-singleinputs.test libFuzzer :: fuzzer-threaded.test libFuzzer :: fuzzer-timeout.test libFuzzer :: fuzzer-ubsan.test libFuzzer :: initialize.test libFuzzer :: len_control.test libFuzzer :: max-number-of-runs.test libFuzzer :: memcmp.test libFuzzer :: memcmp64.test libFuzzer :: merge-control-file.test libFuzzer :: merge-posix.test libFuzzer :: merge.test 22 warning(s) in tests

Hide Details

libFuzzer :: merge_two_step.test libFuzzer :: minimize_crash.test libFuzzer :: minimize_two_crashes.test libFuzzer :: not-instrumented.test libFuzzer :: null-deref-on-empty.test libFuzzer :: null-deref.test libFuzzer :: overwrite-input.test libFuzzer :: read-binary.test libFuzzer :: recommended-dictionary.test libFuzzer :: reduce_inputs.test libFuzzer :: reload.test libFuzzer :: repeated-bytes.test libFuzzer :: seed_inputs.test libFuzzer :: shrink.test libFuzzer :: simple.test libFuzzer :: standalone.test libFuzzer :: strcmp.test libFuzzer :: strncmp.test libFuzzer :: strstr.test libFuzzer :: swap-cmp.test libFuzzer :: three-bytes.test libFuzzer :: trace-malloc.test libFuzzer :: ulimit.test libFuzzer :: value-profile-cmp.test libFuzzer :: value-profile-cmp2.test libFuzzer :: value-profile-cmp3.test libFuzzer :: value-profile-cmp4.test libFuzzer :: value-profile-div.test libFuzzer :: value-profile-load.test libFuzzer :: value-profile-mem.test libFuzzer :: value-profile-set.test libFuzzer :: value-profile-strcmp.test libFuzzer :: value-profile-strncmp.test libFuzzer :: value-profile-switch.test

Hide Details

Hide Details

Testing Time: 670.59s Unsupported Tests : 873 Expected Passes : 1133 Expected Failures : 31 Unexpected Failures: 954 FAILED: test/CMakeFiles/check-compiler-rt cd /Users/buildslave/jenkins/workspace/clang-stage1-RA/clang-build/tools/clang/runtime/compiler-rt-bins/test && /usr/local/Frameworks/Python.framework/Versions/3.6/bin/python3.6 /Users/buildslave/jenkins/workspace/clang-stage1-RA/clang-build/./bin/llvm-lit --xunit-xml-output=testresults.xunit.xml -v --timeout=600 /Users/buildslave/jenkins/workspace/clang-stage1-RA/clang-build/tools/clang/runtime/compiler-rt-bins/test/builtins/TestCases /Users/buildslave/jenkins/workspace/clang-stage1-RA/clang-build/tools/clang/runtime/compiler-rt-bins/test/builtins/Unit/X86_64DarwinConfig /Users/buildslave/jenkins/workspace/clang-stage1-RA/clang-build/tools/clang/runtime/compiler-rt-bins/test/lsan/X86_64LsanConfig /Users/buildslave/jenkins/workspace/clang-stage1-RA/clang-build/tools/clang/runtime/compiler-rt-bins/test/lsan/X86_64AsanConfig /Users/buildslave/jenkins/workspace/clang-stage1-RA/clang-build/tools/clang/runtime/compiler-rt-bins/test/ubsan/Standalone-x86_64 /Users/buildslave/jenkins/workspace/clang-stage1-RA/clang-build/tools/clang/runtime/compiler-rt-bins/test/ubsan/AddressSanitizer-x86_64 /Users/buildslave/jenkins/workspace/clang-stage1-RA/clang-build/tools/clang/runtime/compiler-rt-bins/test/ubsan/ThreadSanitizer-x86_64 /Users/buildslave/jenkins/workspace/clang-stage1-RA/clang-build/tools/clang/runtime/compiler-rt-bins/test/ubsan/StandaloneStatic-x86_64 /Users/buildslave/jenkins/workspace/clang-stage1-RA/clang-build/tools/clang/runtime/compiler-rt-bins/test/cfi/Standalone-x86_64 /Users/buildslave/jenkins/workspace/clang-stage1-RA/clang-build/tools/clang/runtime/compiler-rt-bins/test/cfi/Devirt-x86_64 /Users/buildslave/jenkins/workspace/clang-stage1-RA/clang-build/tools/clang/runtime/compiler-rt-bins/test/sanitizer_common/asan-x86_64-Darwin /Users/buildslave/jenkins/workspace/clang-stage1-RA/clang-build/tools/clang/runtime/compiler-rt-bins/test/sanitizer_common/lsan-x86_64-Darwin /Users/buildslave/jenkins/workspace/clang-stage1-RA/clang-build/tools/clang/runtime/compiler-rt-bins/test/sanitizer_common/tsan-x86_64-Darwin /Users/buildslave/jenkins/workspace/clang-stage1-RA/clang-build/tools/clang/runtime/compiler-rt-bins/test/sanitizer_common/ubsan-x86_64-Darwin /Users/buildslave/jenkins/workspace/clang-stage1-RA/clang-build/tools/clang/runtime/compiler-rt-bins/test/sanitizer_common/Unit /Users/buildslave/jenkins/workspace/clang-stage1-RA/clang-build/tools/clang/runtime/compiler-rt-bins/test/fuzzer/unit /Users/buildslave/jenkins/workspace/clang-stage1-RA/clang-build/tools/clang/runtime/compiler-rt-bins/test/fuzzer/X86_64DefaultDarwinConfig/ /Users/buildslave/jenkins/workspace/clang-stage1-RA/clang-build/tools/clang/runtime/compiler-rt-bins/test/asan/X86_64DarwinConfig /Users/buildslave/jenkins/workspace/clang-stage1-RA/clang-build/tools/clang/runtime/compiler-rt-bins/test/asan/Unit /Users/buildslave/jenkins/workspace/clang-stage1-RA/clang-build/tools/clang/runtime/compiler-rt-bins/test/tsan/X86_64Config /Users/buildslave/jenkins/workspace/clang-stage1-RA/clang-build/tools/clang/runtime/compiler-rt-bins/test/tsan/Unit /Users/buildslave/jenkins/workspace/clang-stage1-RA/clang-build/tools/clang/runtime/compiler-rt-bins/test/ubsan_minimal/x86_64 /Users/buildslave/jenkins/workspace/clang-stage1-RA/clang-build/tools/clang/runtime/compiler-rt-bins/test/profile/Profile-x86_64 /Users/buildslave/jenkins/workspace/clang-stage1-RA/clang-build/tools/clang/runtime/compiler-rt-bins/test/xray/X86_64DarwinConfig /Users/buildslave/jenkins/workspace/clang-stage1-RA/clang-build/tools/clang/runtime/compiler-rt-bins/test/xray/X86_64HDarwinConfig /Users/buildslave/jenkins/workspace/clang-stage1-RA/clang-build/tools/clang/runtime/compiler-rt-bins/test/shadowcallstack/arm64 ninja: build stopped: subcommand failed. [257/760] cd /Users/buildslave/jenkins/workspace/clang-stage1-RA/llvm-project/clang/bindings/python && /usr/local/Cellar/cmake/3.17.2/bin/cmake -E env CLANG_LIBRARY_PATH=/Users/buildslave/jenkins/workspace/clang-stage1-RA/clang-build/lib /usr/local/Frameworks/Python.framework/Versions/3.6/bin/python3.6 -m unittest discover ........................................................./Users/buildslave/jenkins/workspace/clang-stage1-RA/llvm-project/clang/bindings/python/tests/cindex/test_diagnostics.py:101: DeprecationWarning: Please use assertRegex instead. '.*declared here') ..................................................................... ---------------------------------------------------------------------- Ran 126 tests in 0.668s

Hide Details

OK [758/760] : && /Applications/Xcode.app/Contents/Developer/Toolchains/XcodeDefault.xctoolchain/usr/bin/c++ -fPIC -fvisibility-inlines-hidden -Werror=date-time -Werror=unguarded-availability-new -Wall -Wextra -Wno-unused-parameter -Wwrite-strings -Wcast-qual -Wmissing-field-initializers -pedantic -Wno-long-long -Wimplicit-fallthrough -Wcovered-switch-default -Wno-noexcept-type -Wnon-virtual-dtor -Wdelete-non-virtual-dtor -Wstring-conversion -fdiagnostics-color -O2 -g -isysroot /Applications/Xcode.app/Contents/Developer/Platforms/MacOSX.platform/Developer/SDKs/MacOSX10.14.sdk -mmacosx-version-min=10.9 -Wl,-search_paths_first -Wl,-headerpad_max_install_names -Wl,-dead_strip unittests/tools/llvm-exegesis/Mips/CMakeFiles/LLVMExegesisMipsTests.dir/BenchmarkResultTest.cpp.o unittests/tools/llvm-exegesis/Mips/CMakeFiles/LLVMExegesisMipsTests.dir/RegisterAliasingTest.cpp.o unittests/tools/llvm-exegesis/Mips/CMakeFiles/LLVMExegesisMipsTests.dir/SnippetGeneratorTest.cpp.o unittests/tools/llvm-exegesis/Mips/CMakeFiles/LLVMExegesisMipsTests.dir/TargetTest.cpp.o -o unittests/tools/llvm-exegesis/Mips/LLVMExegesisMipsTests lib/libLLVMMC.a lib/libLLVMMCParser.a lib/libLLVMObject.a lib/libLLVMSupport.a lib/libLLVMSymbolize.a lib/libLLVMMipsCodeGen.a lib/libLLVMMipsAsmParser.a lib/libLLVMMipsDesc.a lib/libLLVMMipsDisassembler.a lib/libLLVMMipsInfo.a lib/libLLVMSupport.a lib/libgtest_main.a lib/libgtest.a lib/libLLVMExegesis.a lib/libLLVMExegesisMips.a lib/libLLVMDebugInfoPDB.a -lpthread lib/libLLVMMipsCodeGen.a lib/libLLVMAsmPrinter.a lib/libLLVMDebugInfoDWARF.a lib/libLLVMMipsAsmParser.a lib/libLLVMMipsDesc.a lib/libLLVMMipsDisassembler.a lib/libLLVMMipsInfo.a lib/libLLVMExegesis.a lib/libLLVMGlobalISel.a lib/libLLVMSelectionDAG.a lib/libLLVMCodeGen.a lib/libLLVMBitWriter.a lib/libLLVMScalarOpts.a lib/libLLVMAggressiveInstCombine.a lib/libLLVMInstCombine.a lib/libLLVMTransformUtils.a lib/libLLVMMCDisassembler.a lib/libLLVMMCJIT.a lib/libLLVMExecutionEngine.a lib/libLLVMTarget.a lib/libLLVMAnalysis.a lib/libLLVMProfileData.a lib/libLLVMRuntimeDyld.a lib/libLLVMObjectYAML.a lib/libLLVMObject.a lib/libLLVMMCParser.a lib/libLLVMMC.a lib/libLLVMBitReader.a lib/libLLVMCore.a lib/libLLVMRemarks.a lib/libLLVMBitstreamReader.a lib/libLLVMTextAPI.a lib/libLLVMBinaryFormat.a lib/libLLVMDebugInfoCodeView.a lib/libLLVMDebugInfoMSF.a lib/libLLVMSupport.a -lz -lcurses -lm lib/libLLVMDemangle.a && : FAILED: tools/clang/runtime/CMakeFiles/check-compiler-rt cd /Users/buildslave/jenkins/workspace/clang-stage1-RA/clang-build/tools/clang/runtime/compiler-rt-bins && /usr/local/Cellar/cmake/3.17.2/bin/cmake --build . --target check-all --config RelWithDebInfo ninja: build stopped: cannot make progress due to previous errors. Command failed: Command '['/usr/local/bin/ninja', '-v', '-k', '0', 'check-all']' returned non-zero exit status 1 Command: ['/usr/local/bin/ninja', '-v', '-k', '0', 'check-all'] [Pipeline] } [Pipeline] // timeout [Pipeline] } [Pipeline] // stage [Pipeline] stage [Pipeline] { (Declarative: Post Actions) [Pipeline] scanForIssues [Clang (LLVM based)] Sleeping for 5 seconds due to JENKINS-32191... [Clang (LLVM based)] Parsing console log (workspace: '/Users/buildslave/jenkins/workspace/clang-stage1-RA') [Clang (LLVM based)] Successfully parsed console log [Clang (LLVM based)] -> found 92 issues (skipped 106 duplicates) [Clang (LLVM based)] [-ERROR-] Can't create fingerprints for some files: [Clang (LLVM based)] [-ERROR-] - '/tmp/gotsan.bnRfE1aKaH/gotsan.cpp', IO exception has been thrown: java.nio.file.NoSuchFileException: /tmp/gotsan.bnRfE1aKaH/gotsan.cpp [Clang (LLVM based)] [-ERROR-] - '/Users/buildslave/jenkins/workspace/clang-stage1-RA/clang-build/tools/clang/runtime/compiler-rt-bins/llvm-lit: /Users/buildslave/jenkins/workspace/clang-stage1-RA/llvm-project/compiler-rt/test/lit.common.cfg.py', IO exception has been thrown: java.nio.file.NoSuchFileException: /Users/buildslave/jenkins/workspace/clang-stage1-RA/clang-build/tools/clang/runtime/compiler-rt-bins/llvm-lit: /Users/buildslave/jenkins/workspace/clang-stage1-RA/llvm-project/compiler-rt/test/lit.common.cfg.py [Clang (LLVM based)] [-ERROR-] - '/Users/buildslave/jenkins/workspace/clang-stage1-RA/clang-build/tools/clang/runtime/compiler-rt-bins/<inline asm>', IO exception has been thrown: java.nio.file.NoSuchFileException: /Users/buildslave/jenkins/workspace/clang-stage1-RA/clang-build/tools/clang/runtime/compiler-rt-bins/<inline asm> [Clang (LLVM based)] [-ERROR-] - '/Users/buildslave/jenkins/workspace/clang-stage1-RA/clang-build/tools/clang/runtime/compiler-rt-bins/<inline asm>', IO exception has been thrown: java.nio.file.NoSuchFileException: /Users/buildslave/jenkins/workspace/clang-stage1-RA/clang-build/tools/clang/runtime/compiler-rt-bins/<inline asm> [Clang (LLVM based)] [-ERROR-] - '/Users/buildslave/jenkins/workspace/clang-stage1-RA/clang-build/tools/clang/runtime/compiler-rt-bins/<inline asm>', IO exception has been thrown: java.nio.file.NoSuchFileException: /Users/buildslave/jenkins/workspace/clang-stage1-RA/clang-build/tools/clang/runtime/compiler-rt-bins/<inline asm> [Clang (LLVM based)] Post processing issues on 'green-dragon-18' with source code encoding 'UTF-8' [Clang (LLVM based)] Creating SCM blamer to obtain author and commit information for affected files [Clang (LLVM based)] Creating SCM miner to obtain statistics for affected repository files [Clang (LLVM based)] Resolving file names for all issues in source directory '/Users/buildslave/jenkins/workspace/clang-stage1-RA' [Clang (LLVM based)] -> resolved paths in source directory (64 found, 3 not found) [Clang (LLVM based)] Resolving module names from module definitions (build.xml, pom.xml, or Manifest.mf files) [Clang (LLVM based)] -> resolved module names for 92 issues [Clang (LLVM based)] Resolving package names (or namespaces) by parsing the affected files [Clang (LLVM based)] -> resolved package names of 67 affected files [Clang (LLVM based)] No filter has been set, publishing all 92 issues [Clang (LLVM based)] Creating fingerprints for all affected code blocks to track issues over different builds [Clang (LLVM based)] -> created fingerprints for 87 issues (skipped 5 issues) [Clang (LLVM based)] Copying affected files to Jenkins' build folder '/Users/Shared/Jenkins/Home/jobs/clang-stage1-RA/builds/10982/files-with-issues' [Clang (LLVM based)] -> 64 copied, 0 not in workspace, 5 not-found, 0 with I/O error [Pipeline] } [Pipeline] // stage [Pipeline] } [Pipeline] // node [Pipeline] End of Pipeline ERROR: script returned exit code 1 Finished: FAILURE