UnstableConsole Output

Skipping 62,229 KB.. Full Log
estBackticksWithoutATarget.py (602 of 2028)
PASS: lldb-unit :: Target/./TargetTests/MemoryRegionInfoTest.Formatv (603 of 2028)
UNSUPPORTED: lldb-shell :: ScriptInterpreter/Lua/watchpoint_callback.test (604 of 2028)
PASS: lldb-unit :: ObjectFile/ELF/./ObjectFileELFTests/ObjectFileELFTest.GetModuleSpecifications_EarlySectionHeaders (605 of 2028)
UNSUPPORTED: lldb-api :: tools/lldb-server/thread-name/TestGdbRemoteThreadName.py (606 of 2028)
PASS: lldb-api :: commands/expression/test/TestExprs.py (607 of 2028)
PASS: lldb-api :: terminal/TestSTTYBeforeAndAfter.py (608 of 2028)
PASS: lldb-unit :: ScriptInterpreter/Python/./ScriptInterpreterPythonTests/PythonDataObjectsTest.TestCallable (609 of 2028)
PASS: lldb-unit :: Utility/./UtilityTests/SerializationRountripTest.SerializeDeserializeCStringArrayNullptrElem (610 of 2028)
UNSUPPORTED: lldb-api :: functionalities/darwin_log/format/TestDarwinLogMessageFormat.py (611 of 2028)
PASS: lldb-unit :: Expression/./ExpressionTests/DiagnosticManagerTest.PutStringSeverities (612 of 2028)
PASS: lldb-unit :: UnwindAssembly/x86/./UnwindAssemblyx86Tests/Testx86AssemblyInspectionEngine.TestSpArithx86_64Augmented (613 of 2028)
PASS: lldb-shell :: SymbolFile/DWARF/debug-types-dwarf5.s (614 of 2028)
UNSUPPORTED: lldb-shell :: SymbolFile/PDB/func-symbols.test (615 of 2028)
PASS: lldb-unit :: Utility/./UtilityTests/ArchSpecTest.YAML (616 of 2028)
PASS: lldb-shell :: SymbolFile/DWARF/dwp.s (617 of 2028)
PASS: lldb-api :: commands/expression/import-std-module/vector-of-vectors/TestVectorOfVectorsFromStdModule.py (618 of 2028)
UNSUPPORTED: lldb-api :: commands/watchpoints/multiple_hits/TestMultipleHits.py (619 of 2028)
PASS: lldb-unit :: Utility/./UtilityTests/RangeTest.ContainsRangeStartingFromZero (620 of 2028)
PASS: lldb-shell :: Commands/command-source.test (621 of 2028)
PASS: lldb-unit :: Host/./HostTests/SocketAddressTest.GetAddressInfo (622 of 2028)
UNSUPPORTED: lldb-shell :: SymbolFile/NativePDB/globals-bss.cpp (623 of 2028)
PASS: lldb-unit :: Utility/./UtilityTests/StreamTeeTest.SetStreamAtIndexOutOfBounds (624 of 2028)
PASS: lldb-api :: lang/cpp/gmodules-templates/TestGModules.py (625 of 2028)
PASS: lldb-unit :: Language/Highlighting/./HighlighterTests/HighlighterTest.ClangCommas (626 of 2028)
PASS: lldb-api :: functionalities/data-formatter/setvaluefromcstring/TestSetValueFromCString.py (627 of 2028)
PASS: lldb-api :: commands/expression/import-std-module/sysroot/TestStdModuleSysroot.py (628 of 2028)
PASS: lldb-api :: functionalities/data-formatter/compactvectors/TestCompactVectors.py (629 of 2028)
PASS: lldb-unit :: Utility/./UtilityTests/StringListTest.RemoveBlankLines (630 of 2028)
PASS: lldb-unit :: debugserver/./debugserverTests/JSON.Parse (631 of 2028)
PASS: lldb-api :: lang/cpp/global_variables/TestCPPGlobalVariables.py (632 of 2028)
PASS: lldb-shell :: SymbolFile/DWARF/debug_rnglists-dwo.s (633 of 2028)
PASS: lldb-unit :: Host/./HostTests/SocketTest.DecodeHostAndPort (634 of 2028)
PASS: lldb-unit :: Expression/./ExpressionTests/DiagnosticManagerTest.FixedExpression (635 of 2028)
PASS: lldb-api :: functionalities/thread/step_out/TestThreadStepOut.py (636 of 2028)
PASS: lldb-unit :: Utility/./UtilityTests/CompletionRequest.TestCompletionOwnership (637 of 2028)
PASS: lldb-api :: functionalities/signal/handle-abrt/TestHandleAbort.py (638 of 2028)
PASS: lldb-api :: lang/mixed/TestMixedLanguages.py (639 of 2028)
PASS: lldb-unit :: Utility/./UtilityTests/StringLexerTest.Peek (640 of 2028)
PASS: lldb-unit :: Utility/./UtilityTests/FileSpecTest.FormatFileSpec (641 of 2028)
PASS: lldb-unit :: Utility/./UtilityTests/Flags.AnyClear (642 of 2028)
PASS: lldb-unit :: Utility/./UtilityTests/StringLexerTest.HasAtLeast (643 of 2028)
PASS: lldb-api :: python_api/lldbutil/process/TestPrintStackTraces.py (644 of 2028)
PASS: lldb-unit :: Utility/./UtilityTests/StringListTest.GetMaxStringLengthDecreasingSize (645 of 2028)
PASS: lldb-api :: functionalities/data-formatter/user-format-vs-summary/TestUserFormatVsSummary.py (646 of 2028)
PASS: lldb-unit :: Utility/./UtilityTests/StringExtractorTest.GetNameColonValueSuccess (647 of 2028)
PASS: lldb-api :: lang/c/struct_types/TestStructTypes.py (648 of 2028)
PASS: lldb-unit :: Core/./LLDBCoreTests/SourceFileCache.FindSourceFileFound (649 of 2028)
PASS: lldb-api :: functionalities/breakpoint/scripted_bkpt/TestScriptedResolver.py (650 of 2028)
PASS: lldb-shell :: ObjectFile/wasm/stripped-debug-sections.yaml (651 of 2028)
PASS: lldb-api :: commands/expression/persistent_variables/TestPersistentVariables.py (652 of 2028)
PASS: lldb-unit :: Utility/./UtilityTests/SerializationRountripTest.SerializeDeserializePod (653 of 2028)
PASS: lldb-api :: commands/frame/recognizer/TestFrameRecognizer.py (654 of 2028)
PASS: lldb-api :: lang/cpp/namespace/TestNamespace.py (655 of 2028)
PASS: lldb-api :: functionalities/postmortem/elf-core/gcore/TestGCore.py (656 of 2028)
PASS: lldb-shell :: SymbolFile/DWARF/debug-types-missing-signature.test (657 of 2028)
UNSUPPORTED: lldb-shell :: ObjectFile/ELF/basic-info.yaml (658 of 2028)
PASS: lldb-api :: python_api/breakpoint/TestBreakpointAPI.py (659 of 2028)
PASS: lldb-unit :: Utility/./UtilityTests/StringExtractorTest.GetHexBytes_FullString (660 of 2028)
PASS: lldb-unit :: Utility/./UtilityTests/OptionsWithRawTest.EmptyArgsOnlySuffix (661 of 2028)
PASS: lldb-shell :: Quit/TestQuitExitCode0.test (662 of 2028)
PASS: lldb-unit :: Utility/./UtilityTests/BinaryStreamTest.PutSLEB128FiveBytes (663 of 2028)
PASS: lldb-api :: commands/expression/weak_symbols/TestWeakSymbols.py (664 of 2028)
PASS: lldb-unit :: Expression/./ExpressionTests/CppModuleConfigurationTest.MissingUsrInclude (665 of 2028)
UNSUPPORTED: lldb-api :: functionalities/thread/create_during_step/TestCreateDuringStep.py (666 of 2028)
PASS: lldb-api :: lang/objc/objc++/TestObjCXX.py (667 of 2028)
PASS: lldb-api :: functionalities/tail_call_frames/ambiguous_tail_call_seq1/TestAmbiguousTailCallSeq1.py (668 of 2028)
PASS: lldb-unit :: Platform/./LLDBPlatformTests/PlatformDarwinTest.TestParseVersionBuildDir (669 of 2028)
PASS: lldb-unit :: Utility/./UtilityTests/FileSpecTest.Equal (670 of 2028)
PASS: lldb-unit :: Process/minidump/./LLDBMinidumpTests/MinidumpParserTest.GetMemory (671 of 2028)
UNSUPPORTED: lldb-api :: benchmarks/expression/TestExpressionCmd.py (672 of 2028)
PASS: lldb-unit :: Process/gdb-remote/./ProcessGdbRemoteTests/GDBRemoteClientBaseTest.SendContinueDelegateStructuredDataReceipt (673 of 2028)
PASS: lldb-unit :: Utility/./UtilityTests/TimerTest.CategoryTimesStats (674 of 2028)
PASS: lldb-unit :: Utility/./UtilityTests/SerializationRountripTest.SerializeDeserializeObjectPointer (675 of 2028)
UNSUPPORTED: lldb-api :: tools/lldb-server/TestGdbRemoteAuxvSupport.py (676 of 2028)
PASS: lldb-unit :: Utility/./UtilityTests/UriParserTest.BracketedHostnameWithPortIPv6 (677 of 2028)
UNSUPPORTED: lldb-shell :: Process/Windows/exception_access_violation.cpp (678 of 2028)
UNSUPPORTED: lldb-shell :: SymbolFile/DWARF/dwp-separate-debug-file.cpp (679 of 2028)
PASS: lldb-unit :: Utility/./UtilityTests/DataExtractorTest.GetCStrAtNullOffset (680 of 2028)
PASS: lldb-api :: tools/lldb-vscode/breakpoint/TestVSCode_setFunctionBreakpoints.py (681 of 2028)
PASS: lldb-unit :: Utility/./UtilityTests/StringListTest.JoinThree (682 of 2028)
PASS: lldb-unit :: Utility/./UtilityTests/StreamTest.PutHex64ByteOrderBig (683 of 2028)
PASS: lldb-unit :: Utility/./UtilityTests/OptionsWithRawTest.WhitespaceInput (684 of 2028)
PASS: lldb-api :: lang/cpp/operator-overload/TestOperatorOverload.py (685 of 2028)
PASS: lldb-api :: lang/objc/objc-ivar-protocols/TestIvarProtocols.py (686 of 2028)
PASS: lldb-api :: functionalities/gdb_remote_client/TestRecognizeBreakpoint.py (687 of 2028)
PASS: lldb-unit :: Process/gdb-remote/./ProcessGdbRemoteTests/GDBRemoteCommunicationClientTest.SendStopTracePacket (688 of 2028)
PASS: lldb-api :: commands/frame/select/TestFrameSelect.py (689 of 2028)
PASS: lldb-unit :: Utility/./UtilityTests/StringListTest.GetMaxStringLengthEqualSize (690 of 2028)
PASS: lldb-shell :: Expr/TestMultilineExpr.test (691 of 2028)
PASS: lldb-api :: functionalities/float-display/TestFloatDisplay.py (692 of 2028)
PASS: lldb-shell :: Commands/command-breakpoint-col.test (693 of 2028)
PASS: lldb-api :: lang/c/forward/TestForwardDeclaration.py (694 of 2028)
PASS: lldb-api :: lang/c/bitfields/TestBitfields.py (695 of 2028)
PASS: lldb-shell :: ObjectFile/ELF/section-types.yaml (696 of 2028)
PASS: lldb-shell :: Quit/TestQuitExitCodeHex0.test (697 of 2028)
PASS: lldb-api :: lang/cpp/template-function/TestTemplateFunctions.py (698 of 2028)
PASS: lldb-unit :: Utility/./UtilityTests/CompletionRequest.ShiftArguments (699 of 2028)
PASS: lldb-unit :: Expression/./ExpressionTests/ClangExpressionDeclMapTest.TestUnknownIdentifierLookup (700 of 2028)
UNSUPPORTED: lldb-shell :: SymbolFile/PDB/expressions.test (701 of 2028)
PASS: lldb-unit :: Utility/./UtilityTests/SerializationRountripTest.SerializeDeserializeCString (702 of 2028)
PASS: lldb-shell :: Driver/TestRepl.test (703 of 2028)
PASS: lldb-unit :: API/./APITests/SBCommandInterpreterTest.MultiWordCommand (704 of 2028)
PASS: lldb-api :: commands/expression/deleting-implicit-copy-constructor/TestDeletingImplicitCopyConstructor.py (705 of 2028)
PASS: lldb-unit :: Utility/./UtilityTests/StringListTest.ForRange (706 of 2028)
PASS: lldb-unit :: Utility/./UtilityTests/PassiveReplayTest.InstrumentedFoo (707 of 2028)
PASS: lldb-unit :: Platform/./LLDBPlatformTests/PlatformDarwinTest.FindXcodeContentsDirectoryInPath (708 of 2028)
PASS: lldb-api :: commands/breakpoint/set/func-regex/TestBreakpointRegexError.py (709 of 2028)
UNSUPPORTED: lldb-shell :: ScriptInterpreter/Lua/breakpoint_callback.test (710 of 2028)
PASS: lldb-api :: lang/cpp/breakpoint-commands/TestCPPBreakpointCommands.py (711 of 2028)
PASS: lldb-unit :: Utility/./UtilityTests/Flags.Test (712 of 2028)
PASS: lldb-shell :: Reproducer/TestPythonImport.test (713 of 2028)
PASS: lldb-unit :: Process/gdb-remote/./ProcessGdbRemoteTests/GDBRemoteCommunicationClientTest.SendGetDataPacket (714 of 2028)
PASS: lldb-unit :: Utility/./UtilityTests/ArgsTest.ReplaceArgumentAtIndexOutOfRange (715 of 2028)
PASS: lldb-unit :: Utility/./UtilityTests/ScalarTest.GetValue (716 of 2028)
PASS: lldb-unit :: Utility/./UtilityTests/RecordReplayTest.InstrumentedFooSameThis (717 of 2028)
PASS: lldb-shell :: ObjectFile/ELF/netbsd-core-amd64.test (718 of 2028)
PASS: lldb-shell :: Quit/TestQuitExitCode30.test (719 of 2028)
PASS: lldb-shell :: SymbolFile/DWARF/debug_loc_and_loclists.s (720 of 2028)
PASS: lldb-api :: commands/expression/import-std-module/deque-dbg-info-content/TestDbgInfoContentDequeFromStdModule.py (721 of 2028)
PASS: lldb-api :: functionalities/data-formatter/data-formatter-objc/TestDataFormatterObjCCF.py (722 of 2028)
PASS: lldb-unit :: Process/gdb-remote/./ProcessGdbRemoteTests/GDBRemoteCommunicationServerTest.SendErrorResponse_Status (723 of 2028)
PASS: lldb-unit :: Utility/./UtilityTests/StringExtractorTest.GetHexU8_Extra (724 of 2028)
PASS: lldb-unit :: Utility/./UtilityTests/StringExtractorTest.DecodeHexU8_Underflow2 (725 of 2028)
PASS: lldb-api :: lang/c/global_variables/TestGlobalVariables.py (726 of 2028)
UNSUPPORTED: lldb-api :: functionalities/data-formatter/data-formatter-stl/libstdcpp/vector/TestDataFormatterStdVector.py (727 of 2028)
PASS: lldb-api :: commands/expression/import-std-module/conflicts/TestStdModuleWithConflicts.py (728 of 2028)
PASS: lldb-shell :: ExecControl/StopHook/stop-hook.test (729 of 2028)
PASS: lldb-api :: functionalities/multiword-commands/TestMultiWordCommands.py (730 of 2028)
PASS: lldb-api :: commands/expression/import-std-module/vector-bool/TestVectorBoolFromStdModule.py (731 of 2028)
PASS: lldb-unit :: Utility/./UtilityTests/DataExtractorTest.GetCStrAtEnd (732 of 2028)
PASS: lldb-unit :: Utility/./UtilityTests/ArgsTest.StringListConstructor (733 of 2028)
PASS: lldb-api :: types/TestFloatTypesExpr.py (734 of 2028)
PASS: lldb-unit :: ScriptInterpreter/Python/./ScriptInterpreterPythonTests/PythonDataObjectsTest.TestModuleNameResolutionNoDot (735 of 2028)
PASS: lldb-api :: commands/expression/import-std-module/weak_ptr/TestWeakPtrFromStdModule.py (736 of 2028)
PASS: lldb-unit :: Utility/./UtilityTests/DataExtractorTest.GetMaxS64 (737 of 2028)
UNSUPPORTED: lldb-api :: lang/cpp/gmodules/TestWithModuleDebugging.py (738 of 2028)
PASS: lldb-unit :: Utility/./UtilityTests/Flags.AnySet (739 of 2028)
PASS: lldb-unit :: Utility/./UtilityTests/OptionsWithRawTest.EmptyInput (740 of 2028)
PASS: lldb-api :: commands/expression/inline-namespace/TestInlineNamespace.py (741 of 2028)
PASS: lldb-unit :: Utility/./UtilityTests/StringListTest.CopyList (742 of 2028)
PASS: lldb-unit :: Utility/./UtilityTests/XcodeSDKTest.ParseTest (743 of 2028)
PASS: lldb-unit :: Language/Highlighting/./HighlighterTests/HighlighterTest.ClangCursorPosEndOfLine (744 of 2028)
UNSUPPORTED: lldb-shell :: SymbolFile/DWARF/find-variable-dwo.cpp (745 of 2028)
PASS: lldb-api :: macosx/find-dsym/deep-bundle/TestDeepBundle.py (746 of 2028)
PASS: lldb-unit :: UnwindAssembly/x86/./UnwindAssemblyx86Tests/Testx86AssemblyInspectionEngine.TestPushEBX (747 of 2028)
PASS: lldb-unit :: Utility/./UtilityTests/UriParserTest.LongPath (748 of 2028)
PASS: lldb-api :: commands/expression/scoped_enums/TestScopedEnumType.py (749 of 2028)
PASS: lldb-unit :: ScriptInterpreter/Python/./ScriptInterpreterPythonTests/PythonDataObjectsTest.TestRun (750 of 2028)
PASS: lldb-api :: functionalities/gdb_remote_client/TestThreadSelectionBug.py (751 of 2028)
PASS: lldb-api :: lang/c/const_variables/TestConstVariables.py (752 of 2028)
PASS: lldb-api :: commands/expression/call-throws/TestCallThatThrows.py (753 of 2028)
PASS: lldb-unit :: Process/minidump/./LLDBMinidumpTests/MinidumpParserTest.GetArchitecture (754 of 2028)
PASS: lldb-unit :: Utility/./UtilityTests/PassiveReplayTest.InstrumentedBar (755 of 2028)
PASS: lldb-unit :: Language/Highlighting/./HighlighterTests/HighlighterTest.ClangTrailingBackslashWithWhitespace (756 of 2028)
PASS: lldb-api :: functionalities/gdb_remote_client/TestPlatformClient.py (757 of 2028)
UNSUPPORTED: lldb-api :: python_api/watchpoint/condition/TestWatchpointConditionAPI.py (758 of 2028)
PASS: lldb-api :: functionalities/data-formatter/data-formatter-stl/libcxx/forward_list/TestDataFormatterLibcxxForwardList.py (759 of 2028)
PASS: lldb-api :: tools/lldb-vscode/stackTrace/TestVSCode_stackTrace.py (760 of 2028)
PASS: lldb-api :: lang/cpp/bool/TestCPPBool.py (761 of 2028)
UNSUPPORTED: lldb-api :: functionalities/darwin_log/filter/exact_match/subsystem/TestDarwinLogFilterMatchSubsystem.py (762 of 2028)
UNSUPPORTED: lldb-api :: functionalities/tsan/thread_leak/TestTsanThreadLeak.py (763 of 2028)
PASS: lldb-api :: lang/c/unicode/TestUnicodeSymbols.py (764 of 2028)
PASS: lldb-api :: functionalities/breakpoint/address_breakpoints/TestBadAddressBreakpoints.py (765 of 2028)
PASS: lldb-shell :: ObjectFile/PECOFF/section-types.yaml (766 of 2028)
PASS: lldb-unit :: Utility/./UtilityTests/OptionsWithRawTest.SingleWordSuffix (767 of 2028)
PASS: lldb-unit :: Utility/./UtilityTests/NameMatchesTest.Equals (768 of 2028)
UNSUPPORTED: lldb-api :: functionalities/darwin_log/filter/regex/category/TestDarwinLogFilterRegexCategory.py (769 of 2028)
PASS: lldb-unit :: Host/./HostTests/FileSystemTest.Resolve (770 of 2028)
PASS: lldb-unit :: Utility/./UtilityTests/RangeTest.Slide (771 of 2028)
PASS: lldb-shell :: ObjectFile/ELF/build-id-case.yaml (772 of 2028)
PASS: lldb-shell :: SymbolFile/DWARF/debug_loclists-dwo.s (773 of 2028)
PASS: lldb-api :: functionalities/avoids-fd-leak/TestFdLeak.py (774 of 2028)
PASS: lldb-api :: functionalities/var_path/TestVarPath.py (775 of 2028)
PASS: lldb-unit :: Utility/./UtilityTests/BinaryStreamTest.PutULEB128Zero (776 of 2028)
PASS: lldb-shell :: Minidump/Windows/find-module.test (777 of 2028)
PASS: lldb-unit :: ObjectFile/PECOFF/./ObjectFilePECOFFTests/PECallFrameInfoTest.Frame_reg_eh (778 of 2028)
PASS: lldb-unit :: ScriptInterpreter/Python/./ScriptInterpreterPythonTests/PythonDataObjectsTest.TestPythonListToStructuredList (779 of 2028)
PASS: lldb-unit :: Symbol/./SymbolTests/TestTypeSystemClang.TestGetEnumIntegerTypeBasicTypes (780 of 2028)
PASS: lldb-unit :: Utility/./UtilityTests/XcodeSDKTest.GetSDKTypeForTriple (781 of 2028)
PASS: lldb-shell :: Settings/TestDisableColor.test (782 of 2028)
UNSUPPORTED: lldb-api :: functionalities/thread/concurrent_events/TestConcurrentCrashWithWatchpointBreakpointSignal.py (783 of 2028)
PASS: lldb-shell :: ObjectFile/ELF/PT_LOAD-empty.yaml (784 of 2028)
PASS: lldb-shell :: Quit/TestQuitExitCodeTooManyArgs.test (785 of 2028)
PASS: lldb-api :: commands/version/TestVersion.py (786 of 2028)
PASS: lldb-api :: sample_test/TestSampleTest.py (787 of 2028)
UNSUPPORTED: lldb-shell :: SymbolFile/PDB/variables.test (788 of 2028)
PASS: lldb-api :: functionalities/process_crash_info/TestProcessCrashInfo.py (789 of 2028)
PASS: lldb-api :: lang/objc/conflicting-definition/TestConflictingDefinition.py (790 of 2028)
PASS: lldb-unit :: Utility/./UtilityTests/StringExtractorTest.DecodeHexU8_InvalidHex (791 of 2028)
UNSUPPORTED: lldb-api :: commands/watchpoints/watchpoint_set_command/TestWatchLocationWithWatchSet.py (792 of 2028)
PASS: lldb-shell :: SymbolFile/DWARF/debug_loc.s (793 of 2028)
UNSUPPORTED: lldb-api :: linux/mix-dwo-and-regular-objects/TestMixedDwarfBinary.py (794 of 2028)
PASS: lldb-unit :: Utility/./UtilityTests/StreamTest.PutPtr (795 of 2028)
PASS: lldb-unit :: Utility/./UtilityTests/BinaryStreamTest.PutULEB128FiveBytes (796 of 2028)
PASS: lldb-api :: macosx/universal/TestUniversal.py (797 of 2028)
PASS: lldb-unit :: Utility/./UtilityTests/GeneratorTest.GetOrCreate (798 of 2028)
PASS: lldb-unit :: Process/minidump/./LLDBMinidumpTests/RegisterContextMinidump.ConvertMinidumpContext_x86_32 (799 of 2028)
PASS: lldb-api :: lang/objc/objc-runtime-ivars/TestRuntimeIvars.py (800 of 2028)
PASS: lldb-unit :: Expression/./ExpressionTests/ClangHostTest.MacOSX (801 of 2028)
PASS: lldb-api :: lang/c/anonymous/TestAnonymous.py (802 of 2028)
UNSUPPORTED: lldb-api :: benchmarks/startup/TestStartupDelays.py (803 of 2028)
PASS: lldb-api :: functionalities/breakpoint/source_regexp/TestSourceRegexBreakpoints.py (804 of 2028)
PASS: lldb-api :: lang/cpp/class_types/TestClassTypes.py (805 of 2028)
PASS: lldb-api :: functionalities/thread/concurrent_events/TestConcurrentCrashWithBreak.py (806 of 2028)
PASS: lldb-unit :: Target/./TargetTests/ExecutionContextTest.GetByteOrderProcess (807 of 2028)
PASS: lldb-api :: functionalities/data-formatter/data-formatter-categories/TestDataFormatterCategories.py (808 of 2028)
UNSUPPORTED: lldb-api :: benchmarks/frame_variable/TestFrameVariableResponse.py (809 of 2028)
PASS: lldb-api :: python_api/process/io/TestProcessIO.py (810 of 2028)
PASS: lldb-shell :: Reproducer/TestVersionCheck.test (811 of 2028)
PASS: lldb-unit :: Utility/./UtilityTests/StreamTest.AddressSize (812 of 2028)
PASS: lldb-api :: commands/target/create-no-such-arch/TestNoSuchArch.py (813 of 2028)
PASS: lldb-shell :: BuildScript/modes.test (814 of 2028)
PASS: lldb-api :: functionalities/fat_archives/TestFatArchives.py (815 of 2028)
PASS: lldb-unit :: Host/./HostTests/ProcessLaunchInfoTest.Constructor (816 of 2028)
PASS: lldb-api :: lang/c/function_types/TestFunctionTypes.py (817 of 2028)
PASS: lldb-api :: functionalities/thread/concurrent_events/TestConcurrentSignalDelayBreak.py (818 of 2028)
PASS: lldb-unit :: Utility/./UtilityTests/RangeDataVector.FindEntryThatContains (819 of 2028)
PASS: lldb-unit :: UnwindAssembly/x86/./UnwindAssemblyx86Tests/Testx86AssemblyInspectionEngine.TestAddRSP (820 of 2028)
UNSUPPORTED: lldb-api :: functionalities/thread/multi_break/TestMultipleBreakpoints.py (821 of 2028)
PASS: lldb-unit :: Language/Highlighting/./HighlighterTests/HighlighterTest.DefaultHighlighterWithCursorOutOfBounds (822 of 2028)
PASS: lldb-unit :: Utility/./UtilityTests/BinaryStreamTest.PutSLEB128OneByte (823 of 2028)
PASS: lldb-unit :: Symbol/./SymbolTests/TestClangASTImporter.MetadataPropagation (824 of 2028)
PASS: lldb-unit :: Process/gdb-remote/./ProcessGdbRemoteTests/GDBRemoteCommunicationClientTest.SyncThreadState (825 of 2028)
PASS: lldb-api :: functionalities/conditional_break/TestConditionalBreak.py (826 of 2028)
PASS: lldb-api :: lang/objc/objc-ivar-stripped/TestObjCIvarStripped.py (827 of 2028)
PASS: lldb-api :: python_api/sbtype_typeclass/TestSBTypeTypeClass.py (828 of 2028)
PASS: lldb-api :: commands/expression/no-deadlock/TestExprDoesntBlock.py (829 of 2028)
PASS: lldb-unit :: Utility/./UtilityTests/StringListTest.LongestCommonPrefixSingleElement (830 of 2028)
PASS: lldb-unit :: Utility/./UtilityTests/ProcessInstanceInfo.Dump (831 of 2028)
PASS: lldb-unit :: UnwindAssembly/x86/./UnwindAssemblyx86Tests/Testx86AssemblyInspectionEngine.TestStackRealign8BitDisp_i386 (832 of 2028)
PASS: lldb-shell :: ScriptInterpreter/None/none.test (833 of 2028)
PASS: lldb-api :: commands/expression/persistent_ptr_update/TestPersistentPtrUpdate.py (834 of 2028)
PASS: lldb-api :: functionalities/data-formatter/array_typedef/TestArrayTypedef.py (835 of 2028)
PASS: lldb-unit :: UnwindAssembly/x86/./UnwindAssemblyx86Tests/Testx86AssemblyInspectionEngine.Test32bitFramelessSmallStackFrame (836 of 2028)
PASS: lldb-api :: functionalities/data-formatter/parray/TestPrintArray.py (837 of 2028)
PASS: lldb-api :: lang/cpp/extern_c/TestExternCSymbols.py (838 of 2028)
PASS: lldb-api :: functionalities/data-formatter/format-propagation/TestFormatPropagation.py (839 of 2028)
PASS: lldb-unit :: ScriptInterpreter/Python/./ScriptInterpreterPythonTests/PythonDataObjectsTest.TestPythonCallableInvoke (840 of 2028)
PASS: lldb-unit :: Utility/./UtilityTests/StreamTest.QuotedCString (841 of 2028)
PASS: lldb-unit :: Utility/./UtilityTests/BinaryStreamTest.PutSLEB128ThreeBytes (842 of 2028)
PASS: lldb-unit :: Host/./HostTests/FileSystemTest.MakeAbsolute (843 of 2028)
UNSUPPORTED: lldb-api :: commands/expression/macros/TestMacros.py (844 of 2028)
PASS: lldb-api :: functionalities/pointer_num_children/TestPointerNumChildren.py (845 of 2028)
PASS: lldb-api :: lang/cpp/thread_local/TestThreadLocal.py (846 of 2028)
PASS: lldb-unit :: Utility/./UtilityTests/SerializationRountripTest.SerializeDeserializePodReferences (847 of 2028)
PASS: lldb-api :: lang/objc/foundation/TestRuntimeTypes.py (848 of 2028)
PASS: lldb-unit :: Process/gdb-remote/./ProcessGdbRemoteTests/GDBRemoteCommunicationClientTest.GetModulesInfo_UUID20 (849 of 2028)
PASS: lldb-unit :: Symbol/./SymbolTests/Type.GetTypeScopeAndBasename (850 of 2028)
PASS: lldb-unit :: SymbolFile/DWARF/./SymbolFileDWARFTests/SymbolFileDWARFTests.TestAbbrevOutOfOrder (851 of 2028)
PASS: lldb-unit :: Utility/./UtilityTests/OptionsWithRawTest.SingleWhitespaceInput (852 of 2028)
PASS: lldb-unit :: UnwindAssembly/x86/./UnwindAssemblyx86Tests/Testx86AssemblyInspectionEngine.TestPushR15 (853 of 2028)
PASS: lldb-unit :: Utility/./UtilityTests/StringListTest.GetMaxStringLengthMixed (854 of 2028)
PASS: lldb-unit :: Utility/./UtilityTests/StreamTeeTest.SetStreamAtIndexOverwrite (855 of 2028)
PASS: lldb-unit :: Utility/./UtilityTests/StreamTest.Indent (856 of 2028)
UNSUPPORTED: lldb-api :: functionalities/thread/concurrent_events/TestConcurrentDelaySignalWatch.py (857 of 2028)
UNSUPPORTED: lldb-shell :: SymbolFile/NativePDB/local-variables.cpp (858 of 2028)
PASS: lldb-shell :: Reproducer/TestFileRepro.test (859 of 2028)
PASS: lldb-shell :: Host/TestCustomShell.test (860 of 2028)
PASS: lldb-api :: functionalities/tail_call_frames/sbapi_support/TestTailCallFrameSBAPI.py (861 of 2028)
UNSUPPORTED: lldb-api :: functionalities/signal/handle-segv/TestHandleSegv.py (862 of 2028)
PASS: lldb-unit :: Expression/./ExpressionTests/DiagnosticManagerTest.AppendMessageAttachToLastDiag (863 of 2028)
PASS: lldb-api :: lang/objc/variadic_methods/TestVariadicMethods.py (864 of 2028)
PASS: lldb-api :: macosx/function-starts/TestFunctionStarts.py (865 of 2028)
PASS: lldb-api :: commands/expression/vector_of_enums/TestVectorOfEnums.py (866 of 2028)
PASS: lldb-api :: functionalities/data-formatter/data-formatter-ptr-to-array/TestPtrToArrayFormatting.py (867 of 2028)
PASS: lldb-shell :: Driver/TestCommands.test (868 of 2028)
PASS: lldb-unit :: Utility/./UtilityTests/ArgsTest.Yaml (869 of 2028)
PASS: lldb-api :: python_api/value/change_values/TestChangeValueAPI.py (870 of 2028)
PASS: lldb-unit :: ScriptInterpreter/Python/./ScriptInterpreterPythonTests/PythonDataObjectsTest.TestPythonDictionaryToStructuredDictionary (871 of 2028)
UNSUPPORTED: lldb-api :: commands/watchpoints/watchpoint_count/TestWatchpointCount.py (872 of 2028)
PASS: lldb-unit :: Host/./HostTests/FileActionTest.Open (873 of 2028)
PASS: lldb-shell :: Reproducer/TestDSYM.test (874 of 2028)
PASS: lldb-unit :: UnwindAssembly/x86/./UnwindAssemblyx86Tests/Testx86AssemblyInspectionEngine.Test32bitFramelessBigStackFrame (875 of 2028)
UNSUPPORTED: lldb-api :: commands/watchpoints/step_over_watchpoint/TestStepOverWatchpoint.py (876 of 2028)
PASS: lldb-unit :: Utility/./UtilityTests/ArgsTest.GetQuotedCommandString (877 of 2028)
PASS: lldb-api :: functionalities/stats_api/TestStatisticsAPI.py (878 of 2028)
PASS: lldb-api :: functionalities/data-formatter/data-formatter-objc/cmtime/TestDataFormatterCMTime.py (879 of 2028)
PASS: lldb-api :: lang/objc/objc-dyn-sbtype/TestObjCDynamicSBType.py (880 of 2028)
PASS: lldb-unit :: Target/./TargetTests/RemoteAwarePlatformTest.TestResolveExecutabelOnClientByPlatform (881 of 2028)
PASS: lldb-unit :: Expression/./ExpressionTests/CppModuleConfigurationTest.LibCppV2 (882 of 2028)
PASS: lldb-api :: functionalities/thread/thread_specific_break/TestThreadSpecificBreakpoint.py (883 of 2028)
PASS: lldb-api :: lang/c/unions/TestUnionMembers.py (884 of 2028)
PASS: lldb-unit :: SymbolFile/NativePDB/./SymbolFileNativePDBTests/PDBFPOProgramToDWARFExpressionTests.MultipleDependentAssignments (885 of 2028)
PASS: lldb-unit :: UnwindAssembly/x86/./UnwindAssemblyx86Tests/Testx86AssemblyInspectionEngine.Test64bitFramelessSmallStackFrame (886 of 2028)
UNSUPPORTED: lldb-api :: commands/watchpoints/watchpoint_commands/command/TestWatchpointCommandLLDB.py (887 of 2028)
PASS: lldb-api :: types/TestRecursiveTypes.py (888 of 2028)
PASS: lldb-unit :: Utility/./UtilityTests/BinaryStreamTest.PutSLEB128TwoBytes (889 of 2028)
PASS: lldb-unit :: ScriptInterpreter/Python/./ScriptInterpreterPythonTests/PythonDataObjectsTest.TestInstanceNameResolutionNoDot (890 of 2028)
PASS: lldb-api :: functionalities/data-formatter/data-formatter-stl/libcxx/queue/TestDataFormatterLibcxxQueue.py (891 of 2028)
PASS: lldb-shell :: SymbolFile/DWARF/apple-index-is-used.cpp (892 of 2028)
PASS: lldb-unit :: Process/gdb-remote/./ProcessGdbRemoteTests/GDBRemoteCommunicationServerTest.SendErrorResponse_StringError (893 of 2028)
UNSUPPORTED: lldb-shell :: SymbolFile/NativePDB/break-by-function.cpp (894 of 2028)
UNSUPPORTED: lldb-api :: functionalities/thread/concurrent_events/TestConcurrentTwoWatchpointsOneBreakpoint.py (895 of 2028)
PASS: lldb-unit :: Utility/./UtilityTests/ArgsTest.BareSingleQuote (896 of 2028)
PASS: lldb-api :: commands/settings/use_source_cache/TestUseSourceCache.py (897 of 2028)
PASS: lldb-unit :: ScriptInterpreter/Python/./ScriptInterpreterPythonTests/PythonDataObjectsTest.TestPythonByteArray (898 of 2028)
PASS: lldb-unit :: Utility/./UtilityTests/StringListTest.DefaultConstructor (899 of 2028)
UNSUPPORTED: lldb-api :: commands/watchpoints/multiple_threads/TestWatchpointMultipleThreads.py (900 of 2028)
PASS: lldb-unit :: Utility/./UtilityTests/ArgsTest.ReplaceArgumentAtIndexFarOutOfRange (901 of 2028)
PASS: lldb-unit :: Utility/./UtilityTests/GeneratorTest.Get (902 of 2028)
PASS: lldb-shell :: Reproducer/TestDump.test (903 of 2028)
PASS: lldb-api :: lang/cpp/inlines/TestInlines.py (904 of 2028)
PASS: lldb-unit :: Utility/./UtilityTests/AnsiTerminal.AtStart (905 of 2028)
PASS: lldb-api :: functionalities/set-data/TestSetData.py (906 of 2028)
PASS: lldb-unit :: Utility/./UtilityTests/ArgsTest.TestAppendArg (907 of 2028)
PASS: lldb-unit :: Process/minidump/./LLDBMinidumpTests/MinidumpParserTest.GetThreadsAndGetThreadContext (908 of 2028)
PASS: lldb-shell :: ObjectFile/Breakpad/discontiguous-sections.test (909 of 2028)
PASS: lldb-unit :: Utility/./UtilityTests/StringListTest.InsertStringAtIndexEnd (910 of 2028)
PASS: lldb-unit :: Process/gdb-remote/./ProcessGdbRemoteTests/GDBRemoteCommunicationClientTest.SendGetMetaDataPacket (911 of 2028)
PASS: lldb-api :: lang/objc/modules-auto-import/TestModulesAutoImport.py (912 of 2028)
PASS: lldb-shell :: ScriptInterpreter/Python/crashlog.test (913 of 2028)
PASS: lldb-api :: commands/expression/ir-interpreter/TestIRInterpreter.py (914 of 2028)
PASS: lldb-unit :: Utility/./UtilityTests/XcodeSDKTest.MergeTest (915 of 2028)
PASS: lldb-shell :: SymbolFile/DWARF/DW_OP_piece-smaller-than-struct.s (916 of 2028)
PASS: lldb-api :: macosx/thread_suspend/TestInternalThreadSuspension.py (917 of 2028)
PASS: lldb-api :: lang/objc/objc-new-syntax/TestObjCNewSyntaxArray.py (918 of 2028)
PASS: lldb-unit :: Process/minidump/./LLDBMinidumpTests/MinidumpParserTest.GetPid (919 of 2028)
PASS: lldb-unit :: Utility/./UtilityTests/StringListTest.ShiftStdString (920 of 2028)
PASS: lldb-unit :: Utility/./UtilityTests/RangeTest.DefaultConstructor (921 of 2028)
UNSUPPORTED: lldb-shell :: Breakpoint/ppc64-localentry.test (922 of 2028)
PASS: lldb-api :: functionalities/inferior-crashing/TestInferiorCrashing.py (923 of 2028)
PASS: lldb-unit :: Target/./TargetTests/PathMappingListTest.RelativeTests (924 of 2028)
PASS: lldb-unit :: Utility/./UtilityTests/AnsiTerminal.Twice (925 of 2028)
UNSUPPORTED: lldb-shell :: ObjectFile/PECOFF/dep-modules.yaml (926 of 2028)
PASS: lldb-unit :: Utility/./UtilityTests/ScalarTest.SetValueFromCString (927 of 2028)
PASS: lldb-shell :: SymbolFile/DWARF/dwp-debug-types.s (928 of 2028)
PASS: lldb-api :: api/log/TestAPILog.py (929 of 2028)
PASS: lldb-unit :: API/./APITests/SBCommandInterpreterTest.SingleWordCommand (930 of 2028)
PASS: lldb-shell :: ObjectFile/ELF/compressed-sections.yaml (931 of 2028)
PASS: lldb-shell :: ObjectFile/MachO/lc_build_version_notools.yaml (932 of 2028)
PASS: lldb-unit :: Process/minidump/./LLDBMinidumpTests/MinidumpParserTest.GetFilteredModuleList (933 of 2028)
PASS: lldb-unit :: UnwindAssembly/x86/./UnwindAssemblyx86Tests/Testx86AssemblyInspectionEngine.TestPushRBP (934 of 2028)
PASS: lldb-shell :: Settings/TestModuleCacheSanity.test (935 of 2028)
PASS: lldb-unit :: Utility/./UtilityTests/Flags.AllSet (936 of 2028)
PASS: lldb-unit :: Language/Highlighting/./HighlighterTests/HighlighterTest.HighlighterSelectionType (937 of 2028)
PASS: lldb-api :: commands/register/register/register_command/TestRegisters.py (938 of 2028)
PASS: lldb-unit :: ScriptInterpreter/Python/./ScriptInterpreterPythonTests/PythonDataObjectsTest.TestGlobalNameResolutionNoDot (939 of 2028)
PASS: lldb-unit :: UnwindAssembly/x86/./UnwindAssemblyx86Tests/Testx86AssemblyInspectionEngine.TestCALLNextInsn (940 of 2028)
PASS: lldb-api :: functionalities/thread/thread_exit/TestThreadExit.py (941 of 2028)
PASS: lldb-unit :: SymbolFile/NativePDB/./SymbolFileNativePDBTests/PDBFPOProgramToDWARFExpressionTests.MissingTargetRegister (942 of 2028)
PASS: lldb-api :: commands/add-dsym/uuid/TestAddDsymCommand.py (943 of 2028)
PASS: lldb-api :: tools/lldb-server/TestGdbRemoteThreadsInStopReply.py (944 of 2028)
PASS: lldb-api :: commands/expression/char/TestExprsChar.py (945 of 2028)
PASS: lldb-shell :: SymbolFile/DWARF/debug-types-line-tables.s (946 of 2028)
PASS: lldb-unit :: Host/./HostTests/NativeProcessProtocolTest.ReadCStringFromMemory (947 of 2028)
PASS: lldb-api :: python_api/section/TestSectionAPI.py (948 of 2028)
PASS: lldb-api :: commands/expression/argument_passing_restrictions/TestArgumentPassingRestrictions.py (949 of 2028)
PASS: lldb-unit :: Process/minidump/./LLDBMinidumpTests/MinidumpParserTest.GetMemoryRegionInfo (950 of 2028)
PASS: lldb-shell :: Settings/TestDisassemblyFormat.test (951 of 2028)
PASS: lldb-unit :: Utility/./UtilityTests/RangeTest.LessThanInvalid (952 of 2028)
PASS: lldb-shell :: Breakpoint/debug_rnglist_basic.test (953 of 2028)
PASS: lldb-shell :: Minidump/fb-dump.test (954 of 2028)
UNSUPPORTED: lldb-shell :: SymbolFile/DWARF/debug-types-expressions.test (955 of 2028)
PASS: lldb-unit :: Utility/./UtilityTests/FileSpecTest.GetPath (956 of 2028)
PASS: lldb-shell :: SymbolFile/DWARF/debug_rnglists.s (957 of 2028)
PASS: lldb-api :: lang/cpp/bitfields/TestCppBitfields.py (958 of 2028)
PASS: lldb-unit :: Signals/./SignalsTests/UnixSignalsTest.VersionChange (959 of 2028)
PASS: lldb-unit :: Expression/./ExpressionTests/DiagnosticManagerTest.HasFixits (960 of 2028)
PASS: lldb-unit :: Utility/./UtilityTests/StringExtractorTest.GetHexBytes_Partial (961 of 2028)
PASS: lldb-api :: commands/expression/regression-access-function-template-in-record/TestRegressionAccessFunctionTemplateInRecord.py (962 of 2028)
PASS: lldb-unit :: Language/CPlusPlus/./LanguageCPlusPlusTests/CPlusPlusLanguage.ExtractContextAndIdentifier (963 of 2028)
UNSUPPORTED: lldb-api :: python_api/watchpoint/watchlocation/TestSetWatchlocation.py (964 of 2028)
PASS: lldb-unit :: Utility/./UtilityTests/StreamTeeTest.Assignment (965 of 2028)
PASS: lldb-api :: commands/command/nested_alias/TestNestedAlias.py (966 of 2028)
PASS: lldb-api :: sample_test/TestSampleInlineTest.py (967 of 2028)
PASS: lldb-api :: functionalities/return-value/TestReturnValue.py (968 of 2028)
PASS: lldb-api :: functionalities/inline-stepping/TestInlineStepping.py (969 of 2028)
PASS: lldb-unit :: Utility/./UtilityTests/StreamTest.PutCharWhitespace (970 of 2028)
PASS: lldb-unit :: SymbolFile/DWARF/./SymbolFileDWARFTests/SymbolFileDWARFTests.TestAbbrevOrder1Start1 (971 of 2028)
UNSUPPORTED: lldb-api :: functionalities/asan/TestReportData.py (972 of 2028)
PASS: lldb-api :: commands/expression/options/TestExprOptions.py (973 of 2028)
PASS: lldb-unit :: Utility/./UtilityTests/RangeTest.SetRangeBase (974 of 2028)
PASS: lldb-api :: lang/objc/foundation/TestObjCMethodsString.py (975 of 2028)
PASS: lldb-api :: lang/cpp/template/TestTemplateArgs.py (976 of 2028)
PASS: lldb-api :: lang/cpp/nested-class-other-compilation-unit/TestNestedClassWithParentInAnotherCU.py (977 of 2028)
PASS: lldb-api :: functionalities/thread/concurrent_events/TestConcurrentManyBreakpoints.py (978 of 2028)
PASS: lldb-api :: commands/expression/two-files/TestObjCTypeQueryFromOtherCompileUnit.py (979 of 2028)
UNSUPPORTED: lldb-api :: functionalities/tsan/global_location/TestTsanGlobalLocation.py (980 of 2028)
PASS: lldb-api :: python_api/type/TestTypeList.py (981 of 2028)
PASS: lldb-unit :: Host/./HostTests/NativeProcessProtocolTest.SetBreakpoint (982 of 2028)
PASS: lldb-shell :: SymbolFile/Breakpad/line-table-discontinuous-file-ids.test (983 of 2028)
PASS: lldb-api :: lang/cpp/class_static/TestStaticVariables.py (984 of 2028)
PASS: lldb-api :: macosx/dyld-trie-symbols/TestDyldTrieSymbols.py (985 of 2028)
PASS: lldb-api :: lang/objcxx/objcxx-ivar-vector/TestIvarVector.py (986 of 2028)
UNSUPPORTED: lldb-api :: linux/thread/create_during_instruction_step/TestCreateDuringInstructionStep.py (987 of 2028)
PASS: lldb-unit :: Target/./TargetTests/StackFrameRecognizerTest.NullModuleRegex (988 of 2028)
PASS: lldb-api :: functionalities/optimized_code/TestNoASanExceptionAfterEvalOP_piece.py (989 of 2028)
PASS: lldb-api :: commands/target/stop-hooks/TestStopHooks.py (990 of 2028)
PASS: lldb-unit :: UnwindAssembly/x86/./UnwindAssemblyx86Tests/Testx86AssemblyInspectionEngine.TestPush0 (991 of 2028)
PASS: lldb-api :: lang/objc/orderedset/TestOrderedSet.py (992 of 2028)
PASS: lldb-unit :: SymbolFile/NativePDB/./SymbolFileNativePDBTests/PDBFPOProgramToDWARFExpressionTests.UnresolvedRegisterAssignmentReference (993 of 2028)
PASS: lldb-unit :: UnwindAssembly/x86/./UnwindAssemblyx86Tests/Testx86AssemblyInspectionEngine.TestDisassemblyMidFunctionEpilogues (994 of 2028)
PASS: lldb-unit :: Utility/./UtilityTests/OptionsWithRawTest.EmptySuffix (995 of 2028)
PASS: lldb-unit :: Utility/./UtilityTests/ConstStringTest.CompareConstString (996 of 2028)
PASS: lldb-unit :: Utility/./UtilityTests/ConstStringTest.CompareStringRef (997 of 2028)
PASS: lldb-api :: functionalities/data-formatter/poarray/TestPrintObjectArray.py (998 of 2028)
PASS: lldb-unit :: ObjectFile/PECOFF/./ObjectFilePECOFFTests/PECallFrameInfoTest.Basic_eh (999 of 2028)
PASS: lldb-api :: functionalities/source-map/TestTargetSourceMap.py (1000 of 2028)
PASS: lldb-api :: python_api/value_var_update/TestValueVarUpdate.py (1001 of 2028)
UNSUPPORTED: lldb-shell :: SymbolFile/DWARF/dwarf5_locations.s (1002 of 2028)
PASS: lldb-unit :: Utility/./UtilityTests/ArchSpecTest.TestParseMachCPUDashSubtypeTripleSimple (1003 of 2028)
PASS: lldb-unit :: UnwindAssembly/x86/./UnwindAssemblyx86Tests/Testx86AssemblyInspectionEngine.TestPushEDI (1004 of 2028)
PASS: lldb-shell :: Driver/TestConvenienceVariables.test (1005 of 2028)
PASS: lldb-unit :: Utility/./UtilityTests/CompletionRequest.DuplicateFilteringWithComments (1006 of 2028)
PASS: lldb-shell :: ObjectFile/ELF/minidebuginfo-find-symbols.yaml (1007 of 2028)
PASS: lldb-api :: functionalities/breakpoint/objc/TestObjCBreakpoints.py (1008 of 2028)
PASS: lldb-api :: commands/expression/import-std-module/queue/TestQueueFromStdModule.py (1009 of 2028)
PASS: lldb-unit :: Utility/./UtilityTests/DataExtractorTest.GetCStrUnterminated (1010 of 2028)
PASS: lldb-shell :: ObjectFile/Breakpad/sections.test (1011 of 2028)
PASS: lldb-unit :: Utility/./UtilityTests/StringExtractorTest.GetHexBytesAvail_OddPair (1012 of 2028)
UNSUPPORTED: lldb-api :: commands/watchpoints/variable_out_of_scope/TestWatchedVarHitWhenInScope.py (1013 of 2028)
PASS: lldb-unit :: Symbol/./SymbolTests/TestTypeSystemClang.TestGetEnumIntegerTypeUnexpectedType (1014 of 2028)
PASS: lldb-shell :: Reproducer/Functionalities/TestStepping.test (1015 of 2028)
UNSUPPORTED: lldb-api :: functionalities/thread/concurrent_events/TestConcurrentSignalWatchBreak.py (1016 of 2028)
PASS: lldb-api :: macosx/save_crashlog/TestSaveCrashlog.py (1017 of 2028)
PASS: lldb-api :: functionalities/data-formatter/data-formatter-objc/TestDataFormatterObjCNSData.py (1018 of 2028)
PASS: lldb-api :: commands/expression/expr-in-syscall/TestExpressionInSyscall.py (1019 of 2028)
PASS: lldb-api :: functionalities/gdb_remote_client/TestNoGPacketSupported.py (1020 of 2028)
PASS: lldb-api :: commands/expression/ir-interpreter-phi-nodes/TestIRInterpreterPHINodes.py (1021 of 2028)
UNSUPPORTED: lldb-shell :: SymbolFile/DWARF/debug-types-basic.test (1022 of 2028)
UNSUPPORTED: lldb-api :: lang/objc/bitfield_ivars/TestBitfieldIvars.py (1023 of 2028)
PASS: lldb-api :: lang/cpp/type_lookup/TestCppTypeLookup.py (1024 of 2028)
PASS: lldb-shell :: ObjectFile/ELF/section-permissions.yaml (1025 of 2028)
PASS: lldb-unit :: Utility/./UtilityTests/StreamTest.PutChar (1026 of 2028)
PASS: lldb-unit :: Process/gdb-remote/./ProcessGdbRemoteTests/GDBRemoteClientBaseTest.SendContinueAndWait (1027 of 2028)
PASS: lldb-unit :: Utility/./UtilityTests/RegularExpression.Match (1028 of 2028)
PASS: lldb-shell :: Commands/command-backtrace.test (1029 of 2028)
PASS: lldb-api :: functionalities/tail_call_frames/inlining_and_tail_calls/TestInliningAndTailCalls.py (1030 of 2028)
PASS: lldb-api :: lang/cpp/dynamic-value/TestDynamicValue.py (1031 of 2028)
PASS: lldb-api :: functionalities/data-formatter/data-formatter-objc/TestDataFormatterObjNSException.py (1032 of 2028)
PASS: lldb-api :: types/TestIntegerTypeExpr.py (1033 of 2028)
PASS: lldb-api :: lang/objc/objc-property/TestObjCProperty.py (1034 of 2028)
PASS: lldb-unit :: Process/gdb-remote/./ProcessGdbRemoteTests/GDBRemoteCommunicationServerTest.SendErrorResponse_UnimplementedError (1035 of 2028)
PASS: lldb-api :: sanity/TestSettingSkipping.py (1036 of 2028)
PASS: lldb-unit :: ScriptInterpreter/Python/./ScriptInterpreterPythonTests/PythonDataObjectsTest.TestPythonTupleToStructuredList (1037 of 2028)
PASS: lldb-api :: commands/frame/diagnose/bad-reference/TestBadReference.py (1038 of 2028)
PASS: lldb-unit :: Utility/./UtilityTests/RangeDataVector.FindEntryThatContains_Overlap (1039 of 2028)
PASS: lldb-unit :: Language/Highlighting/./HighlighterTests/HighlighterTest.ClangCursorPosInOtherToken (1040 of 2028)
PASS: lldb-unit :: Symbol/./SymbolTests/TestTypeSystemClang.TestRemoveFastQualifiers (1041 of 2028)
PASS: lldb-unit :: Utility/./UtilityTests/LogChannelTest.Enable (1042 of 2028)
PASS: lldb-api :: functionalities/unwind/noreturn/TestNoreturnUnwind.py (1043 of 2028)
PASS: lldb-unit :: Utility/./UtilityTests/VASprintfTest.EncodingError (1044 of 2028)
PASS: lldb-unit :: Utility/./UtilityTests/StreamTest.PutRawBytesToMixedEndian (1045 of 2028)
PASS: lldb-unit :: Utility/./UtilityTests/RegularExpression.CopyAssignment (1046 of 2028)
PASS: lldb-unit :: Language/Highlighting/./HighlighterTests/HighlighterTest.ClangOperators (1047 of 2028)
UNSUPPORTED: lldb-api :: arm/breakpoint-thumb-codesection/TestBreakpointThumbCodesection.py (1048 of 2028)
PASS: lldb-unit :: Host/./HostTests/FileSystemTest.EnumerateDirectory (1049 of 2028)
UNSUPPORTED: lldb-api :: functionalities/thread/concurrent_events/TestConcurrentCrashWithWatchpoint.py (1050 of 2028)
UNSUPPORTED: lldb-api :: functionalities/ubsan/user-expression/TestUbsanUserExpression.py (1051 of 2028)
PASS: lldb-unit :: Utility/./UtilityTests/RecordReplayTest.InstrumentedBar (1052 of 2028)
PASS: lldb-api :: commands/expression/anonymous-struct/TestCallUserAnonTypedef.py (1053 of 2028)
PASS: lldb-shell :: SymbolFile/DWARF/debug_loc-aslr.s (1054 of 2028)
PASS: lldb-unit :: Utility/./UtilityTests/ArchSpecTest.OperatorBool (1055 of 2028)
PASS: lldb-unit :: Utility/./UtilityTests/StringListTest.InsertStringAtIndexMove (1056 of 2028)
PASS: lldb-unit :: Utility/./UtilityTests/UUIDTest.StringConverion (1057 of 2028)
PASS: lldb-unit :: Utility/./UtilityTests/ArgsTest.TestTrailingBackslash (1058 of 2028)
PASS: lldb-unit :: Utility/./UtilityTests/ArchSpecTest.Compatibility (1059 of 2028)
UNSUPPORTED: lldb-shell :: ObjectFile/PECOFF/export-dllfunc.yaml (1060 of 2028)
PASS: lldb-shell :: SymbolFile/Breakpad/symtab-macho.test (1061 of 2028)
PASS: lldb-shell :: SymbolFile/DWARF/parallel-indexing-stress.s (1062 of 2028)
PASS: lldb-api :: lang/c/offsetof/TestOffsetof.py (1063 of 2028)
PASS: lldb-unit :: Utility/./UtilityTests/ScalarTest.Equality (1064 of 2028)
UNSUPPORTED: lldb-api :: tools/lldb-server/signal-filtering/TestGdbRemote_QPassSignals.py (1065 of 2028)
UNSUPPORTED: lldb-shell :: SymbolFile/DWARF/find-inline-method.s (1066 of 2028)
UNSUPPORTED: lldb-shell :: SymbolFile/DWARF/find-method.cpp (1067 of 2028)
PASS: lldb-unit :: Utility/./UtilityTests/UriParserTest.PortOverflow (1068 of 2028)
UNSUPPORTED: lldb-shell :: Watchpoint/netbsd-nouserdbregs.test (1069 of 2028)
PASS: lldb-unit :: Expression/./ExpressionTests/CppModuleConfigurationTest.LinuxLocalLibCpp (1070 of 2028)
PASS: lldb-unit :: Utility/./UtilityTests/UriParserTest.SchemeHostSeparator2 (1071 of 2028)
PASS: lldb-api :: commands/expression/completion-in-lambda-and-unnamed-class/TestCompletionInLambdaAndUnnamedClass.py (1072 of 2028)
PASS: lldb-unit :: Utility/./UtilityTests/StreamTest.PutBytesAsRawHex8ToMixedEndian (1073 of 2028)
PASS: lldb-unit :: Expression/./ExpressionTests/DiagnosticManagerTest.PutString (1074 of 2028)
PASS: lldb-unit :: Utility/./UtilityTests/BinaryStreamTest.PutULEB128TwoBytes (1075 of 2028)
PASS: lldb-unit :: Utility/./UtilityTests/StreamTeeTest.DefaultConstructor (1076 of 2028)
PASS: lldb-unit :: ScriptInterpreter/Python/./ScriptInterpreterPythonTests/PythonDataObjectsTest.TestPythonIntegerToStructuredInteger (1077 of 2028)
UNSUPPORTED: lldb-api :: functionalities/data-formatter/data-formatter-stl/libstdcpp/unique_ptr/TestDataFormatterStdUniquePtr.py (1078 of 2028)
PASS: lldb-shell :: SymbolFile/DWARF/split-dwarf-multiple-cu.ll (1079 of 2028)
PASS: lldb-unit :: Expression/./ExpressionTests/DiagnosticManagerTest.GetStringNoDiags (1080 of 2028)
PASS: lldb-unit :: Core/./LLDBCoreTests/RichManglingContextTest.Basic (1081 of 2028)
PASS: lldb-api :: commands/frame/diagnose/dereference-this/TestDiagnoseDereferenceThis.py (1082 of 2028)
PASS: lldb-unit :: Utility/./UtilityTests/StringListTest.AppendStringCString (1083 of 2028)
PASS: lldb-unit :: Process/minidump/./LLDBMinidumpTests/MinidumpParserTest.FindMemoryRangeWithFullMemoryMinidump (1084 of 2028)
PASS: lldb-unit :: Process/gdb-remote/./ProcessGdbRemoteTests/GDBRemoteClientBaseTest.SendContinueDelegateInterface (1085 of 2028)
PASS: lldb-shell :: ObjectFile/PECOFF/basic-info-arm64.yaml (1086 of 2028)
PASS: lldb-api :: commands/expression/import-std-module/shared_ptr/TestSharedPtrFromStdModule.py (1087 of 2028)
PASS: lldb-shell :: Reproducer/TestDriverOptions.test (1088 of 2028)
PASS: lldb-shell :: ObjectFile/ELF/PT_TLS-overlap-PT_LOAD.yaml (1089 of 2028)
PASS: lldb-unit :: Utility/./UtilityTests/StringListTest.JoinSingle (1090 of 2028)
PASS: lldb-shell :: SymbolFile/DWARF/DW_AT_loclists_base.s (1091 of 2028)
UNSUPPORTED: lldb-shell :: SymbolFile/DWARF/dir-separator-windows.s (1092 of 2028)
UNSUPPORTED: lldb-api :: functionalities/thread/concurrent_events/TestConcurrentSignalNWatchNBreak.py (1093 of 2028)
PASS: lldb-unit :: Host/./HostTests/SocketTest.DomainListenConnectAccept (1094 of 2028)
PASS: lldb-unit :: UnwindAssembly/x86/./UnwindAssemblyx86Tests/Testx86AssemblyInspectionEngine.TestPopESI (1095 of 2028)
PASS: lldb-unit :: Utility/./UtilityTests/StringExtractorTest.GetHexBytesAvail_Underflow (1096 of 2028)
UNSUPPORTED: lldb-shell :: SymbolFile/NativePDB/tag-types.cpp (1097 of 2028)
PASS: lldb-unit :: Process/gdb-remote/./ProcessGdbRemoteTests/GDBRemoteClientBaseTest.SendContinueAndAsyncSignal (1098 of 2028)
PASS: lldb-unit :: Core/./LLDBCoreTests/MangledTest.ResultForBlockInvocation (1099 of 2028)
UNSUPPORTED: lldb-shell :: SymbolFile/dissassemble-entry-point.s (1100 of 2028)
PASS: lldb-shell :: SymbolFile/DWARF/dwo-type-in-main-file.s (1101 of 2028)
PASS: lldb-api :: lang/c/conflicting-symbol/TestConflictingSymbol.py (1102 of 2028)
PASS: lldb-api :: python_api/class_members/TestSBTypeClassMembers.py (1103 of 2028)
PASS: lldb-unit :: Host/./HostTests/NativeProcessProtocolTest.ReadCStringFromMemory_MaxSize (1104 of 2028)
UNSUPPORTED: lldb-api :: functionalities/data-formatter/data-formatter-stl/libstdcpp/vbool/TestDataFormatterStdVBool.py (1105 of 2028)
PASS: lldb-shell :: SymbolFile/Breakpad/unwind-via-stack-cfi.test (1106 of 2028)
UNSUPPORTED: lldb-shell :: SymbolFile/PDB/calling-conventions.test (1107 of 2028)
PASS: lldb-unit :: Utility/./UtilityTests/CompletionRequest.TryCompleteCurrentArgMode (1108 of 2028)
PASS: lldb-unit :: SymbolFile/DWARF/./SymbolFileDWARFTests/SymbolFileDWARFTests.TestAbilitiesForDWARF (1109 of 2028)
UNSUPPORTED: lldb-api :: arm/breakpoint-it/TestBreakpointIt.py (1110 of 2028)
PASS: lldb-shell :: SymbolFile/DWARF/compilercontext.ll (1111 of 2028)
PASS: lldb-api :: functionalities/postmortem/minidump-new/TestMiniDumpUUID.py (1112 of 2028)
PASS: lldb-unit :: Expression/./ExpressionTests/CppModuleConfigurationTest.AmbiguousCLib (1113 of 2028)
PASS: lldb-unit :: SymbolFile/NativePDB/./SymbolFileNativePDBTests/PDBFPOProgramToDWARFExpressionTests.SingleAssignmentRegisterRef (1114 of 2028)
UNSUPPORTED: lldb-api :: tools/lldb-vscode/completions/TestVSCode_completions.py (1115 of 2028)
PASS: lldb-unit :: Utility/./UtilityTests/AnsiTerminal.WhiteSpace (1116 of 2028)
PASS: lldb-unit :: Utility/./UtilityTests/AnsiTerminal.AtEnd (1117 of 2028)
PASS: lldb-unit :: Utility/./UtilityTests/StreamTest.PutHex8 (1118 of 2028)
PASS: lldb-shell :: Settings/TestFrameFormatNoColor.test (1119 of 2028)
PASS: lldb-api :: functionalities/tail_call_frames/cross_object/TestCrossObjectTailCalls.py (1120 of 2028)
PASS: lldb-api :: types/TestLongTypes.py (1121 of 2028)
PASS: lldb-shell :: ObjectFile/ELF/PT_LOAD-overlap-PT_TLS.yaml (1122 of 2028)
UNSUPPORTED: lldb-shell :: Register/x86-64-gp-write.test (1123 of 2028)
PASS: lldb-api :: lang/objc/exceptions/TestObjCExceptions.py (1124 of 2028)
UNSUPPORTED: lldb-shell :: SymbolFile/NativePDB/typedefs.cpp (1125 of 2028)
PASS: lldb-unit :: Utility/./UtilityTests/StringListTest.ForRangeEmpty (1126 of 2028)
PASS: lldb-unit :: Utility/./UtilityTests/StreamTeeTest.GetStreamAtIndexOutOfBounds (1127 of 2028)
PASS: lldb-api :: lang/c/set_values/TestSetValues.py (1128 of 2028)
PASS: lldb-unit :: UnwindAssembly/x86/./UnwindAssemblyx86Tests/Testx86AssemblyInspectionEngine.TestPopRBPWithREX (1129 of 2028)
PASS: lldb-unit :: Utility/./UtilityTests/UriParserTest.SchemeHostSeparator (1130 of 2028)
PASS: lldb-api :: lang/cpp/rvalue-references/TestRvalueReferences.py (1131 of 2028)
PASS: lldb-api :: python_api/hello_world/TestHelloWorld.py (1132 of 2028)
UNSUPPORTED: lldb-shell :: ScriptInterpreter/Lua/bindings.test (1133 of 2028)
PASS: lldb-unit :: DataFormatter/./LLDBFormatterTests/StringPrinterTests.CxxASCII (1134 of 2028)
PASS: lldb-unit :: Utility/./UtilityTests/OptionsWithRawTest.WhitespaceSuffix (1135 of 2028)
UNSUPPORTED: lldb-api :: lang/cpp/function-template-parameter-pack/TestFunctionTemplateParameterPack.py (1136 of 2028)
PASS: lldb-unit :: ScriptInterpreter/Python/./ScriptInterpreterPythonTests/PythonDataObjectsTest.TestPythonDictionaryValueEquality (1137 of 2028)
PASS: lldb-api :: functionalities/breakpoint/auto_continue/TestBreakpointAutoContinue.py (1138 of 2028)
PASS: lldb-unit :: Symbol/./SymbolTests/TestClangASTImporter.ImportInvalidType (1139 of 2028)
PASS: lldb-unit :: Utility/./UtilityTests/RangeTest.ContainsAddr (1140 of 2028)
PASS: lldb-api :: lang/cpp/global_operators/TestCppGlobalOperators.py (1141 of 2028)
PASS: lldb-unit :: Utility/./UtilityTests/FileSpecTest.EqualDotsPosixRoot (1142 of 2028)
PASS: lldb-api :: functionalities/param_entry_vals/basic_entry_values/TestBasicEntryValues.py (1143 of 2028)
PASS: lldb-api :: lang/cpp/auto/TestCPPAuto.py (1144 of 2028)
PASS: lldb-api :: lang/c/array_types/TestArrayTypes.py (1145 of 2028)
PASS: lldb-api :: commands/expression/persistent_types/TestPersistentTypes.py (1146 of 2028)
PASS: lldb-unit :: Expression/./ExpressionTests/CppModuleConfigurationTest.Sysroot (1147 of 2028)
PASS: lldb-unit :: Core/./LLDBCoreTests/CommunicationTest.SynchronizeWhileClosing (1148 of 2028)
PASS: lldb-unit :: Utility/./UtilityTests/BinaryStreamTest.PutSLEB128MaxValue (1149 of 2028)
PASS: lldb-unit :: Utility/./UtilityTests/ArgsTest.TestSingleArg (1150 of 2028)
PASS: lldb-api :: lang/cpp/virtual-overload/TestVirtualOverload.py (1151 of 2028)
UNSUPPORTED: lldb-api :: lang/objc/modules-update/TestClangModulesUpdate.py (1152 of 2028)
PASS: lldb-unit :: Utility/./UtilityTests/RangeTest.Union (1153 of 2028)
PASS: lldb-unit :: Utility/./UtilityTests/StreamTest.AddressSuffix (1154 of 2028)
PASS: lldb-shell :: SymbolFile/DWARF/split-dwarf-inlining.cpp (1155 of 2028)
PASS: lldb-api :: api/check_public_api_headers/TestPublicAPIHeaders.py (1156 of 2028)
UNSUPPORTED: lldb-api :: lang/objc/modules-incomplete/TestIncompleteModules.py (1157 of 2028)
PASS: lldb-unit :: Utility/./UtilityTests/StreamTeeTest.Flush (1158 of 2028)
UNSUPPORTED: lldb-shell :: SymbolFile/PDB/function-level-linking.test (1159 of 2028)
PASS: lldb-unit :: Language/Highlighting/./HighlighterTests/HighlighterTest.ClangCursorPosAfterOtherToken (1160 of 2028)
UNSUPPORTED: lldb-shell :: SymbolFile/NativePDB/function-types-classes.cpp (1161 of 2028)
UNSUPPORTED: lldb-shell :: Register/x86-64-xmm16-read.test (1162 of 2028)
PASS: lldb-api :: functionalities/data-formatter/data-formatter-stl/libcxx/string/TestDataFormatterLibcxxString.py (1163 of 2028)
PASS: lldb-unit :: Symbol/./SymbolTests/Type.CompilerContextPattern (1164 of 2028)
PASS: lldb-api :: commands/expression/import-std-module/deque-basic/TestDequeFromStdModule.py (1165 of 2028)
PASS: lldb-api :: functionalities/breakpoint/debugbreak/TestDebugBreak.py (1166 of 2028)
PASS: lldb-unit :: ObjectFile/Breakpad/./ObjectFileBreakpadTests/PublicRecord.parse (1167 of 2028)
PASS: lldb-api :: commands/log/basic/TestLogging.py (1168 of 2028)
UNSUPPORTED: lldb-api :: functionalities/darwin_log/source/info/TestDarwinLogSourceInfo.py (1169 of 2028)
PASS: lldb-api :: functionalities/breakpoint/breakpoint_options/TestBreakpointOptions.py (1170 of 2028)
UNSUPPORTED: lldb-api :: commands/watchpoints/watchpoint_commands/condition/TestWatchpointConditionCmd.py (1171 of 2028)
PASS: lldb-unit :: Utility/./UtilityTests/StringExtractorTest.GetHexBytes_OddPair2 (1172 of 2028)
PASS: lldb-api :: lang/objc/radar-9691614/TestObjCMethodReturningBOOL.py (1173 of 2028)
PASS: lldb-api :: commands/command/script/import/TestImport.py (1174 of 2028)
PASS: lldb-unit :: Symbol/./SymbolTests/LineEntryTest.GetSameLineContiguousAddressRangeNoInlines (1175 of 2028)
UNSUPPORTED: lldb-api :: benchmarks/expression/TestRepeatedExprs.py (1176 of 2028)
UNSUPPORTED: lldb-api :: functionalities/thread/thread_specific_break_plus_condition/TestThreadSpecificBpPlusCondition.py (1177 of 2028)
PASS: lldb-unit :: SymbolFile/NativePDB/./SymbolFileNativePDBTests/PDBFPOProgramToDWARFExpressionTests.UnsupportedRASearch (1178 of 2028)
PASS: lldb-unit :: Utility/./UtilityTests/ProcessInstanceInfoList.Yaml (1179 of 2028)
UNSUPPORTED: lldb-api :: api/multiple-debuggers/TestMultipleDebuggers.py (1180 of 2028)
PASS: lldb-unit :: ObjectFile/Breakpad/./ObjectFileBreakpadTests/Record.classify (1181 of 2028)
PASS: lldb-shell :: ObjectFile/ELF/duplicate-section.yaml (1182 of 2028)
PASS: lldb-unit :: Symbol/./SymbolTests/TestTypeSystemClang.TestOwningModule (1183 of 2028)
PASS: lldb-unit :: Utility/./UtilityTests/CompletionRequest.Constructor (1184 of 2028)
PASS: lldb-api :: types/TestDoubleTypesExpr.py (1185 of 2028)
PASS: lldb-unit :: Utility/./UtilityTests/ScalarTest.APIntConstructor (1186 of 2028)
UNSUPPORTED: lldb-api :: functionalities/data-formatter/data-formatter-stl/libstdcpp/map/TestDataFormatterStdMap.py (1187 of 2028)
PASS: lldb-api :: functionalities/breakpoint/step_over_breakpoint/TestStepOverBreakpoint.py (1188 of 2028)
PASS: lldb-api :: lang/cpp/namespace_definitions/TestNamespaceDefinitions.py (1189 of 2028)
UNSUPPORTED: lldb-shell :: Register/x86-zmm-read.test (1190 of 2028)
PASS: lldb-unit :: Language/Highlighting/./HighlighterTests/HighlighterTest.ClangCursorPosBeforeOtherToken (1191 of 2028)
PASS: lldb-api :: commands/expression/radar_9531204/TestPrintfAfterUp.py (1192 of 2028)
UNSUPPORTED: lldb-shell :: SymbolFile/NativePDB/stack_unwinding01.cpp (1193 of 2028)
PASS: lldb-unit :: Utility/./UtilityTests/StringListTest.CopyListSingle (1194 of 2028)
PASS: lldb-unit :: Symbol/./SymbolTests/DWARFCallFrameInfoTest.Basic_dwarf4 (1195 of 2028)
UNSUPPORTED: lldb-api :: commands/watchpoints/watchpoint_commands/command/TestWatchpointCommandPython.py (1196 of 2028)
PASS: lldb-shell :: SymbolFile/DWARF/dwarf5-atomic.s (1197 of 2028)
PASS: lldb-unit :: Utility/./UtilityTests/StringLexerTest.GetUnlexed (1198 of 2028)
PASS: lldb-unit :: Symbol/./SymbolTests/DWARFCallFrameInfoTest.Basic_eh (1199 of 2028)
PASS: lldb-unit :: Utility/./UtilityTests/CompletionRequest.TryCompleteCurrentArgBad (1200 of 2028)
PASS: lldb-unit :: Utility/./UtilityTests/StringListTest.AppendList (1201 of 2028)
UNSUPPORTED: lldb-api :: functionalities/thread/concurrent_events/TestConcurrentSignalWatch.py (1202 of 2028)
PASS: lldb-unit :: Host/./HostTests/MainLoopTest.UnmonitoredSignal (1203 of 2028)
PASS: lldb-shell :: Quit/TestQuitExitCodeHexA.test (1204 of 2028)
UNSUPPORTED: lldb-shell :: SymbolFile/Breakpad/stack-cfi-arm.yaml (1205 of 2028)
PASS: lldb-api :: functionalities/data-formatter/data-formatter-globals/TestDataFormatterGlobals.py (1206 of 2028)
PASS: lldb-unit :: ScriptInterpreter/Python/./ScriptInterpreterPythonTests/PythonDataObjectsTest.TestGlobalNameResolutionWithDot (1207 of 2028)
PASS: lldb-api :: commands/expression/po_verbosity/TestPoVerbosity.py (1208 of 2028)
PASS: lldb-unit :: Language/Highlighting/./HighlighterTests/HighlighterTest.ClangIdentifiers (1209 of 2028)
PASS: lldb-unit :: ObjectFile/Breakpad/./ObjectFileBreakpadTests/StackCFIRecord.parse (1210 of 2028)
PASS: lldb-unit :: Utility/./UtilityTests/StringExtractorTest.GetU64BigEndian (1211 of 2028)
PASS: lldb-shell :: ObjectFile/PECOFF/basic-info-arm.yaml (1212 of 2028)
PASS: lldb-unit :: Utility/./UtilityTests/StringExtractorTest.GetHexU8_Exact_NoEof (1213 of 2028)
PASS: lldb-unit :: Utility/./UtilityTests/EnvironmentTest.EnvpConversion (1214 of 2028)
PASS: lldb-api :: python_api/sbplatform/TestSBPlatform.py (1215 of 2028)
PASS: lldb-unit :: Utility/./UtilityTests/BinaryStreamTest.PutSLEB128EightBytes (1216 of 2028)
PASS: lldb-unit :: Utility/./UtilityTests/OptionsWithRawTest.UnterminatedQuote (1217 of 2028)
UNSUPPORTED: lldb-api :: commands/register/register/intel_xtended_registers/mpx_bound_violation/TestBoundViolation.py (1218 of 2028)
PASS: lldb-api :: python_api/lldbutil/frame/TestFrameUtils.py (1219 of 2028)
PASS: lldb-api :: lang/cpp/wchar_t/TestCxxWCharT.py (1220 of 2028)
PASS: lldb-unit :: Utility/./UtilityTests/StreamTest.PutHex32ByteOrderLittle (1221 of 2028)
UNSUPPORTED: lldb-api :: functionalities/tsan/cpp_global_location/TestTsanCPPGlobalLocation.py (1222 of 2028)
PASS: lldb-api :: functionalities/data-formatter/data-formatter-stl/libcxx/iterator/TestDataFormatterLibccIterator.py (1223 of 2028)
PASS: lldb-api :: lang/objc/objc-new-syntax/TestObjCNewSyntaxLiteral.py (1224 of 2028)
PASS: lldb-unit :: Utility/./UtilityTests/ProcessInfoTest.Constructor (1225 of 2028)
PASS: lldb-api :: commands/frame/diagnose/inheritance/TestDiagnoseInheritance.py (1226 of 2028)
PASS: lldb-unit :: Expression/./ExpressionTests/CppModuleConfigurationTest.UnknownLibCppFile (1227 of 2028)
PASS: lldb-unit :: Symbol/./SymbolTests/TestTypeSystemClang.TestDeletingImplicitCopyCstrDueToMoveCStr (1228 of 2028)
UNSUPPORTED: lldb-shell :: ScriptInterpreter/Lua/lua.test (1229 of 2028)
PASS: lldb-unit :: Utility/./UtilityTests/StringExtractorTest.GetU64LittleEndian (1230 of 2028)
PASS: lldb-api :: lang/c/local_types/TestUseClosestType.py (1231 of 2028)
PASS: lldb-unit :: Utility/./UtilityTests/ArgsTest.TestSingleQuotedArgWithSpace (1232 of 2028)
PASS: lldb-unit :: Utility/./UtilityTests/ArgsTest.AppendArguments (1233 of 2028)
PASS: lldb-unit :: Utility/./UtilityTests/RangeTest.DoesIntersect (1234 of 2028)
PASS: lldb-unit :: SymbolFile/NativePDB/./SymbolFileNativePDBTests/PDBFPOProgramToDWARFExpressionTests.InvalidAssignmentSingle (1235 of 2028)
PASS: lldb-unit :: Utility/./UtilityTests/StreamTest.AddressEmptyPrefix (1236 of 2028)
PASS: lldb-unit :: Utility/./UtilityTests/StreamTest.PutSLEB128 (1237 of 2028)
PASS: lldb-unit :: Utility/./UtilityTests/StreamTest.AddressPrefix (1238 of 2028)
PASS: lldb-unit :: Utility/./UtilityTests/FileSpecTest.FileAndDirectoryComponents (1239 of 2028)
PASS: lldb-api :: functionalities/data-formatter/frameformat_smallstruct/TestFrameFormatSmallStruct.py (1240 of 2028)
PASS: lldb-shell :: ObjectFile/ELF/aarch64-relocations.yaml (1241 of 2028)
PASS: lldb-api :: commands/expression/fixits/TestFixIts.py (1242 of 2028)
PASS: lldb-unit :: UnwindAssembly/x86/./UnwindAssemblyx86Tests/Testx86AssemblyInspectionEngine.TestPushR14 (1243 of 2028)
UNSUPPORTED: lldb-shell :: SymbolFile/NativePDB/ast-functions-msvc.cpp (1244 of 2028)
UNSUPPORTED: lldb-shell :: SymbolFile/DWARF/debug-types-signature-loop.s (1245 of 2028)
PASS: lldb-api :: lang/c/find_struct_type/TestFindStructTypes.py (1246 of 2028)
PASS: lldb-api :: functionalities/data-formatter/data-formatter-stl/libcxx/multiset/TestDataFormatterLibcxxMultiSet.py (1247 of 2028)
PASS: lldb-api :: lang/objcxx/class-name-clash/TestNameClash.py (1248 of 2028)
PASS: lldb-api :: commands/target/create-deps/TestTargetCreateDeps.py (1249 of 2028)
PASS: lldb-unit :: Utility/./UtilityTests/UriParserTest.SchemeHostSeparator4 (1250 of 2028)
UNSUPPORTED: lldb-shell :: Breakpoint/case-insensitive.test (1251 of 2028)
PASS: lldb-unit :: DataFormatter/./LLDBFormatterTests/StringPrinterTests.CxxUTF8 (1252 of 2028)
UNSUPPORTED: lldb-api :: functionalities/thread/break_after_join/TestBreakAfterJoin.py (1253 of 2028)
PASS: lldb-unit :: Utility/./UtilityTests/ScalarTest.Comparison (1254 of 2028)
PASS: lldb-unit :: debugserver/./debugserverTests/RNBSocket.LoopBackListenIPv4 (1255 of 2028)
PASS: lldb-api :: functionalities/thread/concurrent_events/TestConcurrentTwoBreakpointsOneDelaySignal.py (1256 of 2028)
UNSUPPORTED: lldb-shell :: SymbolFile/NativePDB/s_constant.cpp (1257 of 2028)
PASS: lldb-api :: commands/settings/TestSettings.py (1258 of 2028)
PASS: lldb-unit :: Utility/./UtilityTests/StringListTest.PopBack (1259 of 2028)
PASS: lldb-unit :: Symbol/./SymbolTests/TestClangASTImporter.MetadataPropagationAfterCopying (1260 of 2028)
PASS: lldb-shell :: Quit/TestQuitExitCode-30.test (1261 of 2028)
PASS: lldb-api :: tools/lldb-vscode/launch/TestVSCode_launch.py (1262 of 2028)
PASS: lldb-api :: lang/objc/objc-struct-return/TestObjCStructReturn.py (1263 of 2028)
PASS: lldb-api :: tools/lldb-server/TestGdbRemoteAttach.py (1264 of 2028)
PASS: lldb-unit :: Host/./HostTests/NativeProcessProtocolTest.SetBreakpointFailRead (1265 of 2028)
PASS: lldb-shell :: Commands/command-disassemble.s (1266 of 2028)
PASS: lldb-unit :: Language/CPlusPlus/./LanguageCPlusPlusTests/CPlusPlusLanguage.CPlusPlusNameParser (1267 of 2028)
PASS: lldb-unit :: Utility/./UtilityTests/StructuredDataTest.ParseJSONFromFile (1268 of 2028)
PASS: lldb-unit :: Utility/./UtilityTests/StreamTeeTest.Constructor2Streams (1269 of 2028)
PASS: lldb-unit :: Utility/./UtilityTests/BinaryStreamTest.PutULEB128FourBytes (1270 of 2028)
UNSUPPORTED: lldb-api :: commands/watchpoints/multi_watchpoint_slots/TestWatchpointMultipleSlots.py (1271 of 2028)
PASS: lldb-api :: functionalities/breakpoint/breakpoint_set_restart/TestBreakpointSetRestart.py (1272 of 2028)
PASS: lldb-api :: tools/lldb-server/TestGdbRemoteHostInfo.py (1273 of 2028)
PASS: lldb-unit :: Process/minidump/./LLDBMinidumpTests/MinidumpParserTest.GetThreadContext_x86_32_wow64 (1274 of 2028)
PASS: lldb-unit :: Utility/./UtilityTests/StringExtractorTest.GetHexBytesAvail (1275 of 2028)
PASS: lldb-unit :: Utility/./UtilityTests/FileSpecTest.Yaml (1276 of 2028)
PASS: lldb-unit :: Breakpoint/./LLDBBreakpointTests/BreakpointIDTest.StringIsBreakpointName (1277 of 2028)
PASS: lldb-unit :: Utility/./UtilityTests/FileSpecTest.Match (1278 of 2028)
PASS: lldb-api :: commands/expression/save_jit_objects/TestSaveJITObjects.py (1279 of 2028)
PASS: lldb-unit :: Core/./LLDBCoreTests/RichManglingContextTest.SwitchProvider (1280 of 2028)
PASS: lldb-unit :: ScriptInterpreter/Python/./ScriptInterpreterPythonTests/PythonDataObjectsTest.TestPythonFile (1281 of 2028)
PASS: lldb-api :: commands/expression/result_numbering/TestResultNumbering.py (1282 of 2028)
UNSUPPORTED: lldb-api :: functionalities/thread/concurrent_events/TestConcurrentDelayedCrashWithBreakpointWatchpoint.py (1283 of 2028)
PASS: lldb-api :: tools/lldb-server/inferior-crash/TestGdbRemoteSegFault.py (1284 of 2028)
PASS: lldb-unit :: Expression/./ExpressionTests/CppModuleConfigurationTest.Linux (1285 of 2028)
UNSUPPORTED: lldb-shell :: ObjectFile/PECOFF/uuid.yaml (1286 of 2028)
PASS: lldb-unit :: Process/gdb-remote/./ProcessGdbRemoteTests/GDBRemoteCommunicationClientTest.WriteRegister (1287 of 2028)
PASS: lldb-unit :: UnwindAssembly/x86/./UnwindAssemblyx86Tests/Testx86AssemblyInspectionEngine.TestPushEDX (1288 of 2028)
PASS: lldb-shell :: SymbolFile/Breakpad/unwind-via-stack-win-no-memory-info.yaml (1289 of 2028)
PASS: lldb-unit :: Utility/./UtilityTests/UriParserTest.BracketedHostnamePort (1290 of 2028)
PASS: lldb-api :: functionalities/data-formatter/summary-string-onfail/Test-rdar-9974002.py (1291 of 2028)
UNSUPPORTED: lldb-api :: benchmarks/libcxxmap/TestBenchmarkLibcxxMap.py (1292 of 2028)
UNSUPPORTED: lldb-shell :: SymbolFile/DWARF/dwarf5-index-is-used.cpp (1293 of 2028)
PASS: lldb-unit :: ScriptInterpreter/Python/./ScriptInterpreterPythonTests/PythonDataObjectsTest.TestExtractingUInt64ThroughStructuredData (1294 of 2028)
PASS: lldb-unit :: Utility/./UtilityTests/StringListTest.InsertStringAtIndexStart (1295 of 2028)
PASS: lldb-unit :: Symbol/./SymbolTests/TestClangASTImporter.CanImportInvalidType (1296 of 2028)
UNSUPPORTED: lldb-api :: functionalities/process_save_core/TestProcessSaveCore.py (1297 of 2028)
PASS: lldb-api :: commands/expression/pr35310/TestExprsBug35310.py (1298 of 2028)
PASS: lldb-unit :: Host/./HostTests/SocketTest.UDPConnect (1299 of 2028)
PASS: lldb-unit :: Utility/./UtilityTests/EventTest.DumpEventDataBytes (1300 of 2028)
PASS: lldb-unit :: Utility/./UtilityTests/StringListTest.SplitIntoLines (1301 of 2028)
PASS: lldb-unit :: Utility/./UtilityTests/UriParserTest.Minimal (1302 of 2028)
UNSUPPORTED: lldb-api :: functionalities/tty/TestTerminal.py (1303 of 2028)
PASS: lldb-unit :: SymbolFile/DWARF/./SymbolFileDWARFTests/SymbolFileDWARFTests.TestAbbrevOrder1Start5 (1304 of 2028)
PASS: lldb-shell :: Breakpoint/single-file-split-dwarf.test (1305 of 2028)
PASS: lldb-unit :: ScriptInterpreter/Python/./ScriptInterpreterPythonTests/PythonDataObjectsTest.TestDictionaryResolutionWithDot (1306 of 2028)
PASS: lldb-unit :: Utility/./UtilityTests/UserIDResolver.GetUserName (1307 of 2028)
PASS: lldb-api :: functionalities/type_lookup/TestTypeLookup.py (1308 of 2028)
PASS: lldb-api :: commands/target/dump-symtab-demangle/TestDumpSymtabDemangle.py (1309 of 2028)
PASS: lldb-api :: commands/expression/import-std-module/vector-dbg-info-content/TestDbgInfoContentVectorFromStdModule.py (1310 of 2028)
PASS: lldb-api :: python_api/disassemble-raw-data/TestDisassembleRawData.py (1311 of 2028)
PASS: lldb-shell :: Unwind/eh-frame-dwarf-unwind.test (1312 of 2028)
PASS: lldb-unit :: SymbolFile/DWARF/./SymbolFileDWARFTests/DWARFASTParserClangTests.EnsureAllDIEsInDeclContextHaveBeenParsedParsesOnlyMatchingEntries (1313 of 2028)
PASS: lldb-unit :: Symbol/./SymbolTests/PostfixExpression.ToDWARF (1314 of 2028)
PASS: lldb-unit :: Symbol/./SymbolTests/TestTypeSystemClang.TestUnifyAccessSpecifiers (1315 of 2028)
PASS: lldb-api :: commands/expression/import-std-module/forward_list/TestForwardListFromStdModule.py (1316 of 2028)
PASS: lldb-unit :: Utility/./UtilityTests/UserIDResolver.GetGroupName (1317 of 2028)
PASS: lldb-shell :: Driver/TestCore.test (1318 of 2028)
UNSUPPORTED: lldb-api :: functionalities/asan/TestMemoryHistory.py (1319 of 2028)
PASS: lldb-api :: functionalities/data-formatter/ostypeformatting/TestFormattersOsType.py (1320 of 2028)
UNSUPPORTED: lldb-api :: functionalities/thread/concurrent_events/TestConcurrentTwoWatchpointsOneDelayBreakpoint.py (1321 of 2028)
PASS: lldb-api :: tools/lldb-vscode/variables/TestVSCode_variables.py (1322 of 2028)
PASS: lldb-unit :: Core/./LLDBCoreTests/MangledTest.ResultForValidName (1323 of 2028)
PASS: lldb-shell :: Breakpoint/dummy-target.test (1324 of 2028)
PASS: lldb-api :: functionalities/data-formatter/data-formatter-stl/libcxx/bitset/TestDataFormatterLibcxxBitset.py (1325 of 2028)
PASS: lldb-unit :: Expression/./ExpressionTests/DiagnosticManagerTest.GetStringSeverityLabels (1326 of 2028)
PASS: lldb-unit :: ScriptInterpreter/Python/./ScriptInterpreterPythonTests/PythonDataObjectsTest.TestPythonBytes (1327 of 2028)
PASS: lldb-api :: functionalities/memory/cache/TestMemoryCache.py (1328 of 2028)
PASS: lldb-unit :: Utility/./UtilityTests/StringListTest.LongestCommonPrefix (1329 of 2028)
PASS: lldb-unit :: Process/gdb-remote/./ProcessGdbRemoteTests/GDBRemoteCommunicationClientTest.SendStartTracePacket (1330 of 2028)
PASS: lldb-api :: python_api/interpreter/TestCommandInterpreterAPI.py (1331 of 2028)
UNSUPPORTED: lldb-shell :: SymbolFile/NativePDB/function-types-builtins.cpp (1332 of 2028)
PASS: lldb-api :: lang/objc/objc-stepping/TestObjCStepping.py (1333 of 2028)
UNSUPPORTED: lldb-shell :: SymbolFile/DWARF/dir-separator-no-comp-dir-relative-name.s (1334 of 2028)
PASS: lldb-shell :: BuildScript/compiler-full-path.test (1335 of 2028)
PASS: lldb-unit :: Process/gdb-remote/./ProcessGdbRemoteTests/GDBRemoteCommunicationServerTest.SendErrorResponse_ErrorList (1336 of 2028)
PASS: lldb-unit :: Utility/./UtilityTests/OptionsWithRawTest.EmptySuffixSingleWhitespace (1337 of 2028)
PASS: lldb-shell :: Commands/CommandScriptImmediateOutput/CommandScriptImmediateOutputConsole.test (1338 of 2028)
PASS: lldb-api :: lang/cpp/enum_types/TestCPP11EnumTypes.py (1339 of 2028)
PASS: lldb-api :: lang/objc/objc-baseclass-sbtype/TestObjCBaseClassSBType.py (1340 of 2028)
PASS: lldb-api :: commands/gui/invalid-args/TestInvalidArgsGui.py (1341 of 2028)
PASS: lldb-api :: commands/disassemble/basic/TestDisassembleBreakpoint.py (1342 of 2028)
PASS: lldb-api :: python_api/process/TestProcessAPI.py (1343 of 2028)
UNSUPPORTED: lldb-shell :: Register/x86-ymm-write.test (1344 of 2028)
PASS: lldb-unit :: Utility/./UtilityTests/StringExtractorTest.GetNameColonValueNoColon (1345 of 2028)
PASS: lldb-unit :: ScriptInterpreter/Python/./ScriptInterpreterPythonTests/PythonDataObjectsTest.TestPythonBoolean (1346 of 2028)
PASS: lldb-unit :: Utility/./UtilityTests/StreamTest.PutCStringWithStringRef (1347 of 2028)
PASS: lldb-api :: functionalities/exec/TestExec.py (1348 of 2028)
PASS: lldb-api :: python_api/symbol-context/TestSymbolContext.py (1349 of 2028)
UNSUPPORTED: lldb-shell :: SymbolFile/PDB/ast-restore.test (1350 of 2028)
PASS: lldb-unit :: Utility/./UtilityTests/StreamTest.ShiftOperatorPtr (1351 of 2028)
UNSUPPORTED: lldb-shell :: ScriptInterpreter/Lua/command_script_import.test (1352 of 2028)
PASS: lldb-unit :: Interpreter/./InterpreterTests/OptionArgParserTest.toScriptLanguage (1353 of 2028)
PASS: lldb-api :: types/TestCharTypeExpr.py (1354 of 2028)
PASS: lldb-api :: functionalities/data-formatter/data-formatter-objc/TestDataFormatterObjCNSBundle.py (1355 of 2028)
PASS: lldb-api :: functionalities/multidebugger_commands/TestMultipleDebuggersCommands.py (1356 of 2028)
PASS: lldb-unit :: Utility/./UtilityTests/StringExtractorTest.GetU32LittleEndian (1357 of 2028)
PASS: lldb-api :: commands/apropos/basic/TestApropos.py (1358 of 2028)
PASS: lldb-api :: functionalities/data-formatter/refpointer-recursion/TestDataFormatterRefPtrRecursion.py (1359 of 2028)
PASS: lldb-unit :: Utility/./UtilityTests/LogTest.Register (1360 of 2028)
PASS: lldb-unit :: UnwindAssembly/x86/./UnwindAssemblyx86Tests/Testx86AssemblyInspectionEngine.TestPopEBP (1361 of 2028)
PASS: lldb-unit :: Utility/./UtilityTests/ArgsTest.ReplaceArgumentAtIndexEqual (1362 of 2028)
PASS: lldb-api :: tools/lldb-server/TestGdbRemoteExpeditedRegisters.py (1363 of 2028)
UNSUPPORTED: lldb-api :: functionalities/thread/concurrent_events/TestConcurrentTwoWatchpointsOneSignal.py (1364 of 2028)
PASS: lldb-unit :: Symbol/./SymbolTests/SymbolsTest.TerminateLocateExecutableSymbolFileForUnknownExecutableAndUnknownSymbolFile (1365 of 2028)
PASS: lldb-unit :: Utility/./UtilityTests/OptionsWithRawTest.TerminatedQuote (1366 of 2028)
PASS: lldb-api :: iohandler/unicode/TestUnicode.py (1367 of 2028)
PASS: lldb-api :: commands/expression/persistent_types/TestNestedPersistentTypes.py (1368 of 2028)
PASS: lldb-unit :: Language/Highlighting/./HighlighterTests/HighlighterTest.Keywords (1369 of 2028)
PASS: lldb-api :: tools/lldb-server/TestGdbRemoteProcessInfo.py (1370 of 2028)
UNSUPPORTED: lldb-shell :: Register/aarch64-gp-read.test (1371 of 2028)
PASS: lldb-unit :: Host/./HostTests/SocketAddressTest.Set (1372 of 2028)
PASS: lldb-api :: python_api/module_section/TestModuleAndSection.py (1373 of 2028)
PASS: lldb-unit :: UnwindAssembly/x86/./UnwindAssemblyx86Tests/Testx86AssemblyInspectionEngine.TestReturnDetect (1374 of 2028)
PASS: lldb-unit :: Utility/./UtilityTests/FileSpecTest.AppendPathComponent (1375 of 2028)
PASS: lldb-unit :: Utility/./UtilityTests/RangeTest.Copy (1376 of 2028)
PASS: lldb-unit :: Symbol/./SymbolTests/TestTypeSystemClang.AddMethodToObjCObjectType (1377 of 2028)
PASS: lldb-unit :: Utility/./UtilityTests/Flags.GetBitSize (1378 of 2028)
PASS: lldb-shell :: SymbolFile/Breakpad/line-table-missing-file.test (1379 of 2028)
PASS: lldb-unit :: Utility/./UtilityTests/StringListTest.Assignment (1380 of 2028)
UNSUPPORTED: lldb-shell :: SymbolFile/PDB/variables-locations.test (1381 of 2028)
PASS: lldb-api :: functionalities/data-formatter/data-formatter-objc/TestDataFormatterObjCNSContainer.py (1382 of 2028)
PASS: lldb-api :: functionalities/data-formatter/data-formatter-synthtype/TestDataFormatterSynthType.py (1383 of 2028)
PASS: lldb-api :: lang/objc/modules-inline-functions/TestModulesInlineFunctions.py (1384 of 2028)
UNSUPPORTED: lldb-shell :: ExecControl/StopHook/stop-hook-threads.test (1385 of 2028)
PASS: lldb-api :: commands/expression/import-std-module/list/TestListFromStdModule.py (1386 of 2028)
PASS: lldb-api :: macosx/safe-to-func-call/TestSafeFuncCalls.py (1387 of 2028)
PASS: lldb-unit :: ObjectFile/ELF/./ObjectFileELFTests/ObjectFileELFTest.GetSymtab_NoSymEntryPointArmThumbAddressClass (1388 of 2028)
PASS: lldb-unit :: Utility/./UtilityTests/RangeTest.NotEqualInvalid (1389 of 2028)
PASS: lldb-shell :: Driver/TestPositionalArgs.test (1390 of 2028)
PASS: lldb-unit :: SymbolFile/DWARF/./SymbolFileDWARFTests/XcodeSDKModuleTests.TestModuleGetXcodeSDK (1391 of 2028)
PASS: lldb-api :: functionalities/memory/find/TestMemoryFind.py (1392 of 2028)
PASS: lldb-unit :: Utility/./UtilityTests/StringListTest.LongestCommonPrefixNoPrefix (1393 of 2028)
PASS: lldb-shell :: SymbolFile/DWARF/clang-ast-from-dwarf-objc-property.m (1394 of 2028)
PASS: lldb-unit :: ScriptInterpreter/Python/./ScriptInterpreterPythonTests/PythonDataObjectsTest.TestPythonString (1395 of 2028)
UNSUPPORTED: lldb-shell :: BuildScript/toolchain-clang-cl.test (1396 of 2028)
PASS: lldb-unit :: Utility/./UtilityTests/UriParserTest.MinimalPath (1397 of 2028)
PASS: lldb-api :: functionalities/data-formatter/var-in-aggregate-misuse/TestVarInAggregateMisuse.py (1398 of 2028)
PASS: lldb-api :: lang/objc/objc-optimized/TestObjcOptimized.py (1399 of 2028)
PASS: lldb-unit :: Utility/./UtilityTests/ArgsTest.TestUnknownEscape (1400 of 2028)
PASS: lldb-api :: python_api/objc_type/TestObjCType.py (1401 of 2028)
PASS: lldb-api :: lang/cpp/unique-types/TestUniqueTypes.py (1402 of 2028)
PASS: lldb-unit :: ScriptInterpreter/Python/./ScriptInterpreterPythonTests/PythonDataObjectsTest.TestOwnedReferences (1403 of 2028)
PASS: lldb-unit :: Utility/./UtilityTests/NameMatchesTest.Contains (1404 of 2028)
PASS: lldb-api :: lang/objc/objc-class-method/TestObjCClassMethod.py (1405 of 2028)
PASS: lldb-unit :: Utility/./UtilityTests/RangeTest.DoesAdjoinOrIntersect (1406 of 2028)
UNSUPPORTED: lldb-shell :: SymbolFile/DWARF/dwarf5-partial-index.cpp (1407 of 2028)
PASS: lldb-unit :: UnwindAssembly/x86/./UnwindAssemblyx86Tests/Testx86AssemblyInspectionEngine.TestPushExtended (1408 of 2028)
PASS: lldb-api :: functionalities/type_completion/TestTypeCompletion.py (1409 of 2028)
PASS: lldb-api :: terminal/TestEditline.py (1410 of 2028)
PASS: lldb-unit :: Utility/./UtilityTests/DataExtractorTest.UncommonAddressSize (1411 of 2028)
PASS: lldb-unit :: Signals/./SignalsTests/UnixSignalsTest.GetFilteredSignals (1412 of 2028)
PASS: lldb-unit :: UnwindAssembly/x86/./UnwindAssemblyx86Tests/Testx86AssemblyInspectionEngine.Testi386IgnoredRegisters (1413 of 2028)
PASS: lldb-unit :: Utility/./UtilityTests/BroadcasterTest.EventTypeHasListeners (1414 of 2028)
PASS: lldb-api :: commands/breakpoint/command/list/TestBreakpointCommandList.py (1415 of 2028)
PASS: lldb-unit :: Utility/./UtilityTests/DeserializerTest.HasData (1416 of 2028)
PASS: lldb-api :: functionalities/data-formatter/data-formatter-objc/TestDataFormatterObjCNSError.py (1417 of 2028)
PASS: lldb-unit :: UnwindAssembly/x86/./UnwindAssemblyx86Tests/Testx86AssemblyInspectionEngine.TestStackRealign32BitDisp_x86_64 (1418 of 2028)
PASS: lldb-unit :: ScriptInterpreter/Python/./ScriptInterpreterPythonTests/PythonDataObjectsTest.TestPythonStringToStr (1419 of 2028)
PASS: lldb-api :: functionalities/gdb_remote_client/TestTargetXMLArch.py (1420 of 2028)
PASS: lldb-unit :: Utility/./UtilityTests/UriParserTest.MinimalPort (1421 of 2028)
PASS: lldb-unit :: SymbolFile/DWARF/./SymbolFileDWARFTests/SymbolFileDWARFTests.TestAbbrevValidAttrNullForm (1422 of 2028)
UNSUPPORTED: lldb-api :: functionalities/breakpoint/breakpoint_in_delayslot/TestAvoidBreakpointInDelaySlot.py (1423 of 2028)
PASS: lldb-unit :: Process/gdb-remote/./ProcessGdbRemoteTests/GDBRemoteClientBaseTest.InterruptNoResponse (1424 of 2028)
PASS: lldb-unit :: Process/gdb-remote/./ProcessGdbRemoteTests/GDBRemoteClientBaseTest.SendPacketAndReceiveResponseWithOutputSupport (1425 of 2028)
UNSUPPORTED: lldb-shell :: SymbolFile/DWARF/array-sizes.s (1426 of 2028)
PASS: lldb-unit :: UnwindAssembly/x86/./UnwindAssemblyx86Tests/Testx86AssemblyInspectionEngine.TestPopEDI (1427 of 2028)
PASS: lldb-shell :: Process/UnsupportedLanguage.test (1428 of 2028)
PASS: lldb-shell :: Driver/TestProcessAttach.test (1429 of 2028)
PASS: lldb-api :: types/TestCharType.py (1430 of 2028)
PASS: lldb-unit :: Symbol/./SymbolTests/TestTypeSystemClang.TestFunctionTemplateConstruction (1431 of 2028)
UNSUPPORTED: lldb-api :: functionalities/thread/concurrent_events/TestConcurrentManySignals.py (1432 of 2028)
PASS: lldb-unit :: Utility/./UtilityTests/ScalarTest.ExtractBitfield (1433 of 2028)
PASS: lldb-shell :: ObjectFile/ELF/section-types-edgecases.yaml (1434 of 2028)
PASS: lldb-api :: commands/expression/multiline-navigation/TestMultilineNavigation.py (1435 of 2028)
PASS: lldb-api :: arm/emulation/TestEmulations.py (1436 of 2028)
PASS: lldb-shell :: SymbolFile/Breakpad/line-table-mixed-path-styles.test (1437 of 2028)
PASS: lldb-api :: functionalities/breakpoint/breakpoint_callback_command_source/TestBreakpointCallbackCommandSource.py (1438 of 2028)
PASS: lldb-unit :: Expression/./ExpressionTests/ClangHostTest.ComputeClangResourceDirectory (1439 of 2028)
PASS: lldb-unit :: Utility/./UtilityTests/SerializationRountripTest.SerializeDeserializeCStringArray (1440 of 2028)
PASS: lldb-api :: types/TestLongTypesExpr.py (1441 of 2028)
PASS: lldb-unit :: Utility/./UtilityTests/TimeoutTest.Construction (1442 of 2028)
UNSUPPORTED: lldb-api :: commands/expression/import_builtin_fileid/TestImportBuiltinFileID.py (1443 of 2028)
PASS: lldb-unit :: Symbol/./SymbolTests/PostfixExpression.ParseFPOProgram (1444 of 2028)
PASS: lldb-unit :: Expression/./ExpressionTests/DiagnosticManagerTest.GetStringMultiline (1445 of 2028)
PASS: lldb-unit :: UnwindAssembly/x86/./UnwindAssemblyx86Tests/Testx86AssemblyInspectionEngine.TestSimple64bitFrameFunction (1446 of 2028)
PASS: lldb-unit :: Utility/./UtilityTests/LogChannelTest.List (1447 of 2028)
PASS: lldb-api :: lang/objc/blocks/TestObjCIvarsInBlocks.py (1448 of 2028)
PASS: lldb-unit :: tools/lldb-server/tests/./LLDBServerTests/StandardStartupTest.TestStopReplyContainsThreadPcs (1449 of 2028)
PASS: lldb-api :: functionalities/data-formatter/dump_dynamic/TestDumpDynamic.py (1450 of 2028)
PASS: lldb-unit :: Utility/./UtilityTests/StringExtractorTest.InitEmpty (1451 of 2028)
PASS: lldb-unit :: Symbol/./SymbolTests/TestClangASTImporter.DeportDeclTagDecl (1452 of 2028)
PASS: lldb-api :: python_api/sbdata/TestSBData.py (1453 of 2028)
PASS: lldb-unit :: Utility/./UtilityTests/StreamTeeTest.GetStreamAtIndexOutOfBoundsEmpty (1454 of 2028)
PASS: lldb-api :: functionalities/gdb_remote_client/TestNoWatchpointSupportInfo.py (1455 of 2028)
UNSUPPORTED: lldb-api :: benchmarks/libcxxlist/TestBenchmarkLibcxxList.py (1456 of 2028)
PASS: lldb-unit :: Target/./TargetTests/PathMappingListTest.RemapRoot (1457 of 2028)
PASS: lldb-api :: functionalities/tail_call_frames/unambiguous_sequence/TestUnambiguousTailCalls.py (1458 of 2028)
PASS: lldb-api :: functionalities/data-formatter/hexcaps/TestDataFormatterHexCaps.py (1459 of 2028)
PASS: lldb-api :: lang/cpp/unsigned_types/TestUnsignedTypes.py (1460 of 2028)
PASS: lldb-api :: functionalities/data-formatter/data-formatter-stl/libcxx/map/TestDataFormatterLibccMap.py (1461 of 2028)
PASS: lldb-shell :: Breakpoint/implicit_const_form_support.test (1462 of 2028)
PASS: lldb-api :: commands/expression/invalid-args/TestInvalidArgsExpression.py (1463 of 2028)
PASS: lldb-api :: commands/settings/quoting/TestQuoting.py (1464 of 2028)
PASS: lldb-unit :: Utility/./UtilityTests/StateTest.Formatv (1465 of 2028)
PASS: lldb-unit :: Utility/./UtilityTests/LogChannelEnabledTest.LLDB_LOG_ERROR (1466 of 2028)
PASS: lldb-api :: functionalities/breakpoint/inlined_breakpoints/TestInlinedBreakpoints.py (1467 of 2028)
UNSUPPORTED: lldb-shell :: Reproducer/TestLuaImport.test (1468 of 2028)
PASS: lldb-unit :: Utility/./UtilityTests/EnvironmentTest.EnvpConstruction (1469 of 2028)
PASS: lldb-api :: tools/lldb-server/TestGdbRemoteExitCode.py (1470 of 2028)
PASS: lldb-api :: functionalities/step_scripted/TestStepScripted.py (1471 of 2028)
PASS: lldb-unit :: Utility/./UtilityTests/TimerTest.CategoryTimesNested (1472 of 2028)
PASS: lldb-api :: macosx/profile_vrs_detach/TestDetachVrsProfile.py (1473 of 2028)
PASS: lldb-api :: functionalities/completion/TestCompletion.py (1474 of 2028)
PASS: lldb-unit :: Host/./HostTests/ConnectionFileDescriptorTest.TCPGetURIv4 (1475 of 2028)
UNSUPPORTED: lldb-api :: commands/expression/call-restarts/TestCallThatRestarts.py (1476 of 2028)
PASS: lldb-api :: python_api/frame/inlines/TestInlinedFrame.py (1477 of 2028)
PASS: lldb-unit :: Utility/./UtilityTests/RegularExpression.Empty (1478 of 2028)
PASS: lldb-unit :: Utility/./UtilityTests/VASprintfTest.BufferResize (1479 of 2028)
PASS: lldb-api :: lang/objc/foundation/TestSymbolTable.py (1480 of 2028)
PASS: lldb-api :: lang/cpp/char8_t/TestCxxChar8_t.py (1481 of 2028)
PASS: lldb-unit :: Utility/./UtilityTests/StringLexerTest.PutBack (1482 of 2028)
PASS: lldb-shell :: SymbolFile/DWARF/find-qualified-variable.cpp (1483 of 2028)
PASS: lldb-unit :: Utility/./UtilityTests/BinaryStreamTest.PutULEB128SixBytes (1484 of 2028)
UNSUPPORTED: lldb-api :: android/platform/TestDefaultCacheLineSize.py (1485 of 2028)
PASS: lldb-unit :: Expression/./ExpressionTests/CppModuleConfigurationTest.IgnoreLibStdCpp (1486 of 2028)
PASS: lldb-api :: lang/objc/objc-ivar-offsets/TestObjCIvarOffsets.py (1487 of 2028)
PASS: lldb-api :: lang/c/step_over_no_deadlock/TestStepOverDoesntBlock.py (1488 of 2028)
PASS: lldb-unit :: UnwindAssembly/x86/./UnwindAssemblyx86Tests/Testx86AssemblyInspectionEngine.TestPopRBP (1489 of 2028)
PASS: lldb-api :: functionalities/data-formatter/data-formatter-objc/nsindexpath/TestDataFormatterNSIndexPath.py (1490 of 2028)
PASS: lldb-unit :: Host/./HostTests/HostInfoTest.GetXcodeSDK (1491 of 2028)
PASS: lldb-unit :: SymbolFile/NativePDB/./SymbolFileNativePDBTests/PDBFPOProgramToDWARFExpressionTests.DependencyChain (1492 of 2028)
PASS: lldb-unit :: Utility/./UtilityTests/SerializationRountripTest.SerializeDeserializeObjectReference (1493 of 2028)
PASS: lldb-api :: lang/cpp/dynamic-value/TestCppValueCast.py (1494 of 2028)
PASS: lldb-api :: functionalities/data-formatter/data-formatter-cpp/TestDataFormatterCpp.py (1495 of 2028)
PASS: lldb-api :: functionalities/postmortem/netbsd-core/TestNetBSDCore.py (1496 of 2028)
PASS: lldb-unit :: Utility/./UtilityTests/AnsiTerminal.Empty (1497 of 2028)
PASS: lldb-shell :: Minidump/no-process-id.yaml (1498 of 2028)
PASS: lldb-api :: commands/process/attach/TestProcessAttach.py (1499 of 2028)
PASS: lldb-api :: functionalities/unwind/zeroth_frame/TestZerothFrame.py (1500 of 2028)
PASS: lldb-api :: api/multithreaded/TestMultithreaded.py (1501 of 2028)
PASS: lldb-unit :: Utility/./UtilityTests/RecordReplayTest.InstrumentedFoo (1502 of 2028)
XFAIL: lldb-shell :: Unwind/prefer-debug-over-eh-frame.test (1503 of 2028)
PASS: lldb-unit :: Utility/./UtilityTests/UriParserTest.TypicalPortPathIPv4 (1504 of 2028)
PASS: lldb-api :: functionalities/gdb_remote_client/TestStopPCs.py (1505 of 2028)
UNSUPPORTED: lldb-shell :: Register/x86-gp-read.test (1506 of 2028)
PASS: lldb-shell :: ObjectFile/wasm/unified-debug-sections.yaml (1507 of 2028)
PASS: lldb-unit :: Process/minidump/./LLDBMinidumpTests/MinidumpParserTest.MinidumpDuplicateModuleMinAddress (1508 of 2028)
UNSUPPORTED: lldb-shell :: SymbolFile/NativePDB/ast-functions.cpp (1509 of 2028)
PASS: lldb-unit :: ScriptInterpreter/Python/./ScriptInterpreterPythonTests/PythonDataObjectsTest.TestPythonTupleInitializerList2 (1510 of 2028)
PASS: lldb-api :: functionalities/abbreviation/TestAbbreviations.py (1511 of 2028)
PASS: lldb-unit :: Target/./TargetTests/ExecutionContextTest.GetByteOrder (1512 of 2028)
UNSUPPORTED: lldb-shell :: SymbolFile/DWARF/debug-names-compressed.cpp (1513 of 2028)
PASS: lldb-api :: lang/objc/ivar-IMP/TestObjCiVarIMP.py (1514 of 2028)
UNSUPPORTED: lldb-api :: commands/expression/namespace_local_var_same_name_obj_c/TestNamespaceLocalVarSameNameObjC.py (1515 of 2028)
UNSUPPORTED: lldb-api :: lang/cpp/printf/TestPrintf.py (1516 of 2028)
PASS: lldb-shell :: SymbolFile/DWARF/debug_ranges-missing-section.s (1517 of 2028)
UNSUPPORTED: lldb-shell :: SymbolFile/DWARF/inline-function-address.ll (1518 of 2028)
PASS: lldb-unit :: Symbol/./SymbolTests/TestClangASTImporter.RecordLayout (1519 of 2028)
PASS: lldb-shell :: VSCode/TestOptions.test (1520 of 2028)
UNSUPPORTED: lldb-api :: commands/watchpoints/hello_watchpoint/TestMyFirstWatchpoint.py (1521 of 2028)
PASS: lldb-unit :: Utility/./UtilityTests/StatusTest.ErrorConstructor (1522 of 2028)
PASS: lldb-shell :: ObjectFile/ELF/PT_LOAD-overlap-section.yaml (1523 of 2028)
PASS: lldb-unit :: Utility/./UtilityTests/StringExtractorTest.GetHexU8_Underflow (1524 of 2028)
PASS: lldb-api :: functionalities/data-formatter/data-formatter-stl/libcxx/optional/TestDataFormatterLibcxxOptional.py (1525 of 2028)
UNSUPPORTED: lldb-api :: python_api/watchpoint/TestWatchpointIter.py (1526 of 2028)
UNSUPPORTED: lldb-api :: tools/lldb-server/TestGdbRemote_vContThreads.py (1527 of 2028)
PASS: lldb-api :: python_api/sbvalue_const_addrof/TestSBValueConstAddrOf.py (1528 of 2028)
PASS: lldb-api :: commands/platform/basic/TestPlatformPython.py (1529 of 2028)
PASS: lldb-unit :: Utility/./UtilityTests/CompletionRequest.DuplicateFiltering (1530 of 2028)
PASS: lldb-unit :: Expression/./ExpressionTests/DiagnosticManagerTest.AddDiagnostic (1531 of 2028)
PASS: lldb-api :: python_api/name_lookup/TestNameLookup.py (1532 of 2028)
PASS: lldb-api :: commands/gui/basic/TestGuiBasic.py (1533 of 2028)
PASS: lldb-unit :: Language/Highlighting/./HighlighterTests/HighlighterTest.Colons (1534 of 2028)
UNSUPPORTED: lldb-api :: linux/sepdebugsymlink/TestTargetSymbolsSepDebugSymlink.py (1535 of 2028)
PASS: lldb-api :: macosx/duplicate-archive-members/TestDuplicateMembers.py (1536 of 2028)
PASS: lldb-unit :: Process/gdb-remote/./ProcessGdbRemoteTests/GDBRemoteClientBaseTest.SendContinueAndInterrupt2PacketBug (1537 of 2028)
PASS: lldb-unit :: UnwindAssembly/x86/./UnwindAssemblyx86Tests/Testx86AssemblyInspectionEngine.TestPushEBP (1538 of 2028)
PASS: lldb-api :: commands/expression/import_base_class_when_class_has_derived_member/TestImportBaseClassWhenClassHasDerivedMember.py (1539 of 2028)
PASS: lldb-shell :: ObjectFile/MachO/subsections.yaml (1540 of 2028)
PASS: lldb-api :: lang/objc/foundation/TestObjCMethodsNSError.py (1541 of 2028)
PASS: lldb-api :: functionalities/inferior-assert/TestInferiorAssert.py (1542 of 2028)
PASS: lldb-shell :: Settings/TestFrameFormatMangling.test (1543 of 2028)
PASS: lldb-unit :: ScriptInterpreter/Python/./ScriptInterpreterPythonTests/PythonDataObjectsTest.TestPythonTupleSize (1544 of 2028)
PASS: lldb-unit :: Utility/./UtilityTests/StringExtractorTest.GetHexBytesAvail_FullString (1545 of 2028)
PASS: lldb-api :: lang/cpp/unicode-literals/TestUnicodeLiterals.py (1546 of 2028)
PASS: lldb-unit :: UnwindAssembly/x86/./UnwindAssemblyx86Tests/Testx86AssemblyInspectionEngine.TestStackRealignMSVC_i386 (1547 of 2028)
PASS: lldb-api :: functionalities/gdb_remote_client/TestArmRegisterDefinition.py (1548 of 2028)
PASS: lldb-api :: functionalities/gdb_remote_client/TestNestedRegDefinitions.py (1549 of 2028)
PASS: lldb-api :: commands/frame/diagnose/complicated-expression/TestComplicatedExpression.py (1550 of 2028)
PASS: lldb-api :: functionalities/signal/raise/TestRaise.py (1551 of 2028)
PASS: lldb-api :: functionalities/mtc/simple/TestMTCSimple.py (1552 of 2028)
PASS: lldb-api :: functionalities/gdb_remote_client/TestGDBRemoteLoad.py (1553 of 2028)
PASS: lldb-shell :: Settings/TestSettingsSet.test (1554 of 2028)
PASS: lldb-unit :: Utility/./UtilityTests/NameMatchesTest.EndsWith (1555 of 2028)
PASS: lldb-unit :: Utility/./UtilityTests/AnsiTerminal.KnownPrefix (1556 of 2028)
PASS: lldb-unit :: UnwindAssembly/x86/./UnwindAssemblyx86Tests/Testx86AssemblyInspectionEngine.TestSimplei386ugmented (1557 of 2028)
PASS: lldb-api :: lang/cpp/overloaded-functions/TestOverloadedFunctions.py (1558 of 2028)
PASS: lldb-unit :: Utility/./UtilityTests/StringListTest.JoinEmpty (1559 of 2028)
PASS: lldb-api :: commands/expression/call-function/TestCallBuiltinFunction.py (1560 of 2028)
PASS: lldb-unit :: Symbol/./SymbolTests/SymbolsTest.LocateExecutableSymbolFileForUnknownExecutableAndMissingSymbolFile (1561 of 2028)
PASS: lldb-shell :: Minidump/dump-all.test (1562 of 2028)
PASS: lldb-unit :: Utility/./UtilityTests/ArchSpecTest.MergeFromMachOUnknown (1563 of 2028)
PASS: lldb-api :: functionalities/data-formatter/data-formatter-stl/libcxx/list/TestDataFormatterLibcxxList.py (1564 of 2028)
PASS: lldb-unit :: Utility/./UtilityTests/NameMatchesTest.Ignore (1565 of 2028)
PASS: lldb-api :: functionalities/tail_call_frames/disambiguate_paths_to_common_sink/TestDisambiguatePathsToCommonSink.py (1566 of 2028)
PASS: lldb-api :: commands/expression/radar_9673664/TestExprHelpExamples.py (1567 of 2028)
PASS: lldb-unit :: Utility/./UtilityTests/ArchSpecTest.TestSetTriple (1568 of 2028)
PASS: lldb-unit :: Process/minidump/./LLDBMinidumpTests/MinidumpParserTest.GetThreadContext_x86_64 (1569 of 2028)
PASS: lldb-api :: lang/objcxx/hide-runtime-values/TestObjCXXHideRuntimeValues.py (1570 of 2028)
PASS: lldb-shell :: Minidump/Windows/Sigsegv/sigsegv.test (1571 of 2028)
PASS: lldb-unit :: Utility/./UtilityTests/StringListTest.GetMaxStringLengthEmpty (1572 of 2028)
PASS: lldb-api :: functionalities/breakpoint/global_constructor/TestBreakpointInGlobalConstructor.py (1573 of 2028)
PASS: lldb-unit :: Utility/./UtilityTests/ListenerTest.GetEventWait (1574 of 2028)
PASS: lldb-api :: functionalities/breakpoint/comp_dir_symlink/TestCompDirSymLink.py (1575 of 2028)
UNSUPPORTED: lldb-api :: functionalities/darwin_log/filter/regex/activity-chain/TestDarwinLogFilterRegexActivityChain.py (1576 of 2028)
PASS: lldb-shell :: Expr/TestIRMemoryMap.test (1577 of 2028)
PASS: lldb-unit :: Utility/./UtilityTests/LogChannelEnabledTest.LogGetLogThread (1578 of 2028)
PASS: lldb-unit :: Utility/./UtilityTests/StringExtractorTest.InitMisc (1579 of 2028)
PASS: lldb-unit :: Utility/./UtilityTests/StreamTest.PutBytesAsRawHex8ToLittleEndian (1580 of 2028)
PASS: lldb-unit :: Utility/./UtilityTests/StreamTest.AddressNoSuffix (1581 of 2028)
PASS: lldb-unit :: Process/gdb-remote/./ProcessGdbRemoteTests/GDBRemoteCommunicationClientTest.ReadRegister (1582 of 2028)
PASS: lldb-unit :: Utility/./UtilityTests/UUIDTest.Validity (1583 of 2028)
UNSUPPORTED: lldb-api :: python_api/watchpoint/TestWatchpointIgnoreCount.py (1584 of 2028)
PASS: lldb-unit :: Utility/./UtilityTests/LogTest.LLDB_LOG_nullptr (1585 of 2028)
PASS: lldb-api :: lang/objc/modules-non-objc-target/TestObjCModulesNonObjCTarget.py (1586 of 2028)
PASS: lldb-unit :: Utility/./UtilityTests/ArgsTest.ReplaceArgumentAtIndexShort (1587 of 2028)
PASS: lldb-api :: functionalities/inferior-crashing/recursive-inferior/TestRecursiveInferior.py (1588 of 2028)
PASS: lldb-unit :: Utility/./UtilityTests/ArgsTest.ReplaceArgumentAtIndexLonger (1589 of 2028)
PASS: lldb-api :: functionalities/data-formatter/data-formatter-proper-plurals/TestFormattersOneIsSingular.py (1590 of 2028)
PASS: lldb-api :: functionalities/data-formatter/nsdictionarysynth/TestNSDictionarySynthetic.py (1591 of 2028)
PASS: lldb-unit :: UnwindAssembly/x86/./UnwindAssemblyx86Tests/Testx86AssemblyInspectionEngine.TestAddESP (1592 of 2028)
PASS: lldb-unit :: Process/gdb-remote/./ProcessGdbRemoteTests/GDBRemoteCommunicationClientTest.GetQOffsets (1593 of 2028)
PASS: lldb-unit :: Utility/./UtilityTests/BinaryStreamTest.PutSLEB128FourBytes (1594 of 2028)
PASS: lldb-api :: lang/objc/foundation/TestObjCMethodsNSArray.py (1595 of 2028)
PASS: lldb-unit :: Utility/./UtilityTests/XcodeSDKTest.SDKSupportsModules (1596 of 2028)
PASS: lldb-api :: functionalities/ptr_refs/TestPtrRefs.py (1597 of 2028)
PASS: lldb-unit :: Process/minidump/./LLDBMinidumpTests/MinidumpParserTest.GetThreadContext_x86_32 (1598 of 2028)
PASS: lldb-api :: commands/frame/var/TestFrameVar.py (1599 of 2028)
PASS: lldb-api :: python_api/symbol-context/two-files/TestSymbolContextTwoFiles.py (1600 of 2028)
PASS: lldb-api :: functionalities/data-formatter/data-formatter-stl/libcxx/vbool/TestDataFormatterLibcxxVBool.py (1601 of 2028)
PASS: lldb-api :: commands/frame/var-scope/TestFrameVariableScope.py (1602 of 2028)
PASS: lldb-api :: functionalities/gdb_remote_client/TestJLink6Armv7RegisterDefinition.py (1603 of 2028)
PASS: lldb-unit :: Utility/./UtilityTests/SubsystemRAIITest.NormalSubsystem (1604 of 2028)
PASS: lldb-unit :: ScriptInterpreter/Python/./ScriptInterpreterPythonTests/PythonDataObjectsTest.TestExceptions (1605 of 2028)
PASS: lldb-unit :: Language/Highlighting/./HighlighterTests/HighlighterTest.ClangStringLiterals (1606 of 2028)
PASS: lldb-api :: functionalities/tail_call_frames/thread_step_out_or_return/TestSteppingOutWithArtificialFrames.py (1607 of 2028)
PASS: lldb-unit :: Utility/./UtilityTests/BinaryStreamTest.PutSLEB128One (1608 of 2028)
PASS: lldb-shell :: SymbolFile/DWARF/dwarf5-debug_line.s (1609 of 2028)
PASS: lldb-unit :: Core/./LLDBCoreTests/UniqueCStringMap.NoDefaultConstructor (1610 of 2028)
PASS: lldb-api :: python_api/lldbutil/iter/TestRegistersIterator.py (1611 of 2028)
PASS: lldb-unit :: Host/./HostTests/SocketTest.TCPGetConnectURI (1612 of 2028)
PASS: lldb-api :: functionalities/data-formatter/data-formatter-caching/TestDataFormatterCaching.py (1613 of 2028)
PASS: lldb-unit :: Utility/./UtilityTests/FileSpecTest.RemoveLastPathComponent (1614 of 2028)
PASS: lldb-unit :: Utility/./UtilityTests/StreamTest.AddressRangeEmptyRange (1615 of 2028)
PASS: lldb-api :: functionalities/data-formatter/synthupdate/TestSyntheticFilterRecompute.py (1616 of 2028)
UNSUPPORTED: lldb-shell :: Register/x86-64-zmm-read.test (1617 of 2028)
PASS: lldb-api :: lang/objcxx/cxx-bridged-po/TestObjCXXBridgedPO.py (1618 of 2028)
PASS: lldb-unit :: Utility/./UtilityTests/StringExtractorTest.GetHexU8_Underflow2 (1619 of 2028)
PASS: lldb-api :: functionalities/gdb_remote_client/TestRegDefinitionInParts.py (1620 of 2028)
PASS: lldb-api :: functionalities/gdb_remote_client/TestGDBRemoteClient.py (1621 of 2028)
UNSUPPORTED: lldb-shell :: SymbolFile/target-symbols-add-unwind.test (1622 of 2028)
PASS: lldb-api :: lang/objc/objc-static-method/TestObjCStaticMethod.py (1623 of 2028)
PASS: lldb-shell :: Reproducer/Functionalities/TestImageList.test (1624 of 2028)
PASS: lldb-api :: lang/cpp/dynamic-value-same-basename/TestDynamicValueSameBase.py (1625 of 2028)
PASS: lldb-api :: functionalities/thread/backtrace_limit/TestBacktraceLimit.py (1626 of 2028)
PASS: lldb-api :: commands/log/invalid-args/TestInvalidArgsLog.py (1627 of 2028)
PASS: lldb-api :: types/TestDoubleTypes.py (1628 of 2028)
UNSUPPORTED: lldb-shell :: SymbolFile/PDB/type-quals.test (1629 of 2028)
PASS: lldb-unit :: Utility/./UtilityTests/StreamTest.ShiftOperatorStrings (1630 of 2028)
PASS: lldb-api :: lang/cpp/exceptions/TestCPPExceptionBreakpoints.py (1631 of 2028)
PASS: lldb-shell :: Commands/command-disassemble-process.yaml (1632 of 2028)
UNSUPPORTED: lldb-api :: functionalities/data-formatter/data-formatter-stl/libstdcpp/list/TestDataFormatterStdList.py (1633 of 2028)
PASS: lldb-unit :: UnwindAssembly/x86/./UnwindAssemblyx86Tests/Testx86AssemblyInspectionEngine.TestPushImm (1634 of 2028)
PASS: lldb-unit :: Utility/./UtilityTests/StreamTest.PutCharNull (1635 of 2028)
PASS: lldb-unit :: SymbolFile/DWARF/./SymbolFileDWARFTests/SymbolFileDWARFTests.ParseArangesNonzeroSegmentSize (1636 of 2028)
UNSUPPORTED: lldb-shell :: SymbolFile/PDB/vbases.test (1637 of 2028)
PASS: lldb-unit :: Utility/./UtilityTests/StreamTest.PutNHex8 (1638 of 2028)
PASS: lldb-api :: python_api/sbvalue_persist/TestSBValuePersist.py (1639 of 2028)
UNSUPPORTED: lldb-api :: commands/register/register/intel_xtended_registers/TestMPXRegisters.py (1640 of 2028)
PASS: lldb-api :: functionalities/thread/concurrent_events/TestConcurrentTwoBreakpointThreads.py (1641 of 2028)
PASS: lldb-api :: python_api/exprpath_synthetic/TestExprPathSynthetic.py (1642 of 2028)
PASS: lldb-unit :: Process/gdb-remote/./ProcessGdbRemoteTests/GDBRemoteCommunicationClientTest.SendGetTraceConfigPacket (1643 of 2028)
PASS: lldb-unit :: Utility/./UtilityTests/SubsystemRAIITest.SubsystemWithErrorFailure (1644 of 2028)
PASS: lldb-api :: commands/process/launch-with-shellexpand/TestLaunchWithShellExpand.py (1645 of 2028)
PASS: lldb-unit :: Expression/./ExpressionTests/CppModuleConfigurationTest.UnrelatedLibrary (1646 of 2028)
PASS: lldb-api :: commands/expression/entry-bp/TestExprEntryBP.py (1647 of 2028)
PASS: lldb-shell :: Driver/TestTarget.test (1648 of 2028)
UNSUPPORTED: lldb-api :: functionalities/tsan/basic/TestTsanBasic.py (1649 of 2028)
PASS: lldb-shell :: Settings/TestFrameFormatColor.test (1650 of 2028)
PASS: lldb-unit :: Utility/./UtilityTests/ArgsTest.TestArgv (1651 of 2028)
PASS: lldb-api :: lang/c/modules/TestCModules.py (1652 of 2028)
PASS: lldb-shell :: ObjectFile/ELF/PT_LOAD-overlap-PT_INTERP.yaml (1653 of 2028)
PASS: lldb-unit :: Host/./HostTests/FileSystemTest.Exists (1654 of 2028)
PASS: lldb-unit :: Utility/./UtilityTests/FileSpecTest.GuessPathStyle (1655 of 2028)
UNSUPPORTED: lldb-shell :: SymbolFile/DWARF/debug-line-basic.s (1656 of 2028)
PASS: lldb-unit :: Utility/./UtilityTests/RangeDataVector.CustomSort (1657 of 2028)
PASS: lldb-unit :: Symbol/./SymbolTests/TestTypeSystemClang.TestConvertAccessTypeToAccessSpecifier (1658 of 2028)
UNSUPPORTED: lldb-api :: commands/target/auto-install-main-executable/TestAutoInstallMainExecutable.py (1659 of 2028)
PASS: lldb-api :: functionalities/data-formatter/boolreference/TestFormattersBoolRefPtr.py (1660 of 2028)
PASS: lldb-api :: python_api/value/empty_class/TestValueAPIEmptyClass.py (1661 of 2028)
PASS: lldb-unit :: Process/gdb-remote/./ProcessGdbRemoteTests/GDBRemoteCommunicationClientTest.GetModulesInfoInvalidResponse (1662 of 2028)
PASS: lldb-api :: commands/expression/top-level/TestTopLevelExprs.py (1663 of 2028)
PASS: lldb-api :: commands/process/attach-resume/TestAttachResume.py (1664 of 2028)
PASS: lldb-unit :: Utility/./UtilityTests/OptionsWithRawTest.LeadingSpaceArgs (1665 of 2028)
UNSUPPORTED: lldb-api :: functionalities/thread/concurrent_events/TestConcurrentBreakpointsDelayedBreakpointOneWatchpoint.py (1666 of 2028)
PASS: lldb-shell :: Settings/TestStopCommandSourceOnError.test (1667 of 2028)
PASS: lldb-unit :: Host/./HostTests/SocketTest.TCPListen0ConnectAccept (1668 of 2028)
PASS: lldb-unit :: ScriptInterpreter/Python/./ScriptInterpreterPythonTests/PythonDataObjectsTest.TestPythonTupleValues (1669 of 2028)
PASS: lldb-api :: functionalities/thread/step_until/TestStepUntil.py (1670 of 2028)
PASS: lldb-unit :: Symbol/./SymbolTests/TestTypeSystemClang.TestGetTypeClassTypeOf (1671 of 2028)
PASS: lldb-unit :: Utility/./UtilityTests/StringLexerTest.NextIf (1672 of 2028)
PASS: lldb-unit :: Utility/./UtilityTests/StringExtractorTest.DecodeHexU8_InvalidHex2 (1673 of 2028)
PASS: lldb-unit :: Utility/./UtilityTests/RangeTest.Clear (1674 of 2028)
PASS: lldb-unit :: Target/./TargetTests/ModuleCacheTest.GetAndPut (1675 of 2028)
PASS: lldb-unit :: Utility/./UtilityTests/LogChannelTest.Disable (1676 of 2028)
XFAIL: lldb-shell :: Register/x86-64-write.test (1677 of 2028)
PASS: lldb-shell :: Commands/command-script-import.test (1678 of 2028)
PASS: lldb-unit :: Utility/./UtilityTests/AnsiTerminal.Basic (1679 of 2028)
PASS: lldb-unit :: Language/CPlusPlus/./LanguageCPlusPlusTests/CPlusPlusLanguage.MethodNameParsing (1680 of 2028)
UNSUPPORTED: lldb-shell :: Register/arm-fp-read.test (1681 of 2028)
PASS: lldb-api :: macosx/version_zero/TestGetVersionZeroVersion.py (1682 of 2028)
UNSUPPORTED: lldb-api :: functionalities/longjmp/TestLongjmp.py (1683 of 2028)
PASS: lldb-unit :: Symbol/./SymbolTests/TestTypeSystemClang.TestIsClangType (1684 of 2028)
PASS: lldb-unit :: Utility/./UtilityTests/ArchSpecTest.TestParseMachCPUDashSubtypeTripleExtra (1685 of 2028)
UNSUPPORTED: lldb-api :: tools/intel-features/intel-pt/test/TestIntelPTSimpleBinary.py (1686 of 2028)
PASS: lldb-shell :: Heap/heap-cstr.test (1687 of 2028)
PASS: lldb-unit :: SymbolFile/NativePDB/./SymbolFileNativePDBTests/PDBFPOProgramToDWARFExpressionTests.UnresolvedDependentCyclicRegisterAssignmentReference (1688 of 2028)
PASS: lldb-api :: commands/expression/ignore-artificial-constructors/TestIgnoreArtificialConstructors.py (1689 of 2028)
PASS: lldb-shell :: Expr/TestTypeOfDeclTypeExpr.test (1690 of 2028)
PASS: lldb-unit :: Utility/./UtilityTests/DataExtractorTest.GetBitfield (1691 of 2028)
PASS: lldb-unit :: Utility/./UtilityTests/StreamTest.AddressPrefixAndSuffix (1692 of 2028)
PASS: lldb-unit :: UnwindAssembly/x86/./UnwindAssemblyx86Tests/Testx86AssemblyInspectionEngine.TestPushESI (1693 of 2028)
PASS: lldb-unit :: SymbolFile/DWARF/./SymbolFileDWARFTests/SymbolFileDWARFTests.TestAbbrevInvalidNULLTag (1694 of 2028)
PASS: lldb-shell :: Minidump/memory-region-from-module.yaml (1695 of 2028)
PASS: lldb-api :: macosx/nslog/TestDarwinNSLogOutput.py (1696 of 2028)
UNSUPPORTED: lldb-shell :: Register/x86-64-ymm16-write.test (1697 of 2028)
PASS: lldb-unit :: Host/./HostTests/MainLoopTest.Signal (1698 of 2028)
PASS: lldb-unit :: Utility/./UtilityTests/DataExtractorTest.GetMaxU64 (1699 of 2028)
PASS: lldb-api :: functionalities/data-formatter/data-formatter-objc/TestDataFormatterObjCPlain.py (1700 of 2028)
PASS: lldb-api :: tools/lldb-server/TestAppleSimulatorOSType.py (1701 of 2028)
PASS: lldb-unit :: Utility/./UtilityTests/LogChannelEnabledTest.LogVerboseThread (1702 of 2028)
PASS: lldb-api :: python_api/value/TestValueAPI.py (1703 of 2028)
PASS: lldb-api :: lang/cpp/stl/TestSTL.py (1704 of 2028)
PASS: lldb-api :: python_api/target/TestTargetAPI.py (1705 of 2028)
PASS: lldb-unit :: Process/gdb-remote/./ProcessGdbRemoteTests/GDBRemoteCommunicationClientTest.SendSignalsToIgnore (1706 of 2028)
UNSUPPORTED: lldb-api :: functionalities/unwind/ehframe/TestEhFrameUnwind.py (1707 of 2028)
PASS: lldb-api :: lang/objc/objc-builtin-types/TestObjCBuiltinTypes.py (1708 of 2028)
PASS: lldb-shell :: Quit/TestQuitExitCodeNonInt.test (1709 of 2028)
UNSUPPORTED: lldb-shell :: SymbolFile/DWARF/find-variable-file.cpp (1710 of 2028)
UNSUPPORTED: lldb-api :: commands/watchpoints/watchpoint_disable/TestWatchpointDisable.py (1711 of 2028)
PASS: lldb-api :: commands/expression/unwind_expression/TestUnwindExpression.py (1712 of 2028)
PASS: lldb-api :: functionalities/breakpoint/move_nearest/TestMoveNearest.py (1713 of 2028)
PASS: lldb-api :: macosx/DBGSourcePathRemapping/TestDSYMSourcePathRemapping.py (1714 of 2028)
PASS: lldb-unit :: Utility/./UtilityTests/ArgsTest.TestMultipleArgs (1715 of 2028)
PASS: lldb-shell :: ObjectFile/ELF/PT_LOAD-overlap.yaml (1716 of 2028)
PASS: lldb-unit :: UnwindAssembly/x86/./UnwindAssemblyx86Tests/Testx86AssemblyInspectionEngine.TestLEAVE (1717 of 2028)
PASS: lldb-api :: functionalities/data-formatter/data-formatter-objc/TestDataFormatterObjCNSDate.py (1718 of 2028)
PASS: lldb-api :: lang/objc/objc_direct-methods/TestObjCDirectMethods.py (1719 of 2028)
PASS: lldb-shell :: ScriptInterpreter/Python/scripted_breakpoint.test (1720 of 2028)
PASS: lldb-api :: functionalities/thread/concurrent_events/TestConcurrentManyCrash.py (1721 of 2028)
PASS: lldb-unit :: Host/./HostTests/SocketTest.TCPListen0GetPort (1722 of 2028)
PASS: lldb-api :: functionalities/data-formatter/pyobjsynthprovider/TestPyObjSynthProvider.py (1723 of 2028)
PASS: lldb-unit :: Symbol/./SymbolTests/TestClangASTImporter.DeportTypeTagDecl (1724 of 2028)
PASS: lldb-unit :: Process/minidump/./LLDBMinidumpTests/MinidumpParserTest.InvalidMinidump (1725 of 2028)
PASS: lldb-api :: lang/c/inlines/TestRedefinitionsInInlines.py (1726 of 2028)
PASS: lldb-api :: functionalities/plugins/command_plugin/TestPluginCommands.py (1727 of 2028)
UNSUPPORTED: lldb-api :: functionalities/thread/concurrent_events/TestConcurrentWatchBreak.py (1728 of 2028)
PASS: lldb-unit :: ObjectFile/Breakpad/./ObjectFileBreakpadTests/StackWinRecord.parse (1729 of 2028)
PASS: lldb-unit :: Host/./HostTests/SocketTest.UDPGetConnectURI (1730 of 2028)
PASS: lldb-api :: functionalities/unwind/sigtramp/TestSigtrampUnwind.py (1731 of 2028)
PASS: lldb-api :: macosx/queues/TestQueues.py (1732 of 2028)
PASS: lldb-unit :: Utility/./UtilityTests/VASprintfTest.NoBufferResize (1733 of 2028)
PASS: lldb-unit :: Utility/./UtilityTests/RangeTest.SlideZero (1734 of 2028)
PASS: lldb-unit :: Utility/./UtilityTests/SerializationRountripTest.SerializeDeserializeCStringArrayNullptr (1735 of 2028)
PASS: lldb-api :: commands/frame/diagnose/dereference-argument/TestDiagnoseDereferenceArgument.py (1736 of 2028)
PASS: lldb-shell :: Reproducer/TestCaptureEnvOverride.test (1737 of 2028)
UNSUPPORTED: lldb-api :: functionalities/thread/concurrent_events/TestConcurrentWatchBreakDelay.py (1738 of 2028)
PASS: lldb-api :: functionalities/value_md5_crash/TestValueMD5Crash.py (1739 of 2028)
PASS: lldb-unit :: UnwindAssembly/x86/./UnwindAssemblyx86Tests/Testx86AssemblyInspectionEngine.TestPushR12 (1740 of 2028)
PASS: lldb-unit :: Signals/./SignalsTests/UnixSignalsTest.GetInfo (1741 of 2028)
PASS: lldb-api :: functionalities/tail_call_frames/disambiguate_tail_call_seq/TestDisambiguateTailCallSeq.py (1742 of 2028)
PASS: lldb-unit :: Utility/./UtilityTests/StreamTest.PutMaxHex64ByteOrderLittle (1743 of 2028)
UNSUPPORTED: lldb-api :: lang/objc/modules-app-update/TestClangModulesAppUpdate.py (1744 of 2028)
PASS: lldb-unit :: Process/gdb-remote/./ProcessGdbRemoteTests/GDBRemoteCommunicationTest.ReadPacket_checksum (1745 of 2028)
UNSUPPORTED: lldb-api :: functionalities/darwin_log/filter/regex/activity/TestDarwinLogFilterRegexActivity.py (1746 of 2028)
PASS: lldb-api :: lang/c/register_variables/TestRegisterVariables.py (1747 of 2028)
PASS: lldb-unit :: Expression/./ExpressionTests/DiagnosticManagerTest.AppendMessageNoDiag (1748 of 2028)
PASS: lldb-shell :: Reproducer/Modules/TestModuleCXX.test (1749 of 2028)
PASS: lldb-api :: lang/cpp/stl/TestStdCXXDisassembly.py (1750 of 2028)
PASS: lldb-api :: types/TestShortTypeExpr.py (1751 of 2028)
PASS: lldb-unit :: ObjectFile/Breakpad/./ObjectFileBreakpadTests/LineRecord.parse (1752 of 2028)
PASS: lldb-unit :: Utility/./UtilityTests/StatusTest.ErrorConversion (1753 of 2028)
PASS: lldb-api :: functionalities/data-formatter/data-formatter-objc/TestDataFormatterObjCKVO.py (1754 of 2028)
PASS: lldb-api :: lang/objc/foundation/TestObjectDescriptionAPI.py (1755 of 2028)
PASS: lldb-api :: lang/cpp/function-qualifiers/TestCppFunctionQualifiers.py (1756 of 2028)
PASS: lldb-api :: lang/cpp/constructors/TestCppConstructors.py (1757 of 2028)
PASS: lldb-api :: lang/cpp/nsimport/TestCppNsImport.py (1758 of 2028)
PASS: lldb-api :: python_api/lldbutil/iter/TestLLDBIterator.py (1759 of 2028)
PASS: lldb-unit :: ObjectFile/ELF/./ObjectFileELFTests/ObjectFileELFTest.GetSymtab_NoSymEntryPointArmAddressClass (1760 of 2028)
PASS: lldb-api :: lang/c/vla/TestVLA.py (1761 of 2028)
PASS: lldb-api :: lang/cpp/symbols/TestSymbols.py (1762 of 2028)
PASS: lldb-unit :: SymbolFile/DWARF/./SymbolFileDWARFTests/SymbolFileDWARFTests.TestAbbrevMissingTerminator (1763 of 2028)
PASS: lldb-api :: commands/frame/diagnose/dereference-function-return/TestDiagnoseDereferenceFunctionReturn.py (1764 of 2028)
PASS: lldb-api :: commands/expression/call-function/TestCallStdStringFunction.py (1765 of 2028)
PASS: lldb-unit :: ScriptInterpreter/Python/./ScriptInterpreterPythonTests/PythonDataObjectsTest.TestPythonInteger (1766 of 2028)
PASS: lldb-api :: functionalities/thread/concurrent_events/TestConcurrentBreakpointOneDelayBreakpointThreads.py (1767 of 2028)
PASS: lldb-unit :: Utility/./UtilityTests/StringExtractorTest.GetHexU8_Underflow_NoEof (1768 of 2028)
PASS: lldb-unit :: Language/Highlighting/./HighlighterTests/HighlighterTest.DefaultHighlighter (1769 of 2028)
PASS: lldb-unit :: ScriptInterpreter/Python/./ScriptInterpreterPythonTests/PythonDataObjectsTest.TestPythonCallableCheck (1770 of 2028)
UNSUPPORTED: lldb-shell :: Register/aarch64-fp-read.test (1771 of 2028)
PASS: lldb-unit :: Interpreter/./InterpreterTests/CompletionTest.DirCompletionUsername (1772 of 2028)
PASS: lldb-api :: functionalities/thread/jump/TestThreadJump.py (1773 of 2028)
PASS: lldb-unit :: Host/./HostTests/Host.WaitStatusFormat (1774 of 2028)
UNSUPPORTED: lldb-shell :: SymbolFile/PDB/typedefs.test (1775 of 2028)
PASS: lldb-unit :: Process/minidump/./LLDBMinidumpTests/MinidumpParserTest.GetExceptionStream (1776 of 2028)
PASS: lldb-shell :: ObjectFile/Breakpad/breakpad-identification.test (1777 of 2028)
UNSUPPORTED: lldb-shell :: SymbolFile/DWARF/dir-separator-posix.s (1778 of 2028)
PASS: lldb-unit :: Process/gdb-remote/./ProcessGdbRemoteTests/GDBRemoteCommunicationClientTest.WriteRegisterNoSuffix (1779 of 2028)
PASS: lldb-unit :: Utility/./UtilityTests/FileSpecTest.CopyByAppendingPathComponent (1780 of 2028)
PASS: lldb-unit :: Utility/./UtilityTests/RecordReplayTest.InstrumentedBarRef (1781 of 2028)
PASS: lldb-unit :: Utility/./UtilityTests/StringExtractorTest.GetNameColonValueNoSemicolon (1782 of 2028)
PASS: lldb-unit :: UnwindAssembly/x86/./UnwindAssemblyx86Tests/Testx86AssemblyInspectionEngine.TestPopR13 (1783 of 2028)
UNSUPPORTED: lldb-shell :: SymbolFile/DWARF/find-basic-type.cpp (1784 of 2028)
PASS: lldb-api :: lang/objc/real-definition/TestRealDefinition.py (1785 of 2028)
PASS: lldb-unit :: Process/gdb-remote/./ProcessGdbRemoteTests/GDBRemoteClientBaseTest.SendContinueAndAsyncPacket (1786 of 2028)
PASS: lldb-api :: commands/expression/calculator_mode/TestCalculatorMode.py (1787 of 2028)
PASS: lldb-api :: functionalities/plugins/python_os_plugin/stepping_plugin_threads/TestOSPluginStepping.py (1788 of 2028)
PASS: lldb-unit :: Utility/./UtilityTests/DataExtractorTest.GetCStr (1789 of 2028)
PASS: lldb-unit :: Utility/./UtilityTests/UriParserTest.BadPort2 (1790 of 2028)
PASS: lldb-unit :: Utility/./UtilityTests/StatusTest.Formatv (1791 of 2028)
PASS: lldb-unit :: Utility/./UtilityTests/GeneratorTest.Create (1792 of 2028)
PASS: lldb-unit :: SymbolFile/NativePDB/./SymbolFileNativePDBTests/PDBFPOProgramToDWARFExpressionTests.InvalidOpUnary (1793 of 2028)
PASS: lldb-unit :: Process/minidump/./LLDBMinidumpTests/MinidumpParserTest.GetArchitectureWindows (1794 of 2028)
PASS: lldb-unit :: Utility/./UtilityTests/PassiveReplayTest.InstrumentedBarPtr (1795 of 2028)
PASS: lldb-api :: functionalities/testid/TestTestId.py (1796 of 2028)
PASS: lldb-unit :: Utility/./UtilityTests/AnsiTerminal.Incomplete (1797 of 2028)
PASS: lldb-unit :: UnwindAssembly/x86/./UnwindAssemblyx86Tests/Testx86AssemblyInspectionEngine.TestSpillRegToStackViaMOVi386 (1798 of 2028)
PASS: lldb-shell :: SymbolFile/DWARF/deterministic-build.cpp (1799 of 2028)
PASS: lldb-api :: commands/expression/call-function/TestCallStopAndContinue.py (1800 of 2028)
PASS: lldb-unit :: Host/./HostTests/NativeProcessProtocolTest.ReadCStringFromMemory_CrossPageBoundary (1801 of 2028)
PASS: lldb-api :: functionalities/abbreviation/TestCommonShortSpellings.py (1802 of 2028)
PASS: lldb-unit :: Host/./HostTests/FileSystemTest.FileAndDirectoryComponents (1803 of 2028)
UNSUPPORTED: lldb-api :: lang/cpp/breakpoint_in_member_func_w_non_primitive_params/TestBreakpointInMemberFuncWNonPrimitiveParams.py (1804 of 2028)
PASS: lldb-unit :: Host/./HostTests/MainLoopTest.ReadObject (1805 of 2028)
PASS: lldb-api :: lang/objc/modules/TestObjCModules.py (1806 of 2028)
PASS: lldb-api :: functionalities/target-new-solib-notifications/TestModuleLoadedNotifys.py (1807 of 2028)
PASS: lldb-shell :: Breakpoint/case-sensitive.test (1808 of 2028)
PASS: lldb-unit :: Process/gdb-remote/./ProcessGdbRemoteTests/GDBRemoteClientBaseTest.SendContinueAndLateInterrupt (1809 of 2028)
PASS: lldb-unit :: Expression/./ExpressionTests/CppModuleConfigurationTest.AmbiguousLibCpp (1810 of 2028)
PASS: lldb-unit :: Symbol/./SymbolTests/LineEntryTest.GetSameLineContiguousAddressRangeNestedInline (1811 of 2028)
PASS: lldb-api :: commands/expression/import-std-module/unique_ptr/TestUniquePtrFromStdModule.py (1812 of 2028)
PASS: lldb-unit :: Utility/./UtilityTests/RangeDataVector.FindEntryIndexesThatContain (1813 of 2028)
PASS: lldb-unit :: Utility/./UtilityTests/ArchSpecTest.MergeFrom (1814 of 2028)
PASS: lldb-unit :: Utility/./UtilityTests/ConstStringTest.YAML (1815 of 2028)
PASS: lldb-unit :: Host/./HostTests/NativeProcessProtocolTest.SetBreakpointFailVerify (1816 of 2028)
PASS: lldb-api :: commands/command/history/TestCommandHistory.py (1817 of 2028)
PASS: lldb-unit :: Utility/./UtilityTests/StringListTest.GetMaxStringLengthIncreasingSize (1818 of 2028)
PASS: lldb-api :: functionalities/gdb_remote_client/TestqOffsets.py (1819 of 2028)
PASS: lldb-unit :: SymbolFile/NativePDB/./SymbolFileNativePDBTests/PDBFPOProgramToDWARFExpressionTests.InvalidOpBinary (1820 of 2028)
UNSUPPORTED: lldb-shell :: SymbolFile/NativePDB/source-list.cpp (1821 of 2028)
PASS: lldb-api :: macosx/lc-note/kern-ver-str/TestKernVerStrLCNOTE.py (1822 of 2028)
PASS: lldb-unit :: Utility/./UtilityTests/ProcessInstanceInfoMatch.Name (1823 of 2028)
PASS: lldb-unit :: Utility/./UtilityTests/BinaryStreamTest.PutULEB128ThreeBytes (1824 of 2028)
PASS: lldb-api :: functionalities/load_using_paths/TestLoadUsingPaths.py (1825 of 2028)
PASS: lldb-shell :: ObjectFile/MachO/lc_build_version.yaml (1826 of 2028)
PASS: lldb-unit :: Platform/./LLDBPlatformTests/PlatformDarwinTest.FindComponentInPath (1827 of 2028)
UNSUPPORTED: lldb-shell :: Register/x86-64-ymm16-read.test (1828 of 2028)
PASS: lldb-unit :: UnwindAssembly/x86/./UnwindAssemblyx86Tests/Testx86AssemblyInspectionEngine.TestPopR12 (1829 of 2028)
PASS: lldb-api :: lang/objc/objc-static-method-stripped/TestObjCStaticMethodStripped.py (1830 of 2028)
PASS: lldb-unit :: ObjectFile/ELF/./ObjectFileELFTests/ObjectFileELFTest.SectionsResolveConsistently (1831 of 2028)
PASS: lldb-shell :: Reproducer/TestReuseDirectory.test (1832 of 2028)
PASS: lldb-unit :: Utility/./UtilityTests/ScalarTest.Promotion (1833 of 2028)
PASS: lldb-unit :: Utility/./UtilityTests/StreamTest.AddressRangeSize (1834 of 2028)
PASS: lldb-api :: commands/quit/TestQuit.py (1835 of 2028)
PASS: lldb-unit :: Utility/./UtilityTests/OptionsWithRawTest.MultiWordSuffix (1836 of 2028)
PASS: lldb-unit :: Utility/./UtilityTests/SerializationRountripTest.SerializeDeserializeCStringNull (1837 of 2028)
PASS: lldb-unit :: Utility/./UtilityTests/StringListTest.AppendStringMove (1838 of 2028)
PASS: lldb-api :: lang/objc/direct-dispatch-step/TestObjCDirectDispatchStepping.py (1839 of 2028)
PASS: lldb-shell :: SymbolFile/Breakpad/stack-cfi-parsing.test (1840 of 2028)
PASS: lldb-unit :: Utility/./UtilityTests/ArgsTest.TestQuotedUnknownEscape (1841 of 2028)
PASS: lldb-api :: tools/lldb-server/commandline/TestStubReverseConnect.py (1842 of 2028)
PASS: lldb-api :: lang/objc/modules-compile-error/TestModulesCompileError.py (1843 of 2028)
PASS: lldb-unit :: Utility/./UtilityTests/StringListTest.AppendListCStringArray (1844 of 2028)
PASS: lldb-unit :: Utility/./UtilityTests/Flags.IsClear (1845 of 2028)
PASS: lldb-unit :: Target/./TargetTests/ModuleCacheTest.GetAndPutStrangeHostname (1846 of 2028)
UNSUPPORTED: lldb-api :: commands/expression/completion-crash-invalid-iterator/TestInvalidIteratorCompletionCrash.py (1847 of 2028)
PASS: lldb-unit :: debugserver/./debugserverTests/RNBSocket.AnyListen (1848 of 2028)
PASS: lldb-api :: commands/disassemble/basic/TestFrameDisassemble.py (1849 of 2028)
PASS: lldb-api :: lang/objc/unicode-string/TestUnicodeString.py (1850 of 2028)
PASS: lldb-unit :: Utility/./UtilityTests/FileSpecTest.EqualDotsWindows (1851 of 2028)
UNSUPPORTED: lldb-shell :: ObjectFile/ELF/minidebuginfo-no-lzma.yaml (1852 of 2028)
FAIL: lldb-api :: tools/lldb-server/register-reading/TestGdbRemoteGPacket.py (1853 of 2028)
******************** TEST 'lldb-api :: tools/lldb-server/register-reading/TestGdbRemoteGPacket.py' FAILED ********************
Script:
--
/usr/local/Frameworks/Python.framework/Versions/3.7/bin/python3.7 /Users/buildslave/jenkins/workspace/lldb-cmake-matrix/llvm-project/lldb/test/API/dotest.py --arch x86_64 -s /Users/buildslave/jenkins/workspace/lldb-cmake-matrix/lldb-build/lldb-test-traces -S nm -u CXXFLAGS -u CFLAGS --codesign-identity lldb_codesign --server /Users/buildslave/jenkins/workspace/lldb-cmake-matrix/lldb-build/./bin/debugserver --arch x86_64 --build-dir /Users/buildslave/jenkins/workspace/lldb-cmake-matrix/lldb-build/lldb-test-build.noindex -s=/Users/buildslave/jenkins/workspace/lldb-cmake-matrix/test/logs -t --env TERM=vt100 --skip-category gmodules --skip-category watchpoint --arch=x86_64 --env LLVM_LIBS_DIR=/Users/buildslave/jenkins/workspace/lldb-cmake-matrix/lldb-build/./lib --build-dir /Users/buildslave/jenkins/workspace/lldb-cmake-matrix/lldb-build/lldb-test-build.noindex --lldb-module-cache-dir /Users/buildslave/jenkins/workspace/lldb-cmake-matrix/lldb-build/lldb-test-build.noindex/module-cache-lldb/lldb-api --clang-module-cache-dir /Users/buildslave/jenkins/workspace/lldb-cmake-matrix/lldb-build/lldb-test-build.noindex/module-cache-clang/lldb-api --executable /Users/buildslave/jenkins/workspace/lldb-cmake-matrix/lldb-build/./bin/lldb --compiler /Users/buildslave/jenkins/workspace/lldb-cmake-matrix/lldb-build/./bin/clang --dsymutil /Users/buildslave/jenkins/workspace/lldb-cmake-matrix/lldb-build/./bin/dsymutil --filecheck /Users/buildslave/jenkins/workspace/lldb-cmake-matrix/lldb-build/./bin/FileCheck --lldb-libs-dir /Users/buildslave/jenkins/workspace/lldb-cmake-matrix/lldb-build/./lib /Users/buildslave/jenkins/workspace/lldb-cmake-matrix/llvm-project/lldb/test/API/tools/lldb-server/register-reading -p TestGdbRemoteGPacket.py
--
Exit Code: 1

Hide Details

Command Output (stdout): -- lldb version 11.0.99 clang revision d33ba1aa0b505e3f4c55b382f171e8cbef6a1843 llvm revision d33ba1aa0b505e3f4c55b382f171e8cbef6a1843 LLDB library dir: /Users/buildslave/jenkins/workspace/lldb-cmake-matrix/lldb-build/bin LLDB import library dir: /Users/buildslave/jenkins/workspace/lldb-cmake-matrix/lldb-build/./lib libstdcxx tests will not be run because: Don't know how to build with libstdcxx on macosx Skipping following debug info categories: ['dwo']

Hide Details

-- Command Output (stderr): --

Hide Details

Session logs for test failures/errors/unexpected successes will go into directory '/Users/buildslave/jenkins/workspace/lldb-cmake-matrix/test/logs' Command invoked: /Users/buildslave/jenkins/workspace/lldb-cmake-matrix/llvm-project/lldb/test/API/dotest.py --arch x86_64 -s /Users/buildslave/jenkins/workspace/lldb-cmake-matrix/lldb-build/lldb-test-traces -S nm -u CXXFLAGS -u CFLAGS --codesign-identity lldb_codesign --server /Users/buildslave/jenkins/workspace/lldb-cmake-matrix/lldb-build/./bin/debugserver --arch x86_64 --build-dir /Users/buildslave/jenkins/workspace/lldb-cmake-matrix/lldb-build/lldb-test-build.noindex -s=/Users/buildslave/jenkins/workspace/lldb-cmake-matrix/test/logs -t --env TERM=vt100 --skip-category gmodules --skip-category watchpoint --arch=x86_64 --env LLVM_LIBS_DIR=/Users/buildslave/jenkins/workspace/lldb-cmake-matrix/lldb-build/./lib --build-dir /Users/buildslave/jenkins/workspace/lldb-cmake-matrix/lldb-build/lldb-test-build.noindex --lldb-module-cache-dir /Users/buildslave/jenkins/workspace/lldb-cmake-matrix/lldb-build/lldb-test-build.noindex/module-cache-lldb/lldb-api --clang-module-cache-dir /Users/buildslave/jenkins/workspace/lldb-cmake-matrix/lldb-build/lldb-test-build.noindex/module-cache-clang/lldb-api --executable /Users/buildslave/jenkins/workspace/lldb-cmake-matrix/lldb-build/./bin/lldb --compiler /Users/buildslave/jenkins/workspace/lldb-cmake-matrix/lldb-build/./bin/clang --dsymutil /Users/buildslave/jenkins/workspace/lldb-cmake-matrix/lldb-build/./bin/dsymutil --filecheck /Users/buildslave/jenkins/workspace/lldb-cmake-matrix/lldb-build/./bin/FileCheck --lldb-libs-dir /Users/buildslave/jenkins/workspace/lldb-cmake-matrix/lldb-build/./lib /Users/buildslave/jenkins/workspace/lldb-cmake-matrix/llvm-project/lldb/test/API/tools/lldb-server/register-reading -p TestGdbRemoteGPacket.py Change dir to: /Users/buildslave/jenkins/workspace/lldb-cmake-matrix/llvm-project/lldb/test/API/tools/lldb-server/register-reading runCmd: settings clear -all output:

Hide Details

runCmd: settings set symbols.enable-external-lookup false output:

Hide Details

runCmd: settings set target.auto-apply-fixits false output:

Hide Details

runCmd: settings set plugin.process.gdb-remote.packet-timeout 60 output:

Hide Details

runCmd: settings set symbols.clang-modules-cache-path "/Users/buildslave/jenkins/workspace/lldb-cmake-matrix/lldb-build/lldb-test-build.noindex/module-cache-lldb/lldb-api" output:

Hide Details

runCmd: settings set use-color false output:

Hide Details

runCmd: setting set target.prefer-dynamic-value no-dynamic-values output:

Hide Details

Adding tearDown hook: def shutdown_named_pipe(): # Close the pipe. try: named_pipe.close() except: print("failed to close named pipe") None

Hide Details

# Delete the pipe. try: os.remove(named_pipe_path) except: print("failed to delete named pipe: {}".format(named_pipe_path)) None

Hide Details

# Delete the temp directory. try: os.rmdir(temp_dir) except: print( "failed to delete temp dir: {}, directory contents: '{}'".format( temp_dir, os.listdir(temp_dir))) None

Hide Details

Hide Details

Adding tearDown hook: def cleanupSubprocesses(self): # Ensure any subprocesses are cleaned up for p in self.subprocesses: p.terminate() del p del self.subprocesses[:] # Ensure any forked processes are cleaned up for pid in self.forkedProcessPids: try: os.kill(pid, signal.SIGTERM) except OSError: pass

Hide Details

Hide Details

Adding tearDown hook: def shutdown_debug_monitor(): try: server.terminate() except: logger.warning( "failed to terminate server for debug monitor: {}; ignoring".format( sys.exc_info()[0]))

Hide Details

Hide Details

Adding tearDown hook: def shutdown_socket(): if sock: try: # send the kill packet so lldb-server shuts down gracefully sock.sendall(GdbRemoteTestCaseBase._GDBREMOTE_KILL_PACKET) except: logger.warning( "failed to send kill packet to debug monitor: {}; ignoring".format( sys.exc_info()[0]))

Hide Details

try: sock.close() except: logger.warning( "failed to close socket to debug monitor: {}; ignoring".format( sys.exc_info()[0]))

Hide Details

Hide Details

Adding tearDown hook: def cleanupSubprocesses(self): # Ensure any subprocesses are cleaned up for p in self.subprocesses: p.terminate() del p del self.subprocesses[:] # Ensure any forked processes are cleaned up for pid in self.forkedProcessPids: try: os.kill(pid, signal.SIGTERM) except OSError: pass

Hide Details

Hide Details

FAIL: LLDB (/Users/buildslave/jenkins/workspace/lldb-cmake-matrix/lldb-build/bin/clang-11-x86_64) :: test_g_packet_debugserver (TestGdbRemoteGPacket.TestGdbRemoteGPacket) Executing tearDown hook: def cleanupSubprocesses(self): # Ensure any subprocesses are cleaned up for p in self.subprocesses: p.terminate() del p del self.subprocesses[:] # Ensure any forked processes are cleaned up for pid in self.forkedProcessPids: try: os.kill(pid, signal.SIGTERM) except OSError: pass

Hide Details

Hide Details

Executing tearDown hook: def shutdown_socket(): if sock: try: # send the kill packet so lldb-server shuts down gracefully sock.sendall(GdbRemoteTestCaseBase._GDBREMOTE_KILL_PACKET) except: logger.warning( "failed to send kill packet to debug monitor: {}; ignoring".format( sys.exc_info()[0]))

Hide Details

try: sock.close() except: logger.warning( "failed to close socket to debug monitor: {}; ignoring".format( sys.exc_info()[0]))

Hide Details

Hide Details

2020-05-31 08:33:36,152 WARNING failed to send kill packet to debug monitor: <class 'TypeError'>; ignoring Executing tearDown hook: def shutdown_debug_monitor(): try: server.terminate() except: logger.warning( "failed to terminate server for debug monitor: {}; ignoring".format( sys.exc_info()[0]))

Hide Details

Hide Details

Executing tearDown hook: def cleanupSubprocesses(self): # Ensure any subprocesses are cleaned up for p in self.subprocesses: p.terminate() del p del self.subprocesses[:] # Ensure any forked processes are cleaned up for pid in self.forkedProcessPids: try: os.kill(pid, signal.SIGTERM) except OSError: pass

Hide Details

Hide Details

Executing tearDown hook: def shutdown_named_pipe(): # Close the pipe. try: named_pipe.close() except: print("failed to close named pipe") None

Hide Details

# Delete the pipe. try: os.remove(named_pipe_path) except: print("failed to delete named pipe: {}".format(named_pipe_path)) None

Hide Details

# Delete the temp directory. try: os.rmdir(temp_dir) except: print( "failed to delete temp dir: {}, directory contents: '{}'".format( temp_dir, os.listdir(temp_dir))) None

Hide Details

Hide Details

runCmd: settings clear -all output:

Hide Details

runCmd: settings set symbols.enable-external-lookup false output:

Hide Details

runCmd: settings set target.auto-apply-fixits false output:

Hide Details

runCmd: settings set plugin.process.gdb-remote.packet-timeout 60 output:

Hide Details

runCmd: settings set symbols.clang-modules-cache-path "/Users/buildslave/jenkins/workspace/lldb-cmake-matrix/lldb-build/lldb-test-build.noindex/module-cache-lldb/lldb-api" output:

Hide Details

runCmd: settings set use-color false output:

Hide Details

runCmd: setting set target.prefer-dynamic-value no-dynamic-values output:

Hide Details

UNSUPPORTED: LLDB (/Users/buildslave/jenkins/workspace/lldb-cmake-matrix/lldb-build/bin/clang-11-x86_64) :: test_g_returns_correct_data_no_suffix_llgs (TestGdbRemoteGPacket.TestGdbRemoteGPacket) (llgs tests) runCmd: settings clear -all output:

Hide Details

runCmd: settings set symbols.enable-external-lookup false output:

Hide Details

runCmd: settings set target.auto-apply-fixits false output:

Hide Details

runCmd: settings set plugin.process.gdb-remote.packet-timeout 60 output:

Hide Details

runCmd: settings set symbols.clang-modules-cache-path "/Users/buildslave/jenkins/workspace/lldb-cmake-matrix/lldb-build/lldb-test-build.noindex/module-cache-lldb/lldb-api" output:

Hide Details

runCmd: settings set use-color false output:

Hide Details

runCmd: setting set target.prefer-dynamic-value no-dynamic-values output:

Hide Details

UNSUPPORTED: LLDB (/Users/buildslave/jenkins/workspace/lldb-cmake-matrix/lldb-build/bin/clang-11-x86_64) :: test_g_returns_correct_data_with_suffix_llgs (TestGdbRemoteGPacket.TestGdbRemoteGPacket) (llgs tests) Restore dir to: /Users/buildslave/jenkins/workspace/lldb-cmake-matrix/lldb-build/tools/lldb/test ====================================================================== FAIL: test_g_packet_debugserver (TestGdbRemoteGPacket.TestGdbRemoteGPacket) ---------------------------------------------------------------------- Traceback (most recent call last): File "/Users/buildslave/jenkins/workspace/lldb-cmake-matrix/llvm-project/lldb/packages/Python/lldbsuite/test/decorators.py", line 140, in wrapper func(*args, **kwargs) File "/Users/buildslave/jenkins/workspace/lldb-cmake-matrix/llvm-project/lldb/packages/Python/lldbsuite/test/decorators.py", line 140, in wrapper func(*args, **kwargs) File "/Users/buildslave/jenkins/workspace/lldb-cmake-matrix/llvm-project/lldb/test/API/tools/lldb-server/register-reading/TestGdbRemoteGPacket.py", line 58, in test_g_packet_debugserver self.run_test_g_packet() File "/Users/buildslave/jenkins/workspace/lldb-cmake-matrix/llvm-project/lldb/test/API/tools/lldb-server/register-reading/TestGdbRemoteGPacket.py", line 40, in run_test_g_packet self.connect_to_debug_monitor() File "/Users/buildslave/jenkins/workspace/lldb-cmake-matrix/llvm-project/lldb/packages/Python/lldbsuite/test/tools/lldb-server/gdbremote_testcase.py", line 418, in connect_to_debug_monitor server = self.launch_debug_monitor(attach_pid=attach_pid) File "/Users/buildslave/jenkins/workspace/lldb-cmake-matrix/llvm-project/lldb/packages/Python/lldbsuite/test/tools/lldb-server/gdbremote_testcase.py", line 411, in launch_debug_monitor self.port = self.get_stub_port_from_named_socket(self._READ_TIMEOUT) File "/Users/buildslave/jenkins/workspace/lldb-cmake-matrix/llvm-project/lldb/packages/Python/lldbsuite/test/tools/lldb-server/gdbremote_testcase.py", line 225, in get_stub_port_from_named_socket "no content to read on pipe") AssertionError: 0 == 0 : no content to read on pipe Config=x86_64-/Users/buildslave/jenkins/workspace/lldb-cmake-matrix/lldb-build/bin/clang-11 ---------------------------------------------------------------------- Ran 3 tests in 0.831s

Hide Details

RESULT: FAILED (0 passes, 1 failures, 0 errors, 2 skipped, 0 expected failures, 0 unexpected successes)

Hide Details

--

Hide Details

******************** PASS: lldb-shell :: SymbolFile/DWARF/DW_AT_low_pc-addrx.s (1854 of 2028) PASS: lldb-api :: commands/expression/multiline-completion/TestMultilineCompletion.py (1855 of 2028) PASS: lldb-unit :: Utility/./UtilityTests/BinaryStreamTest.PutULEB128SevenBytes (1856 of 2028) PASS: lldb-unit :: Utility/./UtilityTests/Predicate.WaitForValueNotEqualTo (1857 of 2028) PASS: lldb-api :: functionalities/breakpoint/breakpoint_command/TestBreakpointCommandsFromPython.py (1858 of 2028) PASS: lldb-shell :: Reproducer/TestDiscard.test (1859 of 2028) PASS: lldb-unit :: Utility/./UtilityTests/StreamTest.PutRawBytesToLittleEndian (1860 of 2028) PASS: lldb-unit :: Symbol/./SymbolTests/TestTypeSystemClang.TestGetBasicTypeFromName (1861 of 2028) PASS: lldb-api :: functionalities/data-formatter/nsarraysynth/TestNSArraySynthetic.py (1862 of 2028) PASS: lldb-api :: functionalities/postmortem/minidump-new/TestMiniDumpNew.py (1863 of 2028) PASS: lldb-api :: functionalities/target_var/TestTargetVar.py (1864 of 2028) PASS: lldb-shell :: SymbolFile/DWARF/find-method-local-struct.cpp (1865 of 2028) PASS: lldb-shell :: SymbolFile/DWARF/debug_line-relative_path.s (1866 of 2028) PASS: lldb-api :: functionalities/thread_plan/TestThreadPlanCommands.py (1867 of 2028) UNSUPPORTED: lldb-shell :: Register/x86-gp-write.test (1868 of 2028) PASS: lldb-unit :: Language/Highlighting/./HighlighterTests/HighlighterTest.ClangComments (1869 of 2028) PASS: lldb-unit :: Utility/./UtilityTests/RangeTest.LessThan (1870 of 2028) PASS: lldb-api :: functionalities/wrong_commands/TestWrongCommands.py (1871 of 2028) PASS: lldb-api :: python_api/file_handle/TestFileHandle.py (1872 of 2028) PASS: lldb-api :: lang/c/stepping/TestStepAndBreakpoints.py (1873 of 2028) PASS: lldb-api :: commands/expression/context-object-objc/TestContextObjectObjc.py (1874 of 2028) PASS: lldb-api :: functionalities/tail_call_frames/cross_dso/TestCrossDSOTailCalls.py (1875 of 2028) PASS: lldb-api :: python_api/value/linked_list/TestValueAPILinkedList.py (1876 of 2028) PASS: lldb-api :: types/TestShortType.py (1877 of 2028) PASS: lldb-unit :: Host/./HostTests/MainLoopTest.TerminatesImmediately (1878 of 2028) PASS: lldb-unit :: Utility/./UtilityTests/BroadcasterTest.BroadcastEvent (1879 of 2028) PASS: lldb-unit :: Utility/./UtilityTests/StringExtractorTest.GetU32BigEndian (1880 of 2028) PASS: lldb-api :: lang/cpp/trivial_abi/TestTrivialABI.py (1881 of 2028) PASS: lldb-api :: commands/expression/cast_int_to_anonymous_enum/TestCastIntToAnonymousEnum.py (1882 of 2028) PASS: lldb-api :: lang/c/stepping/TestThreadStepping.py (1883 of 2028) UNSUPPORTED: lldb-api :: functionalities/thread/state/TestThreadStates.py (1884 of 2028) PASS: lldb-unit :: Target/./TargetTests/ModuleCacheTest.GetAndPutUuidExists (1885 of 2028) PASS: lldb-unit :: Utility/./UtilityTests/VMRange.SetEndAddress (1886 of 2028) PASS: lldb-api :: commands/frame/diagnose/virtual-method-call/TestDiagnoseDereferenceVirtualMethodCall.py (1887 of 2028) PASS: lldb-api :: lang/cpp/function_refs/TestFunctionRefs.py (1888 of 2028) UNSUPPORTED: lldb-shell :: Register/x86-zmm-write.test (1889 of 2028) UNSUPPORTED: lldb-api :: lang/objc/modules-hash-mismatch/TestClangModulesHashMismatch.py (1890 of 2028) PASS: lldb-unit :: Language/Highlighting/./HighlighterTests/HighlighterTest.DefaultHighlighterWithCursor (1891 of 2028) PASS: lldb-api :: functionalities/object-file/TestImageListMultiArchitecture.py (1892 of 2028) PASS: lldb-unit :: Core/./LLDBCoreTests/SourceFileCache.FindSourceFileNotFound (1893 of 2028) PASS: lldb-unit :: Utility/./UtilityTests/BinaryStreamTest.PutULEB128OneByte (1894 of 2028) PASS: lldb-unit :: UnwindAssembly/x86/./UnwindAssemblyx86Tests/Testx86AssemblyInspectionEngine.TestPopR15 (1895 of 2028) PASS: lldb-shell :: Breakpoint/debug_addrx.test (1896 of 2028) UNSUPPORTED: lldb-api :: functionalities/darwin_log/filter/exact_match/activity-chain/TestDarwinLogFilterMatchActivityChain.py (1897 of 2028) PASS: lldb-api :: commands/apropos/with-process/TestAproposWithProcess.py (1898 of 2028) PASS: lldb-api :: tools/lldb-server/TestGdbRemoteRegisterState.py (1899 of 2028) PASS: lldb-unit :: Utility/./UtilityTests/ArgsTest.TestOverwriteArgs (1900 of 2028) PASS: lldb-unit :: Host/./HostTests/HostInfoTest.GetHostname (1901 of 2028) PASS: lldb-api :: commands/reproducer/invalid-args/TestInvalidArgsReproducer.py (1902 of 2028) PASS: lldb-unit :: UnwindAssembly/x86/./UnwindAssemblyx86Tests/Testx86AssemblyInspectionEngine.TestPopEBX (1903 of 2028) PASS: lldb-unit :: Utility/./UtilityTests/StreamTest.PutULEB128 (1904 of 2028) UNSUPPORTED: lldb-shell :: SymbolFile/DWARF/debug-types-dwo-cross-reference.cpp (1905 of 2028) PASS: lldb-api :: commands/command/source/TestCommandSource.py (1906 of 2028) PASS: lldb-api :: tools/lldb-vscode/breakpoint/TestVSCode_setBreakpoints.py (1907 of 2028) PASS: lldb-api :: functionalities/show_location/TestShowLocationDwarf5.py (1908 of 2028) PASS: lldb-shell :: SymbolFile/Breakpad/line-table.test (1909 of 2028) PASS: lldb-api :: functionalities/breakpoint/dummy_target_breakpoints/TestBreakpointsWithNoTargets.py (1910 of 2028) UNSUPPORTED: lldb-shell :: SymbolFile/NativePDB/disassembly.cpp (1911 of 2028) PASS: lldb-unit :: Utility/./UtilityTests/StringExtractorTest.DecodeHexU8_Exact (1912 of 2028) PASS: lldb-api :: functionalities/postmortem/elf-core/TestLinuxCore.py (1913 of 2028) PASS: lldb-unit :: Utility/./UtilityTests/StringLexerTest.NextIfList (1914 of 2028) PASS: lldb-unit :: ScriptInterpreter/Python/./ScriptInterpreterPythonTests/PythonDataObjectsTest.TestPythonTupleInitializerList (1915 of 2028) PASS: lldb-api :: types/TestFloatTypes.py (1916 of 2028) PASS: lldb-shell :: Reproducer/Functionalities/TestDataFormatter.test (1917 of 2028) PASS: lldb-unit :: Utility/./UtilityTests/ConstStringTest.UpdateMangledCounterpart (1918 of 2028) PASS: lldb-api :: macosx/order/TestOrderFile.py (1919 of 2028) PASS: lldb-unit :: Utility/./UtilityTests/ConstStringTest.MangledCounterpart (1920 of 2028) PASS: lldb-unit :: Host/./HostTests/FileSystemTest.GetByteSize (1921 of 2028) PASS: lldb-unit :: Utility/./UtilityTests/TimeoutTest.Format (1922 of 2028) PASS: lldb-api :: commands/source/info/TestSourceInfo.py (1923 of 2028) UNSUPPORTED: lldb-api :: functionalities/darwin_log/filter/exact_match/message/TestDarwinLogFilterMatchMessage.py (1924 of 2028) PASS: lldb-unit :: Utility/./UtilityTests/RangeTest.ContainsAddrInvalid (1925 of 2028) PASS: lldb-api :: lang/cpp/chained-calls/TestCppChainedCalls.py (1926 of 2028) PASS: lldb-unit :: Symbol/./SymbolTests/TestTypeSystemClang.TestGetTypeClassTypeOfExpr (1927 of 2028) PASS: lldb-unit :: Utility/./UtilityTests/ProcessInstanceInfo.DumpTable_invalidUID (1928 of 2028) PASS: lldb-api :: functionalities/data-formatter/data-formatter-stl/libcxx/function/TestLibCxxFunction.py (1929 of 2028) PASS: lldb-api :: functionalities/tail_call_frames/disambiguate_call_site/TestDisambiguateCallSite.py (1930 of 2028) PASS: lldb-unit :: Utility/./UtilityTests/RegisterValueTest.GetSet8 (1931 of 2028) PASS: lldb-unit :: Expression/./ExpressionTests/DiagnosticManagerTest.GetStringMultipleDiags (1932 of 2028) PASS: lldb-api :: commands/expression/import-std-module/basic/TestImportStdModule.py (1933 of 2028) PASS: lldb-api :: functionalities/data-formatter/data-formatter-synthval/TestDataFormatterSynthVal.py (1934 of 2028) PASS: lldb-api :: functionalities/data-formatter/data-formatter-enum-format/TestDataFormatterEnumFormat.py (1935 of 2028) PASS: lldb-unit :: Utility/./UtilityTests/ReproducerTest.SetCapture (1936 of 2028) PASS: lldb-unit :: Utility/./UtilityTests/ArgsTest.DoubleQuotedItem (1937 of 2028) PASS: lldb-unit :: Utility/./UtilityTests/ArchSpecTest.TripleComponentsWereSpecified (1938 of 2028) PASS: lldb-unit :: UnwindAssembly/x86/./UnwindAssemblyx86Tests/Testx86AssemblyInspectionEngine.TestDisassemblyJunkBytes (1939 of 2028) PASS: lldb-shell :: Breakpoint/debug_rnglist_offset_pair.test (1940 of 2028) PASS: lldb-api :: lang/c/shared_lib_stripped_symbols/TestSharedLibStrippedSymbols.py (1941 of 2028) UNSUPPORTED: lldb-api :: functionalities/tsan/multiple/TestTsanMultiple.py (1942 of 2028) PASS: lldb-api :: functionalities/non-overlapping-index-variable-i/TestIndexVariable.py (1943 of 2028) PASS: lldb-api :: commands/frame/diagnose/array/TestArray.py (1944 of 2028) PASS: lldb-api :: functionalities/breakpoint/breakpoint_by_line_and_column/TestBreakpointByLineAndColumn.py (1945 of 2028) PASS: lldb-api :: commands/expression/import-std-module/weak_ptr-dbg-info-content/TestDbgInfoContentWeakPtrFromStdModule.py (1946 of 2028) PASS: lldb-api :: commands/expression/timeout/TestCallWithTimeout.py (1947 of 2028) PASS: lldb-unit :: Utility/./UtilityTests/StringListTest.InsertStringAtIndexStdString (1948 of 2028) PASS: lldb-api :: functionalities/data-formatter/data-formatter-stl/libcxx/variant/TestDataFormatterLibcxxVariant.py (1949 of 2028) UNSUPPORTED: lldb-shell :: Unwind/eh-frame-small-fde.test (1950 of 2028) UNSUPPORTED: lldb-api :: commands/watchpoints/watchpoint_size/TestWatchpointSizes.py (1951 of 2028) PASS: lldb-shell :: BuildScript/toolchain-clang.test (1952 of 2028) PASS: lldb-shell :: ObjectFile/ELF/minidebuginfo-corrupt-xz.yaml (1953 of 2028) PASS: lldb-api :: lang/objc/self/TestObjCSelf.py (1954 of 2028) PASS: lldb-shell :: ObjectFile/ELF/avr-basic-info.yaml (1955 of 2028) PASS: lldb-shell :: SymbolFile/Breakpad/unwind-via-raSearch.test (1956 of 2028) PASS: lldb-unit :: Utility/./UtilityTests/StringExtractorTest.GetNameColonValueContainsColon (1957 of 2028) PASS: lldb-api :: functionalities/data-formatter/data-formatter-stl/libcxx/unique_ptr/TestDataFormatterLibcxxUniquePtr.py (1958 of 2028) UNSUPPORTED: lldb-shell :: SymbolFile/NativePDB/nested-types.cpp (1959 of 2028) PASS: lldb-api :: lang/cpp/char1632_t/TestChar1632T.py (1960 of 2028) PASS: lldb-unit :: Target/./TargetTests/ExecutionContextTest.GetByteOrderTarget (1961 of 2028) PASS: lldb-unit :: Utility/./UtilityTests/StreamTest.ShiftOperatorChars (1962 of 2028) PASS: lldb-unit :: ScriptInterpreter/Python/./ScriptInterpreterPythonTests/PythonDataObjectsTest.TestBorrowedReferences (1963 of 2028) PASS: lldb-api :: linux/builtin_trap/TestBuiltinTrap.py (1964 of 2028) PASS: lldb-unit :: Host/./HostTests/ConnectionFileDescriptorTest.TCPGetURIv6 (1965 of 2028) UNSUPPORTED: lldb-shell :: Register/arm-gp-read.test (1966 of 2028) PASS: lldb-api :: commands/expression/static-initializers/TestStaticInitializers.py (1967 of 2028) PASS: lldb-api :: commands/expression/call-function/TestCallUserDefinedFunction.py (1968 of 2028) PASS: lldb-shell :: ScriptInterpreter/None/import_module.test (1969 of 2028) PASS: lldb-unit :: Utility/./UtilityTests/UriParserTest.MinimalPortPath (1970 of 2028) PASS: lldb-unit :: Utility/./UtilityTests/Predicate.WaitForValueEqualTo (1971 of 2028) PASS: lldb-api :: functionalities/breakpoint/breakpoint_names/TestBreakpointNames.py (1972 of 2028) PASS: lldb-unit :: Utility/./UtilityTests/StringListTest.SplitIntoLinesEmpty (1973 of 2028) UNSUPPORTED: lldb-shell :: SymbolFile/NativePDB/global-classes.cpp (1974 of 2028) PASS: lldb-unit :: Utility/./UtilityTests/LogChannelEnabledTest.LogThread (1975 of 2028) PASS: lldb-unit :: Utility/./UtilityTests/ConstStringTest.format_provider (1976 of 2028) PASS: lldb-api :: lang/objc/objc-super/TestObjCSuper.py (1977 of 2028) PASS: lldb-unit :: Utility/./UtilityTests/StringExtractorTest.GetHexU8_Underflow2_NoEof (1978 of 2028) UNSUPPORTED: lldb-api :: linux/add-symbols/TestTargetSymbolsAddCommand.py (1979 of 2028) PASS: lldb-unit :: Symbol/./SymbolTests/TestTypeSystemClang.TestDisplayNameEmpty (1980 of 2028) PASS: lldb-api :: functionalities/recursion/TestValueObjectRecursion.py (1981 of 2028) UNSUPPORTED: lldb-shell :: SymbolFile/DWARF/debug_ranges_and_rnglists.test (1982 of 2028) PASS: lldb-api :: python_api/debugger/TestDebuggerAPI.py (1983 of 2028) PASS: lldb-unit :: Expression/./ExpressionTests/CppModuleConfigurationTest.MissingLibCpp (1984 of 2028) UNSUPPORTED: lldb-api :: functionalities/thread/concurrent_events/TestConcurrentTwoWatchpointThreads.py (1985 of 2028) PASS: lldb-api :: macosx/find-app-in-bundle/TestFindAppInBundle.py (1986 of 2028) PASS: lldb-unit :: Language/Highlighting/./HighlighterTests/HighlighterTest.ClangScalarLiterals (1987 of 2028) PASS: lldb-unit :: Process/gdb-remote/./ProcessGdbRemoteTests/GDBRemoteCommunicationClientTest.SaveRestoreRegistersNoSuffix (1988 of 2028) PASS: lldb-unit :: Host/./HostTests/Host.GetEnvironment (1989 of 2028) PASS: lldb-api :: python_api/formatters/TestFormattersSBAPI.py (1990 of 2028) UNSUPPORTED: lldb-shell :: ScriptInterpreter/Lua/persistent_state.test (1991 of 2028) PASS: lldb-unit :: Host/./HostTests/FileSystemTest.EmptyTest (1992 of 2028) PASS: lldb-api :: functionalities/thread/concurrent_events/TestConcurrentDelaySignalBreak.py (1993 of 2028) PASS: lldb-unit :: Symbol/./SymbolTests/TestTypeSystemClang.TestGetBasicTypeFromEnum (1994 of 2028) PASS: lldb-unit :: Interpreter/./InterpreterTests/CompletionTest.DirCompletionAbsolute (1995 of 2028) PASS: lldb-shell :: ObjectFile/PECOFF/basic-info.yaml (1996 of 2028) PASS: lldb-api :: commands/expression/import-std-module/unique_ptr-dbg-info-content/TestUniquePtrDbgInfoContent.py (1997 of 2028) PASS: lldb-api :: functionalities/rerun/TestRerun.py (1998 of 2028) PASS: lldb-api :: functionalities/data-formatter/data-formatter-stl/libstdcpp/unique_ptr/invalid/TestDataFormatterInvalidStdUniquePtr.py (1999 of 2028) PASS: lldb-unit :: Expression/./ExpressionTests/DiagnosticManagerTest.GetStringPreserveOrder (2000 of 2028) PASS: lldb-unit :: Utility/./UtilityTests/RangeDataVector.FindEntryIndexesThatContain_Overlap (2001 of 2028) PASS: lldb-shell :: SymbolFile/DWARF/anon_class_w_and_wo_export_symbols.ll (2002 of 2028) PASS: lldb-unit :: Utility/./UtilityTests/LogTest.Unregister (2003 of 2028) UNSUPPORTED: lldb-shell :: SymbolFile/NativePDB/ast-types.cpp (2004 of 2028) PASS: lldb-shell :: Register/x86-64-ymm-read.test (2005 of 2028) PASS: lldb-unit :: Expression/./ExpressionTests/DiagnosticManagerTest.GetStringBasic (2006 of 2028) PASS: lldb-unit :: Utility/./UtilityTests/NameMatchesTest.RegularExpression (2007 of 2028) PASS: lldb-api :: commands/expression/xvalue/TestXValuePrinting.py (2008 of 2028) PASS: lldb-shell :: BuildScript/script-args.test (2009 of 2028) PASS: lldb-unit :: Utility/./UtilityTests/StreamTest.AddressRangeInvalidRange (2010 of 2028) PASS: lldb-shell :: Process/TestEnvironment.test (2011 of 2028) UNSUPPORTED: lldb-shell :: SymbolFile/DWARF/debug-types-address-ranges.s (2012 of 2028) PASS: lldb-api :: lang/cpp/limit-debug-info/TestWithLimitDebugInfo.py (2013 of 2028) PASS: lldb-api :: macosx/find-dsym/bundle-with-dot-in-filename/TestBundleWithDotInFilename.py (2014 of 2028) PASS: lldb-api :: functionalities/thread/concurrent_events/TestConcurrentCrashWithSignal.py (2015 of 2028) PASS: lldb-api :: lang/objc/rdar-10967107/TestRdar10967107.py (2016 of 2028) PASS: lldb-shell :: Reproducer/TestGDBRemoteRepro.test (2017 of 2028) PASS: lldb-api :: commands/expression/import-std-module/vector/TestVectorFromStdModule.py (2018 of 2028) PASS: lldb-shell :: Reproducer/TestWorkingDir.test (2019 of 2028) PASS: lldb-api :: functionalities/thread/exit_during_step/TestExitDuringStep.py (2020 of 2028) PASS: lldb-api :: commands/expression/persist_objc_pointeetype/TestPersistObjCPointeeType.py (2021 of 2028) PASS: lldb-api :: tools/lldb-server/TestGdbRemote_qThreadStopInfo.py (2022 of 2028) PASS: lldb-api :: functionalities/inferior-crashing/TestInferiorCrashingStep.py (2023 of 2028) PASS: lldb-api :: lang/cpp/namespace/TestNamespaceLookup.py (2024 of 2028) PASS: lldb-api :: lang/objc/objc-new-syntax/TestObjCNewSyntaxDictionary.py (2025 of 2028) PASS: lldb-api :: lang/objc/hidden-ivars/TestHiddenIvars.py (2026 of 2028) PASS: lldb-api :: lang/objc/foundation/TestFoundationDisassembly.py (2027 of 2028) PASS: lldb-api :: tools/lldb-server/TestLldbGdbServer.py (2028 of 2028) Slowest Tests: -------------------------------------------------------------------------- 120.91s: lldb-api :: lang/objc/foundation/TestFoundationDisassembly.py 60.64s: lldb-api :: api/multithreaded/TestMultithreaded.py 58.95s: lldb-api :: tools/lldb-server/TestLldbGdbServer.py 52.68s: lldb-api :: lang/objc/foundation/TestObjCMethods.py 45.34s: lldb-api :: lang/objc/exceptions/TestObjCExceptions.py 43.84s: lldb-api :: lang/objc/hidden-ivars/TestHiddenIvars.py 37.61s: lldb-api :: lang/objc/objc-new-syntax/TestObjCNewSyntaxLiteral.py 34.17s: lldb-api :: lang/objc/real-definition/TestRealDefinition.py 31.71s: lldb-api :: tools/lldb-server/TestGdbRemoteThreadsInStopReply.py 30.31s: lldb-api :: types/TestLongTypesExpr.py 28.72s: lldb-api :: lang/objc/foundation/TestObjCMethodsNSError.py 28.40s: lldb-api :: lang/objc/objc-new-syntax/TestObjCNewSyntaxArray.py 27.10s: lldb-api :: lang/objc/foundation/TestObjCMethodsString.py 23.98s: lldb-api :: lang/cpp/namespace/TestNamespaceLookup.py 23.71s: lldb-api :: commands/settings/TestSettings.py 22.68s: lldb-api :: tools/lldb-server/TestAppleSimulatorOSType.py 22.58s: lldb-api :: types/TestLongTypes.py 20.38s: lldb-api :: lang/objc/forward-decl/TestForwardDecl.py 20.23s: lldb-api :: lang/objc/objc-new-syntax/TestObjCNewSyntaxDictionary.py 20.01s: lldb-api :: functionalities/recursion/TestValueObjectRecursion.py

Hide Details

Tests Times: -------------------------------------------------------------------------- [ Range ] :: [ Percentage ] :: [ Count ] -------------------------------------------------------------------------- [120s,130s) :: [ ] :: [ 1/2028] [110s,120s) :: [ ] :: [ 0/2028] [100s,110s) :: [ ] :: [ 0/2028] [ 90s,100s) :: [ ] :: [ 0/2028] [ 80s, 90s) :: [ ] :: [ 0/2028] [ 70s, 80s) :: [ ] :: [ 0/2028] [ 60s, 70s) :: [ ] :: [ 2/2028] [ 50s, 60s) :: [ ] :: [ 1/2028] [ 40s, 50s) :: [ ] :: [ 3/2028] [ 30s, 40s) :: [ ] :: [ 5/2028] [ 20s, 30s) :: [ ] :: [ 11/2028] [ 10s, 20s) :: [** ] :: [ 119/2028] [ 0s, 10s) :: [************************************* ] :: [1886/2028] -------------------------------------------------------------------------- ******************** Failing Tests (1): lldb-api :: tools/lldb-server/register-reading/TestGdbRemoteGPacket.py

Hide Details

Hide Details

Testing Time: 308.24s Unsupported Tests : 258 Expected Passes : 1764 Expected Failures : 5 Unexpected Failures: 1 FAILED: tools/lldb/test/CMakeFiles/check-lldb-lit cd /Users/buildslave/jenkins/workspace/lldb-cmake-matrix/lldb-build/tools/lldb/test && /usr/local/Frameworks/Python.framework/Versions/3.7/bin/python3.7 /Users/buildslave/jenkins/workspace/lldb-cmake-matrix/lldb-build/./bin/llvm-lit -v --time-tests --shuffle --xunit-xml-output=/Users/buildslave/jenkins/workspace/lldb-cmake-matrix/test/results.xml -v /Users/buildslave/jenkins/workspace/lldb-cmake-matrix/lldb-build/tools/lldb/test ninja: build stopped: subcommand failed. Command failed: Command '['/usr/bin/env', 'TERM=vt100', '/usr/local/bin/ninja', '-v', 'check-lldb']' returned non-zero exit status 1. Command: ['/usr/bin/env', 'TERM=vt100', '/usr/local/bin/ninja', '-v', 'check-lldb'] + set -e [Pipeline] } [Pipeline] // timeout [Pipeline] junit Recording test results [Pipeline] } [Pipeline] // stage [Pipeline] } [Pipeline] // withEnv [Pipeline] } [Pipeline] // node [Pipeline] End of Pipeline Finished: UNSTABLE