UnstableConsole Output

Skipping 64,202 KB.. Full Log
arning(
                        "failed to send kill packet to debug monitor: {}; ignoring".format(
                            sys.exc_info()[0]))

Hide Details

try: sock.close() except: logger.warning( "failed to close socket to debug monitor: {}; ignoring".format( sys.exc_info()[0]))

Hide Details

Hide Details

2020-06-30 20:37:58,968 WARNING failed to send kill packet to debug monitor: <class 'TypeError'>; ignoring Executing tearDown hook: def shutdown_debug_monitor(): try: server.terminate() except: logger.warning( "failed to terminate server for debug monitor: {}; ignoring".format( sys.exc_info()[0]))

Hide Details

Hide Details

Executing tearDown hook: def cleanupSubprocesses(self): # Ensure any subprocesses are cleaned up for p in self.subprocesses: p.terminate() del p del self.subprocesses[:] # Ensure any forked processes are cleaned up for pid in self.forkedProcessPids: try: os.kill(pid, signal.SIGTERM) except OSError: pass

Hide Details

Hide Details

Executing tearDown hook: def shutdown_named_pipe(): # Close the pipe. try: named_pipe.close() except: print("failed to close named pipe") None

Hide Details

# Delete the pipe. try: os.remove(named_pipe_path) except: print("failed to delete named pipe: {}".format(named_pipe_path)) None

Hide Details

# Delete the temp directory. try: os.rmdir(temp_dir) except: print( "failed to delete temp dir: {}, directory contents: '{}'".format( temp_dir, os.listdir(temp_dir))) None

Hide Details

Hide Details

PASS: LLDB (/Users/buildslave/jenkins/workspace/lldb-cmake-matrix/lldb-build/bin/clang-11-x86_64) :: test_qSupported_returns_known_stub_features_debugserver (TestLldbGdbServer.LldbGdbServerTestCase) runCmd: settings clear -all output:

Hide Details

runCmd: settings set symbols.enable-external-lookup false output:

Hide Details

runCmd: settings set target.auto-apply-fixits false output:

Hide Details

runCmd: settings set plugin.process.gdb-remote.packet-timeout 60 output:

Hide Details

runCmd: settings set symbols.clang-modules-cache-path "/Users/buildslave/jenkins/workspace/lldb-cmake-matrix/lldb-build/lldb-test-build.noindex/module-cache-lldb/lldb-api" output:

Hide Details

runCmd: settings set use-color false output:

Hide Details

runCmd: setting set target.prefer-dynamic-value no-dynamic-values output:

Hide Details

UNSUPPORTED: LLDB (/Users/buildslave/jenkins/workspace/lldb-cmake-matrix/lldb-build/bin/clang-11-x86_64) :: test_qSupported_returns_known_stub_features_llgs (TestLldbGdbServer.LldbGdbServerTestCase) (llgs tests) runCmd: settings clear -all output:

Hide Details

runCmd: settings set symbols.enable-external-lookup false output:

Hide Details

runCmd: settings set target.auto-apply-fixits false output:

Hide Details

runCmd: settings set plugin.process.gdb-remote.packet-timeout 60 output:

Hide Details

runCmd: settings set symbols.clang-modules-cache-path "/Users/buildslave/jenkins/workspace/lldb-cmake-matrix/lldb-build/lldb-test-build.noindex/module-cache-lldb/lldb-api" output:

Hide Details

runCmd: settings set use-color false output:

Hide Details

runCmd: setting set target.prefer-dynamic-value no-dynamic-values output:

Hide Details

Adding tearDown hook: def shutdown_named_pipe(): # Close the pipe. try: named_pipe.close() except: print("failed to close named pipe") None

Hide Details

# Delete the pipe. try: os.remove(named_pipe_path) except: print("failed to delete named pipe: {}".format(named_pipe_path)) None

Hide Details

# Delete the temp directory. try: os.rmdir(temp_dir) except: print( "failed to delete temp dir: {}, directory contents: '{}'".format( temp_dir, os.listdir(temp_dir))) None

Hide Details

Hide Details

Adding tearDown hook: def shutdown_process_for_attach(): try: inferior.terminate() except: logger.warning( "failed to terminate inferior process for attach: {}; ignoring".format( sys.exc_info()[0]))

Hide Details

Hide Details

Adding tearDown hook: def cleanupSubprocesses(self): # Ensure any subprocesses are cleaned up for p in self.subprocesses: p.terminate() del p del self.subprocesses[:] # Ensure any forked processes are cleaned up for pid in self.forkedProcessPids: try: os.kill(pid, signal.SIGTERM) except OSError: pass

Hide Details

Hide Details

Adding tearDown hook: def shutdown_debug_monitor(): try: server.terminate() except: logger.warning( "failed to terminate server for debug monitor: {}; ignoring".format( sys.exc_info()[0]))

Hide Details

Hide Details

Adding tearDown hook: def shutdown_socket(): if sock: try: # send the kill packet so lldb-server shuts down gracefully sock.sendall(GdbRemoteTestCaseBase._GDBREMOTE_KILL_PACKET) except: logger.warning( "failed to send kill packet to debug monitor: {}; ignoring".format( sys.exc_info()[0]))

Hide Details

try: sock.close() except: logger.warning( "failed to close socket to debug monitor: {}; ignoring".format( sys.exc_info()[0]))

Hide Details

Hide Details

Executing tearDown hook: def shutdown_socket(): if sock: try: # send the kill packet so lldb-server shuts down gracefully sock.sendall(GdbRemoteTestCaseBase._GDBREMOTE_KILL_PACKET) except: logger.warning( "failed to send kill packet to debug monitor: {}; ignoring".format( sys.exc_info()[0]))

Hide Details

try: sock.close() except: logger.warning( "failed to close socket to debug monitor: {}; ignoring".format( sys.exc_info()[0]))

Hide Details

Hide Details

2020-06-30 20:38:01,402 WARNING failed to send kill packet to debug monitor: <class 'TypeError'>; ignoring Executing tearDown hook: def shutdown_debug_monitor(): try: server.terminate() except: logger.warning( "failed to terminate server for debug monitor: {}; ignoring".format( sys.exc_info()[0]))

Hide Details

Hide Details

Executing tearDown hook: def cleanupSubprocesses(self): # Ensure any subprocesses are cleaned up for p in self.subprocesses: p.terminate() del p del self.subprocesses[:] # Ensure any forked processes are cleaned up for pid in self.forkedProcessPids: try: os.kill(pid, signal.SIGTERM) except OSError: pass

Hide Details

Hide Details

Executing tearDown hook: def shutdown_process_for_attach(): try: inferior.terminate() except: logger.warning( "failed to terminate inferior process for attach: {}; ignoring".format( sys.exc_info()[0]))

Hide Details

Hide Details

Executing tearDown hook: def shutdown_named_pipe(): # Close the pipe. try: named_pipe.close() except: print("failed to close named pipe") None

Hide Details

# Delete the pipe. try: os.remove(named_pipe_path) except: print("failed to delete named pipe: {}".format(named_pipe_path)) None

Hide Details

# Delete the temp directory. try: os.rmdir(temp_dir) except: print( "failed to delete temp dir: {}, directory contents: '{}'".format( temp_dir, os.listdir(temp_dir))) None

Hide Details

Hide Details

PASS: LLDB (/Users/buildslave/jenkins/workspace/lldb-cmake-matrix/lldb-build/bin/clang-11-x86_64) :: test_qThreadInfo_contains_thread_attach_debugserver (TestLldbGdbServer.LldbGdbServerTestCase) runCmd: settings clear -all output:

Hide Details

runCmd: settings set symbols.enable-external-lookup false output:

Hide Details

runCmd: settings set target.auto-apply-fixits false output:

Hide Details

runCmd: settings set plugin.process.gdb-remote.packet-timeout 60 output:

Hide Details

runCmd: settings set symbols.clang-modules-cache-path "/Users/buildslave/jenkins/workspace/lldb-cmake-matrix/lldb-build/lldb-test-build.noindex/module-cache-lldb/lldb-api" output:

Hide Details

runCmd: settings set use-color false output:

Hide Details

runCmd: setting set target.prefer-dynamic-value no-dynamic-values output:

Hide Details

UNSUPPORTED: LLDB (/Users/buildslave/jenkins/workspace/lldb-cmake-matrix/lldb-build/bin/clang-11-x86_64) :: test_qThreadInfo_contains_thread_attach_llgs (TestLldbGdbServer.LldbGdbServerTestCase) (llgs tests) runCmd: settings clear -all output:

Hide Details

runCmd: settings set symbols.enable-external-lookup false output:

Hide Details

runCmd: settings set target.auto-apply-fixits false output:

Hide Details

runCmd: settings set plugin.process.gdb-remote.packet-timeout 60 output:

Hide Details

runCmd: settings set symbols.clang-modules-cache-path "/Users/buildslave/jenkins/workspace/lldb-cmake-matrix/lldb-build/lldb-test-build.noindex/module-cache-lldb/lldb-api" output:

Hide Details

runCmd: settings set use-color false output:

Hide Details

runCmd: setting set target.prefer-dynamic-value no-dynamic-values output:

Hide Details

Adding tearDown hook: def shutdown_named_pipe(): # Close the pipe. try: named_pipe.close() except: print("failed to close named pipe") None

Hide Details

# Delete the pipe. try: os.remove(named_pipe_path) except: print("failed to delete named pipe: {}".format(named_pipe_path)) None

Hide Details

# Delete the temp directory. try: os.rmdir(temp_dir) except: print( "failed to delete temp dir: {}, directory contents: '{}'".format( temp_dir, os.listdir(temp_dir))) None

Hide Details

Hide Details

Adding tearDown hook: def cleanupSubprocesses(self): # Ensure any subprocesses are cleaned up for p in self.subprocesses: p.terminate() del p del self.subprocesses[:] # Ensure any forked processes are cleaned up for pid in self.forkedProcessPids: try: os.kill(pid, signal.SIGTERM) except OSError: pass

Hide Details

Hide Details

Adding tearDown hook: def shutdown_debug_monitor(): try: server.terminate() except: logger.warning( "failed to terminate server for debug monitor: {}; ignoring".format( sys.exc_info()[0]))

Hide Details

Hide Details

Adding tearDown hook: def shutdown_socket(): if sock: try: # send the kill packet so lldb-server shuts down gracefully sock.sendall(GdbRemoteTestCaseBase._GDBREMOTE_KILL_PACKET) except: logger.warning( "failed to send kill packet to debug monitor: {}; ignoring".format( sys.exc_info()[0]))

Hide Details

try: sock.close() except: logger.warning( "failed to close socket to debug monitor: {}; ignoring".format( sys.exc_info()[0]))

Hide Details

Hide Details

Executing tearDown hook: def shutdown_socket(): if sock: try: # send the kill packet so lldb-server shuts down gracefully sock.sendall(GdbRemoteTestCaseBase._GDBREMOTE_KILL_PACKET) except: logger.warning( "failed to send kill packet to debug monitor: {}; ignoring".format( sys.exc_info()[0]))

Hide Details

try: sock.close() except: logger.warning( "failed to close socket to debug monitor: {}; ignoring".format( sys.exc_info()[0]))

Hide Details

Hide Details

2020-06-30 20:38:04,051 WARNING failed to send kill packet to debug monitor: <class 'TypeError'>; ignoring Executing tearDown hook: def shutdown_debug_monitor(): try: server.terminate() except: logger.warning( "failed to terminate server for debug monitor: {}; ignoring".format( sys.exc_info()[0]))

Hide Details

Hide Details

Executing tearDown hook: def cleanupSubprocesses(self): # Ensure any subprocesses are cleaned up for p in self.subprocesses: p.terminate() del p del self.subprocesses[:] # Ensure any forked processes are cleaned up for pid in self.forkedProcessPids: try: os.kill(pid, signal.SIGTERM) except OSError: pass

Hide Details

Hide Details

Executing tearDown hook: def shutdown_named_pipe(): # Close the pipe. try: named_pipe.close() except: print("failed to close named pipe") None

Hide Details

# Delete the pipe. try: os.remove(named_pipe_path) except: print("failed to delete named pipe: {}".format(named_pipe_path)) None

Hide Details

# Delete the temp directory. try: os.rmdir(temp_dir) except: print( "failed to delete temp dir: {}, directory contents: '{}'".format( temp_dir, os.listdir(temp_dir))) None

Hide Details

Hide Details

PASS: LLDB (/Users/buildslave/jenkins/workspace/lldb-cmake-matrix/lldb-build/bin/clang-11-x86_64) :: test_qThreadInfo_contains_thread_launch_debugserver (TestLldbGdbServer.LldbGdbServerTestCase) runCmd: settings clear -all output:

Hide Details

runCmd: settings set symbols.enable-external-lookup false output:

Hide Details

runCmd: settings set target.auto-apply-fixits false output:

Hide Details

runCmd: settings set plugin.process.gdb-remote.packet-timeout 60 output:

Hide Details

runCmd: settings set symbols.clang-modules-cache-path "/Users/buildslave/jenkins/workspace/lldb-cmake-matrix/lldb-build/lldb-test-build.noindex/module-cache-lldb/lldb-api" output:

Hide Details

runCmd: settings set use-color false output:

Hide Details

runCmd: setting set target.prefer-dynamic-value no-dynamic-values output:

Hide Details

UNSUPPORTED: LLDB (/Users/buildslave/jenkins/workspace/lldb-cmake-matrix/lldb-build/bin/clang-11-x86_64) :: test_qThreadInfo_contains_thread_launch_llgs (TestLldbGdbServer.LldbGdbServerTestCase) (llgs tests) runCmd: settings clear -all output:

Hide Details

runCmd: settings set symbols.enable-external-lookup false output:

Hide Details

runCmd: settings set target.auto-apply-fixits false output:

Hide Details

runCmd: settings set plugin.process.gdb-remote.packet-timeout 60 output:

Hide Details

runCmd: settings set symbols.clang-modules-cache-path "/Users/buildslave/jenkins/workspace/lldb-cmake-matrix/lldb-build/lldb-test-build.noindex/module-cache-lldb/lldb-api" output:

Hide Details

runCmd: settings set use-color false output:

Hide Details

runCmd: setting set target.prefer-dynamic-value no-dynamic-values output:

Hide Details

Adding tearDown hook: def shutdown_named_pipe(): # Close the pipe. try: named_pipe.close() except: print("failed to close named pipe") None

Hide Details

# Delete the pipe. try: os.remove(named_pipe_path) except: print("failed to delete named pipe: {}".format(named_pipe_path)) None

Hide Details

# Delete the temp directory. try: os.rmdir(temp_dir) except: print( "failed to delete temp dir: {}, directory contents: '{}'".format( temp_dir, os.listdir(temp_dir))) None

Hide Details

Hide Details

Adding tearDown hook: def shutdown_process_for_attach(): try: inferior.terminate() except: logger.warning( "failed to terminate inferior process for attach: {}; ignoring".format( sys.exc_info()[0]))

Hide Details

Hide Details

Adding tearDown hook: def cleanupSubprocesses(self): # Ensure any subprocesses are cleaned up for p in self.subprocesses: p.terminate() del p del self.subprocesses[:] # Ensure any forked processes are cleaned up for pid in self.forkedProcessPids: try: os.kill(pid, signal.SIGTERM) except OSError: pass

Hide Details

Hide Details

Adding tearDown hook: def shutdown_debug_monitor(): try: server.terminate() except: logger.warning( "failed to terminate server for debug monitor: {}; ignoring".format( sys.exc_info()[0]))

Hide Details

Hide Details

Adding tearDown hook: def shutdown_socket(): if sock: try: # send the kill packet so lldb-server shuts down gracefully sock.sendall(GdbRemoteTestCaseBase._GDBREMOTE_KILL_PACKET) except: logger.warning( "failed to send kill packet to debug monitor: {}; ignoring".format( sys.exc_info()[0]))

Hide Details

try: sock.close() except: logger.warning( "failed to close socket to debug monitor: {}; ignoring".format( sys.exc_info()[0]))

Hide Details

Hide Details

Executing tearDown hook: def shutdown_socket(): if sock: try: # send the kill packet so lldb-server shuts down gracefully sock.sendall(GdbRemoteTestCaseBase._GDBREMOTE_KILL_PACKET) except: logger.warning( "failed to send kill packet to debug monitor: {}; ignoring".format( sys.exc_info()[0]))

Hide Details

try: sock.close() except: logger.warning( "failed to close socket to debug monitor: {}; ignoring".format( sys.exc_info()[0]))

Hide Details

Hide Details

2020-06-30 20:38:06,738 WARNING failed to send kill packet to debug monitor: <class 'TypeError'>; ignoring Executing tearDown hook: def shutdown_debug_monitor(): try: server.terminate() except: logger.warning( "failed to terminate server for debug monitor: {}; ignoring".format( sys.exc_info()[0]))

Hide Details

Hide Details

Executing tearDown hook: def cleanupSubprocesses(self): # Ensure any subprocesses are cleaned up for p in self.subprocesses: p.terminate() del p del self.subprocesses[:] # Ensure any forked processes are cleaned up for pid in self.forkedProcessPids: try: os.kill(pid, signal.SIGTERM) except OSError: pass

Hide Details

Hide Details

Executing tearDown hook: def shutdown_process_for_attach(): try: inferior.terminate() except: logger.warning( "failed to terminate inferior process for attach: {}; ignoring".format( sys.exc_info()[0]))

Hide Details

Hide Details

Executing tearDown hook: def shutdown_named_pipe(): # Close the pipe. try: named_pipe.close() except: print("failed to close named pipe") None

Hide Details

# Delete the pipe. try: os.remove(named_pipe_path) except: print("failed to delete named pipe: {}".format(named_pipe_path)) None

Hide Details

# Delete the temp directory. try: os.rmdir(temp_dir) except: print( "failed to delete temp dir: {}, directory contents: '{}'".format( temp_dir, os.listdir(temp_dir))) None

Hide Details

Hide Details

PASS: LLDB (/Users/buildslave/jenkins/workspace/lldb-cmake-matrix/lldb-build/bin/clang-11-x86_64) :: test_qThreadInfo_matches_qC_attach_debugserver (TestLldbGdbServer.LldbGdbServerTestCase) runCmd: settings clear -all output:

Hide Details

runCmd: settings set symbols.enable-external-lookup false output:

Hide Details

runCmd: settings set target.auto-apply-fixits false output:

Hide Details

runCmd: settings set plugin.process.gdb-remote.packet-timeout 60 output:

Hide Details

runCmd: settings set symbols.clang-modules-cache-path "/Users/buildslave/jenkins/workspace/lldb-cmake-matrix/lldb-build/lldb-test-build.noindex/module-cache-lldb/lldb-api" output:

Hide Details

runCmd: settings set use-color false output:

Hide Details

runCmd: setting set target.prefer-dynamic-value no-dynamic-values output:

Hide Details

UNSUPPORTED: LLDB (/Users/buildslave/jenkins/workspace/lldb-cmake-matrix/lldb-build/bin/clang-11-x86_64) :: test_qThreadInfo_matches_qC_attach_llgs (TestLldbGdbServer.LldbGdbServerTestCase) (llgs tests) runCmd: settings clear -all output:

Hide Details

runCmd: settings set symbols.enable-external-lookup false output:

Hide Details

runCmd: settings set target.auto-apply-fixits false output:

Hide Details

runCmd: settings set plugin.process.gdb-remote.packet-timeout 60 output:

Hide Details

runCmd: settings set symbols.clang-modules-cache-path "/Users/buildslave/jenkins/workspace/lldb-cmake-matrix/lldb-build/lldb-test-build.noindex/module-cache-lldb/lldb-api" output:

Hide Details

runCmd: settings set use-color false output:

Hide Details

runCmd: setting set target.prefer-dynamic-value no-dynamic-values output:

Hide Details

Adding tearDown hook: def shutdown_named_pipe(): # Close the pipe. try: named_pipe.close() except: print("failed to close named pipe") None

Hide Details

# Delete the pipe. try: os.remove(named_pipe_path) except: print("failed to delete named pipe: {}".format(named_pipe_path)) None

Hide Details

# Delete the temp directory. try: os.rmdir(temp_dir) except: print( "failed to delete temp dir: {}, directory contents: '{}'".format( temp_dir, os.listdir(temp_dir))) None

Hide Details

Hide Details

Adding tearDown hook: def cleanupSubprocesses(self): # Ensure any subprocesses are cleaned up for p in self.subprocesses: p.terminate() del p del self.subprocesses[:] # Ensure any forked processes are cleaned up for pid in self.forkedProcessPids: try: os.kill(pid, signal.SIGTERM) except OSError: pass

Hide Details

Hide Details

Adding tearDown hook: def shutdown_debug_monitor(): try: server.terminate() except: logger.warning( "failed to terminate server for debug monitor: {}; ignoring".format( sys.exc_info()[0]))

Hide Details

Hide Details

Adding tearDown hook: def shutdown_socket(): if sock: try: # send the kill packet so lldb-server shuts down gracefully sock.sendall(GdbRemoteTestCaseBase._GDBREMOTE_KILL_PACKET) except: logger.warning( "failed to send kill packet to debug monitor: {}; ignoring".format( sys.exc_info()[0]))

Hide Details

try: sock.close() except: logger.warning( "failed to close socket to debug monitor: {}; ignoring".format( sys.exc_info()[0]))

Hide Details

Hide Details

Executing tearDown hook: def shutdown_socket(): if sock: try: # send the kill packet so lldb-server shuts down gracefully sock.sendall(GdbRemoteTestCaseBase._GDBREMOTE_KILL_PACKET) except: logger.warning( "failed to send kill packet to debug monitor: {}; ignoring".format( sys.exc_info()[0]))

Hide Details

try: sock.close() except: logger.warning( "failed to close socket to debug monitor: {}; ignoring".format( sys.exc_info()[0]))

Hide Details

Hide Details

2020-06-30 20:38:09,280 WARNING failed to send kill packet to debug monitor: <class 'TypeError'>; ignoring Executing tearDown hook: def shutdown_debug_monitor(): try: server.terminate() except: logger.warning( "failed to terminate server for debug monitor: {}; ignoring".format( sys.exc_info()[0]))

Hide Details

Hide Details

Executing tearDown hook: def cleanupSubprocesses(self): # Ensure any subprocesses are cleaned up for p in self.subprocesses: p.terminate() del p del self.subprocesses[:] # Ensure any forked processes are cleaned up for pid in self.forkedProcessPids: try: os.kill(pid, signal.SIGTERM) except OSError: pass

Hide Details

Hide Details

Executing tearDown hook: def shutdown_named_pipe(): # Close the pipe. try: named_pipe.close() except: print("failed to close named pipe") None

Hide Details

# Delete the pipe. try: os.remove(named_pipe_path) except: print("failed to delete named pipe: {}".format(named_pipe_path)) None

Hide Details

# Delete the temp directory. try: os.rmdir(temp_dir) except: print( "failed to delete temp dir: {}, directory contents: '{}'".format( temp_dir, os.listdir(temp_dir))) None

Hide Details

Hide Details

PASS: LLDB (/Users/buildslave/jenkins/workspace/lldb-cmake-matrix/lldb-build/bin/clang-11-x86_64) :: test_qThreadInfo_matches_qC_launch_debugserver (TestLldbGdbServer.LldbGdbServerTestCase) runCmd: settings clear -all output:

Hide Details

runCmd: settings set symbols.enable-external-lookup false output:

Hide Details

runCmd: settings set target.auto-apply-fixits false output:

Hide Details

runCmd: settings set plugin.process.gdb-remote.packet-timeout 60 output:

Hide Details

runCmd: settings set symbols.clang-modules-cache-path "/Users/buildslave/jenkins/workspace/lldb-cmake-matrix/lldb-build/lldb-test-build.noindex/module-cache-lldb/lldb-api" output:

Hide Details

runCmd: settings set use-color false output:

Hide Details

runCmd: setting set target.prefer-dynamic-value no-dynamic-values output:

Hide Details

UNSUPPORTED: LLDB (/Users/buildslave/jenkins/workspace/lldb-cmake-matrix/lldb-build/bin/clang-11-x86_64) :: test_qThreadInfo_matches_qC_launch_llgs (TestLldbGdbServer.LldbGdbServerTestCase) (llgs tests) runCmd: settings clear -all output:

Hide Details

runCmd: settings set symbols.enable-external-lookup false output:

Hide Details

runCmd: settings set target.auto-apply-fixits false output:

Hide Details

runCmd: settings set plugin.process.gdb-remote.packet-timeout 60 output:

Hide Details

runCmd: settings set symbols.clang-modules-cache-path "/Users/buildslave/jenkins/workspace/lldb-cmake-matrix/lldb-build/lldb-test-build.noindex/module-cache-lldb/lldb-api" output:

Hide Details

runCmd: settings set use-color false output:

Hide Details

runCmd: setting set target.prefer-dynamic-value no-dynamic-values output:

Hide Details

Adding tearDown hook: def shutdown_named_pipe(): # Close the pipe. try: named_pipe.close() except: print("failed to close named pipe") None

Hide Details

# Delete the pipe. try: os.remove(named_pipe_path) except: print("failed to delete named pipe: {}".format(named_pipe_path)) None

Hide Details

# Delete the temp directory. try: os.rmdir(temp_dir) except: print( "failed to delete temp dir: {}, directory contents: '{}'".format( temp_dir, os.listdir(temp_dir))) None

Hide Details

Hide Details

Adding tearDown hook: def cleanupSubprocesses(self): # Ensure any subprocesses are cleaned up for p in self.subprocesses: p.terminate() del p del self.subprocesses[:] # Ensure any forked processes are cleaned up for pid in self.forkedProcessPids: try: os.kill(pid, signal.SIGTERM) except OSError: pass

Hide Details

Hide Details

Adding tearDown hook: def shutdown_debug_monitor(): try: server.terminate() except: logger.warning( "failed to terminate server for debug monitor: {}; ignoring".format( sys.exc_info()[0]))

Hide Details

Hide Details

Adding tearDown hook: def shutdown_socket(): if sock: try: # send the kill packet so lldb-server shuts down gracefully sock.sendall(GdbRemoteTestCaseBase._GDBREMOTE_KILL_PACKET) except: logger.warning( "failed to send kill packet to debug monitor: {}; ignoring".format( sys.exc_info()[0]))

Hide Details

try: sock.close() except: logger.warning( "failed to close socket to debug monitor: {}; ignoring".format( sys.exc_info()[0]))

Hide Details

Hide Details

FAIL: LLDB (/Users/buildslave/jenkins/workspace/lldb-cmake-matrix/lldb-build/bin/clang-11-x86_64) :: test_software_breakpoint_set_and_remove_work_debugserver (TestLldbGdbServer.LldbGdbServerTestCase) Executing tearDown hook: def shutdown_socket(): if sock: try: # send the kill packet so lldb-server shuts down gracefully sock.sendall(GdbRemoteTestCaseBase._GDBREMOTE_KILL_PACKET) except: logger.warning( "failed to send kill packet to debug monitor: {}; ignoring".format( sys.exc_info()[0]))

Hide Details

try: sock.close() except: logger.warning( "failed to close socket to debug monitor: {}; ignoring".format( sys.exc_info()[0]))

Hide Details

Hide Details

2020-06-30 20:38:11,686 WARNING failed to send kill packet to debug monitor: <class 'TypeError'>; ignoring Executing tearDown hook: def shutdown_debug_monitor(): try: server.terminate() except: logger.warning( "failed to terminate server for debug monitor: {}; ignoring".format( sys.exc_info()[0]))

Hide Details

Hide Details

Executing tearDown hook: def cleanupSubprocesses(self): # Ensure any subprocesses are cleaned up for p in self.subprocesses: p.terminate() del p del self.subprocesses[:] # Ensure any forked processes are cleaned up for pid in self.forkedProcessPids: try: os.kill(pid, signal.SIGTERM) except OSError: pass

Hide Details

Hide Details

Executing tearDown hook: def shutdown_named_pipe(): # Close the pipe. try: named_pipe.close() except: print("failed to close named pipe") None

Hide Details

# Delete the pipe. try: os.remove(named_pipe_path) except: print("failed to delete named pipe: {}".format(named_pipe_path)) None

Hide Details

# Delete the temp directory. try: os.rmdir(temp_dir) except: print( "failed to delete temp dir: {}, directory contents: '{}'".format( temp_dir, os.listdir(temp_dir))) None

Hide Details

Hide Details

runCmd: settings clear -all output:

Hide Details

runCmd: settings set symbols.enable-external-lookup false output:

Hide Details

runCmd: settings set target.auto-apply-fixits false output:

Hide Details

runCmd: settings set plugin.process.gdb-remote.packet-timeout 60 output:

Hide Details

runCmd: settings set symbols.clang-modules-cache-path "/Users/buildslave/jenkins/workspace/lldb-cmake-matrix/lldb-build/lldb-test-build.noindex/module-cache-lldb/lldb-api" output:

Hide Details

runCmd: settings set use-color false output:

Hide Details

runCmd: setting set target.prefer-dynamic-value no-dynamic-values output:

Hide Details

UNSUPPORTED: LLDB (/Users/buildslave/jenkins/workspace/lldb-cmake-matrix/lldb-build/bin/clang-11-x86_64) :: test_software_breakpoint_set_and_remove_work_llgs (TestLldbGdbServer.LldbGdbServerTestCase) (llgs tests) runCmd: settings clear -all output:

Hide Details

runCmd: settings set symbols.enable-external-lookup false output:

Hide Details

runCmd: settings set target.auto-apply-fixits false output:

Hide Details

runCmd: settings set plugin.process.gdb-remote.packet-timeout 60 output:

Hide Details

runCmd: settings set symbols.clang-modules-cache-path "/Users/buildslave/jenkins/workspace/lldb-cmake-matrix/lldb-build/lldb-test-build.noindex/module-cache-lldb/lldb-api" output:

Hide Details

runCmd: settings set use-color false output:

Hide Details

runCmd: setting set target.prefer-dynamic-value no-dynamic-values output:

Hide Details

Adding tearDown hook: def shutdown_named_pipe(): # Close the pipe. try: named_pipe.close() except: print("failed to close named pipe") None

Hide Details

# Delete the pipe. try: os.remove(named_pipe_path) except: print("failed to delete named pipe: {}".format(named_pipe_path)) None

Hide Details

# Delete the temp directory. try: os.rmdir(temp_dir) except: print( "failed to delete temp dir: {}, directory contents: '{}'".format( temp_dir, os.listdir(temp_dir))) None

Hide Details

Hide Details

Adding tearDown hook: def cleanupSubprocesses(self): # Ensure any subprocesses are cleaned up for p in self.subprocesses: p.terminate() del p del self.subprocesses[:] # Ensure any forked processes are cleaned up for pid in self.forkedProcessPids: try: os.kill(pid, signal.SIGTERM) except OSError: pass

Hide Details

Hide Details

Adding tearDown hook: def shutdown_debug_monitor(): try: server.terminate() except: logger.warning( "failed to terminate server for debug monitor: {}; ignoring".format( sys.exc_info()[0]))

Hide Details

Hide Details

Adding tearDown hook: def shutdown_socket(): if sock: try: # send the kill packet so lldb-server shuts down gracefully sock.sendall(GdbRemoteTestCaseBase._GDBREMOTE_KILL_PACKET) except: logger.warning( "failed to send kill packet to debug monitor: {}; ignoring".format( sys.exc_info()[0]))

Hide Details

try: sock.close() except: logger.warning( "failed to close socket to debug monitor: {}; ignoring".format( sys.exc_info()[0]))

Hide Details

Hide Details

Executing tearDown hook: def shutdown_socket(): if sock: try: # send the kill packet so lldb-server shuts down gracefully sock.sendall(GdbRemoteTestCaseBase._GDBREMOTE_KILL_PACKET) except: logger.warning( "failed to send kill packet to debug monitor: {}; ignoring".format( sys.exc_info()[0]))

Hide Details

try: sock.close() except: logger.warning( "failed to close socket to debug monitor: {}; ignoring".format( sys.exc_info()[0]))

Hide Details

Hide Details

2020-06-30 20:38:11,847 WARNING failed to send kill packet to debug monitor: <class 'TypeError'>; ignoring Executing tearDown hook: def shutdown_debug_monitor(): try: server.terminate() except: logger.warning( "failed to terminate server for debug monitor: {}; ignoring".format( sys.exc_info()[0]))

Hide Details

Hide Details

Executing tearDown hook: def cleanupSubprocesses(self): # Ensure any subprocesses are cleaned up for p in self.subprocesses: p.terminate() del p del self.subprocesses[:] # Ensure any forked processes are cleaned up for pid in self.forkedProcessPids: try: os.kill(pid, signal.SIGTERM) except OSError: pass

Hide Details

Hide Details

Executing tearDown hook: def shutdown_named_pipe(): # Close the pipe. try: named_pipe.close() except: print("failed to close named pipe") None

Hide Details

# Delete the pipe. try: os.remove(named_pipe_path) except: print("failed to delete named pipe: {}".format(named_pipe_path)) None

Hide Details

# Delete the temp directory. try: os.rmdir(temp_dir) except: print( "failed to delete temp dir: {}, directory contents: '{}'".format( temp_dir, os.listdir(temp_dir))) None

Hide Details

Hide Details

PASS: LLDB (/Users/buildslave/jenkins/workspace/lldb-cmake-matrix/lldb-build/bin/clang-11-x86_64) :: test_start_no_ack_mode_debugserver (TestLldbGdbServer.LldbGdbServerTestCase) runCmd: settings clear -all output:

Hide Details

runCmd: settings set symbols.enable-external-lookup false output:

Hide Details

runCmd: settings set target.auto-apply-fixits false output:

Hide Details

runCmd: settings set plugin.process.gdb-remote.packet-timeout 60 output:

Hide Details

runCmd: settings set symbols.clang-modules-cache-path "/Users/buildslave/jenkins/workspace/lldb-cmake-matrix/lldb-build/lldb-test-build.noindex/module-cache-lldb/lldb-api" output:

Hide Details

runCmd: settings set use-color false output:

Hide Details

runCmd: setting set target.prefer-dynamic-value no-dynamic-values output:

Hide Details

UNSUPPORTED: LLDB (/Users/buildslave/jenkins/workspace/lldb-cmake-matrix/lldb-build/bin/clang-11-x86_64) :: test_start_no_ack_mode_llgs (TestLldbGdbServer.LldbGdbServerTestCase) (llgs tests) runCmd: settings clear -all output:

Hide Details

runCmd: settings set symbols.enable-external-lookup false output:

Hide Details

runCmd: settings set target.auto-apply-fixits false output:

Hide Details

runCmd: settings set plugin.process.gdb-remote.packet-timeout 60 output:

Hide Details

runCmd: settings set symbols.clang-modules-cache-path "/Users/buildslave/jenkins/workspace/lldb-cmake-matrix/lldb-build/lldb-test-build.noindex/module-cache-lldb/lldb-api" output:

Hide Details

runCmd: settings set use-color false output:

Hide Details

runCmd: setting set target.prefer-dynamic-value no-dynamic-values output:

Hide Details

Adding tearDown hook: def shutdown_named_pipe(): # Close the pipe. try: named_pipe.close() except: print("failed to close named pipe") None

Hide Details

# Delete the pipe. try: os.remove(named_pipe_path) except: print("failed to delete named pipe: {}".format(named_pipe_path)) None

Hide Details

# Delete the temp directory. try: os.rmdir(temp_dir) except: print( "failed to delete temp dir: {}, directory contents: '{}'".format( temp_dir, os.listdir(temp_dir))) None

Hide Details

Hide Details

Adding tearDown hook: def cleanupSubprocesses(self): # Ensure any subprocesses are cleaned up for p in self.subprocesses: p.terminate() del p del self.subprocesses[:] # Ensure any forked processes are cleaned up for pid in self.forkedProcessPids: try: os.kill(pid, signal.SIGTERM) except OSError: pass

Hide Details

Hide Details

Adding tearDown hook: def shutdown_debug_monitor(): try: server.terminate() except: logger.warning( "failed to terminate server for debug monitor: {}; ignoring".format( sys.exc_info()[0]))

Hide Details

Hide Details

Adding tearDown hook: def shutdown_socket(): if sock: try: # send the kill packet so lldb-server shuts down gracefully sock.sendall(GdbRemoteTestCaseBase._GDBREMOTE_KILL_PACKET) except: logger.warning( "failed to send kill packet to debug monitor: {}; ignoring".format( sys.exc_info()[0]))

Hide Details

try: sock.close() except: logger.warning( "failed to close socket to debug monitor: {}; ignoring".format( sys.exc_info()[0]))

Hide Details

Hide Details

Executing tearDown hook: def shutdown_socket(): if sock: try: # send the kill packet so lldb-server shuts down gracefully sock.sendall(GdbRemoteTestCaseBase._GDBREMOTE_KILL_PACKET) except: logger.warning( "failed to send kill packet to debug monitor: {}; ignoring".format( sys.exc_info()[0]))

Hide Details

try: sock.close() except: logger.warning( "failed to close socket to debug monitor: {}; ignoring".format( sys.exc_info()[0]))

Hide Details

Hide Details

2020-06-30 20:38:11,913 WARNING failed to send kill packet to debug monitor: <class 'TypeError'>; ignoring Executing tearDown hook: def shutdown_debug_monitor(): try: server.terminate() except: logger.warning( "failed to terminate server for debug monitor: {}; ignoring".format( sys.exc_info()[0]))

Hide Details

Hide Details

Executing tearDown hook: def cleanupSubprocesses(self): # Ensure any subprocesses are cleaned up for p in self.subprocesses: p.terminate() del p del self.subprocesses[:] # Ensure any forked processes are cleaned up for pid in self.forkedProcessPids: try: os.kill(pid, signal.SIGTERM) except OSError: pass

Hide Details

Hide Details

Executing tearDown hook: def shutdown_named_pipe(): # Close the pipe. try: named_pipe.close() except: print("failed to close named pipe") None

Hide Details

# Delete the pipe. try: os.remove(named_pipe_path) except: print("failed to delete named pipe: {}".format(named_pipe_path)) None

Hide Details

# Delete the temp directory. try: os.rmdir(temp_dir) except: print( "failed to delete temp dir: {}, directory contents: '{}'".format( temp_dir, os.listdir(temp_dir))) None

Hide Details

Hide Details

PASS: LLDB (/Users/buildslave/jenkins/workspace/lldb-cmake-matrix/lldb-build/bin/clang-11-x86_64) :: test_thread_suffix_supported_debugserver (TestLldbGdbServer.LldbGdbServerTestCase) runCmd: settings clear -all output:

Hide Details

runCmd: settings set symbols.enable-external-lookup false output:

Hide Details

runCmd: settings set target.auto-apply-fixits false output:

Hide Details

runCmd: settings set plugin.process.gdb-remote.packet-timeout 60 output:

Hide Details

runCmd: settings set symbols.clang-modules-cache-path "/Users/buildslave/jenkins/workspace/lldb-cmake-matrix/lldb-build/lldb-test-build.noindex/module-cache-lldb/lldb-api" output:

Hide Details

runCmd: settings set use-color false output:

Hide Details

runCmd: setting set target.prefer-dynamic-value no-dynamic-values output:

Hide Details

UNSUPPORTED: LLDB (/Users/buildslave/jenkins/workspace/lldb-cmake-matrix/lldb-build/bin/clang-11-x86_64) :: test_thread_suffix_supported_llgs (TestLldbGdbServer.LldbGdbServerTestCase) (llgs tests) runCmd: settings clear -all output:

Hide Details

runCmd: settings set symbols.enable-external-lookup false output:

Hide Details

runCmd: settings set target.auto-apply-fixits false output:

Hide Details

runCmd: settings set plugin.process.gdb-remote.packet-timeout 60 output:

Hide Details

runCmd: settings set symbols.clang-modules-cache-path "/Users/buildslave/jenkins/workspace/lldb-cmake-matrix/lldb-build/lldb-test-build.noindex/module-cache-lldb/lldb-api" output:

Hide Details

runCmd: settings set use-color false output:

Hide Details

runCmd: setting set target.prefer-dynamic-value no-dynamic-values output:

Hide Details

Adding tearDown hook: def shutdown_named_pipe(): # Close the pipe. try: named_pipe.close() except: print("failed to close named pipe") None

Hide Details

# Delete the pipe. try: os.remove(named_pipe_path) except: print("failed to delete named pipe: {}".format(named_pipe_path)) None

Hide Details

# Delete the temp directory. try: os.rmdir(temp_dir) except: print( "failed to delete temp dir: {}, directory contents: '{}'".format( temp_dir, os.listdir(temp_dir))) None

Hide Details

Hide Details

Adding tearDown hook: def cleanupSubprocesses(self): # Ensure any subprocesses are cleaned up for p in self.subprocesses: p.terminate() del p del self.subprocesses[:] # Ensure any forked processes are cleaned up for pid in self.forkedProcessPids: try: os.kill(pid, signal.SIGTERM) except OSError: pass

Hide Details

Hide Details

Adding tearDown hook: def shutdown_debug_monitor(): try: server.terminate() except: logger.warning( "failed to terminate server for debug monitor: {}; ignoring".format( sys.exc_info()[0]))

Hide Details

Hide Details

Adding tearDown hook: def shutdown_socket(): if sock: try: # send the kill packet so lldb-server shuts down gracefully sock.sendall(GdbRemoteTestCaseBase._GDBREMOTE_KILL_PACKET) except: logger.warning( "failed to send kill packet to debug monitor: {}; ignoring".format( sys.exc_info()[0]))

Hide Details

try: sock.close() except: logger.warning( "failed to close socket to debug monitor: {}; ignoring".format( sys.exc_info()[0]))

Hide Details

Hide Details

Executing tearDown hook: def shutdown_socket(): if sock: try: # send the kill packet so lldb-server shuts down gracefully sock.sendall(GdbRemoteTestCaseBase._GDBREMOTE_KILL_PACKET) except: logger.warning( "failed to send kill packet to debug monitor: {}; ignoring".format( sys.exc_info()[0]))

Hide Details

try: sock.close() except: logger.warning( "failed to close socket to debug monitor: {}; ignoring".format( sys.exc_info()[0]))

Hide Details

Hide Details

2020-06-30 20:38:15,237 WARNING failed to send kill packet to debug monitor: <class 'TypeError'>; ignoring Executing tearDown hook: def shutdown_debug_monitor(): try: server.terminate() except: logger.warning( "failed to terminate server for debug monitor: {}; ignoring".format( sys.exc_info()[0]))

Hide Details

Hide Details

Executing tearDown hook: def cleanupSubprocesses(self): # Ensure any subprocesses are cleaned up for p in self.subprocesses: p.terminate() del p del self.subprocesses[:] # Ensure any forked processes are cleaned up for pid in self.forkedProcessPids: try: os.kill(pid, signal.SIGTERM) except OSError: pass

Hide Details

Hide Details

Executing tearDown hook: def shutdown_named_pipe(): # Close the pipe. try: named_pipe.close() except: print("failed to close named pipe") None

Hide Details

# Delete the pipe. try: os.remove(named_pipe_path) except: print("failed to delete named pipe: {}".format(named_pipe_path)) None

Hide Details

# Delete the temp directory. try: os.rmdir(temp_dir) except: print( "failed to delete temp dir: {}, directory contents: '{}'".format( temp_dir, os.listdir(temp_dir))) None

Hide Details

Hide Details

PASS: LLDB (/Users/buildslave/jenkins/workspace/lldb-cmake-matrix/lldb-build/bin/clang-11-x86_64) :: test_written_M_content_reads_back_correctly_debugserver (TestLldbGdbServer.LldbGdbServerTestCase) runCmd: settings clear -all output:

Hide Details

runCmd: settings set symbols.enable-external-lookup false output:

Hide Details

runCmd: settings set target.auto-apply-fixits false output:

Hide Details

runCmd: settings set plugin.process.gdb-remote.packet-timeout 60 output:

Hide Details

runCmd: settings set symbols.clang-modules-cache-path "/Users/buildslave/jenkins/workspace/lldb-cmake-matrix/lldb-build/lldb-test-build.noindex/module-cache-lldb/lldb-api" output:

Hide Details

runCmd: settings set use-color false output:

Hide Details

runCmd: setting set target.prefer-dynamic-value no-dynamic-values output:

Hide Details

UNSUPPORTED: LLDB (/Users/buildslave/jenkins/workspace/lldb-cmake-matrix/lldb-build/bin/clang-11-x86_64) :: test_written_M_content_reads_back_correctly_llgs (TestLldbGdbServer.LldbGdbServerTestCase) (llgs tests) Restore dir to: /Users/buildslave/jenkins/workspace/lldb-cmake-matrix/lldb-build/tools/lldb/test ====================================================================== FAIL: test_P_and_p_thread_suffix_work_debugserver (TestLldbGdbServer.LldbGdbServerTestCase) ---------------------------------------------------------------------- Traceback (most recent call last): File "/Users/buildslave/jenkins/workspace/lldb-cmake-matrix/llvm-project/lldb/packages/Python/lldbsuite/test/decorators.py", line 140, in wrapper func(*args, **kwargs) File "/Users/buildslave/jenkins/workspace/lldb-cmake-matrix/llvm-project/lldb/test/API/tools/lldb-server/TestLldbGdbServer.py", line 1579, in test_P_and_p_thread_suffix_work_debugserver self.P_and_p_thread_suffix_work() File "/Users/buildslave/jenkins/workspace/lldb-cmake-matrix/llvm-project/lldb/test/API/tools/lldb-server/TestLldbGdbServer.py", line 1474, in P_and_p_thread_suffix_work process_info = self.parse_process_info_response(context) File "/Users/buildslave/jenkins/workspace/lldb-cmake-matrix/llvm-project/lldb/packages/Python/lldbsuite/test/tools/lldb-server/gdbremote_testcase.py", line 711, in parse_process_info_response self.assertTrue(key in self._KNOWN_PROCESS_INFO_KEYS) AssertionError: False is not True Config=x86_64-/Users/buildslave/jenkins/workspace/lldb-cmake-matrix/lldb-build/bin/clang-11 ====================================================================== FAIL: test_P_writes_all_gpr_registers_debugserver (TestLldbGdbServer.LldbGdbServerTestCase) ---------------------------------------------------------------------- Traceback (most recent call last): File "/Users/buildslave/jenkins/workspace/lldb-cmake-matrix/llvm-project/lldb/packages/Python/lldbsuite/test/decorators.py", line 140, in wrapper func(*args, **kwargs) File "/Users/buildslave/jenkins/workspace/lldb-cmake-matrix/llvm-project/lldb/test/API/tools/lldb-server/TestLldbGdbServer.py", line 1454, in test_P_writes_all_gpr_registers_debugserver self.P_writes_all_gpr_registers() File "/Users/buildslave/jenkins/workspace/lldb-cmake-matrix/llvm-project/lldb/test/API/tools/lldb-server/TestLldbGdbServer.py", line 1429, in P_writes_all_gpr_registers process_info = self.parse_process_info_response(context) File "/Users/buildslave/jenkins/workspace/lldb-cmake-matrix/llvm-project/lldb/packages/Python/lldbsuite/test/tools/lldb-server/gdbremote_testcase.py", line 711, in parse_process_info_response self.assertTrue(key in self._KNOWN_PROCESS_INFO_KEYS) AssertionError: False is not True Config=x86_64-/Users/buildslave/jenkins/workspace/lldb-cmake-matrix/lldb-build/bin/clang-11 ====================================================================== FAIL: test_software_breakpoint_set_and_remove_work_debugserver (TestLldbGdbServer.LldbGdbServerTestCase) ---------------------------------------------------------------------- Traceback (most recent call last): File "/Users/buildslave/jenkins/workspace/lldb-cmake-matrix/llvm-project/lldb/packages/Python/lldbsuite/test/decorators.py", line 140, in wrapper func(*args, **kwargs) File "/Users/buildslave/jenkins/workspace/lldb-cmake-matrix/llvm-project/lldb/test/API/tools/lldb-server/TestLldbGdbServer.py", line 1266, in test_software_breakpoint_set_and_remove_work_debugserver self.breakpoint_set_and_remove_work(want_hardware=False) File "/Users/buildslave/jenkins/workspace/lldb-cmake-matrix/llvm-project/lldb/test/API/tools/lldb-server/TestLldbGdbServer.py", line 1154, in breakpoint_set_and_remove_work process_info = self.parse_process_info_response(context) File "/Users/buildslave/jenkins/workspace/lldb-cmake-matrix/llvm-project/lldb/packages/Python/lldbsuite/test/tools/lldb-server/gdbremote_testcase.py", line 711, in parse_process_info_response self.assertTrue(key in self._KNOWN_PROCESS_INFO_KEYS) AssertionError: False is not True Config=x86_64-/Users/buildslave/jenkins/workspace/lldb-cmake-matrix/lldb-build/bin/clang-11 ---------------------------------------------------------------------- Ran 65 tests in 86.947s

Hide Details

RESULT: FAILED (27 passes, 3 failures, 0 errors, 34 skipped, 1 expected failures, 0 unexpected successes)

Hide Details

--

Hide Details

******************** PASS: lldb-unit :: Utility/./UtilityTests/StringExtractorTest.GetNameColonValueNoSemicolon (1290 of 2058) PASS: lldb-unit :: Core/./LLDBCoreTests/MangledTest.NameIndexes_FindFunctionSymbols (1291 of 2058) PASS: lldb-unit :: Utility/./UtilityTests/DataExtractorTest.GetCStrUnterminated (1292 of 2058) PASS: lldb-unit :: Language/Highlighting/./HighlighterTests/HighlighterTest.ClangTrailingBackslashMissingNewLine (1293 of 2058) XFAIL: lldb-shell :: Register/x86-64-ymm-write.test (1294 of 2058) PASS: lldb-unit :: Utility/./UtilityTests/ListenerTest.GetEventWait (1295 of 2058) PASS: lldb-unit :: Utility/./UtilityTests/ArgsTest.Yaml (1296 of 2058) PASS: lldb-shell :: ObjectFile/ELF/duplicate-section.yaml (1297 of 2058) PASS: lldb-api :: commands/expression/persistent_types/TestNestedPersistentTypes.py (1298 of 2058) UNSUPPORTED: lldb-shell :: ScriptInterpreter/Lua/nested_sessions.test (1299 of 2058) PASS: lldb-api :: tools/lldb-server/TestGdbRemoteSingleStep.py (1300 of 2058) UNSUPPORTED: lldb-shell :: SymbolFile/NativePDB/globals-fundamental.cpp (1301 of 2058) PASS: lldb-api :: driver/batch_mode/TestBatchMode.py (1302 of 2058) PASS: lldb-shell :: SymbolFile/DWARF/parallel-indexing-stress.s (1303 of 2058) PASS: lldb-api :: functionalities/postmortem/elf-core/TestLinuxCore.py (1304 of 2058) PASS: lldb-unit :: Host/./HostTests/ConnectionFileDescriptorTest.TCPGetURIv4 (1305 of 2058) PASS: lldb-api :: commands/command/delete/TestCommandDelete.py (1306 of 2058) PASS: lldb-api :: functionalities/data-formatter/data-formatter-globals/TestDataFormatterGlobals.py (1307 of 2058) PASS: lldb-unit :: SymbolFile/DWARF/./SymbolFileDWARFTests/SymbolFileDWARFTests.ParseArangesNonzeroSegmentSize (1308 of 2058) PASS: lldb-shell :: ScriptInterpreter/None/none.test (1309 of 2058) PASS: lldb-api :: lang/cpp/diamond/TestDiamond.py (1310 of 2058) PASS: lldb-unit :: Utility/./UtilityTests/RegisterValueTest.GetSet8 (1311 of 2058) PASS: lldb-api :: arm/emulation/TestEmulations.py (1312 of 2058) PASS: lldb-unit :: Utility/./UtilityTests/BinaryStreamTest.PutSLEB128EightBytes (1313 of 2058) PASS: lldb-unit :: Utility/./UtilityTests/VASprintfTest.BufferResize (1314 of 2058) PASS: lldb-api :: lang/objc/foundation/TestObjCMethods.py (1315 of 2058) PASS: lldb-unit :: UnwindAssembly/x86/./UnwindAssemblyx86Tests/Testx86AssemblyInspectionEngine.TestSimplex86_64Augmented (1316 of 2058) UNSUPPORTED: lldb-api :: functionalities/thread/concurrent_events/TestConcurrentTwoBreakpointsOneWatchpoint.py (1317 of 2058) PASS: lldb-unit :: Utility/./UtilityTests/RangeTest.ContainsAddr (1318 of 2058) PASS: lldb-api :: functionalities/data-formatter/compactvectors/TestCompactVectors.py (1319 of 2058) PASS: lldb-api :: lang/cpp/rvalue-references/TestRvalueReferences.py (1320 of 2058) PASS: lldb-api :: commands/expression/deleting-implicit-copy-constructor/TestDeletingImplicitCopyConstructor.py (1321 of 2058) PASS: lldb-api :: functionalities/pre_run_dylibs/TestPreRunDylibs.py (1322 of 2058) PASS: lldb-unit :: Core/./LLDBCoreTests/UniqueCStringMap.NoDefaultConstructor (1323 of 2058) PASS: lldb-api :: commands/register/register/register_command/TestRegisters.py (1324 of 2058) PASS: lldb-unit :: Symbol/./SymbolTests/TestClangASTImporter.MetadataPropagation (1325 of 2058) PASS: lldb-unit :: Utility/./UtilityTests/OptionsWithRawTest.LeadingSpaceArgs (1326 of 2058) PASS: lldb-shell :: Quit/TestQuitExitCodeHex0.test (1327 of 2058) PASS: lldb-shell :: Watchpoint/SetErrorCases.test (1328 of 2058) UNSUPPORTED: lldb-api :: functionalities/darwin_log/filter/regex/subsystem/TestDarwinLogFilterRegexSubsystem.py (1329 of 2058) PASS: lldb-unit :: Process/minidump/./LLDBMinidumpTests/MinidumpParserTest.MinidumpModuleOrder (1330 of 2058) PASS: lldb-unit :: ScriptInterpreter/Python/./ScriptInterpreterPythonTests/PythonDataObjectsTest.TestGlobalNameResolutionNoDot (1331 of 2058) PASS: lldb-unit :: Utility/./UtilityTests/BinaryStreamTest.PutULEB128TwoBytes (1332 of 2058) PASS: lldb-unit :: Utility/./UtilityTests/ScalarTest.ExtractBitfield (1333 of 2058) PASS: lldb-shell :: Settings/TestSettingsSet.test (1334 of 2058) PASS: lldb-unit :: Utility/./UtilityTests/ArgsTest.StringListConstructor (1335 of 2058) PASS: lldb-api :: commands/expression/persist_objc_pointeetype/TestPersistObjCPointeeType.py (1336 of 2058) PASS: lldb-api :: functionalities/mtc/simple/TestMTCSimple.py (1337 of 2058) UNSUPPORTED: lldb-api :: functionalities/darwin_log/filter/regex/activity-chain/TestDarwinLogFilterRegexActivityChain.py (1338 of 2058) PASS: lldb-api :: commands/expression/anonymous-struct/TestCallUserAnonTypedef.py (1339 of 2058) PASS: lldb-unit :: Symbol/./SymbolTests/SymbolsTest.TerminateLocateExecutableSymbolFileForUnknownExecutableAndUnknownSymbolFile (1340 of 2058) UNSUPPORTED: lldb-shell :: SymbolFile/PDB/expressions.test (1341 of 2058) PASS: lldb-api :: functionalities/data-formatter/boolreference/TestFormattersBoolRefPtr.py (1342 of 2058) PASS: lldb-unit :: Expression/./ExpressionTests/ClangExpressionDeclMapTest.TestUnknownIdentifierLookup (1343 of 2058) PASS: lldb-unit :: Symbol/./SymbolTests/TestClangASTImporter.DeportDeclTagDecl (1344 of 2058) PASS: lldb-api :: lang/objc/objc-dyn-sbtype/TestObjCDynamicSBType.py (1345 of 2058) PASS: lldb-shell :: Reproducer/TestPythonImport.test (1346 of 2058) PASS: lldb-api :: lang/cpp/std-function-step-into-callable/TestStdFunctionStepIntoCallable.py (1347 of 2058) PASS: lldb-api :: macosx/order/TestOrderFile.py (1348 of 2058) PASS: lldb-api :: functionalities/signal/raise/TestRaise.py (1349 of 2058) PASS: lldb-api :: python_api/process/read-mem-cstring/TestReadMemCString.py (1350 of 2058) PASS: lldb-api :: commands/expression/call-function/TestCallStdStringFunction.py (1351 of 2058) PASS: lldb-api :: commands/expression/weak_symbols/TestWeakSymbols.py (1352 of 2058) PASS: lldb-shell :: Commands/command-regex-unalias.test (1353 of 2058) PASS: lldb-api :: commands/expression/context-object-objc/TestContextObjectObjc.py (1354 of 2058) PASS: lldb-api :: python_api/module_section/TestModuleAndSection.py (1355 of 2058) PASS: lldb-api :: functionalities/source-map/TestTargetSourceMap.py (1356 of 2058) PASS: lldb-unit :: Core/./LLDBCoreTests/RichManglingContextTest.SwitchProvider (1357 of 2058) PASS: lldb-unit :: Expression/./ExpressionTests/ClangHostTest.ComputeClangResourceDirectory (1358 of 2058) PASS: lldb-unit :: Host/./HostTests/SocketTest.UDPGetConnectURI (1359 of 2058) PASS: lldb-api :: lang/objc/objc-baseclass-sbtype/TestObjCBaseClassSBType.py (1360 of 2058) PASS: lldb-unit :: Utility/./UtilityTests/RangeTest.NotEqualInvalid (1361 of 2058) PASS: lldb-api :: commands/expression/static-initializers/TestStaticInitializers.py (1362 of 2058) PASS: lldb-unit :: Utility/./UtilityTests/StringListTest.DefaultConstructor (1363 of 2058) UNSUPPORTED: lldb-api :: python_api/event/TestEvents.py (1364 of 2058) PASS: lldb-unit :: Process/minidump/./LLDBMinidumpTests/MinidumpParserTest.GetThreadContext_x86_64 (1365 of 2058) PASS: lldb-unit :: Utility/./UtilityTests/SerializationRountripTest.SerializeDeserializeCString (1366 of 2058) UNSUPPORTED: lldb-shell :: Unwind/unwind-plan-dwarf-dump.test (1367 of 2058) PASS: lldb-unit :: Expression/./ExpressionTests/DiagnosticManagerTest.AppendMessageNoDiag (1368 of 2058) PASS: lldb-unit :: UnwindAssembly/x86/./UnwindAssemblyx86Tests/Testx86AssemblyInspectionEngine.TestPopRBP (1369 of 2058) PASS: lldb-shell :: Breakpoint/debug_rnglist_rlestartend.test (1370 of 2058) PASS: lldb-api :: lang/c/offsetof/TestOffsetof.py (1371 of 2058) PASS: lldb-unit :: UnwindAssembly/x86/./UnwindAssemblyx86Tests/Testx86AssemblyInspectionEngine.TestSimple32bitFrameFunction (1372 of 2058) PASS: lldb-api :: functionalities/gdb_remote_client/TestNoGPacketSupported.py (1373 of 2058) PASS: lldb-shell :: ScriptInterpreter/Python/sb_address_exception.test (1374 of 2058) UNSUPPORTED: lldb-shell :: SymbolFile/DWARF/find-function-regex.cpp (1375 of 2058) PASS: lldb-unit :: Expression/./ExpressionTests/DWARFExpression.DW_OP_stack_value (1376 of 2058) PASS: lldb-unit :: Utility/./UtilityTests/RangeDataVector.FindEntryThatContains_Overlap (1377 of 2058) PASS: lldb-unit :: Utility/./UtilityTests/StringExtractorTest.GetHexU8_Underflow (1378 of 2058) PASS: lldb-api :: commands/expression/import-std-module/unique_ptr-dbg-info-content/TestUniquePtrDbgInfoContent.py (1379 of 2058) PASS: lldb-unit :: Target/./TargetTests/ModuleCacheTest.GetAndPutUuidExists (1380 of 2058) PASS: lldb-unit :: Utility/./UtilityTests/StreamTeeTest.Write (1381 of 2058) PASS: lldb-unit :: UnwindAssembly/x86/./UnwindAssemblyx86Tests/Testx86AssemblyInspectionEngine.TestStackRealign8BitDisp_i386 (1382 of 2058) PASS: lldb-unit :: Thread/./ThreadTests/ThreadTest.GetPrivateStopInfo (1383 of 2058) PASS: lldb-unit :: Utility/./UtilityTests/LogChannelTest.Disable (1384 of 2058) PASS: lldb-unit :: Utility/./UtilityTests/UserIDResolver.GetGroupName (1385 of 2058) PASS: lldb-api :: sample_test/TestSampleInlineTest.py (1386 of 2058) PASS: lldb-api :: functionalities/breakpoint/cpp/TestCPPBreakpointLocations.py (1387 of 2058) PASS: lldb-unit :: Utility/./UtilityTests/VMRange.Ordering (1388 of 2058) UNSUPPORTED: lldb-api :: functionalities/thread/concurrent_events/TestConcurrentCrashWithWatchpointBreakpointSignal.py (1389 of 2058) UNSUPPORTED: lldb-api :: functionalities/thread/concurrent_events/TestConcurrentSignalWatchBreak.py (1390 of 2058) PASS: lldb-shell :: ObjectFile/PECOFF/basic-info-arm.yaml (1391 of 2058) PASS: lldb-unit :: Utility/./UtilityTests/StringListTest.LongestCommonPrefixNoPrefix (1392 of 2058) PASS: lldb-shell :: Commands/command-thread-select.test (1393 of 2058) PASS: lldb-api :: lang/objc/global_ptrs/TestGlobalObjects.py (1394 of 2058) PASS: lldb-unit :: Utility/./UtilityTests/StreamTest.PutBytesAsRawHex8ToBigEndian (1395 of 2058) PASS: lldb-unit :: Process/gdb-remote/./ProcessGdbRemoteTests/GDBRemoteCommunicationTest.ReadPacket_checksum (1396 of 2058) UNSUPPORTED: lldb-api :: functionalities/thread/concurrent_events/TestConcurrentBreakpointsDelayedBreakpointOneWatchpoint.py (1397 of 2058) UNSUPPORTED: lldb-shell :: Unwind/eh-frame-small-fde.test (1398 of 2058) PASS: lldb-api :: functionalities/data-formatter/data-formatter-stl/libcxx/list/TestDataFormatterLibcxxList.py (1399 of 2058) PASS: lldb-api :: lang/cpp/call-function/TestCallCPPFunction.py (1400 of 2058) PASS: lldb-api :: tools/lldb-vscode/launch/TestVSCode_launch.py (1401 of 2058) UNSUPPORTED: lldb-shell :: SymbolFile/NativePDB/globals-bss.cpp (1402 of 2058) PASS: lldb-unit :: ScriptInterpreter/Python/./ScriptInterpreterPythonTests/PythonDataObjectsTest.TestPythonIntegerToStructuredInteger (1403 of 2058) PASS: lldb-api :: lang/cpp/operator-overload/TestOperatorOverload.py (1404 of 2058) PASS: lldb-unit :: Utility/./UtilityTests/StringListTest.GetMaxStringLengthEqualSize (1405 of 2058) PASS: lldb-api :: commands/command/source/TestCommandSource.py (1406 of 2058) PASS: lldb-api :: commands/platform/basic/TestPlatformCommand.py (1407 of 2058) PASS: lldb-unit :: Language/Highlighting/./HighlighterTests/HighlighterTest.DefaultHighlighterWithCursor (1408 of 2058) PASS: lldb-api :: functionalities/breakpoint/objc/TestObjCBreakpoints.py (1409 of 2058) PASS: lldb-shell :: Process/UnsupportedLanguage.test (1410 of 2058) PASS: lldb-api :: functionalities/memory/cache/TestMemoryCache.py (1411 of 2058) PASS: lldb-api :: functionalities/thread/ignore_suspended/TestIgnoreSuspendedThread.py (1412 of 2058) PASS: lldb-unit :: Utility/./UtilityTests/OptionsWithRawTest.SingleWhitespaceInput (1413 of 2058) PASS: lldb-api :: lang/objc/exceptions/TestObjCExceptions.py (1414 of 2058) PASS: lldb-shell :: Driver/TestNoUseColor.test (1415 of 2058) PASS: lldb-shell :: SymbolFile/Breakpad/unwind-via-stack-win.test (1416 of 2058) PASS: lldb-unit :: UnwindAssembly/x86/./UnwindAssemblyx86Tests/Testx86AssemblyInspectionEngine.TestPushR12 (1417 of 2058) UNSUPPORTED: lldb-shell :: SymbolFile/NativePDB/tag-types.cpp (1418 of 2058) PASS: lldb-unit :: Utility/./UtilityTests/PassiveReplayTest.InstrumentedFooInvalid (1419 of 2058) PASS: lldb-unit :: UnwindAssembly/x86/./UnwindAssemblyx86Tests/Testx86AssemblyInspectionEngine.TestSpArithx86_64Augmented (1420 of 2058) PASS: lldb-unit :: Utility/./UtilityTests/StringExtractorTest.DecodeHexU8_InvalidHex (1421 of 2058) PASS: lldb-shell :: Commands/CommandScriptImmediateOutput/CommandScriptImmediateOutputConsole.test (1422 of 2058) PASS: lldb-unit :: Utility/./UtilityTests/StructuredDataTest.ParseJSONFromFile (1423 of 2058) PASS: lldb-shell :: Driver/TestTarget.test (1424 of 2058) PASS: lldb-api :: functionalities/data-formatter/data-formatter-stl/libcxx/vector/TestDataFormatterLibcxxVector.py (1425 of 2058) PASS: lldb-shell :: ObjectFile/PECOFF/section-types.yaml (1426 of 2058) PASS: lldb-unit :: ScriptInterpreter/Python/./ScriptInterpreterPythonTests/PythonDataObjectsTest.TestPythonBoolean (1427 of 2058) PASS: lldb-unit :: Utility/./UtilityTests/StringExtractorTest.GetNameColonValueNoColon (1428 of 2058) PASS: lldb-api :: python_api/breakpoint/TestBreakpointAPI.py (1429 of 2058) PASS: lldb-unit :: Utility/./UtilityTests/CompletionRequest.TryCompleteCurrentArgBad (1430 of 2058) PASS: lldb-api :: commands/expression/scoped_enums/TestScopedEnumType.py (1431 of 2058) PASS: lldb-api :: lang/cpp/const_this/TestConstThis.py (1432 of 2058) PASS: lldb-api :: lang/objc/objc-new-syntax/TestObjCNewSyntaxLiteral.py (1433 of 2058) PASS: lldb-api :: lang/objc/foundation/TestFoundationDisassembly.py (1434 of 2058) PASS: lldb-api :: lang/objc/foundation/TestRuntimeTypes.py (1435 of 2058) PASS: lldb-shell :: BuildScript/modes.test (1436 of 2058) UNSUPPORTED: lldb-shell :: SymbolFile/DWARF/find-variable-file.cpp (1437 of 2058) PASS: lldb-unit :: Utility/./UtilityTests/StreamTest.AddressRangeEmptyRange (1438 of 2058) PASS: lldb-unit :: UnwindAssembly/x86/./UnwindAssemblyx86Tests/Testx86AssemblyInspectionEngine.TestPushEDX (1439 of 2058) PASS: lldb-unit :: Utility/./UtilityTests/CompletionRequest.DuplicateFilteringWithComments (1440 of 2058) PASS: lldb-unit :: Utility/./UtilityTests/StringListTest.SetSize (1441 of 2058) PASS: lldb-unit :: Utility/./UtilityTests/RangeTest.Equal (1442 of 2058) PASS: lldb-unit :: Expression/./ExpressionTests/DiagnosticManagerTest.AppendMessageAttachToLastDiag (1443 of 2058) PASS: lldb-unit :: UnwindAssembly/x86/./UnwindAssemblyx86Tests/Testx86AssemblyInspectionEngine.TestAddRSP (1444 of 2058) PASS: lldb-unit :: Utility/./UtilityTests/StreamTest.PutBytesAsRawHex8ToMixedEndian (1445 of 2058) PASS: lldb-unit :: Symbol/./SymbolTests/TestTypeSystemClang.TestGetBasicTypeFromEnum (1446 of 2058) PASS: lldb-unit :: Symbol/./SymbolTests/LineEntryTest.GetSameLineContiguousAddressRangeOneInline (1447 of 2058) PASS: lldb-api :: commands/target/create-deps/TestTargetCreateDeps.py (1448 of 2058) PASS: lldb-unit :: Utility/./UtilityTests/StatusTest.ErrorConstructor (1449 of 2058) UNSUPPORTED: lldb-shell :: SymbolFile/PDB/udt-layout.test (1450 of 2058) PASS: lldb-unit :: Utility/./UtilityTests/FileSpecTest.EqualDotsPosixRoot (1451 of 2058) PASS: lldb-unit :: UnwindAssembly/x86/./UnwindAssemblyx86Tests/Testx86AssemblyInspectionEngine.TestAddESP (1452 of 2058) PASS: lldb-api :: lang/objc/unicode-string/TestUnicodeString.py (1453 of 2058) PASS: lldb-unit :: Utility/./UtilityTests/ScalarTest.SetValueFromCString (1454 of 2058) PASS: lldb-api :: lang/cpp/exceptions/TestCPPExceptionBreakpoints.py (1455 of 2058) PASS: lldb-unit :: Utility/./UtilityTests/StringListTest.InsertStringAtIndexEnd (1456 of 2058) PASS: lldb-unit :: Utility/./UtilityTests/StringExtractorTest.GetHexU8_Extra_NoEof (1457 of 2058) PASS: lldb-api :: commands/expression/import-std-module/deque-basic/TestDequeFromStdModule.py (1458 of 2058) PASS: lldb-api :: functionalities/data-formatter/data-formatter-caching/TestDataFormatterCaching.py (1459 of 2058) PASS: lldb-unit :: Utility/./UtilityTests/NameMatchesTest.Contains (1460 of 2058) PASS: lldb-api :: python_api/hello_world/TestHelloWorld.py (1461 of 2058) PASS: lldb-unit :: Utility/./UtilityTests/ScalarTest.Comparison (1462 of 2058) PASS: lldb-api :: functionalities/lazy-loading/TestLazyLoading.py (1463 of 2058) PASS: lldb-unit :: ScriptInterpreter/Python/./ScriptInterpreterPythonTests/PythonDataObjectsTest.TestResetting (1464 of 2058) UNSUPPORTED: lldb-api :: functionalities/unwind/standard/TestStandardUnwind.py (1465 of 2058) PASS: lldb-api :: commands/expression/rdar44436068/Test128BitsInteger.py (1466 of 2058) PASS: lldb-unit :: Utility/./UtilityTests/ScalarTest.GetValue (1467 of 2058) PASS: lldb-unit :: Utility/./UtilityTests/DataExtractorTest.GetCStrAtEnd (1468 of 2058) PASS: lldb-unit :: Utility/./UtilityTests/SerializationRountripTest.SerializeDeserializeCStringNull (1469 of 2058) PASS: lldb-unit :: Utility/./UtilityTests/StreamTest.PutHex16ByteOrderBig (1470 of 2058) PASS: lldb-api :: tools/lldb-vscode/coreFile/TestVSCode_coreFile.py (1471 of 2058) PASS: lldb-unit :: Utility/./UtilityTests/StreamTest.AddressEmptyPrefix (1472 of 2058) PASS: lldb-unit :: Thread/./ThreadTests/ThreadTest.SetStopInfo (1473 of 2058) PASS: lldb-api :: functionalities/tail_call_frames/disambiguate_paths_to_common_sink/TestDisambiguatePathsToCommonSink.py (1474 of 2058) UNSUPPORTED: lldb-shell :: SymbolFile/NativePDB/function-types-builtins.cpp (1475 of 2058) PASS: lldb-shell :: SymbolFile/DWARF/anon_class_w_and_wo_export_symbols.ll (1476 of 2058) UNSUPPORTED: lldb-shell :: Register/x86-zmm-read.test (1477 of 2058) PASS: lldb-api :: python_api/function_symbol/TestDisasmAPI.py (1478 of 2058) PASS: lldb-unit :: Utility/./UtilityTests/StreamTest.PutHex32ByteOrderLittle (1479 of 2058) PASS: lldb-api :: commands/expression/dont_allow_jit/TestAllowJIT.py (1480 of 2058) PASS: lldb-api :: functionalities/conditional_break/TestConditionalBreak.py (1481 of 2058) PASS: lldb-api :: commands/expression/top-level/TestTopLevelExprs.py (1482 of 2058) PASS: lldb-shell :: ObjectFile/ELF/minidebuginfo-corrupt-xz.yaml (1483 of 2058) PASS: lldb-unit :: Utility/./UtilityTests/StreamTest.PutULEB128 (1484 of 2058) PASS: lldb-unit :: debugserver/./debugserverTests/RNBSocket.LoopBackListenIPv4 (1485 of 2058) PASS: lldb-unit :: Expression/./ExpressionTests/DiagnosticManagerTest.PutString (1486 of 2058) PASS: lldb-api :: tools/lldb-server/TestGdbRemoteExpeditedRegisters.py (1487 of 2058) PASS: lldb-api :: commands/frame/diagnose/complicated-expression/TestComplicatedExpression.py (1488 of 2058) PASS: lldb-unit :: Utility/./UtilityTests/StringExtractorTest.GetU32LittleEndian (1489 of 2058) PASS: lldb-unit :: Utility/./UtilityTests/DataExtractorTest.GetCStr (1490 of 2058) PASS: lldb-api :: lang/cpp/stl/TestSTL.py (1491 of 2058) PASS: lldb-api :: functionalities/thread/concurrent_events/TestConcurrentSignalBreak.py (1492 of 2058) UNSUPPORTED: lldb-shell :: ScriptInterpreter/Lua/convenience_variables.test (1493 of 2058) UNSUPPORTED: lldb-api :: functionalities/thread/thread_specific_break_plus_condition/TestThreadSpecificBpPlusCondition.py (1494 of 2058) PASS: lldb-unit :: Target/./TargetTests/StackFrameRecognizerTest.NullModuleRegex (1495 of 2058) PASS: lldb-shell :: SymbolFile/DWARF/find-method-local-struct.cpp (1496 of 2058) PASS: lldb-unit :: Utility/./UtilityTests/BinaryStreamTest.PutULEB128SixBytes (1497 of 2058) PASS: lldb-api :: functionalities/data-formatter/data-formatter-stl/libcxx/iterator/TestDataFormatterLibccIterator.py (1498 of 2058) PASS: lldb-shell :: ObjectFile/wasm/unified-debug-sections.yaml (1499 of 2058) PASS: lldb-api :: functionalities/thread/exit_during_break/TestExitDuringBreak.py (1500 of 2058) PASS: lldb-unit :: SymbolFile/NativePDB/./SymbolFileNativePDBTests/PDBFPOProgramToDWARFExpressionTests.InvalidOpUnary (1501 of 2058) PASS: lldb-api :: functionalities/postmortem/minidump-new/TestMiniDumpNew.py (1502 of 2058) PASS: lldb-unit :: Utility/./UtilityTests/Flags.Clear (1503 of 2058) PASS: lldb-shell :: Driver/TestHelp.test (1504 of 2058) PASS: lldb-shell :: SymbolFile/DWARF/dwp-debug-types.s (1505 of 2058) PASS: lldb-api :: lang/objc/objc-runtime-ivars/TestRuntimeIvars.py (1506 of 2058) PASS: lldb-api :: api/log/TestAPILog.py (1507 of 2058) UNSUPPORTED: lldb-api :: functionalities/ubsan/user-expression/TestUbsanUserExpression.py (1508 of 2058) PASS: lldb-unit :: tools/lldb-server/tests/./LLDBServerTests/TestBase.DebugserverEnv (1509 of 2058) PASS: lldb-unit :: Utility/./UtilityTests/LogChannelTest.Enable (1510 of 2058) PASS: lldb-api :: functionalities/data-formatter/data-formatter-objc/TestDataFormatterObjCKVO.py (1511 of 2058) PASS: lldb-unit :: Utility/./UtilityTests/UriParserTest.SchemeHostSeparator (1512 of 2058) PASS: lldb-api :: iohandler/unicode/TestUnicode.py (1513 of 2058) PASS: lldb-api :: commands/expression/import-std-module/empty-module/TestEmptyStdModule.py (1514 of 2058) PASS: lldb-unit :: Expression/./ExpressionTests/DiagnosticManagerTest.PutStringMultiple (1515 of 2058) UNSUPPORTED: lldb-api :: commands/watchpoints/watchpoint_on_vectors/TestValueOfVectorVariable.py (1516 of 2058) PASS: lldb-unit :: Utility/./UtilityTests/ArgsTest.TestInsertArg (1517 of 2058) PASS: lldb-unit :: Language/Highlighting/./HighlighterTests/HighlighterTest.ClangCursorPosAfterOtherToken (1518 of 2058) PASS: lldb-api :: commands/process/launch/TestProcessLaunch.py (1519 of 2058) PASS: lldb-unit :: Utility/./UtilityTests/RangeTest.ContainsAddrInvalid (1520 of 2058) PASS: lldb-unit :: Utility/./UtilityTests/ProcessInstanceInfo.Yaml (1521 of 2058) PASS: lldb-api :: functionalities/dynamic_value_child_count/TestDynamicValueChildCount.py (1522 of 2058) PASS: lldb-shell :: Commands/command-breakpoint-col.test (1523 of 2058) PASS: lldb-api :: python_api/sbdata/TestSBData.py (1524 of 2058) PASS: lldb-shell :: ObjectFile/ELF/netbsd-exec-8.99.30-amd64.yaml (1525 of 2058) PASS: lldb-unit :: Utility/./UtilityTests/ScalarTest.Promotion (1526 of 2058) PASS: lldb-api :: functionalities/param_entry_vals/basic_entry_values/TestBasicEntryValues.py (1527 of 2058) PASS: lldb-unit :: Interpreter/./InterpreterTests/OptionArgParserTest.toScriptLanguage (1528 of 2058) PASS: lldb-unit :: Utility/./UtilityTests/UriParserTest.SchemeHostSeparator4 (1529 of 2058) PASS: lldb-api :: functionalities/data-formatter/data-formatter-stl/libcxx/atomic/TestLibCxxAtomic.py (1530 of 2058) PASS: lldb-api :: lang/c/struct_types/TestStructTypes.py (1531 of 2058) PASS: lldb-api :: functionalities/data-formatter/data-formatter-skip-summary/TestDataFormatterSkipSummary.py (1532 of 2058) UNSUPPORTED: lldb-shell :: ScriptInterpreter/Lua/bindings.test (1533 of 2058) UNSUPPORTED: lldb-api :: functionalities/tsan/cpp_global_location/TestTsanCPPGlobalLocation.py (1534 of 2058) PASS: lldb-api :: lang/c/tls_globals/TestTlsGlobals.py (1535 of 2058) PASS: lldb-unit :: Utility/./UtilityTests/UUIDTest.SetFromStringRef (1536 of 2058) PASS: lldb-unit :: Utility/./UtilityTests/FileSpecTest.RemoveLastPathComponent (1537 of 2058) PASS: lldb-unit :: Utility/./UtilityTests/FileSpecTest.GuessPathStyle (1538 of 2058) PASS: lldb-unit :: ObjectFile/PECOFF/./ObjectFilePECOFFTests/PECallFrameInfoTest.Frame_reg_eh (1539 of 2058) UNSUPPORTED: lldb-api :: commands/register/register/intel_xtended_registers/TestMPXRegisters.py (1540 of 2058) PASS: lldb-unit :: API/./APITests/SBCommandInterpreterTest.SingleWordCommand (1541 of 2058) PASS: lldb-unit :: Process/minidump/./LLDBMinidumpTests/MinidumpParserTest.GetExceptionStream (1542 of 2058) PASS: lldb-unit :: Utility/./UtilityTests/UriParserTest.BracketedHostname (1543 of 2058) PASS: lldb-unit :: Interpreter/./InterpreterTests/OptionArgParserTest.toBoolean (1544 of 2058) PASS: lldb-unit :: Utility/./UtilityTests/StringListTest.JoinMultiCharSeparator (1545 of 2058) PASS: lldb-unit :: Process/minidump/./LLDBMinidumpTests/MinidumpParserTest.GetThreadContext_x86_32 (1546 of 2058) PASS: lldb-api :: functionalities/postmortem/wow64_minidump/TestWow64MiniDump.py (1547 of 2058) UNSUPPORTED: lldb-api :: benchmarks/startup/TestStartupDelays.py (1548 of 2058) PASS: lldb-api :: functionalities/data-formatter/type_summary_list_arg/TestTypeSummaryListArg.py (1549 of 2058) UNSUPPORTED: lldb-api :: functionalities/data-formatter/data-formatter-stl/libstdcpp/list/TestDataFormatterStdList.py (1550 of 2058) PASS: lldb-unit :: DataFormatter/./LLDBFormatterTests/StringPrinterTests.CxxASCII (1551 of 2058) PASS: lldb-api :: functionalities/breakpoint/breakpoint_language/TestBreakpointLanguage.py (1552 of 2058) PASS: lldb-unit :: Utility/./UtilityTests/CompletionRequest.TestCompletionOwnership (1553 of 2058) PASS: lldb-unit :: Utility/./UtilityTests/StreamTest.PutHex64ByteOrderBig (1554 of 2058) PASS: lldb-unit :: Symbol/./SymbolTests/TestTypeSystemClang.TestOwningModule (1555 of 2058) PASS: lldb-unit :: Utility/./UtilityTests/EventTest.DumpEventDataBytes (1556 of 2058) PASS: lldb-unit :: Utility/./UtilityTests/UriParserTest.MinimalPortPath (1557 of 2058) UNSUPPORTED: lldb-shell :: SymbolFile/DWARF/debug-types-signature-loop.s (1558 of 2058) PASS: lldb-unit :: Utility/./UtilityTests/FileSpecTest.FileAndDirectoryComponents (1559 of 2058) PASS: lldb-unit :: Utility/./UtilityTests/UriParserTest.MinimalPath (1560 of 2058) PASS: lldb-unit :: Utility/./UtilityTests/ScalarTest.Scalar_512 (1561 of 2058) PASS: lldb-api :: lang/cpp/dynamic-value/TestCppValueCast.py (1562 of 2058) PASS: lldb-api :: functionalities/data-formatter/synthcapping/TestSyntheticCapping.py (1563 of 2058) PASS: lldb-api :: commands/expression/multiline-completion/TestMultilineCompletion.py (1564 of 2058) PASS: lldb-unit :: Language/CPlusPlus/./LanguageCPlusPlusTests/CPlusPlusLanguage.FindAlternateFunctionManglings (1565 of 2058) PASS: lldb-unit :: Symbol/./SymbolTests/TestClangASTImporter.CopyDeclTagDecl (1566 of 2058) PASS: lldb-api :: functionalities/step-avoids-no-debug/TestStepNoDebug.py (1567 of 2058) PASS: lldb-api :: functionalities/gdb_remote_client/TestqOffsets.py (1568 of 2058) PASS: lldb-api :: lang/objc/objc-class-method/TestObjCClassMethod.py (1569 of 2058) PASS: lldb-api :: functionalities/optimized_code/TestNoASanExceptionAfterEvalOP_piece.py (1570 of 2058) PASS: lldb-api :: iohandler/resize/TestIOHandlerResizeNoEditline.py (1571 of 2058) PASS: lldb-api :: types/TestShortType.py (1572 of 2058) PASS: lldb-api :: functionalities/breakpoint/dummy_target_breakpoints/TestBreakpointsWithNoTargets.py (1573 of 2058) PASS: lldb-unit :: SymbolFile/NativePDB/./SymbolFileNativePDBTests/PDBFPOProgramToDWARFExpressionTests.MissingTargetRegister (1574 of 2058) UNSUPPORTED: lldb-api :: functionalities/tty/TestTerminal.py (1575 of 2058) PASS: lldb-unit :: Process/minidump/./LLDBMinidumpTests/MinidumpParserTest.GetPidWindows (1576 of 2058) PASS: lldb-api :: functionalities/breakpoint/step_over_breakpoint/TestStepOverBreakpoint.py (1577 of 2058) PASS: lldb-api :: lang/objc/modules-inline-functions/TestModulesInlineFunctions.py (1578 of 2058) UNSUPPORTED: lldb-shell :: ObjectFile/ELF/minidebuginfo-set-and-hit-breakpoint.test (1579 of 2058) UNSUPPORTED: lldb-shell :: SymbolFile/DWARF/find-inline-method.s (1580 of 2058) PASS: lldb-shell :: ObjectFile/PECOFF/basic-info.yaml (1581 of 2058) UNSUPPORTED: lldb-shell :: ScriptInterpreter/Lua/quit.test (1582 of 2058) PASS: lldb-api :: lang/objc/objc-static-method-stripped/TestObjCStaticMethodStripped.py (1583 of 2058) PASS: lldb-api :: python_api/lldbutil/process/TestPrintStackTraces.py (1584 of 2058) PASS: lldb-unit :: Symbol/./SymbolTests/TestTypeSystemClang.TestRecordHasFields (1585 of 2058) PASS: lldb-unit :: Utility/./UtilityTests/StringExtractorTest.GetHexU8_Exact (1586 of 2058) PASS: lldb-api :: python_api/lldbutil/iter/TestLLDBIterator.py (1587 of 2058) PASS: lldb-unit :: SymbolFile/NativePDB/./SymbolFileNativePDBTests/PDBFPOProgramToDWARFExpressionTests.InvalidOpBinary (1588 of 2058) PASS: lldb-unit :: UnwindAssembly/x86/./UnwindAssemblyx86Tests/Testx86AssemblyInspectionEngine.TestPopEBP (1589 of 2058) PASS: lldb-unit :: Utility/./UtilityTests/ScalarTest.TruncOrExtendTo (1590 of 2058) PASS: lldb-api :: functionalities/thread/thread_exit/TestThreadExit.py (1591 of 2058) PASS: lldb-api :: python_api/file_handle/TestFileHandle.py (1592 of 2058) PASS: lldb-api :: functionalities/step_scripted/TestStepScripted.py (1593 of 2058) PASS: lldb-unit :: Process/minidump/./LLDBMinidumpTests/MinidumpParserTest.GetFilteredModuleList (1594 of 2058) PASS: lldb-shell :: SymbolFile/Breakpad/unwind-via-raSearch.test (1595 of 2058) PASS: lldb-unit :: Utility/./UtilityTests/StringListTest.ShiftMove (1596 of 2058) PASS: lldb-api :: commands/apropos/basic/TestApropos.py (1597 of 2058) PASS: lldb-shell :: Commands/command-script-import.test (1598 of 2058) UNSUPPORTED: lldb-api :: functionalities/tsan/thread_leak/TestTsanThreadLeak.py (1599 of 2058) PASS: lldb-unit :: Utility/./UtilityTests/StringListTest.AppendList (1600 of 2058) PASS: lldb-unit :: ScriptInterpreter/Python/./ScriptInterpreterPythonTests/PythonDataObjectsTest.TestPythonTupleInitializerList2 (1601 of 2058) PASS: lldb-api :: lang/objc/objc-property/TestObjCProperty.py (1602 of 2058) UNSUPPORTED: lldb-shell :: ScriptInterpreter/Lua/command_script_import.test (1603 of 2058) UNSUPPORTED: lldb-shell :: SymbolFile/DWARF/debug-line-basic.s (1604 of 2058) UNSUPPORTED: lldb-api :: arm/breakpoint-it/TestBreakpointIt.py (1605 of 2058) PASS: lldb-api :: commands/command/script/import/TestImport.py (1606 of 2058) PASS: lldb-api :: functionalities/process_crash_info/TestProcessCrashInfo.py (1607 of 2058) UNSUPPORTED: lldb-shell :: SymbolFile/DWARF/DW_TAG_GNU_call_site-DW_AT_low_pc.s (1608 of 2058) PASS: lldb-unit :: Utility/./UtilityTests/ScalarTest.CastOperations (1609 of 2058) PASS: lldb-unit :: ObjectFile/ELF/./ObjectFileELFTests/ObjectFileELFTest.SectionsResolveConsistently (1610 of 2058) PASS: lldb-unit :: Utility/./UtilityTests/XcodeSDKTest.SDKSupportsSwift (1611 of 2058) PASS: lldb-api :: functionalities/thread/crash_during_step/TestCrashDuringStep.py (1612 of 2058) PASS: lldb-api :: commands/settings/quoting/TestQuoting.py (1613 of 2058) PASS: lldb-unit :: Utility/./UtilityTests/StringListTest.Join (1614 of 2058) UNSUPPORTED: lldb-api :: functionalities/ubsan/basic/TestUbsanBasic.py (1615 of 2058) UNSUPPORTED: lldb-api :: lang/cpp/gmodules/TestWithModuleDebugging.py (1616 of 2058) PASS: lldb-api :: commands/expression/class_template_specialization_empty_pack/TestClassTemplateSpecializationParametersHandling.py (1617 of 2058) PASS: lldb-unit :: Utility/./UtilityTests/UriParserTest.BracketedHostnameWithPortIPv4 (1618 of 2058) UNSUPPORTED: lldb-shell :: SymbolFile/DWARF/dir-separator-windows.s (1619 of 2058) PASS: lldb-unit :: Utility/./UtilityTests/StreamTest.PutBytesAsRawHex8ToLittleEndian (1620 of 2058) PASS: lldb-api :: functionalities/inferior-crashing/TestInferiorCrashingStep.py (1621 of 2058) PASS: lldb-api :: commands/expression/diagnostics/TestExprDiagnostics.py (1622 of 2058) PASS: lldb-api :: lang/cpp/dynamic-value/TestDynamicValue.py (1623 of 2058) UNSUPPORTED: lldb-shell :: SymbolFile/DWARF/array-sizes.s (1624 of 2058) PASS: lldb-unit :: Target/./TargetTests/ModuleCacheTest.GetAndPutStrangeHostname (1625 of 2058) PASS: lldb-unit :: Utility/./UtilityTests/SerializationRountripTest.SerializeDeserializeObjectPointer (1626 of 2058) PASS: lldb-unit :: Utility/./UtilityTests/UriParserTest.Empty (1627 of 2058) PASS: lldb-unit :: Expression/./ExpressionTests/CppModuleConfigurationTest.MissingUsrInclude (1628 of 2058) PASS: lldb-api :: lang/cpp/symbols/TestSymbols.py (1629 of 2058) PASS: lldb-unit :: Utility/./UtilityTests/BinaryStreamTest.PutULEB128One (1630 of 2058) UNSUPPORTED: lldb-shell :: SymbolFile/PDB/enums-layout.test (1631 of 2058) UNSUPPORTED: lldb-api :: python_api/watchpoint/TestSetWatchpoint.py (1632 of 2058) PASS: lldb-unit :: Utility/./UtilityTests/VMRange.Comparison (1633 of 2058) UNSUPPORTED: lldb-api :: commands/expression/namespace_local_var_same_name_obj_c/TestNamespaceLocalVarSameNameObjC.py (1634 of 2058) PASS: lldb-api :: macosx/version_zero/TestGetVersionZeroVersion.py (1635 of 2058) PASS: lldb-shell :: Reproducer/TestProcessList.test (1636 of 2058) PASS: lldb-api :: functionalities/data-formatter/data-formatter-stl/libcxx/string/TestDataFormatterLibcxxString.py (1637 of 2058) PASS: lldb-api :: functionalities/data-formatter/data-formatter-smart-array/TestDataFormatterSmartArray.py (1638 of 2058) PASS: lldb-api :: commands/expression/xvalue/TestXValuePrinting.py (1639 of 2058) PASS: lldb-api :: lang/cpp/namespace_conflicts/TestNamespaceConflicts.py (1640 of 2058) UNSUPPORTED: lldb-shell :: Register/x86-zmm-write.test (1641 of 2058) PASS: lldb-unit :: Utility/./UtilityTests/RangeDataVector.FindEntryIndexesThatContain_Overlap (1642 of 2058) PASS: lldb-shell :: SymbolFile/DWARF/DW_TAG_variable-invalid_location.s (1643 of 2058) PASS: lldb-api :: lang/cpp/inlines/TestInlines.py (1644 of 2058) PASS: lldb-api :: functionalities/inline-stepping/TestInlineStepping.py (1645 of 2058) PASS: lldb-api :: commands/frame/diagnose/inheritance/TestDiagnoseInheritance.py (1646 of 2058) PASS: lldb-unit :: Expression/./ExpressionTests/DiagnosticManagerTest.FixedExpression (1647 of 2058) PASS: lldb-api :: python_api/name_lookup/TestNameLookup.py (1648 of 2058) PASS: lldb-api :: commands/target/create-no-such-arch/TestNoSuchArch.py (1649 of 2058) PASS: lldb-api :: commands/expression/persistent_ptr_update/TestPersistentPtrUpdate.py (1650 of 2058) UNSUPPORTED: lldb-shell :: SymbolFile/DWARF/dir-separator-no-comp-dir.s (1651 of 2058) PASS: lldb-unit :: Symbol/./SymbolTests/TestTypeSystemClang.TestDeletingImplicitCopyCstrDueToMoveCStr (1652 of 2058) PASS: lldb-api :: lang/objc/direct-dispatch-step/TestObjCDirectDispatchStepping.py (1653 of 2058) PASS: lldb-api :: lang/cpp/constructors/TestCppConstructors.py (1654 of 2058) PASS: lldb-unit :: Utility/./UtilityTests/StreamTest.QuotedCString (1655 of 2058) PASS: lldb-api :: functionalities/gdb_remote_client/TestStopPCs.py (1656 of 2058) PASS: lldb-api :: functionalities/data-formatter/parray/TestPrintArray.py (1657 of 2058) PASS: lldb-api :: commands/frame/diagnose/virtual-method-call/TestDiagnoseDereferenceVirtualMethodCall.py (1658 of 2058) PASS: lldb-api :: functionalities/data-formatter/data-formatter-advanced/TestDataFormatterAdv.py (1659 of 2058) PASS: lldb-unit :: Symbol/./SymbolTests/SymbolsTest.LocateExecutableSymbolFileForUnknownExecutableAndMissingSymbolFile (1660 of 2058) PASS: lldb-api :: functionalities/breakpoint/breakpoint_hit_count/TestBreakpointHitCount.py (1661 of 2058) PASS: lldb-shell :: Driver/TestPositionalArgs.test (1662 of 2058) PASS: lldb-api :: commands/expression/codegen-crash-typedefdecl-not-in_declcontext/TestCodegenCrashTypedefDeclNotInDeclContext.py (1663 of 2058) PASS: lldb-api :: tools/lldb-server/TestGdbRemoteKill.py (1664 of 2058) PASS: lldb-unit :: Utility/./UtilityTests/RegularExpression.Valid (1665 of 2058) PASS: lldb-api :: commands/command/script/import/rdar-12586188/TestRdar12586188.py (1666 of 2058) PASS: lldb-unit :: Utility/./UtilityTests/RegularExpression.Empty (1667 of 2058) PASS: lldb-shell :: SymbolFile/DWARF/debug_loc.s (1668 of 2058) PASS: lldb-api :: python_api/class_members/TestSBTypeClassMembers.py (1669 of 2058) PASS: lldb-unit :: SymbolFile/DWARF/./SymbolFileDWARFTests/SymbolFileDWARFTests.TestAbilitiesForDWARF (1670 of 2058) PASS: lldb-api :: functionalities/return-value/TestReturnValue.py (1671 of 2058) PASS: lldb-api :: linux/builtin_trap/TestBuiltinTrap.py (1672 of 2058) PASS: lldb-unit :: Target/./TargetTests/ExecutionContextTest.GetByteOrderProcess (1673 of 2058) UNSUPPORTED: lldb-shell :: SymbolFile/DWARF/win-i386-line-table.s (1674 of 2058) PASS: lldb-unit :: Host/./HostTests/NativeProcessProtocolTest.ReadCStringFromMemory (1675 of 2058) PASS: lldb-unit :: ScriptInterpreter/Python/./ScriptInterpreterPythonTests/PythonDataObjectsTest.TestPythonListValueEquality (1676 of 2058) PASS: lldb-api :: functionalities/postmortem/elf-core/thread_crash/TestLinuxCoreThreads.py (1677 of 2058) PASS: lldb-unit :: Process/./ProcessEventDataTests/ProcessEventDataTest.DoOnRemoval (1678 of 2058) PASS: lldb-api :: lang/objc/foundation/TestConstStrings.py (1679 of 2058) PASS: lldb-api :: tools/lldb-server/inferior-crash/TestGdbRemoteAbort.py (1680 of 2058) PASS: lldb-unit :: Utility/./UtilityTests/ScalarTest.RightShiftOperator (1681 of 2058) UNSUPPORTED: lldb-api :: functionalities/tsan/thread_numbers/TestTsanThreadNumbers.py (1682 of 2058) PASS: lldb-unit :: ScriptInterpreter/Python/./ScriptInterpreterPythonTests/PythonDataObjectsTest.TestPythonTupleValues (1683 of 2058) PASS: lldb-shell :: Settings/TestEchoCommands.test (1684 of 2058) PASS: lldb-unit :: Language/Highlighting/./HighlighterTests/HighlighterTest.ClangCursorOutOfBounds (1685 of 2058) PASS: lldb-api :: commands/expression/two-files/TestObjCTypeQueryFromOtherCompileUnit.py (1686 of 2058) PASS: lldb-shell :: SymbolFile/DWARF/debug_loc-aslr.s (1687 of 2058) PASS: lldb-api :: functionalities/thread/concurrent_events/TestConcurrentCrashWithBreak.py (1688 of 2058) PASS: lldb-api :: python_api/findvalue_duplist/TestSBFrameFindValue.py (1689 of 2058) PASS: lldb-api :: lang/objc/foundation/TestObjCMethods2.py (1690 of 2058) UNSUPPORTED: lldb-shell :: SymbolFile/NativePDB/disassembly.cpp (1691 of 2058) PASS: lldb-api :: functionalities/thread/concurrent_events/TestConcurrentCrashWithSignal.py (1692 of 2058) PASS: lldb-api :: python_api/sbenvironment/TestSBEnvironment.py (1693 of 2058) PASS: lldb-unit :: Utility/./UtilityTests/StreamTeeTest.DefaultConstructor (1694 of 2058) PASS: lldb-unit :: SymbolFile/DWARF/./SymbolFileDWARFTests/SymbolFileDWARFTests.TestAbbrevOrder1Start1 (1695 of 2058) PASS: lldb-api :: python_api/value/change_values/TestChangeValueAPI.py (1696 of 2058) PASS: lldb-unit :: Utility/./UtilityTests/Flags.AllClear (1697 of 2058) PASS: lldb-unit :: Utility/./UtilityTests/BinaryStreamTest.PutSLEB128ThreeBytes (1698 of 2058) PASS: lldb-unit :: UnwindAssembly/x86/./UnwindAssemblyx86Tests/Testx86AssemblyInspectionEngine.TestPushExtended (1699 of 2058) PASS: lldb-unit :: Utility/./UtilityTests/StringLexerTest.HasAtLeast (1700 of 2058) UNSUPPORTED: lldb-api :: functionalities/thread/concurrent_events/TestConcurrentTwoWatchpointThreads.py (1701 of 2058) PASS: lldb-unit :: Utility/./UtilityTests/BinaryStreamTest.PutSLEB128FiveBytes (1702 of 2058) PASS: lldb-shell :: ObjectFile/ELF/PT_LOAD-overlap.yaml (1703 of 2058) PASS: lldb-unit :: Utility/./UtilityTests/OptionsWithRawTest.EmptySuffix (1704 of 2058) PASS: lldb-api :: macosx/dyld-trie-symbols/TestDyldTrieSymbols.py (1705 of 2058) PASS: lldb-shell :: Quit/TestQuitExitCodeImplicit0.test (1706 of 2058) PASS: lldb-shell :: Commands/command-source.test (1707 of 2058) PASS: lldb-api :: lang/objc/objc++/TestObjCXX.py (1708 of 2058) UNSUPPORTED: lldb-shell :: SymbolFile/DWARF/find-basic-function.cpp (1709 of 2058) UNSUPPORTED: lldb-api :: commands/watchpoints/watchpoint_commands/condition/TestWatchpointConditionCmd.py (1710 of 2058) PASS: lldb-unit :: Core/./LLDBCoreTests/RichManglingContextTest.IPDRealloc (1711 of 2058) PASS: lldb-api :: functionalities/data-formatter/data-formatter-script/TestDataFormatterScript.py (1712 of 2058) PASS: lldb-shell :: SymbolFile/DWARF/DW_AT_loclists_base.s (1713 of 2058) UNSUPPORTED: lldb-api :: commands/expression/completion-crash-invalid-iterator/TestInvalidIteratorCompletionCrash.py (1714 of 2058) PASS: lldb-unit :: Utility/./UtilityTests/BinaryStreamTest.PutULEB128EightBytes (1715 of 2058) PASS: lldb-unit :: UnwindAssembly/x86/./UnwindAssemblyx86Tests/Testx86AssemblyInspectionEngine.TestPushR13 (1716 of 2058) PASS: lldb-unit :: UnwindAssembly/x86/./UnwindAssemblyx86Tests/Testx86AssemblyInspectionEngine.TestSubESP (1717 of 2058) PASS: lldb-shell :: Reproducer/TestReuseDirectory.test (1718 of 2058) PASS: lldb-unit :: Utility/./UtilityTests/TimerTest.CategoryTimes (1719 of 2058) UNSUPPORTED: lldb-api :: functionalities/asan/TestMemoryHistory.py (1720 of 2058) PASS: lldb-unit :: Utility/./UtilityTests/BinaryStreamTest.PutSLEB128FourBytes (1721 of 2058) PASS: lldb-unit :: SymbolFile/DWARF/./SymbolFileDWARFTests/SymbolFileDWARFTests.TestAbbrevOutOfOrder (1722 of 2058) PASS: lldb-api :: python_api/value_var_update/TestValueVarUpdate.py (1723 of 2058) UNSUPPORTED: lldb-shell :: SymbolFile/Breakpad/stack-cfi-arm.yaml (1724 of 2058) PASS: lldb-unit :: Utility/./UtilityTests/StringLexerTest.GetUnlexed (1725 of 2058) PASS: lldb-unit :: Utility/./UtilityTests/FileSpecTest.PrependPathComponent (1726 of 2058) UNSUPPORTED: lldb-api :: functionalities/darwin_log/filter/exact_match/category/TestDarwinLogFilterMatchCategory.py (1727 of 2058) PASS: lldb-unit :: Language/Highlighting/./HighlighterTests/HighlighterTest.ClangEmptyInput (1728 of 2058) PASS: lldb-unit :: Utility/./UtilityTests/UriParserTest.SchemeHostSeparator3 (1729 of 2058) PASS: lldb-api :: functionalities/data-formatter/stringprinter/TestStringPrinter.py (1730 of 2058) PASS: lldb-api :: python_api/section/TestSectionAPI.py (1731 of 2058) PASS: lldb-unit :: Utility/./UtilityTests/ConstStringTest.NullAndEmptyStates (1732 of 2058) PASS: lldb-unit :: Utility/./UtilityTests/StringListTest.ForRange (1733 of 2058) PASS: lldb-unit :: Target/./TargetTests/ExecutionContextTest.GetByteOrderTarget (1734 of 2058) UNSUPPORTED: lldb-api :: functionalities/thread/break_after_join/TestBreakAfterJoin.py (1735 of 2058) PASS: lldb-unit :: Symbol/./SymbolTests/TestClangASTImporter.MetadataPropagationIndirectImport (1736 of 2058) PASS: lldb-api :: functionalities/thread/concurrent_events/TestConcurrentDelaySignalBreak.py (1737 of 2058) PASS: lldb-api :: functionalities/postmortem/elf-core/gcore/TestGCore.py (1738 of 2058) PASS: lldb-api :: api/multiple-targets/TestMultipleTargets.py (1739 of 2058) PASS: lldb-api :: functionalities/plugins/python_os_plugin/TestPythonOSPlugin.py (1740 of 2058) PASS: lldb-unit :: Signals/./SignalsTests/UnixSignalsTest.GetInfo (1741 of 2058) PASS: lldb-unit :: Expression/./ExpressionTests/DWARFExpression.DW_OP_unknown (1742 of 2058) PASS: lldb-unit :: Utility/./UtilityTests/RecordReplayTest.InstrumentedBarPtr (1743 of 2058) PASS: lldb-unit :: Utility/./UtilityTests/OptionsWithRawTest.SingleWordSuffix (1744 of 2058) PASS: lldb-unit :: Signals/./SignalsTests/UnixSignalsTest.VersionChange (1745 of 2058) UNSUPPORTED: lldb-api :: lang/cpp/breakpoint_in_member_func_w_non_primitive_params/TestBreakpointInMemberFuncWNonPrimitiveParams.py (1746 of 2058) PASS: lldb-api :: lang/cpp/type_lookup/TestCppTypeLookup.py (1747 of 2058) PASS: lldb-unit :: UnwindAssembly/x86/./UnwindAssemblyx86Tests/Testx86AssemblyInspectionEngine.TestSpillRegToStackViaMOVx86_64 (1748 of 2058) PASS: lldb-unit :: Language/Highlighting/./HighlighterTests/HighlighterTest.ClangPPDirectives (1749 of 2058) PASS: lldb-unit :: Symbol/./SymbolTests/TestClangASTImporter.DeportTypeTagDecl (1750 of 2058) PASS: lldb-unit :: Process/minidump/./LLDBMinidumpTests/MinidumpParserTest.GetMemoryRegionInfo (1751 of 2058) PASS: lldb-api :: commands/frame/var/TestFrameVar.py (1752 of 2058) PASS: lldb-unit :: Signals/./SignalsTests/UnixSignalsTest.Iteration (1753 of 2058) PASS: lldb-unit :: tools/lldb-server/tests/./LLDBServerTests/TestBase.LaunchModePreservesEnvironment (1754 of 2058) PASS: lldb-unit :: Utility/./UtilityTests/StreamTeeTest.Flush (1755 of 2058) PASS: lldb-unit :: Utility/./UtilityTests/ArgsTest.GetQuotedCommandString (1756 of 2058) PASS: lldb-shell :: Commands/command-disassemble-process.yaml (1757 of 2058) PASS: lldb-unit :: UnwindAssembly/x86/./UnwindAssemblyx86Tests/Testx86AssemblyInspectionEngine.TestPopESI (1758 of 2058) PASS: lldb-api :: functionalities/signal/handle-abrt/TestHandleAbort.py (1759 of 2058) PASS: lldb-shell :: Expr/TestTypeOfDeclTypeExpr.test (1760 of 2058) PASS: lldb-unit :: Symbol/./SymbolTests/Type.GetTypeScopeAndBasename (1761 of 2058) UNSUPPORTED: lldb-shell :: SymbolFile/NativePDB/source-list.cpp (1762 of 2058) PASS: lldb-api :: lang/c/enum_types/TestEnumTypes.py (1763 of 2058) PASS: lldb-unit :: ScriptInterpreter/Python/./ScriptInterpreterPythonTests/PythonDataObjectsTest.TestPythonListManipulation (1764 of 2058) PASS: lldb-unit :: Utility/./UtilityTests/TimerTest.CategoryTimesNested (1765 of 2058) PASS: lldb-unit :: Process/gdb-remote/./ProcessGdbRemoteTests/GDBRemoteCommunicationClientTest.ReadRegister (1766 of 2058) PASS: lldb-api :: lang/objc/self/TestObjCSelf.py (1767 of 2058) PASS: lldb-api :: functionalities/plugins/command_plugin/TestPluginCommands.py (1768 of 2058) PASS: lldb-api :: functionalities/data-formatter/data-formatter-objc/TestDataFormatterObjCNSURL.py (1769 of 2058) PASS: lldb-unit :: Utility/./UtilityTests/FileSpecTest.EqualDotsPosix (1770 of 2058) PASS: lldb-api :: functionalities/data-formatter/data-formatter-enum-format/TestDataFormatterEnumFormat.py (1771 of 2058) PASS: lldb-shell :: Settings/TestDisableColor.test (1772 of 2058) PASS: lldb-unit :: Utility/./UtilityTests/StringExtractorTest.GetHexBytesAvail_OddPair (1773 of 2058) PASS: lldb-api :: lang/c/stepping/TestStepAndBreakpoints.py (1774 of 2058) UNSUPPORTED: lldb-api :: functionalities/darwin_log/filter/regex/activity/TestDarwinLogFilterRegexActivity.py (1775 of 2058) PASS: lldb-api :: functionalities/target-new-solib-notifications/TestModuleLoadedNotifys.py (1776 of 2058) PASS: lldb-unit :: Language/Highlighting/./HighlighterTests/HighlighterTest.ClangTrailingBackslashWithWhitespace (1777 of 2058) PASS: lldb-unit :: Host/./HostTests/FileSystemTest.MakeAbsolute (1778 of 2058) PASS: lldb-unit :: Process/gdb-remote/./ProcessGdbRemoteTests/GDBRemoteCommunicationClientTest.TestPacketSpeedJSON (1779 of 2058) PASS: lldb-unit :: Utility/./UtilityTests/Flags.GetBitSize (1780 of 2058) PASS: lldb-unit :: Utility/./UtilityTests/Predicate.WaitForValueEqualTo (1781 of 2058) PASS: lldb-unit :: Utility/./UtilityTests/RangeTest.ContainsEndInclusive (1782 of 2058) PASS: lldb-shell :: BuildScript/toolchain-clang.test (1783 of 2058) PASS: lldb-unit :: Target/./TargetTests/MCBasedABI.MapRegisterName (1784 of 2058) PASS: lldb-unit :: Expression/./ExpressionTests/DiagnosticManagerTest.GetStringSeverityLabels (1785 of 2058) UNSUPPORTED: lldb-api :: commands/watchpoints/hello_watchlocation/TestWatchLocation.py (1786 of 2058) PASS: lldb-api :: commands/expression/call-function/TestCallUserDefinedFunction.py (1787 of 2058) PASS: lldb-api :: commands/expression/vector_of_enums/TestVectorOfEnums.py (1788 of 2058) PASS: lldb-shell :: SymbolFile/DWARF/apple-index-is-used.cpp (1789 of 2058) UNSUPPORTED: lldb-api :: python_api/watchpoint/TestWatchpointIter.py (1790 of 2058) PASS: lldb-unit :: Process/gdb-remote/./ProcessGdbRemoteTests/GDBRemoteCommunicationClientTest.SendGetDataPacket (1791 of 2058) PASS: lldb-unit :: Utility/./UtilityTests/StatusTest.ErrorCodeConstructor (1792 of 2058) UNSUPPORTED: lldb-api :: lang/c/unicode/TestUnicodeSymbols.py (1793 of 2058) PASS: lldb-api :: functionalities/breakpoint/breakpoint_ids/TestBreakpointIDs.py (1794 of 2058) PASS: lldb-unit :: ScriptInterpreter/Python/./ScriptInterpreterPythonTests/PythonDataObjectsTest.TestRun (1795 of 2058) PASS: lldb-unit :: Host/./HostTests/NativeProcessProtocolTest.SetBreakpointFailRead (1796 of 2058) PASS: lldb-unit :: Utility/./UtilityTests/StreamTest.SetIndentLevel (1797 of 2058) PASS: lldb-unit :: Utility/./UtilityTests/StringListTest.InsertStringAtIndexStart (1798 of 2058) PASS: lldb-api :: functionalities/data-formatter/data-formatter-stl/libcxx/function/TestLibCxxFunction.py (1799 of 2058) PASS: lldb-api :: commands/expression/import-std-module/list/TestListFromStdModule.py (1800 of 2058) PASS: lldb-shell :: ObjectFile/ELF/section-types-edgecases.yaml (1801 of 2058) PASS: lldb-unit :: Host/./HostTests/MainLoopTest.TerminatesImmediately (1802 of 2058) PASS: lldb-unit :: Utility/./UtilityTests/LogChannelTest.EnableOptions (1803 of 2058) PASS: lldb-unit :: Utility/./UtilityTests/RecordReplayTest.InstrumentedBar (1804 of 2058) PASS: lldb-unit :: Utility/./UtilityTests/StringExtractorTest.GetHexU8_Underflow2 (1805 of 2058) PASS: lldb-api :: python_api/value/TestValueAPI.py (1806 of 2058) PASS: lldb-unit :: Symbol/./SymbolTests/Type.CompilerContextPattern (1807 of 2058) PASS: lldb-shell :: Expr/TestMultilineExpr.test (1808 of 2058) PASS: lldb-unit :: Process/gdb-remote/./ProcessGdbRemoteTests/GDBRemoteCommunicationClientTest.WriteRegisterNoSuffix (1809 of 2058) PASS: lldb-shell :: ObjectFile/ELF/section-overlap.yaml (1810 of 2058) UNSUPPORTED: lldb-api :: linux/add-symbols/TestTargetSymbolsAddCommand.py (1811 of 2058) PASS: lldb-unit :: Utility/./UtilityTests/StringListTest.GetMaxStringLengthDecreasingSize (1812 of 2058) PASS: lldb-api :: functionalities/data-formatter/data-formatter-categories/TestDataFormatterCategories.py (1813 of 2058) PASS: lldb-unit :: ScriptInterpreter/Python/./ScriptInterpreterPythonTests/PythonDataObjectsTest.TestPythonTupleToStructuredList (1814 of 2058) UNSUPPORTED: lldb-api :: functionalities/data-formatter/data-formatter-stl/libstdcpp/iterator/TestDataFormatterStdIterator.py (1815 of 2058) PASS: lldb-api :: functionalities/history/TestHistoryRecall.py (1816 of 2058) PASS: lldb-unit :: Utility/./UtilityTests/StreamTest.PutRawBytesToLittleEndian (1817 of 2058) PASS: lldb-api :: tools/lldb-vscode/breakpoint/TestVSCode_setFunctionBreakpoints.py (1818 of 2058) PASS: lldb-api :: lang/cpp/member-and-local-vars-with-same-name/TestMembersAndLocalsWithSameName.py (1819 of 2058) UNSUPPORTED: lldb-shell :: SymbolFile/NativePDB/s_constant.cpp (1820 of 2058) UNSUPPORTED: lldb-api :: tools/lldb-server/TestGdbRemoteModuleInfo.py (1821 of 2058) PASS: lldb-api :: functionalities/thread/step_out/TestThreadStepOut.py (1822 of 2058) PASS: lldb-unit :: Utility/./UtilityTests/StringListTest.GetMaxStringLengthIncreasingSize (1823 of 2058) PASS: lldb-unit :: Utility/./UtilityTests/StringLexerTest.Next (1824 of 2058) PASS: lldb-api :: functionalities/data-formatter/typedef_array/TestTypedefArray.py (1825 of 2058) PASS: lldb-api :: macosx/thread_suspend/TestInternalThreadSuspension.py (1826 of 2058) PASS: lldb-shell :: Heap/heap-cstr.test (1827 of 2058) PASS: lldb-shell :: Register/x86-64-gp-read.test (1828 of 2058) PASS: lldb-api :: types/TestRecursiveTypes.py (1829 of 2058) PASS: lldb-api :: functionalities/data-formatter/data-formatter-stl/libcxx/variant/TestDataFormatterLibcxxVariant.py (1830 of 2058) PASS: lldb-api :: python_api/frame/TestFrames.py (1831 of 2058) PASS: lldb-api :: lang/cpp/limit-debug-info/TestWithLimitDebugInfo.py (1832 of 2058) PASS: lldb-api :: tools/lldb-server/TestGdbRemote_qThreadStopInfo.py (1833 of 2058) PASS: lldb-unit :: Utility/./UtilityTests/StringExtractorTest.GetHexBytesAvail_FullString (1834 of 2058) PASS: lldb-api :: functionalities/completion/TestCompletion.py (1835 of 2058) PASS: lldb-shell :: Reproducer/TestDSYM.test (1836 of 2058) PASS: lldb-unit :: Utility/./UtilityTests/SubsystemRAIITest.SubsystemWithErrorSuccess (1837 of 2058) PASS: lldb-unit :: SymbolFile/NativePDB/./SymbolFileNativePDBTests/PDBFPOProgramToDWARFExpressionTests.UnresolvedRegisterReference (1838 of 2058) UNSUPPORTED: lldb-api :: commands/watchpoints/watchpoint_commands/command/TestWatchpointCommandPython.py (1839 of 2058) PASS: lldb-shell :: Breakpoint/case-sensitive.test (1840 of 2058) PASS: lldb-api :: commands/help/TestHelp.py (1841 of 2058) PASS: lldb-api :: commands/expression/import-std-module/shared_ptr-dbg-info-content/TestSharedPtrDbgInfoContentFromStdModule.py (1842 of 2058) PASS: lldb-unit :: Utility/./UtilityTests/StringListTest.SplitIntoLines (1843 of 2058) PASS: lldb-api :: lang/cpp/frame-var-anon-unions/TestFrameVariableAnonymousUnions.py (1844 of 2058) UNSUPPORTED: lldb-shell :: Register/x86-64-zmm-read.test (1845 of 2058) PASS: lldb-shell :: SymbolFile/DWARF/module-ownership.mm (1846 of 2058) PASS: lldb-unit :: Utility/./UtilityTests/DataExtractorTest.GetMaxU64_unchecked (1847 of 2058) PASS: lldb-unit :: SymbolFile/DWARF/./SymbolFileDWARFTests/SymbolFileDWARFTests.TestAbbrevNullAttrValidForm (1848 of 2058) PASS: lldb-unit :: Utility/./UtilityTests/StreamTest.ChangingByteOrder (1849 of 2058) PASS: lldb-unit :: Utility/./UtilityTests/ArgsTest.ReplaceArgumentAtIndexFarOutOfRange (1850 of 2058) PASS: lldb-api :: lang/objc/modules-compile-error/TestModulesCompileError.py (1851 of 2058) PASS: lldb-api :: functionalities/data-formatter/data-formatter-objc/TestDataFormatterObjCNSDate.py (1852 of 2058) PASS: lldb-shell :: ScriptInterpreter/Python/eof.test (1853 of 2058) PASS: lldb-shell :: ObjectFile/ELF/build-id-case.yaml (1854 of 2058) PASS: lldb-api :: lang/c/local_types/TestUseClosestType.py (1855 of 2058) PASS: lldb-api :: functionalities/thread/concurrent_events/TestConcurrentDelayedCrashWithBreakpointSignal.py (1856 of 2058) PASS: lldb-unit :: Utility/./UtilityTests/UriParserTest.TypicalPortPathIPv6 (1857 of 2058) PASS: lldb-api :: functionalities/breakpoint/breakpoint_callback_command_source/TestBreakpointCallbackCommandSource.py (1858 of 2058) PASS: lldb-shell :: Driver/TestCore.test (1859 of 2058) PASS: lldb-api :: commands/command/invalid-args/TestInvalidArgsCommand.py (1860 of 2058) PASS: lldb-unit :: Utility/./UtilityTests/AnsiTerminal.AtEnd (1861 of 2058) UNSUPPORTED: lldb-shell :: ScriptInterpreter/Lua/independent_state.test (1862 of 2058) PASS: lldb-unit :: Host/./HostTests/FileSystemTest.EmptyTest (1863 of 2058) PASS: lldb-api :: functionalities/thread/exit_during_step/TestExitDuringStep.py (1864 of 2058) PASS: lldb-shell :: ObjectFile/Breakpad/uuid-matching-mac.test (1865 of 2058) PASS: lldb-api :: lang/objc/conflicting-definition/TestConflictingDefinition.py (1866 of 2058) PASS: lldb-unit :: Utility/./UtilityTests/SerializationRountripTest.SerializeDeserializePodPointers (1867 of 2058) PASS: lldb-unit :: Utility/./UtilityTests/AnsiTerminal.Twice (1868 of 2058) PASS: lldb-api :: functionalities/data-formatter/data-formatter-objc/TestDataFormatterObjCExpr.py (1869 of 2058) UNSUPPORTED: lldb-api :: functionalities/data-formatter/data-formatter-stl/libstdcpp/map/TestDataFormatterStdMap.py (1870 of 2058) PASS: lldb-shell :: Settings/TestFrameFormatMangling.test (1871 of 2058) PASS: lldb-api :: functionalities/tail_call_frames/cross_dso/TestCrossDSOTailCalls.py (1872 of 2058) PASS: lldb-api :: functionalities/data-formatter/data-formatter-objc/TestDataFormatterObjCNSError.py (1873 of 2058) PASS: lldb-api :: functionalities/tail_call_frames/cross_object/TestCrossObjectTailCalls.py (1874 of 2058) PASS: lldb-api :: functionalities/thread/concurrent_events/TestConcurrentTwoBreakpointsOneDelaySignal.py (1875 of 2058) PASS: lldb-api :: functionalities/data-formatter/format-propagation/TestFormatPropagation.py (1876 of 2058) PASS: lldb-api :: functionalities/process_group/TestChangeProcessGroup.py (1877 of 2058) UNSUPPORTED: lldb-api :: lang/cpp/printf/TestPrintf.py (1878 of 2058) PASS: lldb-unit :: Utility/./UtilityTests/StreamTeeTest.AppendStream (1879 of 2058) PASS: lldb-unit :: Utility/./UtilityTests/CompletionRequest.FakeLastArg (1880 of 2058) UNSUPPORTED: lldb-api :: commands/register/register/intel_xtended_registers/mpx_bound_violation/TestBoundViolation.py (1881 of 2058) PASS: lldb-unit :: SymbolFile/NativePDB/./SymbolFileNativePDBTests/PDBFPOProgramToDWARFExpressionTests.UnresolvedCyclicRegisterAssignmentReference (1882 of 2058) PASS: lldb-shell :: ObjectFile/PECOFF/basic-info-arm64.yaml (1883 of 2058) PASS: lldb-unit :: UnwindAssembly/x86/./UnwindAssemblyx86Tests/Testx86AssemblyInspectionEngine.TestLEAVE (1884 of 2058) PASS: lldb-shell :: Register/x86-64-ymm-read.test (1885 of 2058) PASS: lldb-api :: macosx/profile_vrs_detach/TestDetachVrsProfile.py (1886 of 2058) PASS: lldb-api :: functionalities/breakpoint/serialize/TestBreakpointSerialization.py (1887 of 2058) PASS: lldb-unit :: Utility/./UtilityTests/RecordReplayTest.InstrumentedFoo (1888 of 2058) PASS: lldb-api :: commands/breakpoint/set/func-regex/TestBreakpointRegexError.py (1889 of 2058) PASS: lldb-shell :: SymbolFile/DWARF/debug_line-relative_path.s (1890 of 2058) PASS: lldb-unit :: Expression/./ExpressionTests/ClangExpressionDeclMapTest.TestPersistentDeclLookup (1891 of 2058) PASS: lldb-unit :: Symbol/./SymbolTests/TestClangASTImporter.CopyTypeTagDecl (1892 of 2058) PASS: lldb-unit :: Process/minidump/./LLDBMinidumpTests/RegisterContextMinidump.ConvertMinidumpContext_x86_64 (1893 of 2058) PASS: lldb-unit :: Utility/./UtilityTests/ProcessInfoTest.Constructor (1894 of 2058) PASS: lldb-api :: functionalities/data-formatter/data-formatter-stl/libcxx/forward_list/TestDataFormatterLibcxxForwardList.py (1895 of 2058) PASS: lldb-api :: lang/objc/print-obj/TestPrintObj.py (1896 of 2058) PASS: lldb-unit :: Utility/./UtilityTests/FileSpecTest.Match (1897 of 2058) PASS: lldb-unit :: Process/gdb-remote/./ProcessGdbRemoteTests/GDBRemoteCommunicationClientTest.SendStopTracePacket (1898 of 2058) PASS: lldb-shell :: ObjectFile/wasm/basic.yaml (1899 of 2058) PASS: lldb-unit :: UnwindAssembly/x86/./UnwindAssemblyx86Tests/Testx86AssemblyInspectionEngine.TestPushR15 (1900 of 2058) PASS: lldb-api :: functionalities/data-formatter/data-formatter-stl/libcxx/map/TestDataFormatterLibccMap.py (1901 of 2058) PASS: lldb-api :: commands/expression/import-std-module/shared_ptr/TestSharedPtrFromStdModule.py (1902 of 2058) PASS: lldb-unit :: Utility/./UtilityTests/UriParserTest.LongPath (1903 of 2058) PASS: lldb-unit :: Utility/./UtilityTests/StringListTest.ShiftCString (1904 of 2058) PASS: lldb-unit :: Utility/./UtilityTests/StreamTest.AddressRangeInvalidRange (1905 of 2058) PASS: lldb-api :: commands/gui/basic/TestGuiBasic.py (1906 of 2058) PASS: lldb-api :: functionalities/unwind/noreturn/module-end/TestNoReturnModuleEnd.py (1907 of 2058) PASS: lldb-api :: source-manager/TestSourceManager.py (1908 of 2058) PASS: lldb-unit :: Language/Highlighting/./HighlighterTests/HighlighterTest.ClangPreserveNewLine (1909 of 2058) PASS: lldb-unit :: Utility/./UtilityTests/TimeoutTest.Construction (1910 of 2058) PASS: lldb-unit :: DataFormatter/./LLDBFormatterTests/StringPrinterTests.SwiftUTF8 (1911 of 2058) PASS: lldb-shell :: ScriptInterpreter/Python/crashlog.test (1912 of 2058) PASS: lldb-shell :: SymbolFile/DWARF/DW_OP_piece-smaller-than-struct.s (1913 of 2058) PASS: lldb-api :: functionalities/testid/TestTestId.py (1914 of 2058) PASS: lldb-unit :: Utility/./UtilityTests/StreamTest.PutCharWhitespace (1915 of 2058) PASS: lldb-unit :: Process/gdb-remote/./ProcessGdbRemoteTests/GDBRemoteCommunicationServerTest.SendErrorResponse_ErrorNumber (1916 of 2058) PASS: lldb-api :: functionalities/thread/concurrent_events/TestConcurrentSignalDelayBreak.py (1917 of 2058) PASS: lldb-unit :: Expression/./ExpressionTests/DiagnosticManagerTest.AddDiagnostic (1918 of 2058) PASS: lldb-api :: functionalities/data-formatter/type_summary_list_script/TestTypeSummaryListScript.py (1919 of 2058) PASS: lldb-api :: functionalities/data-formatter/pyobjsynthprovider/TestPyObjSynthProvider.py (1920 of 2058) PASS: lldb-unit :: Utility/./UtilityTests/RangeTest.Union (1921 of 2058) PASS: lldb-api :: python_api/process/TestProcessAPI.py (1922 of 2058) PASS: lldb-api :: lang/c/step-target/TestStepTarget.py (1923 of 2058) PASS: lldb-unit :: Symbol/./SymbolTests/PostfixExpression.ParseOneExpression (1924 of 2058) PASS: lldb-unit :: Utility/./UtilityTests/DataExtractorTest.GetULEB128_bit63 (1925 of 2058) PASS: lldb-shell :: SymbolFile/DWARF/gnu-style-compression.cpp (1926 of 2058) PASS: lldb-shell :: SymbolFile/DWARF/clang-ast-from-dwarf-objc-property.m (1927 of 2058) UNSUPPORTED: lldb-shell :: ObjectFile/PECOFF/uuid.yaml (1928 of 2058) PASS: lldb-api :: functionalities/breakpoint/hardware_breakpoints/hardware_breakpoint_on_multiple_threads/TestHWBreakMultiThread.py (1929 of 2058) PASS: lldb-api :: python_api/debugger/TestDebuggerAPI.py (1930 of 2058) PASS: lldb-api :: commands/version/TestVersion.py (1931 of 2058) UNSUPPORTED: lldb-shell :: SymbolFile/PDB/func-symbols.test (1932 of 2058) PASS: lldb-shell :: SymbolFile/DWARF/debug-types-missing-signature.test (1933 of 2058) PASS: lldb-unit :: Utility/./UtilityTests/LogTest.Register (1934 of 2058) PASS: lldb-unit :: Process/gdb-remote/./ProcessGdbRemoteTests/GDBRemoteCommunicationServerTest.SendErrorResponse_UnimplementedError (1935 of 2058) PASS: lldb-api :: functionalities/breakpoint/breakpoint_command/TestBreakpointCommand.py (1936 of 2058) PASS: lldb-shell :: Reproducer/Functionalities/TestStepping.test (1937 of 2058) UNSUPPORTED: lldb-shell :: SymbolFile/NativePDB/local-variables.cpp (1938 of 2058) UNSUPPORTED: lldb-api :: functionalities/data-formatter/data-formatter-stl/libstdcpp/vbool/TestDataFormatterStdVBool.py (1939 of 2058) PASS: lldb-api :: api/check_public_api_headers/TestPublicAPIHeaders.py (1940 of 2058) PASS: lldb-unit :: Utility/./UtilityTests/XcodeSDKTest.GetSDKTypeForTriple (1941 of 2058) UNSUPPORTED: lldb-shell :: Register/x86-ymm-read.test (1942 of 2058) PASS: lldb-unit :: Process/minidump/./LLDBMinidumpTests/MinidumpParserTest.InvalidMinidump (1943 of 2058) PASS: lldb-api :: lang/cpp/function_refs/TestFunctionRefs.py (1944 of 2058) UNSUPPORTED: lldb-shell :: SymbolFile/PDB/calling-conventions.test (1945 of 2058) PASS: lldb-unit :: Utility/./UtilityTests/RangeTest.NotEqual (1946 of 2058) PASS: lldb-unit :: Utility/./UtilityTests/GeneratorTest.Get (1947 of 2058) UNSUPPORTED: lldb-api :: functionalities/darwin_log/filter/exact_match/subsystem/TestDarwinLogFilterMatchSubsystem.py (1948 of 2058) PASS: lldb-shell :: SymbolFile/Breakpad/unwind-via-stack-cfi.test (1949 of 2058) PASS: lldb-unit :: Utility/./UtilityTests/StringListTest.LongestCommonPrefix (1950 of 2058) PASS: lldb-api :: lang/cpp/incomplete-types/TestCppIncompleteTypes.py (1951 of 2058) PASS: lldb-unit :: Utility/./UtilityTests/StringListTest.PopBack (1952 of 2058) PASS: lldb-unit :: UnwindAssembly/x86/./UnwindAssemblyx86Tests/Testx86AssemblyInspectionEngine.TestPushRBPWithREX (1953 of 2058) PASS: lldb-api :: commands/expression/import-std-module/vector-of-vectors/TestVectorOfVectorsFromStdModule.py (1954 of 2058) PASS: lldb-api :: functionalities/tail_call_frames/disambiguate_call_site/TestDisambiguateCallSite.py (1955 of 2058) UNSUPPORTED: lldb-shell :: Breakpoint/case-insensitive.test (1956 of 2058) PASS: lldb-shell :: Unwind/eh-frame-dwarf-unwind.test (1957 of 2058) UNSUPPORTED: lldb-api :: commands/watchpoints/watchpoint_count/TestWatchpointCount.py (1958 of 2058) UNSUPPORTED: lldb-api :: functionalities/data-formatter/data-formatter-stl/libstdcpp/vector/TestDataFormatterStdVector.py (1959 of 2058) PASS: lldb-api :: lang/objc/objc-struct-argument/TestObjCStructArgument.py (1960 of 2058) UNSUPPORTED: lldb-shell :: SymbolFile/DWARF/find-basic-namespace.cpp (1961 of 2058) UNSUPPORTED: lldb-shell :: SymbolFile/target-symbols-add-unwind.test (1962 of 2058) PASS: lldb-api :: functionalities/tail_call_frames/ambiguous_tail_call_seq1/TestAmbiguousTailCallSeq1.py (1963 of 2058) PASS: lldb-unit :: Host/./HostTests/File.GetStreamFromDescriptor (1964 of 2058) PASS: lldb-shell :: Breakpoint/debug_addrx.test (1965 of 2058) PASS: lldb-shell :: Minidump/breakpad-symbols.test (1966 of 2058) PASS: lldb-api :: commands/expression/call-throws/TestCallThatThrows.py (1967 of 2058) PASS: lldb-unit :: Language/CPlusPlus/./LanguageCPlusPlusTests/CPlusPlusLanguage.CPlusPlusNameParser (1968 of 2058) PASS: lldb-unit :: Host/./HostTests/FileSystemTest.FileAndDirectoryComponents (1969 of 2058) UNSUPPORTED: lldb-api :: functionalities/thread/concurrent_events/TestConcurrentManySignals.py (1970 of 2058) UNSUPPORTED: lldb-api :: functionalities/thread/concurrent_events/TestConcurrentNWatchNBreak.py (1971 of 2058) UNSUPPORTED: lldb-api :: functionalities/thread/concurrent_events/TestConcurrentWatchpointDelayWatchpointOneBreakpoint.py (1972 of 2058) PASS: lldb-api :: lang/objc/modules/TestObjCModules.py (1973 of 2058) PASS: lldb-unit :: Utility/./UtilityTests/ScalarTest.GetBytes (1974 of 2058) PASS: lldb-shell :: SymbolFile/DWARF/dwarf5-debug_line.s (1975 of 2058) PASS: lldb-unit :: Utility/./UtilityTests/RecordReplayTest.InstrumentedFooSameThis (1976 of 2058) PASS: lldb-api :: functionalities/gdb_remote_client/TestJLink6Armv7RegisterDefinition.py (1977 of 2058) UNSUPPORTED: lldb-api :: functionalities/data-formatter/data-formatter-stl/libstdcpp/string/TestDataFormatterStdString.py (1978 of 2058) PASS: lldb-api :: functionalities/breakpoint/cpp_exception/TestCPPExceptionBreakpoint.py (1979 of 2058) PASS: lldb-unit :: Host/./HostTests/FileSystemTest.OpenErrno (1980 of 2058) PASS: lldb-unit :: Utility/./UtilityTests/SerializationRountripTest.SerializeDeserializeCStringArray (1981 of 2058) PASS: lldb-unit :: Utility/./UtilityTests/StringListTest.InsertStringAtIndexOutOfBounds (1982 of 2058) PASS: lldb-api :: commands/expression/persistent_types/TestPersistentTypes.py (1983 of 2058) UNSUPPORTED: lldb-api :: functionalities/data-formatter/data-formatter-stl/libstdcpp/tuple/TestDataFormatterStdTuple.py (1984 of 2058) PASS: lldb-shell :: Breakpoint/split-dwarf-5-addrbase.test (1985 of 2058) PASS: lldb-api :: functionalities/archives/TestBSDArchives.py (1986 of 2058) PASS: lldb-unit :: Utility/./UtilityTests/OptionsWithRawTest.EmptyInput (1987 of 2058) PASS: lldb-shell :: Breakpoint/single-file-split-dwarf.test (1988 of 2058) PASS: lldb-shell :: Minidump/disassemble-no-module.yaml (1989 of 2058) UNSUPPORTED: lldb-api :: commands/watchpoints/watchpoint_commands/TestWatchpointCommands.py (1990 of 2058) PASS: lldb-unit :: Utility/./UtilityTests/StringListTest.AppendStringMove (1991 of 2058) PASS: lldb-api :: lang/c/bitfields/TestBitfields.py (1992 of 2058) PASS: lldb-api :: lang/mixed/TestMixedLanguages.py (1993 of 2058) PASS: lldb-unit :: Utility/./UtilityTests/StreamTest.PutRawBytesToMixedEndian (1994 of 2058) PASS: lldb-unit :: Target/./TargetTests/PathMappingListTest.RelativeTests (1995 of 2058) UNSUPPORTED: lldb-shell :: Register/x86-64-gp-write.test (1996 of 2058) PASS: lldb-api :: commands/expression/import-std-module/weak_ptr/TestWeakPtrFromStdModule.py (1997 of 2058) UNSUPPORTED: lldb-api :: macosx/macabi/TestMacABImacOSFramework.py (1998 of 2058) UNSUPPORTED: lldb-api :: benchmarks/continue/TestBenchmarkContinue.py (1999 of 2058) PASS: lldb-unit :: Utility/./UtilityTests/UUIDTest.StringConverion (2000 of 2058) UNSUPPORTED: lldb-api :: commands/expression/namespace_local_var_same_name_cpp_and_c/TestNamespaceLocalVarSameNameCppAndC.py (2001 of 2058) PASS: lldb-unit :: Utility/./UtilityTests/StringListTest.Assignment (2002 of 2058) PASS: lldb-unit :: Utility/./UtilityTests/ReproducerTest.SetCapture (2003 of 2058) PASS: lldb-api :: lang/cpp/unicode-literals/TestUnicodeLiterals.py (2004 of 2058) UNSUPPORTED: lldb-api :: lang/c/typedef/Testtypedef.py (2005 of 2058) PASS: lldb-shell :: Expr/TestIRMemoryMap.test (2006 of 2058) PASS: lldb-unit :: Utility/./UtilityTests/NameMatchesTest.RegularExpression (2007 of 2058) PASS: lldb-unit :: ObjectFile/PECOFF/./ObjectFilePECOFFTests/PECallFrameInfoTest.Chained_eh (2008 of 2058) PASS: lldb-api :: lang/c/register_variables/TestRegisterVariables.py (2009 of 2058) PASS: lldb-api :: commands/expression/ir-interpreter/TestIRInterpreter.py (2010 of 2058) PASS: lldb-unit :: ScriptInterpreter/Python/./ScriptInterpreterPythonTests/PythonDataObjectsTest.TestExtractingUInt64ThroughStructuredData (2011 of 2058) PASS: lldb-api :: commands/expression/rdar42038760/TestScalarURem.py (2012 of 2058) PASS: lldb-unit :: Utility/./UtilityTests/ScalarTest.Division (2013 of 2058) PASS: lldb-shell :: ObjectFile/ELF/gnu-debuglink.yaml (2014 of 2058) PASS: lldb-api :: functionalities/breakpoint/breakpoint_names/TestBreakpointNames.py (2015 of 2058) PASS: lldb-unit :: Expression/./ExpressionTests/DiagnosticManagerTest.AppendMessageSubsequentDiags (2016 of 2058) PASS: lldb-api :: functionalities/load_unload/TestLoadUnload.py (2017 of 2058) PASS: lldb-unit :: Symbol/./SymbolTests/LineEntryTest.GetSameLineContiguousAddressRangeNoInlines (2018 of 2058) PASS: lldb-api :: python_api/frame/inlines/TestInlinedFrame.py (2019 of 2058) PASS: lldb-unit :: Utility/./UtilityTests/VASprintfTest.NoBufferResize (2020 of 2058) PASS: lldb-shell :: ObjectFile/ELF/short-build-id.yaml (2021 of 2058) PASS: lldb-unit :: UnwindAssembly/x86/./UnwindAssemblyx86Tests/Testx86AssemblyInspectionEngine.TestPopR12 (2022 of 2058) PASS: lldb-unit :: Platform/Android/./AdbClientTests/AdbClientTest.CreateByDeviceId (2023 of 2058) UNSUPPORTED: lldb-api :: functionalities/darwin_log/filter/exact_match/activity-chain/TestDarwinLogFilterMatchActivityChain.py (2024 of 2058) PASS: lldb-api :: commands/reproducer/invalid-args/TestInvalidArgsReproducer.py (2025 of 2058) PASS: lldb-api :: functionalities/data-formatter/refpointer-recursion/TestDataFormatterRefPtrRecursion.py (2026 of 2058) PASS: lldb-api :: lang/objc/ptr_refs/TestPtrRefsObjC.py (2027 of 2058) PASS: lldb-unit :: Utility/./UtilityTests/ArgsTest.ReplaceArgumentAtIndexLonger (2028 of 2058) PASS: lldb-api :: commands/expression/po_verbosity/TestPoVerbosity.py (2029 of 2058) PASS: lldb-api :: python_api/sbvalue_const_addrof/TestSBValueConstAddrOf.py (2030 of 2058) PASS: lldb-api :: macosx/find-app-in-bundle/TestFindAppInBundle.py (2031 of 2058) PASS: lldb-api :: python_api/lldbutil/frame/TestFrameUtils.py (2032 of 2058) PASS: lldb-api :: api/listeners/TestListener.py (2033 of 2058) PASS: lldb-api :: functionalities/deleted-executable/TestDeletedExecutable.py (2034 of 2058) PASS: lldb-unit :: Utility/./UtilityTests/ReproducerTest.SetReplay (2035 of 2058) UNSUPPORTED: lldb-api :: tools/lldb-vscode/completions/TestVSCode_completions.py (2036 of 2058) PASS: lldb-unit :: ScriptInterpreter/Python/./ScriptInterpreterPythonTests/PythonDataObjectsTest.TestPythonTupleInitializerList (2037 of 2058) PASS: lldb-unit :: Utility/./UtilityTests/UriParserTest.BadPort2 (2038 of 2058) PASS: lldb-unit :: Host/./HostTests/FileSystemTest.GetPermissions (2039 of 2058) PASS: lldb-shell :: SymbolFile/DWARF/split-dwarf-inlining.cpp (2040 of 2058) PASS: lldb-unit :: ScriptInterpreter/Python/./ScriptInterpreterPythonTests/PythonDataObjectsTest.TestPythonCallableInvoke (2041 of 2058) PASS: lldb-api :: functionalities/dead-strip/TestDeadStrip.py (2042 of 2058) PASS: lldb-unit :: Utility/./UtilityTests/RangeTest.Constructor (2043 of 2058) PASS: lldb-api :: macosx/safe-to-func-call/TestSafeFuncCalls.py (2044 of 2058) PASS: lldb-shell :: Reproducer/Functionalities/TestImageList.test (2045 of 2058) PASS: lldb-api :: functionalities/breakpoint/source_regexp/TestSourceRegexBreakpoints.py (2046 of 2058) FAIL: lldb-api :: tools/lldb-server/TestGdbRemoteRegisterState.py (2047 of 2058) ******************** TEST 'lldb-api :: tools/lldb-server/TestGdbRemoteRegisterState.py' FAILED ******************** Script: -- /usr/local/Frameworks/Python.framework/Versions/3.7/bin/python3.7 /Users/buildslave/jenkins/workspace/lldb-cmake-matrix/llvm-project/lldb/test/API/dotest.py --arch x86_64 -s /Users/buildslave/jenkins/workspace/lldb-cmake-matrix/lldb-build/lldb-test-traces -S nm -u CXXFLAGS -u CFLAGS --codesign-identity lldb_codesign --server /Users/buildslave/jenkins/workspace/lldb-cmake-matrix/lldb-build/./bin/debugserver --arch x86_64 --build-dir /Users/buildslave/jenkins/workspace/lldb-cmake-matrix/lldb-build/lldb-test-build.noindex -s=/Users/buildslave/jenkins/workspace/lldb-cmake-matrix/test/logs -t --env TERM=vt100 --skip-category gmodules --skip-category watchpoint --arch=x86_64 --env LLVM_LIBS_DIR=/Users/buildslave/jenkins/workspace/lldb-cmake-matrix/lldb-build/./lib --build-dir /Users/buildslave/jenkins/workspace/lldb-cmake-matrix/lldb-build/lldb-test-build.noindex --lldb-module-cache-dir /Users/buildslave/jenkins/workspace/lldb-cmake-matrix/lldb-build/lldb-test-build.noindex/module-cache-lldb/lldb-api --clang-module-cache-dir /Users/buildslave/jenkins/workspace/lldb-cmake-matrix/lldb-build/lldb-test-build.noindex/module-cache-clang/lldb-api --executable /Users/buildslave/jenkins/workspace/lldb-cmake-matrix/lldb-build/./bin/lldb --compiler /Users/buildslave/jenkins/workspace/lldb-cmake-matrix/lldb-build/./bin/clang --dsymutil /Users/buildslave/jenkins/workspace/lldb-cmake-matrix/lldb-build/./bin/dsymutil --filecheck /Users/buildslave/jenkins/workspace/lldb-cmake-matrix/lldb-build/./bin/FileCheck --lldb-libs-dir /Users/buildslave/jenkins/workspace/lldb-cmake-matrix/lldb-build/./lib /Users/buildslave/jenkins/workspace/lldb-cmake-matrix/llvm-project/lldb/test/API/tools/lldb-server -p TestGdbRemoteRegisterState.py -- Exit Code: 1

Hide Details

Command Output (stdout): -- lldb version 11.0.99 clang revision 5f56da3763ac6d5cc38b474fb05a2c89542d207e llvm revision 5f56da3763ac6d5cc38b474fb05a2c89542d207e LLDB library dir: /Users/buildslave/jenkins/workspace/lldb-cmake-matrix/lldb-build/bin LLDB import library dir: /Users/buildslave/jenkins/workspace/lldb-cmake-matrix/lldb-build/./lib libstdcxx tests will not be run because: Don't know how to build with libstdcxx on macosx Skipping following debug info categories: ['dwo']

Hide Details

-- Command Output (stderr): --

Hide Details

Session logs for test failures/errors/unexpected successes will go into directory '/Users/buildslave/jenkins/workspace/lldb-cmake-matrix/test/logs' Change dir to: /Users/buildslave/jenkins/workspace/lldb-cmake-matrix/llvm-project/lldb/test/API/tools/lldb-server runCmd: settings clear -all output:

Hide Details

runCmd: settings set symbols.enable-external-lookup false output:

Hide Details

runCmd: settings set target.auto-apply-fixits false output:

Hide Details

runCmd: settings set plugin.process.gdb-remote.packet-timeout 60 output:

Hide Details

runCmd: settings set symbols.clang-modules-cache-path "/Users/buildslave/jenkins/workspace/lldb-cmake-matrix/lldb-build/lldb-test-build.noindex/module-cache-lldb/lldb-api" output:

Hide Details

runCmd: settings set use-color false output:

Hide Details

runCmd: setting set target.prefer-dynamic-value no-dynamic-values output:

Hide Details

Adding tearDown hook: def shutdown_named_pipe(): # Close the pipe. try: named_pipe.close() except: print("failed to close named pipe") None

Hide Details

# Delete the pipe. try: os.remove(named_pipe_path) except: print("failed to delete named pipe: {}".format(named_pipe_path)) None

Hide Details

# Delete the temp directory. try: os.rmdir(temp_dir) except: print( "failed to delete temp dir: {}, directory contents: '{}'".format( temp_dir, os.listdir(temp_dir))) None

Hide Details

Hide Details

Adding tearDown hook: def cleanupSubprocesses(self): # Ensure any subprocesses are cleaned up for p in self.subprocesses: p.terminate() del p del self.subprocesses[:] # Ensure any forked processes are cleaned up for pid in self.forkedProcessPids: try: os.kill(pid, signal.SIGTERM) except OSError: pass

Hide Details

Hide Details

Adding tearDown hook: def shutdown_debug_monitor(): try: server.terminate() except: logger.warning( "failed to terminate server for debug monitor: {}; ignoring".format( sys.exc_info()[0]))

Hide Details

Hide Details

Adding tearDown hook: def shutdown_socket(): if sock: try: # send the kill packet so lldb-server shuts down gracefully sock.sendall(GdbRemoteTestCaseBase._GDBREMOTE_KILL_PACKET) except: logger.warning( "failed to send kill packet to debug monitor: {}; ignoring".format( sys.exc_info()[0]))

Hide Details

try: sock.close() except: logger.warning( "failed to close socket to debug monitor: {}; ignoring".format( sys.exc_info()[0]))

Hide Details

Hide Details

FAIL: LLDB (/Users/buildslave/jenkins/workspace/lldb-cmake-matrix/lldb-build/bin/clang-11-x86_64) :: test_grp_register_save_restore_works_no_suffix_debugserver (TestGdbRemoteRegisterState.TestGdbRemoteRegisterState) Executing tearDown hook: def shutdown_socket(): if sock: try: # send the kill packet so lldb-server shuts down gracefully sock.sendall(GdbRemoteTestCaseBase._GDBREMOTE_KILL_PACKET) except: logger.warning( "failed to send kill packet to debug monitor: {}; ignoring".format( sys.exc_info()[0]))

Hide Details

try: sock.close() except: logger.warning( "failed to close socket to debug monitor: {}; ignoring".format( sys.exc_info()[0]))

Hide Details

Hide Details

2020-06-30 20:39:54,937 WARNING failed to send kill packet to debug monitor: <class 'TypeError'>; ignoring Executing tearDown hook: def shutdown_debug_monitor(): try: server.terminate() except: logger.warning( "failed to terminate server for debug monitor: {}; ignoring".format( sys.exc_info()[0]))

Hide Details

Hide Details

Executing tearDown hook: def cleanupSubprocesses(self): # Ensure any subprocesses are cleaned up for p in self.subprocesses: p.terminate() del p del self.subprocesses[:] # Ensure any forked processes are cleaned up for pid in self.forkedProcessPids: try: os.kill(pid, signal.SIGTERM) except OSError: pass

Hide Details

Hide Details

Executing tearDown hook: def shutdown_named_pipe(): # Close the pipe. try: named_pipe.close() except: print("failed to close named pipe") None

Hide Details

# Delete the pipe. try: os.remove(named_pipe_path) except: print("failed to delete named pipe: {}".format(named_pipe_path)) None

Hide Details

# Delete the temp directory. try: os.rmdir(temp_dir) except: print( "failed to delete temp dir: {}, directory contents: '{}'".format( temp_dir, os.listdir(temp_dir))) None

Hide Details

Hide Details

runCmd: settings clear -all output:

Hide Details

runCmd: settings set symbols.enable-external-lookup false output:

Hide Details

runCmd: settings set target.auto-apply-fixits false output:

Hide Details

runCmd: settings set plugin.process.gdb-remote.packet-timeout 60 output:

Hide Details

runCmd: settings set symbols.clang-modules-cache-path "/Users/buildslave/jenkins/workspace/lldb-cmake-matrix/lldb-build/lldb-test-build.noindex/module-cache-lldb/lldb-api" output:

Hide Details

runCmd: settings set use-color false output:

Hide Details

runCmd: setting set target.prefer-dynamic-value no-dynamic-values output:

Hide Details

UNSUPPORTED: LLDB (/Users/buildslave/jenkins/workspace/lldb-cmake-matrix/lldb-build/bin/clang-11-x86_64) :: test_grp_register_save_restore_works_no_suffix_llgs (TestGdbRemoteRegisterState.TestGdbRemoteRegisterState) (llgs tests) runCmd: settings clear -all output:

Hide Details

runCmd: settings set symbols.enable-external-lookup false output:

Hide Details

runCmd: settings set target.auto-apply-fixits false output:

Hide Details

runCmd: settings set plugin.process.gdb-remote.packet-timeout 60 output:

Hide Details

runCmd: settings set symbols.clang-modules-cache-path "/Users/buildslave/jenkins/workspace/lldb-cmake-matrix/lldb-build/lldb-test-build.noindex/module-cache-lldb/lldb-api" output:

Hide Details

runCmd: settings set use-color false output:

Hide Details

runCmd: setting set target.prefer-dynamic-value no-dynamic-values output:

Hide Details

Adding tearDown hook: def shutdown_named_pipe(): # Close the pipe. try: named_pipe.close() except: print("failed to close named pipe") None

Hide Details

# Delete the pipe. try: os.remove(named_pipe_path) except: print("failed to delete named pipe: {}".format(named_pipe_path)) None

Hide Details

# Delete the temp directory. try: os.rmdir(temp_dir) except: print( "failed to delete temp dir: {}, directory contents: '{}'".format( temp_dir, os.listdir(temp_dir))) None

Hide Details

Hide Details

Adding tearDown hook: def cleanupSubprocesses(self): # Ensure any subprocesses are cleaned up for p in self.subprocesses: p.terminate() del p del self.subprocesses[:] # Ensure any forked processes are cleaned up for pid in self.forkedProcessPids: try: os.kill(pid, signal.SIGTERM) except OSError: pass

Hide Details

Hide Details

Adding tearDown hook: def shutdown_debug_monitor(): try: server.terminate() except: logger.warning( "failed to terminate server for debug monitor: {}; ignoring".format( sys.exc_info()[0]))

Hide Details

Hide Details

Adding tearDown hook: def shutdown_socket(): if sock: try: # send the kill packet so lldb-server shuts down gracefully sock.sendall(GdbRemoteTestCaseBase._GDBREMOTE_KILL_PACKET) except: logger.warning( "failed to send kill packet to debug monitor: {}; ignoring".format( sys.exc_info()[0]))

Hide Details

try: sock.close() except: logger.warning( "failed to close socket to debug monitor: {}; ignoring".format( sys.exc_info()[0]))

Hide Details

Hide Details

FAIL: LLDB (/Users/buildslave/jenkins/workspace/lldb-cmake-matrix/lldb-build/bin/clang-11-x86_64) :: test_grp_register_save_restore_works_with_suffix_debugserver (TestGdbRemoteRegisterState.TestGdbRemoteRegisterState) Executing tearDown hook: def shutdown_socket(): if sock: try: # send the kill packet so lldb-server shuts down gracefully sock.sendall(GdbRemoteTestCaseBase._GDBREMOTE_KILL_PACKET) except: logger.warning( "failed to send kill packet to debug monitor: {}; ignoring".format( sys.exc_info()[0]))

Hide Details

try: sock.close() except: logger.warning( "failed to close socket to debug monitor: {}; ignoring".format( sys.exc_info()[0]))

Hide Details

Hide Details

2020-06-30 20:39:57,673 WARNING failed to send kill packet to debug monitor: <class 'TypeError'>; ignoring Executing tearDown hook: def shutdown_debug_monitor(): try: server.terminate() except: logger.warning( "failed to terminate server for debug monitor: {}; ignoring".format( sys.exc_info()[0]))

Hide Details

Hide Details

Executing tearDown hook: def cleanupSubprocesses(self): # Ensure any subprocesses are cleaned up for p in self.subprocesses: p.terminate() del p del self.subprocesses[:] # Ensure any forked processes are cleaned up for pid in self.forkedProcessPids: try: os.kill(pid, signal.SIGTERM) except OSError: pass

Hide Details

Hide Details

Executing tearDown hook: def shutdown_named_pipe(): # Close the pipe. try: named_pipe.close() except: print("failed to close named pipe") None

Hide Details

# Delete the pipe. try: os.remove(named_pipe_path) except: print("failed to delete named pipe: {}".format(named_pipe_path)) None

Hide Details

# Delete the temp directory. try: os.rmdir(temp_dir) except: print( "failed to delete temp dir: {}, directory contents: '{}'".format( temp_dir, os.listdir(temp_dir))) None

Hide Details

Hide Details

runCmd: settings clear -all output:

Hide Details

runCmd: settings set symbols.enable-external-lookup false output:

Hide Details

runCmd: settings set target.auto-apply-fixits false output:

Hide Details

runCmd: settings set plugin.process.gdb-remote.packet-timeout 60 output:

Hide Details

runCmd: settings set symbols.clang-modules-cache-path "/Users/buildslave/jenkins/workspace/lldb-cmake-matrix/lldb-build/lldb-test-build.noindex/module-cache-lldb/lldb-api" output:

Hide Details

runCmd: settings set use-color false output:

Hide Details

runCmd: setting set target.prefer-dynamic-value no-dynamic-values output:

Hide Details

UNSUPPORTED: LLDB (/Users/buildslave/jenkins/workspace/lldb-cmake-matrix/lldb-build/bin/clang-11-x86_64) :: test_grp_register_save_restore_works_with_suffix_llgs (TestGdbRemoteRegisterState.TestGdbRemoteRegisterState) (llgs tests) Restore dir to: /Users/buildslave/jenkins/workspace/lldb-cmake-matrix/lldb-build/tools/lldb/test ====================================================================== FAIL: test_grp_register_save_restore_works_no_suffix_debugserver (TestGdbRemoteRegisterState.TestGdbRemoteRegisterState) ---------------------------------------------------------------------- Traceback (most recent call last): File "/Users/buildslave/jenkins/workspace/lldb-cmake-matrix/llvm-project/lldb/packages/Python/lldbsuite/test/decorators.py", line 140, in wrapper func(*args, **kwargs) File "/Users/buildslave/jenkins/workspace/lldb-cmake-matrix/llvm-project/lldb/test/API/tools/lldb-server/TestGdbRemoteRegisterState.py", line 117, in test_grp_register_save_restore_works_no_suffix_debugserver self.grp_register_save_restore_works(USE_THREAD_SUFFIX) File "/Users/buildslave/jenkins/workspace/lldb-cmake-matrix/llvm-project/lldb/test/API/tools/lldb-server/TestGdbRemoteRegisterState.py", line 29, in grp_register_save_restore_works process_info = self.parse_process_info_response(context) File "/Users/buildslave/jenkins/workspace/lldb-cmake-matrix/llvm-project/lldb/packages/Python/lldbsuite/test/tools/lldb-server/gdbremote_testcase.py", line 711, in parse_process_info_response self.assertTrue(key in self._KNOWN_PROCESS_INFO_KEYS) AssertionError: False is not True Config=x86_64-/Users/buildslave/jenkins/workspace/lldb-cmake-matrix/lldb-build/bin/clang-11 ====================================================================== FAIL: test_grp_register_save_restore_works_with_suffix_debugserver (TestGdbRemoteRegisterState.TestGdbRemoteRegisterState) ---------------------------------------------------------------------- Traceback (most recent call last): File "/Users/buildslave/jenkins/workspace/lldb-cmake-matrix/llvm-project/lldb/packages/Python/lldbsuite/test/decorators.py", line 140, in wrapper func(*args, **kwargs) File "/Users/buildslave/jenkins/workspace/lldb-cmake-matrix/llvm-project/lldb/test/API/tools/lldb-server/TestGdbRemoteRegisterState.py", line 101, in test_grp_register_save_restore_works_with_suffix_debugserver self.grp_register_save_restore_works(USE_THREAD_SUFFIX) File "/Users/buildslave/jenkins/workspace/lldb-cmake-matrix/llvm-project/lldb/test/API/tools/lldb-server/TestGdbRemoteRegisterState.py", line 29, in grp_register_save_restore_works process_info = self.parse_process_info_response(context) File "/Users/buildslave/jenkins/workspace/lldb-cmake-matrix/llvm-project/lldb/packages/Python/lldbsuite/test/tools/lldb-server/gdbremote_testcase.py", line 711, in parse_process_info_response self.assertTrue(key in self._KNOWN_PROCESS_INFO_KEYS) AssertionError: False is not True Config=x86_64-/Users/buildslave/jenkins/workspace/lldb-cmake-matrix/lldb-build/bin/clang-11 ---------------------------------------------------------------------- Ran 4 tests in 5.096s

Hide Details

RESULT: FAILED (0 passes, 2 failures, 0 errors, 2 skipped, 0 expected failures, 0 unexpected successes)

Hide Details

--

Hide Details

******************** PASS: lldb-api :: functionalities/inferior-changed/TestInferiorChanged.py (2048 of 2058) PASS: lldb-api :: commands/frame/var-scope/TestFrameVariableScope.py (2049 of 2058) PASS: lldb-api :: lang/cpp/multiple-inheritance/TestCppMultipleInheritance.py (2050 of 2058) PASS: lldb-api :: lang/cpp/nsimport/TestCppNsImport.py (2051 of 2058) PASS: lldb-api :: types/TestCharTypeExpr.py (2052 of 2058) PASS: lldb-api :: functionalities/data-formatter/data-formatter-proper-plurals/TestFormattersOneIsSingular.py (2053 of 2058) PASS: lldb-api :: lang/objc/objc_direct-methods/TestObjCDirectMethods.py (2054 of 2058) PASS: lldb-api :: lang/objc/radar-9691614/TestObjCMethodReturningBOOL.py (2055 of 2058) PASS: lldb-api :: commands/settings/TestSettings.py (2056 of 2058) PASS: lldb-api :: types/TestShortTypeExpr.py (2057 of 2058) PASS: lldb-api :: lang/objc/hidden-ivars/TestHiddenIvars.py (2058 of 2058) Slowest Tests: -------------------------------------------------------------------------- 87.50s: lldb-api :: tools/lldb-server/TestLldbGdbServer.py 67.76s: lldb-api :: lang/objc/foundation/TestFoundationDisassembly.py 59.50s: lldb-api :: api/multithreaded/TestMultithreaded.py 53.89s: lldb-api :: lang/objc/hidden-ivars/TestHiddenIvars.py 53.35s: lldb-api :: lang/objc/foundation/TestObjCMethods.py 45.67s: lldb-api :: lang/objc/exceptions/TestObjCExceptions.py 39.17s: lldb-api :: functionalities/load_unload/TestLoadUnload.py 35.58s: lldb-api :: lang/objc/objc-new-syntax/TestObjCNewSyntaxLiteral.py 35.50s: lldb-api :: lang/objc/real-definition/TestRealDefinition.py 33.55s: lldb-api :: types/TestLongTypesExpr.py 32.61s: lldb-api :: lang/cpp/namespace/TestNamespaceLookup.py 27.04s: lldb-api :: lang/objc/foundation/TestObjCMethodsString.py 26.96s: lldb-api :: lang/objc/objc-new-syntax/TestObjCNewSyntaxDictionary.py 26.96s: lldb-api :: lang/objc/foundation/TestObjCMethodsNSError.py 26.17s: lldb-api :: lang/objc/objc-new-syntax/TestObjCNewSyntaxArray.py 25.04s: lldb-api :: tools/lldb-server/TestAppleSimulatorOSType.py 23.51s: lldb-api :: types/TestLongTypes.py 21.72s: lldb-api :: types/TestIntegerTypeExpr.py 21.72s: lldb-api :: lang/objc/forward-decl/TestForwardDecl.py 20.97s: lldb-api :: lang/objc/conflicting-definition/TestConflictingDefinition.py

Hide Details

Tests Times: -------------------------------------------------------------------------- [ Range ] :: [ Percentage ] :: [ Count ] -------------------------------------------------------------------------- [85.0s,90.0s) :: [ ] :: [ 1/2058] [80.0s,85.0s) :: [ ] :: [ 0/2058] [75.0s,80.0s) :: [ ] :: [ 0/2058] [70.0s,75.0s) :: [ ] :: [ 0/2058] [65.0s,70.0s) :: [ ] :: [ 1/2058] [60.0s,65.0s) :: [ ] :: [ 1/2058] [55.0s,60.0s) :: [ ] :: [ 1/2058] [50.0s,55.0s) :: [ ] :: [ 1/2058] [45.0s,50.0s) :: [ ] :: [ 1/2058] [40.0s,45.0s) :: [ ] :: [ 1/2058] [35.0s,40.0s) :: [ ] :: [ 2/2058] [30.0s,35.0s) :: [ ] :: [ 2/2058] [25.0s,30.0s) :: [ ] :: [ 5/2058] [20.0s,25.0s) :: [ ] :: [ 8/2058] [15.0s,20.0s) :: [ ] :: [ 18/2058] [10.0s,15.0s) :: [* ] :: [ 74/2058] [ 5.0s,10.0s) :: [*** ] :: [ 189/2058] [ 0.0s, 5.0s) :: [********************************** ] :: [1753/2058] -------------------------------------------------------------------------- ******************** Failed Tests (6): lldb-api :: tools/lldb-server/TestGdbRemoteProcessInfo.py lldb-api :: tools/lldb-server/TestGdbRemoteAttach.py lldb-api :: tools/lldb-server/TestLldbGdbServer.py lldb-api :: tools/lldb-server/TestAppleSimulatorOSType.py lldb-api :: tools/lldb-server/TestGdbRemoteThreadsInStopReply.py lldb-api :: tools/lldb-server/TestGdbRemoteRegisterState.py

Hide Details

Hide Details

Testing Time: 296.62s Unsupported : 265 Passed : 1782 Expectedly Failed: 5 Failed : 6 FAILED: tools/lldb/test/CMakeFiles/check-lldb-lit cd /Users/buildslave/jenkins/workspace/lldb-cmake-matrix/lldb-build/tools/lldb/test && /usr/local/Frameworks/Python.framework/Versions/3.7/bin/python3.7 /Users/buildslave/jenkins/workspace/lldb-cmake-matrix/lldb-build/./bin/llvm-lit -v --time-tests --shuffle --xunit-xml-output=/Users/buildslave/jenkins/workspace/lldb-cmake-matrix/test/results.xml -v /Users/buildslave/jenkins/workspace/lldb-cmake-matrix/lldb-build/tools/lldb/test ninja: build stopped: subcommand failed. Command failed: Command '['/usr/bin/env', 'TERM=vt100', '/usr/local/bin/ninja', '-v', 'check-lldb']' returned non-zero exit status 1. Command: ['/usr/bin/env', 'TERM=vt100', '/usr/local/bin/ninja', '-v', 'check-lldb'] + set -e [Pipeline] } [Pipeline] // timeout [Pipeline] junit Recording test results [Pipeline] } [Pipeline] // stage [Pipeline] } [Pipeline] // withEnv [Pipeline] } [Pipeline] // node [Pipeline] End of Pipeline Finished: UNSTABLE