UnstableConsole Output

Skipping 63,673 KB.. Full Log
nDeclMapTest.TestPersistentDeclLookup (549 of 2073)
UNSUPPORTED: lldb-shell :: SymbolFile/PDB/ast-restore.test (550 of 2073)
UNSUPPORTED: lldb-api :: tools/lldb-server/platform-process-connect/TestPlatformProcessConnect.py (551 of 2073)
PASS: lldb-shell :: SymbolFile/DWARF/split-dwarf-inlining.cpp (552 of 2073)
PASS: lldb-unit :: Host/./HostTests/SocketTest.DomainListenConnectAccept (553 of 2073)
UNSUPPORTED: lldb-shell :: Unwind/eh-frame-augment-noop.test (554 of 2073)
PASS: lldb-api :: functionalities/data-formatter/data-formatter-stl/libcxx/tuple/TestDataFormatterLibcxxTuple.py (555 of 2073)
UNSUPPORTED: lldb-shell :: SymbolFile/DWARF/dir-separator-posix.s (556 of 2073)
PASS: lldb-api :: macosx/version_zero/TestGetVersionZeroVersion.py (557 of 2073)
PASS: lldb-api :: commands/target/stop-hooks/TestStopHooks.py (558 of 2073)
PASS: lldb-unit :: Symbol/./SymbolTests/TestTypeSystemClang.TestGetEnumIntegerTypeUnexpectedType (559 of 2073)
PASS: lldb-api :: python_api/section/TestSectionAPI.py (560 of 2073)
PASS: lldb-unit :: Host/./HostTests/NativeProcessProtocolTest.ReadCStringFromMemory_MaxSize (561 of 2073)
PASS: lldb-api :: lang/cpp/dynamic-value/TestDynamicValue.py (562 of 2073)
PASS: lldb-unit :: Host/./HostTests/FileSystemTest.GetByteSize (563 of 2073)
PASS: lldb-api :: commands/expression/persistent_variables/TestPersistentVariables.py (564 of 2073)
PASS: lldb-unit :: Symbol/./SymbolTests/TestClangASTImporter.DeportDeclTagDecl (565 of 2073)
PASS: lldb-api :: lang/c/enum_types/TestEnumTypes.py (566 of 2073)
PASS: lldb-unit :: Utility/./UtilityTests/UriParserTest.BracketedHostnameWithPortIPv4 (567 of 2073)
PASS: lldb-unit :: Utility/./UtilityTests/ConstStringTest.CompareStringRef (568 of 2073)
PASS: lldb-unit :: Utility/./UtilityTests/StreamTest.PutChar (569 of 2073)
PASS: lldb-api :: terminal/TestEditline.py (570 of 2073)
UNSUPPORTED: lldb-shell :: SymbolFile/DWARF/win-i386-line-table.s (571 of 2073)
PASS: lldb-api :: functionalities/dead-strip/TestDeadStrip.py (572 of 2073)
PASS: lldb-api :: commands/expression/import-std-module/deque-basic/TestDequeFromStdModule.py (573 of 2073)
PASS: lldb-shell :: ObjectFile/ELF/PT_LOAD-overlap-section.yaml (574 of 2073)
PASS: lldb-shell :: ObjectFile/ELF/minidebuginfo-find-symbols.yaml (575 of 2073)
UNSUPPORTED: lldb-shell :: ScriptInterpreter/Lua/convenience_variables.test (576 of 2073)
PASS: lldb-unit :: UnwindAssembly/x86/./UnwindAssemblyx86Tests/Testx86AssemblyInspectionEngine.TestDisassemblyJunkBytes (577 of 2073)
PASS: lldb-api :: functionalities/data-formatter/data-formatter-objc/TestDataFormatterObjCNSContainer.py (578 of 2073)
PASS: lldb-unit :: Process/gdb-remote/./ProcessGdbRemoteTests/GDBRemoteClientBaseTest.SendContinueDelegateStructuredDataReceipt (579 of 2073)
PASS: lldb-unit :: Utility/./UtilityTests/StringListTest.AppendStringCString (580 of 2073)
PASS: lldb-unit :: Host/./HostTests/ConnectionFileDescriptorTest.TCPGetURIv6 (581 of 2073)
PASS: lldb-unit :: Core/./LLDBCoreTests/StreamCallbackTest.Callback (582 of 2073)
PASS: lldb-unit :: Utility/./UtilityTests/CompletionRequest.Constructor (583 of 2073)
PASS: lldb-api :: commands/expression/po_verbosity/TestPoVerbosity.py (584 of 2073)
PASS: lldb-unit :: Language/Highlighting/./HighlighterTests/HighlighterTest.ClangComments (585 of 2073)
PASS: lldb-api :: functionalities/thread/concurrent_events/TestConcurrentTwoBreakpointsOneSignal.py (586 of 2073)
PASS: lldb-unit :: Utility/./UtilityTests/StringExtractorTest.GetU32LittleEndian (587 of 2073)
PASS: lldb-shell :: SymbolFile/DWARF/debug_rnglists.s (588 of 2073)
UNSUPPORTED: lldb-shell :: SymbolFile/PDB/compilands.test (589 of 2073)
PASS: lldb-unit :: Utility/./UtilityTests/SerializationRountripTest.SerializeDeserializePodReferences (590 of 2073)
UNSUPPORTED: lldb-shell :: SymbolFile/NativePDB/bitfields.cpp (591 of 2073)
PASS: lldb-api :: lang/cpp/typedef/TestCppTypedef.py (592 of 2073)
PASS: lldb-api :: tools/lldb-vscode/console/TestVSCode_console.py (593 of 2073)
PASS: lldb-api :: types/TestLongTypes.py (594 of 2073)
UNSUPPORTED: lldb-api :: linux/sepdebugsymlink/TestTargetSymbolsSepDebugSymlink.py (595 of 2073)
XFAIL: lldb-shell :: Unwind/prefer-debug-over-eh-frame.test (596 of 2073)
PASS: lldb-shell :: ObjectFile/Breakpad/discontiguous-sections.test (597 of 2073)
PASS: lldb-unit :: debugserver/./debugserverTests/RNBSocket.LoopBackConnectIPv6 (598 of 2073)
PASS: lldb-unit :: Utility/./UtilityTests/ReproducerTest.SetReplay (599 of 2073)
PASS: lldb-unit :: Utility/./UtilityTests/StringListTest.LongestCommonPrefixSingleElement (600 of 2073)
PASS: lldb-api :: functionalities/dynamic_value_child_count/TestDynamicValueChildCount.py (601 of 2073)
PASS: lldb-unit :: Utility/./UtilityTests/TimerTest.CategoryTimesStats (602 of 2073)
PASS: lldb-unit :: Expression/./ExpressionTests/CppModuleConfigurationTest.LibCppV2 (603 of 2073)
PASS: lldb-unit :: Symbol/./SymbolTests/TestTypeSystemClang.TestDisplayNameEmpty (604 of 2073)
PASS: lldb-unit :: Utility/./UtilityTests/StringListTest.PopBack (605 of 2073)
PASS: lldb-api :: commands/target/stop-hook/delete/TestTargetStopHookDelete.py (606 of 2073)
UNSUPPORTED: lldb-shell :: Process/Windows/exception_access_violation.cpp (607 of 2073)
PASS: lldb-shell :: ObjectFile/Breakpad/uuid-matching-mac.test (608 of 2073)
PASS: lldb-unit :: ScriptInterpreter/Python/./ScriptInterpreterPythonTests/PythonDataObjectsTest.TestScript (609 of 2073)
PASS: lldb-api :: functionalities/breakpoint/breakpoint_command/TestBreakpointCommandsFromPython.py (610 of 2073)
UNSUPPORTED: lldb-api :: functionalities/asan/TestMemoryHistory.py (611 of 2073)
PASS: lldb-unit :: Utility/./UtilityTests/ArgsTest.AppendArguments (612 of 2073)
PASS: lldb-api :: lang/objc/objc-builtin-types/TestObjCBuiltinTypes.py (613 of 2073)
PASS: lldb-unit :: Host/./HostTests/SocketAddressTest.GetAddressInfo (614 of 2073)
PASS: lldb-shell :: ObjectFile/ELF/section-addresses.yaml (615 of 2073)
PASS: lldb-unit :: ObjectFile/Breakpad/./ObjectFileBreakpadTests/ModuleRecord.parse (616 of 2073)
PASS: lldb-unit :: Interpreter/./InterpreterTests/CompletionTest.DirCompletionAbsolute (617 of 2073)
PASS: lldb-api :: functionalities/data-formatter/data-formatter-ptr-to-array/TestPtrToArrayFormatting.py (618 of 2073)
PASS: lldb-unit :: Host/./HostTests/MainLoopTest.TerminatesImmediately (619 of 2073)
UNSUPPORTED: lldb-shell :: SymbolFile/NativePDB/function-types-classes.cpp (620 of 2073)
PASS: lldb-api :: functionalities/gdb_remote_client/TestPlatformClient.py (621 of 2073)
PASS: lldb-unit :: Signals/./SignalsTests/UnixSignalsTest.GetInfo (622 of 2073)
PASS: lldb-api :: python_api/lldbutil/iter/TestLLDBIterator.py (623 of 2073)
PASS: lldb-unit :: Utility/./UtilityTests/StringExtractorTest.GetHexU8_Exact (624 of 2073)
PASS: lldb-api :: functionalities/thread/backtrace_limit/TestBacktraceLimit.py (625 of 2073)
PASS: lldb-unit :: UnwindAssembly/x86/./UnwindAssemblyx86Tests/Testx86AssemblyInspectionEngine.TestSimple64bitFrameFunction (626 of 2073)
PASS: lldb-unit :: Language/Highlighting/./HighlighterTests/HighlighterTest.Colons (627 of 2073)
PASS: lldb-unit :: SymbolFile/DWARF/./SymbolFileDWARFTests/SymbolFileDWARFTests.TestAbbrevOrder1Start5 (628 of 2073)
PASS: lldb-unit :: Symbol/./SymbolTests/TestClangASTImporter.CanImportInvalidType (629 of 2073)
PASS: lldb-api :: lang/objc/objc-baseclass-sbtype/TestObjCBaseClassSBType.py (630 of 2073)
PASS: lldb-api :: lang/cpp/virtual-functions/TestCppVirtualFunctions.py (631 of 2073)
PASS: lldb-api :: lang/cpp/static_methods/TestCPPStaticMethods.py (632 of 2073)
PASS: lldb-api :: lang/objc/hidden-ivars/TestHiddenIvars.py (633 of 2073)
PASS: lldb-unit :: Utility/./UtilityTests/UriParserTest.BracketedHostname (634 of 2073)
PASS: lldb-shell :: Process/UnsupportedLanguage.test (635 of 2073)
UNSUPPORTED: lldb-shell :: SymbolFile/DWARF/array-sizes.s (636 of 2073)
PASS: lldb-unit :: Utility/./UtilityTests/StringExtractorTest.DecodeHexU8_InvalidHex (637 of 2073)
PASS: lldb-unit :: Utility/./UtilityTests/StringListTest.Clear (638 of 2073)
PASS: lldb-api :: python_api/exprpath_synthetic/TestExprPathSynthetic.py (639 of 2073)
PASS: lldb-api :: macosx/order/TestOrderFile.py (640 of 2073)
UNSUPPORTED: lldb-shell :: BuildScript/toolchain-msvc.test (641 of 2073)
PASS: lldb-unit :: Utility/./UtilityTests/CompletionRequest.TryCompleteCurrentArgBad (642 of 2073)
PASS: lldb-unit :: Utility/./UtilityTests/StringListTest.InsertStringAtIndexMove (643 of 2073)
PASS: lldb-shell :: ObjectFile/ELF/compressed-sections.yaml (644 of 2073)
PASS: lldb-unit :: Utility/./UtilityTests/StringListTest.Join (645 of 2073)
PASS: lldb-unit :: Utility/./UtilityTests/SerializationRountripTest.SerializeDeserializeCStringNull (646 of 2073)
PASS: lldb-api :: functionalities/data-formatter/data-formatter-python-synth/TestDataFormatterPythonSynth.py (647 of 2073)
UNSUPPORTED: lldb-api :: functionalities/thread/concurrent_events/TestConcurrentNWatchNBreak.py (648 of 2073)
PASS: lldb-api :: linux/builtin_trap/TestBuiltinTrap.py (649 of 2073)
PASS: lldb-unit :: Utility/./UtilityTests/DataExtractorTest.GetFloatUnaligned (650 of 2073)
PASS: lldb-unit :: Process/minidump/./LLDBMinidumpTests/MinidumpParserTest.InvalidMinidump (651 of 2073)
PASS: lldb-unit :: UnwindAssembly/x86/./UnwindAssemblyx86Tests/Testx86AssemblyInspectionEngine.TestPushRBX (652 of 2073)
PASS: lldb-unit :: Expression/./ExpressionTests/ClangHostTest.MacOSX (653 of 2073)
PASS: lldb-api :: python_api/interpreter/TestCommandInterpreterAPI.py (654 of 2073)
PASS: lldb-shell :: Reproducer/TestRelativePath.test (655 of 2073)
UNSUPPORTED: lldb-shell :: ScriptInterpreter/Lua/quit.test (656 of 2073)
UNSUPPORTED: lldb-shell :: ScriptInterpreter/Lua/watchpoint_callback.test (657 of 2073)
PASS: lldb-unit :: Utility/./UtilityTests/RangeDataVector.FindEntryThatContains_Overlap (658 of 2073)
XFAIL: lldb-shell :: Register/x86-64-write.test (659 of 2073)
PASS: lldb-api :: api/log/TestAPILog.py (660 of 2073)
UNSUPPORTED: lldb-shell :: SymbolFile/NativePDB/nested-types.cpp (661 of 2073)
PASS: lldb-api :: functionalities/data-formatter/nssetsynth/TestNSSetSynthetic.py (662 of 2073)
PASS: lldb-unit :: Interpreter/./InterpreterTests/OptionArgParserTest.toChar (663 of 2073)
PASS: lldb-api :: python_api/frame/TestFrames.py (664 of 2073)
PASS: lldb-unit :: Utility/./UtilityTests/SerializationRountripTest.SerializeDeserializeObjectReference (665 of 2073)
PASS: lldb-unit :: Symbol/./SymbolTests/TestTypeSystemClang.TestGetEnumIntegerTypeBasicTypes (666 of 2073)
PASS: lldb-unit :: Symbol/./SymbolTests/TestTypeSystemClang.TestRecordHasFields (667 of 2073)
UNSUPPORTED: lldb-api :: benchmarks/frame_variable/TestFrameVariableResponse.py (668 of 2073)
PASS: lldb-api :: functionalities/data-formatter/data-formatter-disabling/TestDataFormatterDisabling.py (669 of 2073)
PASS: lldb-unit :: Utility/./UtilityTests/StringListTest.GetMaxStringLengthDecreasingSize (670 of 2073)
PASS: lldb-api :: functionalities/memory/cache/TestMemoryCache.py (671 of 2073)
PASS: lldb-api :: functionalities/data-formatter/boolreference/TestFormattersBoolRefPtr.py (672 of 2073)
PASS: lldb-unit :: Utility/./UtilityTests/ArchSpecTest.TestParseMachCPUDashSubtypeTripleExtra (673 of 2073)
PASS: lldb-unit :: Utility/./UtilityTests/StreamTest.PutBytesAsRawHex8ToBigEndian (674 of 2073)
PASS: lldb-unit :: Utility/./UtilityTests/LogTest.LLDB_LOG_nullptr (675 of 2073)
PASS: lldb-api :: commands/expression/import-std-module/basic/TestImportStdModule.py (676 of 2073)
PASS: lldb-unit :: Utility/./UtilityTests/StringListTest.ShiftStdString (677 of 2073)
PASS: lldb-unit :: Utility/./UtilityTests/ArgsTest.TestArgv (678 of 2073)
PASS: lldb-api :: lang/cpp/offsetof/TestOffsetofCpp.py (679 of 2073)
PASS: lldb-unit :: ScriptInterpreter/Python/./ScriptInterpreterPythonTests/PythonDataObjectsTest.TestPythonCallableInvoke (680 of 2073)
PASS: lldb-api :: lang/objc/objc-new-syntax/TestObjCNewSyntaxDictionary.py (681 of 2073)
PASS: lldb-unit :: Utility/./UtilityTests/XcodeSDKTest.FindXcodeContentsDirectoryInPath (682 of 2073)
PASS: lldb-api :: commands/expression/completion-crash-incomplete-record/TestCompletionCrashIncompleteRecord.py (683 of 2073)
PASS: lldb-api :: lang/objc/global_ptrs/TestGlobalObjects.py (684 of 2073)
UNSUPPORTED: lldb-shell :: ObjectFile/PECOFF/dep-modules.yaml (685 of 2073)
PASS: lldb-unit :: Utility/./UtilityTests/StringExtractorTest.DecodeHexU8_Exact (686 of 2073)
PASS: lldb-unit :: Utility/./UtilityTests/StringExtractorTest.GetHexU8_Extra (687 of 2073)
PASS: lldb-unit :: Utility/./UtilityTests/TimerTest.CategoryTimes (688 of 2073)
PASS: lldb-api :: python_api/sbdata/TestSBData.py (689 of 2073)
PASS: lldb-unit :: Utility/./UtilityTests/BinaryStreamTest.PutSLEB128TwoBytes (690 of 2073)
PASS: lldb-unit :: Process/gdb-remote/./ProcessGdbRemoteTests/GDBRemoteCommunicationClientTest.SendStopTracePacket (691 of 2073)
PASS: lldb-api :: types/TestRecursiveTypes.py (692 of 2073)
PASS: lldb-unit :: Symbol/./SymbolTests/TestTypeSystemClang.TestGetBasicTypeFromName (693 of 2073)
PASS: lldb-api :: lang/objc/modules/TestObjCModules.py (694 of 2073)
PASS: lldb-shell :: Reproducer/TestWorkingDir.test (695 of 2073)
PASS: lldb-api :: lang/objc/rdar-10967107/TestRdar10967107.py (696 of 2073)
PASS: lldb-unit :: Utility/./UtilityTests/ConstStringTest.NullAndEmptyStates (697 of 2073)
UNSUPPORTED: lldb-api :: functionalities/thread/break_after_join/TestBreakAfterJoin.py (698 of 2073)
PASS: lldb-api :: commands/expression/argument_passing_restrictions/TestArgumentPassingRestrictions.py (699 of 2073)
PASS: lldb-api :: python_api/signals/TestSignalsAPI.py (700 of 2073)
PASS: lldb-shell :: ScriptInterpreter/Python/crashlog.test (701 of 2073)
PASS: lldb-shell :: Unwind/eh-frame-dwarf-unwind.test (702 of 2073)
PASS: lldb-api :: functionalities/plugins/python_os_plugin/TestPythonOSPlugin.py (703 of 2073)
PASS: lldb-unit :: UnwindAssembly/x86/./UnwindAssemblyx86Tests/Testx86AssemblyInspectionEngine.TestPushR15 (704 of 2073)
PASS: lldb-unit :: Utility/./UtilityTests/StringExtractorTest.GetHexU8_Underflow2_NoEof (705 of 2073)
PASS: lldb-api :: functionalities/thread/concurrent_events/TestConcurrentBreakpointDelayBreakpointOneSignal.py (706 of 2073)
PASS: lldb-shell :: ObjectFile/ELF/PT_LOAD-overlap.yaml (707 of 2073)
PASS: lldb-api :: commands/platform/file/read/TestPlatformFileRead.py (708 of 2073)
PASS: lldb-unit :: ScriptInterpreter/Python/./ScriptInterpreterPythonTests/PythonDataObjectsTest.TestPythonListManipulation (709 of 2073)
PASS: lldb-unit :: API/./APITests/SBCommandInterpreterTest.MultiWordCommand (710 of 2073)
PASS: lldb-api :: python_api/get-value-32bit-int/TestGetValue32BitInt.py (711 of 2073)
PASS: lldb-api :: lang/c/conflicting-symbol/TestConflictingSymbol.py (712 of 2073)
PASS: lldb-api :: commands/expression/diagnostics/TestExprDiagnostics.py (713 of 2073)
PASS: lldb-api :: python_api/debugger/TestDebuggerAPI.py (714 of 2073)
PASS: lldb-unit :: Utility/./UtilityTests/StringListTest.LongestCommonPrefixDuplicateElement (715 of 2073)
PASS: lldb-api :: lang/c/unions/TestUnionMembers.py (716 of 2073)
UNSUPPORTED: lldb-api :: functionalities/unwind/standard/TestStandardUnwind.py (717 of 2073)
PASS: lldb-api :: functionalities/tail_call_frames/disambiguate_tail_call_seq/TestDisambiguateTailCallSeq.py (718 of 2073)
PASS: lldb-unit :: Utility/./UtilityTests/StatusTest.ErrorCodeConstructor (719 of 2073)
PASS: lldb-api :: lang/c/bitfields/TestBitfields.py (720 of 2073)
PASS: lldb-unit :: Expression/./ExpressionTests/DiagnosticManagerTest.GetStringMultipleDiags (721 of 2073)
PASS: lldb-api :: functionalities/memory-region/TestMemoryRegion.py (722 of 2073)
PASS: lldb-unit :: Process/minidump/./LLDBMinidumpTests/MinidumpParserTest.GetMemoryRegionInfoFromMemory64List (723 of 2073)
PASS: lldb-api :: functionalities/tail_call_frames/thread_step_out_message/TestArtificialFrameStepOutMessage.py (724 of 2073)
PASS: lldb-api :: functionalities/signal/TestSendSignal.py (725 of 2073)
PASS: lldb-api :: lang/objc/modules-auto-import/TestModulesAutoImport.py (726 of 2073)
PASS: lldb-api :: macosx/load-kext/TestLoadKext.py (727 of 2073)
UNSUPPORTED: lldb-shell :: SymbolFile/DWARF/dir-separator-windows.s (728 of 2073)
PASS: lldb-unit :: Utility/./UtilityTests/RangeTest.EqualInvalid (729 of 2073)
PASS: lldb-api :: lang/cpp/operators/TestCppOperators.py (730 of 2073)
PASS: lldb-api :: functionalities/set-data/TestSetData.py (731 of 2073)
PASS: lldb-unit :: SymbolFile/DWARF/./SymbolFileDWARFTests/SymbolFileDWARFTests.ParseArangesNonzeroSegmentSize (732 of 2073)
PASS: lldb-unit :: Core/./LLDBCoreTests/CommunicationTest.SynchronizeWhileClosing (733 of 2073)
PASS: lldb-unit :: Utility/./UtilityTests/StringExtractorTest.GetHexBytesAvail_FullString (734 of 2073)
PASS: lldb-unit :: debugserver/./debugserverTests/RNBSocket.LoopBackListenIPv6 (735 of 2073)
PASS: lldb-unit :: Language/Highlighting/./HighlighterTests/HighlighterTest.ClangBraces (736 of 2073)
PASS: lldb-unit :: Utility/./UtilityTests/StringExtractorTest.InitEmpty (737 of 2073)
PASS: lldb-unit :: Utility/./UtilityTests/RangeTest.NotEqualInvalid (738 of 2073)
UNSUPPORTED: lldb-shell :: SymbolFile/DWARF/find-basic-type.cpp (739 of 2073)
PASS: lldb-unit :: Utility/./UtilityTests/RecordReplayTest.InstrumentedBarPtr (740 of 2073)
PASS: lldb-unit :: Symbol/./SymbolTests/PostfixExpression.ParseOneExpression (741 of 2073)
PASS: lldb-api :: lang/c/strings/TestCStrings.py (742 of 2073)
PASS: lldb-unit :: Utility/./UtilityTests/FileSpecTest.GetPath (743 of 2073)
UNSUPPORTED: lldb-shell :: SymbolFile/DWARF/inline-function-address-shared.test (744 of 2073)
PASS: lldb-api :: lang/c/shared_lib_stripped_symbols/TestSharedLibStrippedSymbols.py (745 of 2073)
UNSUPPORTED: lldb-shell :: ObjectFile/PECOFF/export-dllfunc.yaml (746 of 2073)
PASS: lldb-unit :: Utility/./UtilityTests/StringListTest.LongestCommonPrefix (747 of 2073)
PASS: lldb-shell :: BuildScript/toolchain-clang.test (748 of 2073)
PASS: lldb-api :: macosx/universal/TestUniversal.py (749 of 2073)
PASS: lldb-unit :: Utility/./UtilityTests/OptionsWithRawTest.EmptySuffixSingleWhitespace (750 of 2073)
PASS: lldb-unit :: Utility/./UtilityTests/BroadcasterTest.BroadcastEvent (751 of 2073)
PASS: lldb-api :: functionalities/gdb_remote_client/TestArmRegisterDefinition.py (752 of 2073)
PASS: lldb-api :: commands/reproducer/invalid-args/TestInvalidArgsReproducer.py (753 of 2073)
PASS: lldb-unit :: Utility/./UtilityTests/ScalarTest.SetValueFromCString (754 of 2073)
UNSUPPORTED: lldb-api :: functionalities/darwin_log/filter/exact_match/activity-chain/TestDarwinLogFilterMatchActivityChain.py (755 of 2073)
PASS: lldb-api :: functionalities/tail_call_frames/thread_step_out_or_return/TestSteppingOutWithArtificialFrames.py (756 of 2073)
PASS: lldb-unit :: Utility/./UtilityTests/UserIDResolver.GetGroupName (757 of 2073)
PASS: lldb-unit :: Utility/./UtilityTests/ArgsTest.ReplaceArgumentAtIndexShort (758 of 2073)
PASS: lldb-api :: lang/c/function_types/TestFunctionTypes.py (759 of 2073)
UNSUPPORTED: lldb-api :: functionalities/data-formatter/data-formatter-stl/libstdcpp/smart_ptr/TestDataFormatterStdSmartPtr.py (760 of 2073)
UNSUPPORTED: lldb-api :: commands/expression/macros/TestMacros.py (761 of 2073)
PASS: lldb-unit :: Utility/./UtilityTests/ArgsTest.TestTrailingBackslash (762 of 2073)
PASS: lldb-unit :: Utility/./UtilityTests/ArgsTest.TestInsertArg (763 of 2073)
PASS: lldb-unit :: Utility/./UtilityTests/ArgsTest.DoubleQuotedItem (764 of 2073)
PASS: lldb-api :: functionalities/tail_call_frames/cross_object/TestCrossObjectTailCalls.py (765 of 2073)
UNSUPPORTED: lldb-shell :: SymbolFile/DWARF/find-variable-dwo.cpp (766 of 2073)
PASS: lldb-unit :: Signals/./SignalsTests/UnixSignalsTest.GetFilteredSignals (767 of 2073)
UNSUPPORTED: lldb-shell :: SymbolFile/DWARF/debug-line-basic.s (768 of 2073)
PASS: lldb-api :: functionalities/abbreviation/TestCommonShortSpellings.py (769 of 2073)
PASS: lldb-unit :: Utility/./UtilityTests/StringLexerTest.Peek (770 of 2073)
PASS: lldb-api :: commands/expression/anonymous-struct/TestCallUserAnonTypedef.py (771 of 2073)
PASS: lldb-api :: lang/objc/objc-struct-return/TestObjCStructReturn.py (772 of 2073)
PASS: lldb-unit :: Utility/./UtilityTests/StringListTest.AppendStringMove (773 of 2073)
PASS: lldb-unit :: Utility/./UtilityTests/CompletionRequest.TryCompleteCurrentArgGood (774 of 2073)
PASS: lldb-api :: commands/platform/basic/TestPlatformPython.py (775 of 2073)
PASS: lldb-shell :: ObjectFile/ELF/section-types.yaml (776 of 2073)
PASS: lldb-unit :: Utility/./UtilityTests/ProcessInstanceInfoList.Yaml (777 of 2073)
PASS: lldb-shell :: Reproducer/TestCrash.test (778 of 2073)
PASS: lldb-unit :: Process/gdb-remote/./ProcessGdbRemoteTests/GDBRemoteCommunicationClientTest.SendGetDataPacket (779 of 2073)
PASS: lldb-unit :: Utility/./UtilityTests/ArgsTest.TestAppendArg (780 of 2073)
PASS: lldb-unit :: UnwindAssembly/x86/./UnwindAssemblyx86Tests/Testx86AssemblyInspectionEngine.TestPushExtended (781 of 2073)
PASS: lldb-api :: lang/objc/objc-new-syntax/TestObjCNewSyntaxArray.py (782 of 2073)
PASS: lldb-shell :: SymbolFile/DWARF/debug-types-missing-signature.test (783 of 2073)
PASS: lldb-unit :: Utility/./UtilityTests/PassiveReplayTest.InstrumentedBarRef (784 of 2073)
PASS: lldb-api :: commands/expression/fixits/TestFixIts.py (785 of 2073)
PASS: lldb-api :: functionalities/signal/handle-abrt/TestHandleAbort.py (786 of 2073)
PASS: lldb-unit :: Utility/./UtilityTests/StringListTest.JoinEmpty (787 of 2073)
PASS: lldb-unit :: ObjectFile/PECOFF/./ObjectFilePECOFFTests/PECallFrameInfoTest.Chained_eh (788 of 2073)
UNSUPPORTED: lldb-api :: lang/objc/bitfield_ivars/TestBitfieldIvars.py (789 of 2073)
PASS: lldb-api :: commands/breakpoint/set/func-regex/TestBreakpointRegexError.py (790 of 2073)
PASS: lldb-unit :: Language/Highlighting/./HighlighterTests/HighlighterTest.Keywords (791 of 2073)
UNSUPPORTED: lldb-shell :: Breakpoint/ppc64-localentry.test (792 of 2073)
PASS: lldb-api :: commands/process/launch-with-shellexpand/TestLaunchWithShellExpand.py (793 of 2073)
PASS: lldb-unit :: UnwindAssembly/x86/./UnwindAssemblyx86Tests/Testx86AssemblyInspectionEngine.TestPopR15 (794 of 2073)
PASS: lldb-api :: lang/cpp/gmodules-templates/TestGModules.py (795 of 2073)
PASS: lldb-unit :: ScriptInterpreter/Python/./ScriptInterpreterPythonTests/PythonDataObjectsTest.TestPythonTupleSize (796 of 2073)
PASS: lldb-unit :: Utility/./UtilityTests/StreamTeeTest.Constructor2Streams (797 of 2073)
PASS: lldb-api :: tools/lldb-server/TestGdbRemoteExpeditedRegisters.py (798 of 2073)
PASS: lldb-api :: commands/expression/cast_int_to_anonymous_enum/TestCastIntToAnonymousEnum.py (799 of 2073)
PASS: lldb-unit :: SymbolFile/NativePDB/./SymbolFileNativePDBTests/PDBFPOProgramToDWARFExpressionTests.MultipleDependentAssignments (800 of 2073)
PASS: lldb-api :: functionalities/target-new-solib-notifications/TestModuleLoadedNotifys.py (801 of 2073)
PASS: lldb-unit :: Utility/./UtilityTests/StreamTest.PutCStringWithStringRef (802 of 2073)
PASS: lldb-unit :: Symbol/./SymbolTests/TestTypeSystemClang.TestGetEnumIntegerTypeInvalid (803 of 2073)
PASS: lldb-api :: lang/objc/real-definition/TestRealDefinition.py (804 of 2073)
UNSUPPORTED: lldb-api :: commands/watchpoints/watchpoint_commands/TestWatchpointCommands.py (805 of 2073)
UNSUPPORTED: lldb-api :: commands/watchpoints/variable_out_of_scope/TestWatchedVarHitWhenInScope.py (806 of 2073)
PASS: lldb-api :: functionalities/unwind/noreturn/TestNoreturnUnwind.py (807 of 2073)
PASS: lldb-api :: functionalities/pre_run_dylibs/TestPreRunDylibs.py (808 of 2073)
PASS: lldb-unit :: Utility/./UtilityTests/ArchSpecTest.MergeFrom (809 of 2073)
PASS: lldb-shell :: ObjectFile/ELF/netbsd-exec-8.99.30-amd64.yaml (810 of 2073)
PASS: lldb-unit :: Utility/./UtilityTests/BinaryStreamTest.PutULEB128EightBytes (811 of 2073)
PASS: lldb-shell :: ObjectFile/PECOFF/basic-info-arm64.yaml (812 of 2073)
PASS: lldb-api :: functionalities/data-formatter/data-formatter-stl/libcxx/set/TestDataFormatterLibcxxSet.py (813 of 2073)
UNSUPPORTED: lldb-shell :: Register/x86-ymm-read.test (814 of 2073)
PASS: lldb-unit :: Utility/./UtilityTests/ScalarTest.Equality (815 of 2073)
UNSUPPORTED: lldb-api :: commands/watchpoints/multiple_hits/TestMultipleHits.py (816 of 2073)
PASS: lldb-api :: functionalities/inferior-crashing/recursive-inferior/TestRecursiveInferior.py (817 of 2073)
PASS: lldb-unit :: Symbol/./SymbolTests/DWARFCallFrameInfoTest.Basic_dwarf4 (818 of 2073)
PASS: lldb-api :: functionalities/data-formatter/data-formatter-globals/TestDataFormatterGlobals.py (819 of 2073)
PASS: lldb-shell :: Driver/TestFile.test (820 of 2073)
PASS: lldb-api :: commands/expression/top-level/TestTopLevelExprs.py (821 of 2073)
PASS: lldb-api :: tools/lldb-server/TestGdbRemoteAttach.py (822 of 2073)
PASS: lldb-unit :: Process/minidump/./LLDBMinidumpTests/MinidumpParserTest.GetExceptionStream (823 of 2073)
PASS: lldb-api :: lang/objc/modules-compile-error/TestModulesCompileError.py (824 of 2073)
PASS: lldb-api :: functionalities/data-formatter/setvaluefromcstring/TestSetValueFromCString.py (825 of 2073)
PASS: lldb-api :: functionalities/gdb_remote_client/TestGDBRemoteLoad.py (826 of 2073)
PASS: lldb-api :: lang/objc/foundation/TestConstStrings.py (827 of 2073)
PASS: lldb-shell :: Settings/TestStopCommandSourceOnError.test (828 of 2073)
PASS: lldb-api :: iohandler/completion/TestIOHandlerCompletion.py (829 of 2073)
PASS: lldb-api :: python_api/file_handle/TestFileHandle.py (830 of 2073)
PASS: lldb-api :: functionalities/data-formatter/nsdictionarysynth/TestNSDictionarySynthetic.py (831 of 2073)
PASS: lldb-api :: macosx/queues/TestQueues.py (832 of 2073)
PASS: lldb-unit :: Utility/./UtilityTests/RangeTest.LessThanInvalid (833 of 2073)
PASS: lldb-api :: types/TestIntegerType.py (834 of 2073)
PASS: lldb-unit :: ScriptInterpreter/Python/./ScriptInterpreterPythonTests/PythonDataObjectsTest.TestPythonDictionaryToStructuredDictionary (835 of 2073)
PASS: lldb-unit :: Symbol/./SymbolTests/TestTypeSystemClang.TestGetTypeClassTypeOf (836 of 2073)
PASS: lldb-unit :: Utility/./UtilityTests/ArgsTest.TestSingleArgWithQuotedSpace (837 of 2073)
PASS: lldb-api :: lang/cpp/class_static/TestStaticVariables.py (838 of 2073)
PASS: lldb-api :: iohandler/unicode/TestUnicode.py (839 of 2073)
PASS: lldb-api :: functionalities/data-formatter/data-formatter-stl/libcxx/initializerlist/TestInitializerList.py (840 of 2073)
PASS: lldb-unit :: Utility/./UtilityTests/RecordReplayTest.InstrumentedBarRef (841 of 2073)
PASS: lldb-unit :: Target/./TargetTests/ExecutionContextTest.GetByteOrderTarget (842 of 2073)
PASS: lldb-unit :: Utility/./UtilityTests/ArchSpecTest.OperatorBool (843 of 2073)
PASS: lldb-unit :: Utility/./UtilityTests/BinaryStreamTest.PutULEB128SixBytes (844 of 2073)
PASS: lldb-api :: lang/cpp/class_types/TestClassTypesDisassembly.py (845 of 2073)
UNSUPPORTED: lldb-shell :: Register/aarch64-gp-read.test (846 of 2073)
PASS: lldb-unit :: Host/./HostTests/ProcessLaunchInfoTest.Constructor (847 of 2073)
UNSUPPORTED: lldb-shell :: SymbolFile/PDB/expressions.test (848 of 2073)
PASS: lldb-api :: functionalities/breakpoint/breakpoint_options/TestBreakpointOptions.py (849 of 2073)
PASS: lldb-api :: python_api/type/TestTypeList.py (850 of 2073)
UNSUPPORTED: lldb-api :: functionalities/data-formatter/data-formatter-stl/libstdcpp/map/TestDataFormatterStdMap.py (851 of 2073)
PASS: lldb-api :: functionalities/data-formatter/array_typedef/TestArrayTypedef.py (852 of 2073)
PASS: lldb-api :: lang/c/anonymous/TestAnonymous.py (853 of 2073)
PASS: lldb-unit :: Expression/./ExpressionTests/ClangHostTest.ComputeClangResourceDirectory (854 of 2073)
PASS: lldb-api :: functionalities/data-formatter/nsarraysynth/TestNSArraySynthetic.py (855 of 2073)
PASS: lldb-api :: functionalities/data-formatter/type_summary_list_script/TestTypeSummaryListScript.py (856 of 2073)
PASS: lldb-unit :: Symbol/./SymbolTests/TestTypeSystemClang.TestFunctionTemplateConstruction (857 of 2073)
UNSUPPORTED: lldb-api :: functionalities/thread/multi_break/TestMultipleBreakpoints.py (858 of 2073)
UNSUPPORTED: lldb-api :: functionalities/thread/concurrent_events/TestConcurrentTwoWatchpointsOneDelayBreakpoint.py (859 of 2073)
PASS: lldb-api :: lang/objc/objc-ivar-offsets/TestObjCIvarOffsets.py (860 of 2073)
UNSUPPORTED: lldb-api :: functionalities/thread/concurrent_events/TestConcurrentCrashWithWatchpoint.py (861 of 2073)
UNSUPPORTED: lldb-shell :: SymbolFile/DWARF/find-function-regex.cpp (862 of 2073)
PASS: lldb-unit :: API/./APITests/SBCommandInterpreterTest.SingleWordCommand (863 of 2073)
UNSUPPORTED: lldb-api :: commands/register/register/intel_xtended_registers/mpx_offset_intersection/TestMPXOffsetIntersection.py (864 of 2073)
PASS: lldb-shell :: SymbolFile/DWARF/debug_loc-aslr.s (865 of 2073)
UNSUPPORTED: lldb-shell :: SymbolFile/DWARF/find-inline-method.s (866 of 2073)
PASS: lldb-unit :: Utility/./UtilityTests/ArchSpecTest.YAML (867 of 2073)
UNSUPPORTED: lldb-shell :: SymbolFile/DWARF/find-type-in-function.cpp (868 of 2073)
PASS: lldb-unit :: Symbol/./SymbolTests/TestTypeSystemClang.TestOwningModule (869 of 2073)
PASS: lldb-api :: functionalities/gdb_remote_client/TestWasm.py (870 of 2073)
UNSUPPORTED: lldb-api :: functionalities/data-formatter/data-formatter-stl/libstdcpp/string/TestDataFormatterStdString.py (871 of 2073)
PASS: lldb-unit :: Symbol/./SymbolTests/TestClangASTImporter.DeportTypeTagDecl (872 of 2073)
PASS: lldb-api :: tools/lldb-vscode/breakpoint/TestVSCode_setBreakpoints.py (873 of 2073)
PASS: lldb-shell :: Minidump/dump-all.test (874 of 2073)
PASS: lldb-api :: lang/cpp/constructors/TestCppConstructors.py (875 of 2073)
UNSUPPORTED: lldb-shell :: ExecControl/StopHook/stop-hook-threads.test (876 of 2073)
PASS: lldb-api :: types/TestCharType.py (877 of 2073)
PASS: lldb-unit :: Target/./TargetTests/MemoryRegionInfoTest.Formatv (878 of 2073)
UNSUPPORTED: lldb-api :: commands/expression/completion-crash-invalid-iterator/TestInvalidIteratorCompletionCrash.py (879 of 2073)
PASS: lldb-unit :: Utility/./UtilityTests/StringListTest.InsertStringAtIndexOutOfBounds (880 of 2073)
PASS: lldb-api :: functionalities/data-formatter/data-formatter-stl/libcxx/string/TestDataFormatterLibcxxString.py (881 of 2073)
UNSUPPORTED: lldb-shell :: SymbolFile/NativePDB/ast-types.cpp (882 of 2073)
PASS: lldb-unit :: Utility/./UtilityTests/OptionsWithRawTest.EmptySuffix (883 of 2073)
PASS: lldb-api :: python_api/symbol-context/two-files/TestSymbolContextTwoFiles.py (884 of 2073)
PASS: lldb-api :: lang/cpp/unsigned_types/TestUnsignedTypes.py (885 of 2073)
PASS: lldb-unit :: Utility/./UtilityTests/RangeTest.Copy (886 of 2073)
PASS: lldb-shell :: ObjectFile/MachO/lc_version_min.yaml (887 of 2073)
PASS: lldb-unit :: Utility/./UtilityTests/RangeTest.ContainsRangeStartingFromZero (888 of 2073)
PASS: lldb-unit :: Utility/./UtilityTests/NameMatchesTest.Contains (889 of 2073)
PASS: lldb-unit :: Utility/./UtilityTests/StreamTest.PutMaxHex64ByteOrderLittle (890 of 2073)
PASS: lldb-shell :: Breakpoint/implicit_const_form_support.test (891 of 2073)
PASS: lldb-unit :: Utility/./UtilityTests/StringExtractorTest.GetHexBytesAvail (892 of 2073)
PASS: lldb-shell :: Reproducer/Functionalities/TestStepping.test (893 of 2073)
PASS: lldb-api :: lang/cpp/accelerator-table/TestCPPAccelerator.py (894 of 2073)
UNSUPPORTED: lldb-api :: commands/watchpoints/watchpoint_on_vectors/TestValueOfVectorVariable.py (895 of 2073)
PASS: lldb-unit :: Utility/./UtilityTests/RecordReplayTest.InstrumentedBar (896 of 2073)
PASS: lldb-api :: commands/command/nested_alias/TestNestedAlias.py (897 of 2073)
PASS: lldb-unit :: Utility/./UtilityTests/StreamTest.ChangingByteOrder (898 of 2073)
PASS: lldb-api :: sanity/TestModuleCacheSanity.py (899 of 2073)
PASS: lldb-shell :: SymbolFile/Breakpad/symtab.test (900 of 2073)
PASS: lldb-api :: functionalities/thread/exit_during_break/TestExitDuringBreak.py (901 of 2073)
PASS: lldb-unit :: Utility/./UtilityTests/StreamTeeTest.Flush (902 of 2073)
PASS: lldb-unit :: UnwindAssembly/x86/./UnwindAssemblyx86Tests/Testx86AssemblyInspectionEngine.TestCALLNextInsn (903 of 2073)
UNSUPPORTED: lldb-api :: functionalities/thread/concurrent_events/TestConcurrentTwoWatchpointThreads.py (904 of 2073)
PASS: lldb-unit :: ScriptInterpreter/Python/./ScriptInterpreterPythonTests/PythonDataObjectsTest.TestPythonByteArray (905 of 2073)
PASS: lldb-api :: commands/frame/diagnose/virtual-method-call/TestDiagnoseDereferenceVirtualMethodCall.py (906 of 2073)
PASS: lldb-unit :: SymbolFile/NativePDB/./SymbolFileNativePDBTests/PDBFPOProgramToDWARFExpressionTests.InvalidOpUnary (907 of 2073)
PASS: lldb-unit :: Utility/./UtilityTests/StreamTest.PutHex8 (908 of 2073)
PASS: lldb-shell :: ObjectFile/wasm/unified-debug-sections.yaml (909 of 2073)
PASS: lldb-api :: lang/cpp/char1632_t/TestChar1632T.py (910 of 2073)
UNSUPPORTED: lldb-api :: functionalities/thread/thread_specific_break_plus_condition/TestThreadSpecificBpPlusCondition.py (911 of 2073)
PASS: lldb-unit :: Expression/./ExpressionTests/CppModuleConfigurationTest.Sysroot (912 of 2073)
PASS: lldb-api :: functionalities/inferior-crashing/TestInferiorCrashing.py (913 of 2073)
PASS: lldb-api :: commands/expression/dollar-in-variable/TestDollarInVariable.py (914 of 2073)
PASS: lldb-unit :: Utility/./UtilityTests/LogChannelTest.EnableOptions (915 of 2073)
PASS: lldb-api :: macosx/indirect_symbol/TestIndirectSymbols.py (916 of 2073)
PASS: lldb-api :: commands/expression/ignore-artificial-constructors/TestIgnoreArtificialConstructors.py (917 of 2073)
UNSUPPORTED: lldb-shell :: ScriptInterpreter/Lua/independent_state.test (918 of 2073)
PASS: lldb-api :: functionalities/thread/concurrent_events/TestConcurrentCrashWithSignal.py (919 of 2073)
PASS: lldb-api :: tools/lldb-server/register-reading/TestGdbRemoteGPacket.py (920 of 2073)
PASS: lldb-api :: lang/cpp/template-function/TestTemplateFunctions.py (921 of 2073)
UNSUPPORTED: lldb-api :: tools/lldb-server/signal-filtering/TestGdbRemote_QPassSignals.py (922 of 2073)
PASS: lldb-api :: functionalities/history/TestHistoryRecall.py (923 of 2073)
PASS: lldb-api :: functionalities/breakpoint/breakpoint_by_line_and_column/TestBreakpointByLineAndColumn.py (924 of 2073)
PASS: lldb-shell :: Reproducer/TestSynchronous.test (925 of 2073)
PASS: lldb-unit :: Host/./HostTests/File.GetWaitableHandleFileno (926 of 2073)
PASS: lldb-unit :: Thread/./ThreadTests/ThreadTest.GetPrivateStopInfo (927 of 2073)
PASS: lldb-unit :: Utility/./UtilityTests/StringLexerTest.AdvanceIf (928 of 2073)
PASS: lldb-unit :: Utility/./UtilityTests/SubsystemRAIITest.SubsystemWithErrorSuccess (929 of 2073)
PASS: lldb-api :: lang/cpp/rvalue-references/TestRvalueReferences.py (930 of 2073)
PASS: lldb-unit :: Utility/./UtilityTests/BinaryStreamTest.PutSLEB128Zero (931 of 2073)
PASS: lldb-api :: tools/lldb-vscode/attach/TestVSCode_attach.py (932 of 2073)
PASS: lldb-api :: commands/frame/diagnose/complicated-expression/TestComplicatedExpression.py (933 of 2073)
PASS: lldb-shell :: SymbolFile/DWARF/split-dwarf-multiple-cu.ll (934 of 2073)
PASS: lldb-api :: lang/cpp/operator-overload/TestOperatorOverload.py (935 of 2073)
UNSUPPORTED: lldb-shell :: SymbolFile/NativePDB/global-classes.cpp (936 of 2073)
UNSUPPORTED: lldb-api :: benchmarks/continue/TestBenchmarkContinue.py (937 of 2073)
PASS: lldb-api :: commands/add-dsym/uuid/TestAddDsymCommand.py (938 of 2073)
UNSUPPORTED: lldb-shell :: SymbolFile/DWARF/dwp-separate-debug-file.cpp (939 of 2073)
PASS: lldb-api :: tools/lldb-server/TestGdbRemote_vCont.py (940 of 2073)
PASS: lldb-unit :: Symbol/./SymbolTests/Type.CompilerContextPattern (941 of 2073)
PASS: lldb-api :: api/multithreaded/TestMultithreaded.py (942 of 2073)
PASS: lldb-api :: commands/expression/no-deadlock/TestExprDoesntBlock.py (943 of 2073)
PASS: lldb-unit :: Utility/./UtilityTests/RecordReplayTest.InstrumentedFoo (944 of 2073)
PASS: lldb-shell :: Reproducer/TestDriverOptions.test (945 of 2073)
PASS: lldb-api :: commands/expression/class_template_specialization_empty_pack/TestClassTemplateSpecializationParametersHandling.py (946 of 2073)
PASS: lldb-api :: functionalities/tail_call_frames/disambiguate_call_site/TestDisambiguateCallSite.py (947 of 2073)
PASS: lldb-unit :: Host/./HostTests/FileSystemTest.GetPermissions (948 of 2073)
UNSUPPORTED: lldb-api :: macosx/simulator/TestSimulatorPlatform.py (949 of 2073)
PASS: lldb-shell :: Breakpoint/split-dwarf-5-addrbase.test (950 of 2073)
PASS: lldb-unit :: Utility/./UtilityTests/StringListTest.SplitIntoLines (951 of 2073)
PASS: lldb-api :: lang/cpp/modules-import/TestCXXModulesImport.py (952 of 2073)
PASS: lldb-api :: functionalities/unwind/sigtramp/TestSigtrampUnwind.py (953 of 2073)
PASS: lldb-unit :: Utility/./UtilityTests/StringExtractorTest.DecodeHexU8_Extra (954 of 2073)
PASS: lldb-api :: lang/c/blocks/TestBlocks.py (955 of 2073)
UNSUPPORTED: lldb-shell :: SymbolFile/NativePDB/globals-bss.cpp (956 of 2073)
PASS: lldb-unit :: Utility/./UtilityTests/StreamTest.Indent (957 of 2073)
PASS: lldb-api :: functionalities/thread/create_after_attach/TestCreateAfterAttach.py (958 of 2073)
PASS: lldb-api :: functionalities/data-formatter/data-formatter-stl/libcxx/function/TestLibCxxFunction.py (959 of 2073)
PASS: lldb-unit :: ObjectFile/PECOFF/./ObjectFilePECOFFTests/PECallFrameInfoTest.Basic_eh (960 of 2073)
PASS: lldb-api :: functionalities/backticks/TestBackticksWithoutATarget.py (961 of 2073)
PASS: lldb-unit :: ScriptInterpreter/Python/./ScriptInterpreterPythonTests/PythonDataObjectsTest.TestPythonDictionaryManipulation (962 of 2073)
UNSUPPORTED: lldb-api :: benchmarks/libcxxlist/TestBenchmarkLibcxxList.py (963 of 2073)
PASS: lldb-unit :: UnwindAssembly/x86/./UnwindAssemblyx86Tests/Testx86AssemblyInspectionEngine.TestSimplei386ugmented (964 of 2073)
PASS: lldb-api :: functionalities/data-formatter/frameformat_smallstruct/TestFrameFormatSmallStruct.py (965 of 2073)
PASS: lldb-unit :: Language/CPlusPlus/./LanguageCPlusPlusTests/CPlusPlusLanguage.CPlusPlusNameParser (966 of 2073)
PASS: lldb-unit :: Utility/./UtilityTests/AnsiTerminal.KnownPrefix (967 of 2073)
PASS: lldb-shell :: VSCode/TestOptions.test (968 of 2073)
PASS: lldb-unit :: Symbol/./SymbolTests/LineEntryTest.GetSameLineContiguousAddressRangeNoInlines (969 of 2073)
PASS: lldb-shell :: SymbolFile/DWARF/find-qualified-variable.cpp (970 of 2073)
PASS: lldb-api :: functionalities/data-formatter/data-formatter-objc/TestDataFormatterObjCNSBundle.py (971 of 2073)
PASS: lldb-api :: functionalities/signal/raise/TestRaise.py (972 of 2073)
PASS: lldb-unit :: Utility/./UtilityTests/RangeTest.SizeTypes (973 of 2073)
PASS: lldb-unit :: Expression/./ExpressionTests/CppModuleConfigurationTest.LinuxLocalLibCpp (974 of 2073)
PASS: lldb-unit :: Utility/./UtilityTests/RegisterValueTest.GetSet8 (975 of 2073)
PASS: lldb-unit :: Utility/./UtilityTests/DataExtractorTest.GetDoubleUnaligned (976 of 2073)
PASS: lldb-api :: lang/objc/forward-decl/TestForwardDecl.py (977 of 2073)
PASS: lldb-unit :: Utility/./UtilityTests/SerializationRountripTest.SerializeDeserializePodPointers (978 of 2073)
PASS: lldb-unit :: Utility/./UtilityTests/ArgsTest.ReplaceArgumentAtIndexFarOutOfRange (979 of 2073)
PASS: lldb-api :: tools/lldb-vscode/breakpoint/TestVSCode_setExceptionBreakpoints.py (980 of 2073)
PASS: lldb-unit :: Utility/./UtilityTests/RangeTest.Slide (981 of 2073)
PASS: lldb-shell :: ScriptInterpreter/None/none.test (982 of 2073)
PASS: lldb-unit :: Language/Highlighting/./HighlighterTests/HighlighterTest.FallbackHighlighter (983 of 2073)
PASS: lldb-unit :: Symbol/./SymbolTests/PostfixExpression.ParseFPOProgram (984 of 2073)
PASS: lldb-unit :: Utility/./UtilityTests/Predicate.WaitForValueNotEqualTo (985 of 2073)
PASS: lldb-shell :: SymbolFile/DWARF/dwp-debug-types.s (986 of 2073)
UNSUPPORTED: lldb-shell :: SymbolFile/DWARF/dwarf5-index-is-used.cpp (987 of 2073)
PASS: lldb-unit :: UnwindAssembly/x86/./UnwindAssemblyx86Tests/Testx86AssemblyInspectionEngine.TestPushImm (988 of 2073)
PASS: lldb-unit :: Utility/./UtilityTests/StringExtractorTest.GetU32BigEndian (989 of 2073)
PASS: lldb-unit :: Symbol/./SymbolTests/TestClangASTImporter.MetadataPropagation (990 of 2073)
PASS: lldb-unit :: Utility/./UtilityTests/StringListTest.InsertStringAtIndexEnd (991 of 2073)
PASS: lldb-unit :: Expression/./ExpressionTests/DiagnosticManagerTest.GetStringMultiline (992 of 2073)
PASS: lldb-api :: lang/c/stepping/TestStepAndBreakpoints.py (993 of 2073)
PASS: lldb-unit :: Symbol/./SymbolTests/DWARFCallFrameInfoTest.Basic_eh (994 of 2073)
PASS: lldb-shell :: Driver/TestCore.test (995 of 2073)
PASS: lldb-api :: api/check_public_api_headers/TestPublicAPIHeaders.py (996 of 2073)
PASS: lldb-api :: types/TestDoubleTypes.py (997 of 2073)
PASS: lldb-api :: commands/expression/import-std-module/weak_ptr/TestWeakPtrFromStdModule.py (998 of 2073)
PASS: lldb-api :: lang/cpp/const_this/TestConstThis.py (999 of 2073)
PASS: lldb-shell :: Breakpoint/case-sensitive.test (1000 of 2073)
PASS: lldb-api :: functionalities/source-map/TestTargetSourceMap.py (1001 of 2073)
UNSUPPORTED: lldb-api :: tools/lldb-server/thread-name/TestGdbRemoteThreadName.py (1002 of 2073)
PASS: lldb-api :: commands/frame/recognizer/TestFrameRecognizer.py (1003 of 2073)
PASS: lldb-unit :: Utility/./UtilityTests/ConstStringTest.CompareConstString (1004 of 2073)
PASS: lldb-unit :: Utility/./UtilityTests/RangeTest.DoesIntersect (1005 of 2073)
PASS: lldb-unit :: Utility/./UtilityTests/ArgsTest.EscapeLLDBCommandArgument (1006 of 2073)
PASS: lldb-unit :: Target/./TargetTests/ModuleCacheTest.GetAndPut (1007 of 2073)
PASS: lldb-unit :: ScriptInterpreter/Python/./ScriptInterpreterPythonTests/PythonDataObjectsTest.TestInstanceNameResolutionNoDot (1008 of 2073)
PASS: lldb-api :: lang/cpp/dynamic-value/TestCppValueCast.py (1009 of 2073)
PASS: lldb-unit :: Utility/./UtilityTests/RangeTest.SlideZero (1010 of 2073)
PASS: lldb-api :: lang/cpp/char8_t/TestCxxChar8_t.py (1011 of 2073)
PASS: lldb-api :: lang/objc/objc-static-method-stripped/TestObjCStaticMethodStripped.py (1012 of 2073)
UNSUPPORTED: lldb-api :: functionalities/ubsan/basic/TestUbsanBasic.py (1013 of 2073)
PASS: lldb-unit :: UnwindAssembly/x86/./UnwindAssemblyx86Tests/Testx86AssemblyInspectionEngine.TestPopR13 (1014 of 2073)
UNSUPPORTED: lldb-api :: tools/lldb-vscode/completions/TestVSCode_completions.py (1015 of 2073)
UNSUPPORTED: lldb-shell :: SymbolFile/PDB/vbases.test (1016 of 2073)
XFAIL: lldb-shell :: Register/x86-mm-xmm-read.test (1017 of 2073)
PASS: lldb-unit :: Process/minidump/./LLDBMinidumpTests/RegisterContextMinidump.ConvertMinidumpContext_x86_32 (1018 of 2073)
PASS: lldb-api :: functionalities/breakpoint/scripted_bkpt/TestScriptedResolver.py (1019 of 2073)
UNSUPPORTED: lldb-shell :: SymbolFile/NativePDB/ast-methods.cpp (1020 of 2073)
PASS: lldb-api :: functionalities/data-formatter/builtin-formats/TestBuiltinFormats.py (1021 of 2073)
UNSUPPORTED: lldb-shell :: SymbolFile/NativePDB/ast-functions.cpp (1022 of 2073)
PASS: lldb-unit :: Host/./HostTests/File.GetStreamFromDescriptor (1023 of 2073)
PASS: lldb-shell :: ObjectFile/ELF/section-types-edgecases.yaml (1024 of 2073)
PASS: lldb-api :: functionalities/data-formatter/data-formatter-stl/libcxx/unordered/TestDataFormatterUnordered.py (1025 of 2073)
UNSUPPORTED: lldb-shell :: SymbolFile/DWARF/inline-function-address.ll (1026 of 2073)
PASS: lldb-unit :: Utility/./UtilityTests/LogChannelEnabledTest.LogThread (1027 of 2073)
UNSUPPORTED: lldb-api :: functionalities/darwin_log/basic/TestDarwinLogBasic.py (1028 of 2073)
UNSUPPORTED: lldb-shell :: SymbolFile/DWARF/find-basic-variable.cpp (1029 of 2073)
PASS: lldb-unit :: Utility/./UtilityTests/NameMatchesTest.Equals (1030 of 2073)
PASS: lldb-unit :: Process/minidump/./LLDBMinidumpTests/MinidumpParserTest.GetPidWow64 (1031 of 2073)
PASS: lldb-unit :: Symbol/./SymbolTests/LineEntryTest.GetSameLineContiguousAddressRangeOneInline (1032 of 2073)
PASS: lldb-shell :: Driver/TestNoUseColor.test (1033 of 2073)
UNSUPPORTED: lldb-shell :: SymbolFile/NativePDB/globals-fundamental.cpp (1034 of 2073)
PASS: lldb-unit :: Process/minidump/./LLDBMinidumpTests/MinidumpParserTest.GetMiscInfoWindows (1035 of 2073)
PASS: lldb-unit :: Utility/./UtilityTests/StreamTest.PutHex64ByteOrderLittle (1036 of 2073)
PASS: lldb-unit :: Core/./LLDBCoreTests/RichManglingContextTest.SwitchProvider (1037 of 2073)
PASS: lldb-shell :: Driver/TestSingleQuote.test (1038 of 2073)
PASS: lldb-api :: functionalities/deleted-executable/TestDeletedExecutable.py (1039 of 2073)
PASS: lldb-unit :: Utility/./UtilityTests/XcodeSDKTest.GetCanonicalNameAndConstruct (1040 of 2073)
PASS: lldb-unit :: Utility/./UtilityTests/OptionsWithRawTest.SingleWhitespaceInput (1041 of 2073)
PASS: lldb-unit :: Utility/./UtilityTests/DataExtractorTest.GetMaxU64 (1042 of 2073)
PASS: lldb-api :: functionalities/breakpoint/address_breakpoints/TestAddressBreakpoints.py (1043 of 2073)
PASS: lldb-unit :: Utility/./UtilityTests/ScalarTest.GetBytes (1044 of 2073)
PASS: lldb-unit :: Utility/./UtilityTests/SerializationRountripTest.SerializeDeserializeCStringArrayNullptr (1045 of 2073)
PASS: lldb-api :: commands/command/history/TestCommandHistory.py (1046 of 2073)
PASS: lldb-unit :: Symbol/./SymbolTests/TestTypeSystemClang.TestGetTypeClassNested (1047 of 2073)
PASS: lldb-unit :: Utility/./UtilityTests/BinaryStreamTest.PutULEB128OneByte (1048 of 2073)
PASS: lldb-api :: tools/lldb-server/TestGdbRemoteThreadsInStopReply.py (1049 of 2073)
UNSUPPORTED: lldb-api :: functionalities/thread/concurrent_events/TestConcurrentManySignals.py (1050 of 2073)
PASS: lldb-unit :: Utility/./UtilityTests/BinaryStreamTest.PutULEB128ThreeBytes (1051 of 2073)
PASS: lldb-api :: functionalities/thread/concurrent_events/TestConcurrentManyBreakpoints.py (1052 of 2073)
UNSUPPORTED: lldb-api :: commands/target/auto-install-main-executable/TestAutoInstallMainExecutable.py (1053 of 2073)
PASS: lldb-api :: commands/expression/test/TestExprs.py (1054 of 2073)
PASS: lldb-shell :: SymbolFile/DWARF/DW_TAG_variable-DW_AT_const_value.s (1055 of 2073)
PASS: lldb-unit :: Expression/./ExpressionTests/DiagnosticManagerTest.AppendMessageNoDiag (1056 of 2073)
PASS: lldb-unit :: Host/./HostTests/FileSystemTest.Readable (1057 of 2073)
PASS: lldb-api :: functionalities/breakpoint/breakpoint_hit_count/TestBreakpointHitCount.py (1058 of 2073)
PASS: lldb-api :: commands/expression/persistent_types/TestPersistentTypes.py (1059 of 2073)
PASS: lldb-unit :: ScriptInterpreter/Python/./ScriptInterpreterPythonTests/PythonDataObjectsTest.TestPythonFile (1060 of 2073)
UNSUPPORTED: lldb-shell :: SymbolFile/PDB/type-quals.test (1061 of 2073)
UNSUPPORTED: lldb-api :: functionalities/tsan/multiple/TestTsanMultiple.py (1062 of 2073)
UNSUPPORTED: lldb-api :: functionalities/darwin_log/format/TestDarwinLogMessageFormat.py (1063 of 2073)
UNSUPPORTED: lldb-api :: arm/breakpoint-thumb-codesection/TestBreakpointThumbCodesection.py (1064 of 2073)
PASS: lldb-unit :: Process/minidump/./LLDBMinidumpTests/MinidumpParserTest.GetThreadContext_x86_32 (1065 of 2073)
PASS: lldb-api :: driver/batch_mode/TestBatchMode.py (1066 of 2073)
PASS: lldb-unit :: Utility/./UtilityTests/StreamTest.PutHex16ByteOrderBig (1067 of 2073)
PASS: lldb-shell :: SymbolFile/Breakpad/symtab-macho.test (1068 of 2073)
PASS: lldb-unit :: Utility/./UtilityTests/StringExtractorTest.GetHexBytesAvail_OddPair2 (1069 of 2073)
PASS: lldb-api :: functionalities/data-formatter/language_category_updates/TestDataFormatterLanguageCategoryUpdates.py (1070 of 2073)
PASS: lldb-unit :: Utility/./UtilityTests/StringExtractorTest.GetHexBytes (1071 of 2073)
PASS: lldb-api :: functionalities/data-formatter/typedef_array/TestTypedefArray.py (1072 of 2073)
PASS: lldb-api :: python_api/process/read-mem-cstring/TestReadMemCString.py (1073 of 2073)
PASS: lldb-api :: lang/objc/objc++/TestObjCXX.py (1074 of 2073)
PASS: lldb-unit :: Utility/./UtilityTests/RangeTest.ContainsEndInclusiveInvalid (1075 of 2073)
PASS: lldb-unit :: UnwindAssembly/x86/./UnwindAssemblyx86Tests/Testx86AssemblyInspectionEngine.Testi386IgnoredRegisters (1076 of 2073)
PASS: lldb-api :: functionalities/inferior-crashing/TestInferiorCrashingStep.py (1077 of 2073)
PASS: lldb-unit :: UnwindAssembly/x86/./UnwindAssemblyx86Tests/Testx86AssemblyInspectionEngine.TestPopR14 (1078 of 2073)
PASS: lldb-shell :: Commands/command-disassemble-process.yaml (1079 of 2073)
PASS: lldb-api :: lang/c/step-target/TestStepTarget.py (1080 of 2073)
PASS: lldb-unit :: ScriptInterpreter/Python/./ScriptInterpreterPythonTests/PythonDataObjectsTest.TestPythonStringToStructuredString (1081 of 2073)
PASS: lldb-unit :: Process/minidump/./LLDBMinidumpTests/RegisterContextMinidump.ConvertMinidumpContext_x86_64 (1082 of 2073)
PASS: lldb-api :: commands/expression/entry-bp/TestExprEntryBP.py (1083 of 2073)
PASS: lldb-api :: types/TestCharTypeExpr.py (1084 of 2073)
PASS: lldb-api :: lang/cpp/this_class_type_mixing/TestThisClassTypeMixing.py (1085 of 2073)
PASS: lldb-shell :: ObjectFile/PECOFF/section-types.yaml (1086 of 2073)
PASS: lldb-unit :: Utility/./UtilityTests/StringExtractorTest.GetHexBytesAvail_Partial (1087 of 2073)
PASS: lldb-shell :: Commands/CommandScriptImmediateOutput/CommandScriptImmediateOutputFile.test (1088 of 2073)
PASS: lldb-api :: functionalities/breakpoint/inlined_breakpoints/TestInlinedBreakpoints.py (1089 of 2073)
PASS: lldb-unit :: Target/./TargetTests/ExecutionContextTest.GetByteOrderProcess (1090 of 2073)
PASS: lldb-unit :: Utility/./UtilityTests/FileSpecTest.Equal (1091 of 2073)
PASS: lldb-unit :: Utility/./UtilityTests/StreamTest.PutHex64ByteOrderBig (1092 of 2073)
UNSUPPORTED: lldb-shell :: SymbolFile/NativePDB/function-types-calling-conv.cpp (1093 of 2073)
PASS: lldb-unit :: Symbol/./SymbolTests/TestTypeSystemClang.TemplateArguments (1094 of 2073)
PASS: lldb-unit :: Expression/./ExpressionTests/ClangExpressionDeclMapTest.TestUnknownIdentifierLookup (1095 of 2073)
PASS: lldb-api :: lang/objcxx/cxx-bridged-po/TestObjCXXBridgedPO.py (1096 of 2073)
PASS: lldb-unit :: Process/gdb-remote/./ProcessGdbRemoteTests/GDBRemoteCommunicationClientTest.SendStartTracePacket (1097 of 2073)
PASS: lldb-unit :: UnwindAssembly/x86/./UnwindAssemblyx86Tests/Testx86AssemblyInspectionEngine.TestPushEDI (1098 of 2073)
PASS: lldb-unit :: Utility/./UtilityTests/UUIDTest.SetFromStringRef (1099 of 2073)
PASS: lldb-api :: lang/cpp/unicode-literals/TestUnicodeLiterals.py (1100 of 2073)
PASS: lldb-api :: functionalities/breakpoint/cpp/TestCPPBreakpointLocations.py (1101 of 2073)
PASS: lldb-unit :: UnwindAssembly/x86/./UnwindAssemblyx86Tests/Testx86AssemblyInspectionEngine.TestSimplex86_64Augmented (1102 of 2073)
PASS: lldb-unit :: Utility/./UtilityTests/BinaryStreamTest.PutULEB128TwoBytes (1103 of 2073)
PASS: lldb-api :: functionalities/data-formatter/ptr_ref_typedef/TestPtrRef2Typedef.py (1104 of 2073)
PASS: lldb-api :: functionalities/breakpoint/breakpoint_ids/TestBreakpointIDs.py (1105 of 2073)
PASS: lldb-unit :: Utility/./UtilityTests/ScalarTest.APIntConstructor (1106 of 2073)
PASS: lldb-shell :: Unwind/thread-step-out-ret-addr-check.test (1107 of 2073)
PASS: lldb-unit :: Process/gdb-remote/./ProcessGdbRemoteTests/GDBRemoteCommunicationClientTest.GetMemoryRegionInfoInvalidResponse (1108 of 2073)
PASS: lldb-unit :: UnwindAssembly/x86/./UnwindAssemblyx86Tests/Testx86AssemblyInspectionEngine.Test32bitFramelessBigStackFrame (1109 of 2073)
PASS: lldb-unit :: Utility/./UtilityTests/DeserializerTest.HasData (1110 of 2073)
PASS: lldb-api :: lang/objc/objc-dyn-sbtype/TestObjCDynamicSBType.py (1111 of 2073)
PASS: lldb-shell :: Minidump/fb-dump.test (1112 of 2073)
PASS: lldb-unit :: Utility/./UtilityTests/SerializationRountripTest.SerializeDeserializeCStringArray (1113 of 2073)
PASS: lldb-api :: functionalities/thread/backtrace_all/TestBacktraceAll.py (1114 of 2073)
UNSUPPORTED: lldb-shell :: SymbolFile/PDB/calling-conventions.test (1115 of 2073)
PASS: lldb-api :: functionalities/object-file/TestImageListMultiArchitecture.py (1116 of 2073)
PASS: lldb-api :: functionalities/data-formatter/data-formatter-stl/libcxx/vbool/TestDataFormatterLibcxxVBool.py (1117 of 2073)
PASS: lldb-api :: tools/lldb-server/TestGdbRemoteExitCode.py (1118 of 2073)
PASS: lldb-api :: functionalities/data-formatter/compactvectors/TestCompactVectors.py (1119 of 2073)
PASS: lldb-unit :: Utility/./UtilityTests/OptionsWithRawTest.TerminatedQuote (1120 of 2073)
PASS: lldb-shell :: Reproducer/Functionalities/TestDataFormatter.test (1121 of 2073)
UNSUPPORTED: lldb-api :: macosx/macabi/TestMacABImacOSFramework.py (1122 of 2073)
PASS: lldb-unit :: SymbolFile/NativePDB/./SymbolFileNativePDBTests/PDBFPOProgramToDWARFExpressionTests.UnresolvedDependentCyclicRegisterAssignmentReference (1123 of 2073)
PASS: lldb-api :: python_api/sbvalue_persist/TestSBValuePersist.py (1124 of 2073)
PASS: lldb-shell :: Reproducer/TestGDBRemoteRepro.test (1125 of 2073)
PASS: lldb-unit :: Utility/./UtilityTests/VMRange.Comparison (1126 of 2073)
PASS: lldb-api :: commands/help/TestHelp.py (1127 of 2073)
PASS: lldb-shell :: SymbolFile/DWARF/dwarf5-atomic.s (1128 of 2073)
PASS: lldb-unit :: SymbolFile/DWARF/./SymbolFileDWARFTests/XcodeSDKModuleTests.TestModuleGetXcodeSDK (1129 of 2073)
PASS: lldb-unit :: Symbol/./SymbolTests/TestTypeSystemClang.AddMethodToObjCObjectType (1130 of 2073)
PASS: lldb-api :: macosx/profile_vrs_detach/TestDetachVrsProfile.py (1131 of 2073)
UNSUPPORTED: lldb-api :: functionalities/darwin_log/filter/exact_match/category/TestDarwinLogFilterMatchCategory.py (1132 of 2073)
PASS: lldb-api :: api/command-return-object/TestSBCommandReturnObject.py (1133 of 2073)
PASS: lldb-unit :: Core/./LLDBCoreTests/UniqueCStringMap.NoDefaultConstructor (1134 of 2073)
PASS: lldb-unit :: tools/lldb-server/tests/./LLDBServerTests/StandardStartupTest.TestStopReplyContainsThreadPcs (1135 of 2073)
PASS: lldb-unit :: Utility/./UtilityTests/BinaryStreamTest.PutULEB128FiveBytes (1136 of 2073)
PASS: lldb-shell :: Quit/TestQuitExitCodeNonInt.test (1137 of 2073)
PASS: lldb-api :: commands/expression/multiline-completion/TestMultilineCompletion.py (1138 of 2073)
PASS: lldb-unit :: Utility/./UtilityTests/UUIDTest.RelationalOperators (1139 of 2073)
PASS: lldb-unit :: Utility/./UtilityTests/StreamTeeTest.SetStreamAtIndexOverwrite (1140 of 2073)
PASS: lldb-unit :: Expression/./ExpressionTests/DiagnosticManagerTest.GetStringNoDiags (1141 of 2073)
PASS: lldb-api :: functionalities/data-formatter/data-formatter-stl/libcxx/iterator/TestDataFormatterLibccIterator.py (1142 of 2073)
PASS: lldb-api :: functionalities/thread/step_out/TestThreadStepOut.py (1143 of 2073)
PASS: lldb-unit :: Utility/./UtilityTests/AnsiTerminal.Unknown (1144 of 2073)
PASS: lldb-unit :: Utility/./UtilityTests/AnsiTerminal.Twice (1145 of 2073)
PASS: lldb-api :: commands/expression/import-std-module/vector/TestVectorFromStdModule.py (1146 of 2073)
PASS: lldb-api :: macosx/find-app-in-bundle/TestFindAppInBundle.py (1147 of 2073)
PASS: lldb-unit :: Symbol/./SymbolTests/TestTypeSystemClang.TestUnifyAccessSpecifiers (1148 of 2073)
PASS: lldb-api :: commands/frame/var-scope/TestFrameVariableScope.py (1149 of 2073)
PASS: lldb-shell :: Settings/TestFrameFormatNoColor.test (1150 of 2073)
PASS: lldb-api :: types/TestLongTypesExpr.py (1151 of 2073)
PASS: lldb-shell :: Register/x86-64-gp-read.test (1152 of 2073)
PASS: lldb-unit :: ObjectFile/Breakpad/./ObjectFileBreakpadTests/StackCFIRecord.parse (1153 of 2073)
PASS: lldb-api :: functionalities/unwind/noreturn/module-end/TestNoReturnModuleEnd.py (1154 of 2073)
PASS: lldb-api :: functionalities/postmortem/mach-core/TestMachCore.py (1155 of 2073)
PASS: lldb-unit :: Utility/./UtilityTests/StreamTest.AddressRangeEmptyRange (1156 of 2073)
PASS: lldb-unit :: Utility/./UtilityTests/StringExtractorTest.GetNameColonValueNoColon (1157 of 2073)
PASS: lldb-unit :: Utility/./UtilityTests/Flags.Clear (1158 of 2073)
PASS: lldb-shell :: SymbolFile/DWARF/debug_aranges-empty-section.s (1159 of 2073)
PASS: lldb-api :: commands/breakpoint/command/list/TestBreakpointCommandList.py (1160 of 2073)
PASS: lldb-shell :: Heap/heap-cstr.test (1161 of 2073)
PASS: lldb-unit :: Process/minidump/./LLDBMinidumpTests/MinidumpParserTest.GetThreadContext_x86_32_wow64 (1162 of 2073)
PASS: lldb-shell :: Commands/command-regex-delete.test (1163 of 2073)
PASS: lldb-api :: functionalities/thread/concurrent_events/TestConcurrentSignalBreak.py (1164 of 2073)
PASS: lldb-unit :: Utility/./UtilityTests/StringExtractorTest.GetU64LittleEndian (1165 of 2073)
PASS: lldb-api :: functionalities/inferior-changed/TestInferiorChanged.py (1166 of 2073)
PASS: lldb-unit :: Utility/./UtilityTests/LogTest.Register (1167 of 2073)
UNSUPPORTED: lldb-api :: functionalities/thread/concurrent_events/TestConcurrentWatchBreakDelay.py (1168 of 2073)
PASS: lldb-api :: commands/command/script/import/rdar-12586188/TestRdar12586188.py (1169 of 2073)
PASS: lldb-api :: commands/expression/import-std-module/deque-dbg-info-content/TestDbgInfoContentDequeFromStdModule.py (1170 of 2073)
PASS: lldb-shell :: ObjectFile/MachO/subsections.yaml (1171 of 2073)
UNSUPPORTED: lldb-api :: lang/objc/modules-app-update/TestClangModulesAppUpdate.py (1172 of 2073)
PASS: lldb-api :: functionalities/data-formatter/data-formatter-stl/libcxx/optional/TestDataFormatterLibcxxOptional.py (1173 of 2073)
PASS: lldb-unit :: Utility/./UtilityTests/BinaryStreamTest.PutSLEB128One (1174 of 2073)
UNSUPPORTED: lldb-shell :: Breakpoint/case-insensitive.test (1175 of 2073)
PASS: lldb-api :: commands/command/script/import/TestImport.py (1176 of 2073)
UNSUPPORTED: lldb-api :: commands/watchpoints/watchpoint_size/TestWatchpointSizes.py (1177 of 2073)
PASS: lldb-api :: functionalities/postmortem/elf-core/thread_crash/TestLinuxCoreThreads.py (1178 of 2073)
PASS: lldb-unit :: Host/./HostTests/FileSystemTest.EnumerateDirectory (1179 of 2073)
PASS: lldb-unit :: Utility/./UtilityTests/TildeExpressionResolver.ResolveFullPath (1180 of 2073)
PASS: lldb-unit :: Utility/./UtilityTests/BinaryStreamTest.PutSLEB128FourBytes (1181 of 2073)
PASS: lldb-unit :: Process/minidump/./LLDBMinidumpTests/MinidumpParserTest.FindMemoryRangeWithFullMemoryMinidump (1182 of 2073)
PASS: lldb-api :: functionalities/gdb_remote_client/TestGDBRemoteClient.py (1183 of 2073)
PASS: lldb-api :: functionalities/data-formatter/data-formatter-cpp/TestDataFormatterCpp.py (1184 of 2073)
PASS: lldb-unit :: Language/Highlighting/./HighlighterTests/HighlighterTest.HighlighterSelectionType (1185 of 2073)
UNSUPPORTED: lldb-api :: functionalities/darwin_log/filter/exact_match/subsystem/TestDarwinLogFilterMatchSubsystem.py (1186 of 2073)
PASS: lldb-unit :: Utility/./UtilityTests/StreamTest.ShiftOperatorPtr (1187 of 2073)
PASS: lldb-unit :: Utility/./UtilityTests/StringListTest.GetMaxStringLengthEmpty (1188 of 2073)
PASS: lldb-unit :: ScriptInterpreter/Python/./ScriptInterpreterPythonTests/PythonDataObjectsTest.TestPythonTupleToStructuredList (1189 of 2073)
PASS: lldb-unit :: Expression/./ExpressionTests/CppModuleConfigurationTest.IgnoreLibStdCpp (1190 of 2073)
PASS: lldb-unit :: Symbol/./SymbolTests/TestTypeSystemClang.TestDeletingImplicitCopyCstrDueToMoveCStr (1191 of 2073)
PASS: lldb-api :: functionalities/data-formatter/data-formatter-objc/TestDataFormatterObjCNSData.py (1192 of 2073)
PASS: lldb-unit :: DataFormatter/./LLDBFormatterTests/FormatManagerTests.CompatibleLangs (1193 of 2073)
PASS: lldb-unit :: Utility/./UtilityTests/StringExtractorTest.GetHexBytes_OddPair (1194 of 2073)
PASS: lldb-unit :: Utility/./UtilityTests/Flags.IsClear (1195 of 2073)
PASS: lldb-unit :: tools/lldb-server/tests/./LLDBServerTests/TestBase.DebugserverEnv (1196 of 2073)
PASS: lldb-unit :: Utility/./UtilityTests/OptionsWithRawTest.MultiWordSuffix (1197 of 2073)
PASS: lldb-api :: api/listeners/TestListener.py (1198 of 2073)
PASS: lldb-api :: commands/expression/import-std-module/list-dbg-info-content/TestDbgInfoContentListFromStdModule.py (1199 of 2073)
PASS: lldb-api :: functionalities/data-formatter/data-formatter-stl/libcxx/unique_ptr/TestDataFormatterLibcxxUniquePtr.py (1200 of 2073)
PASS: lldb-unit :: debugserver/./debugserverTests/JSON.Parse (1201 of 2073)
PASS: lldb-api :: lang/objc/ptr_refs/TestPtrRefsObjC.py (1202 of 2073)
PASS: lldb-shell :: ObjectFile/Breakpad/sections.test (1203 of 2073)
PASS: lldb-api :: lang/c/array_types/TestArrayTypes.py (1204 of 2073)
UNSUPPORTED: lldb-shell :: Register/x86-gp-read.test (1205 of 2073)
PASS: lldb-api :: commands/frame/diagnose/dereference-argument/TestDiagnoseDereferenceArgument.py (1206 of 2073)
PASS: lldb-unit :: Interpreter/./InterpreterTests/OptionArgParserTest.toScriptLanguage (1207 of 2073)
UNSUPPORTED: lldb-api :: lang/objc/modules-incomplete/TestIncompleteModules.py (1208 of 2073)
PASS: lldb-unit :: ScriptInterpreter/Python/./ScriptInterpreterPythonTests/PythonDataObjectsTest.TestPythonTupleValues (1209 of 2073)
PASS: lldb-api :: python_api/lldbutil/iter/TestRegistersIterator.py (1210 of 2073)
UNSUPPORTED: lldb-api :: commands/watchpoints/hello_watchpoint/TestMyFirstWatchpoint.py (1211 of 2073)
PASS: lldb-unit :: Process/minidump/./LLDBMinidumpTests/MinidumpParserTest.GetArchitectureWindows (1212 of 2073)
PASS: lldb-shell :: Register/x86-64-ymm-read.test (1213 of 2073)
PASS: lldb-api :: commands/expression/import-std-module/queue/TestQueueFromStdModule.py (1214 of 2073)
PASS: lldb-unit :: Language/Highlighting/./HighlighterTests/HighlighterTest.ClangCursorPos (1215 of 2073)
PASS: lldb-api :: functionalities/data-formatter/data-formatter-stl/libcxx/list/loop/TestDataFormatterLibcxxListLoop.py (1216 of 2073)
PASS: lldb-unit :: Utility/./UtilityTests/SharedCluster.ClusterManager (1217 of 2073)
PASS: lldb-api :: commands/expression/result_numbering/TestResultNumbering.py (1218 of 2073)
PASS: lldb-api :: functionalities/data-formatter/parray/TestPrintArray.py (1219 of 2073)
PASS: lldb-unit :: Symbol/./SymbolTests/TestClangASTImporter.RecordLayout (1220 of 2073)
PASS: lldb-shell :: ObjectFile/Breakpad/breakpad-identification.test (1221 of 2073)
PASS: lldb-shell :: ObjectFile/ELF/minidebuginfo-corrupt-xz.yaml (1222 of 2073)
PASS: lldb-api :: functionalities/data-formatter/data-formatter-stl/libcxx/forward_list/TestDataFormatterLibcxxForwardList.py (1223 of 2073)
UNSUPPORTED: lldb-shell :: Reproducer/TestLuaImport.test (1224 of 2073)
PASS: lldb-api :: functionalities/data-formatter/data-formatter-stl/libstdcpp/unique_ptr/invalid/TestDataFormatterInvalidStdUniquePtr.py (1225 of 2073)
PASS: lldb-api :: commands/expression/inline-namespace/TestInlineNamespace.py (1226 of 2073)
PASS: lldb-unit :: Utility/./UtilityTests/StructuredDataTest.ParseJSONFromFile (1227 of 2073)
PASS: lldb-unit :: Process/gdb-remote/./ProcessGdbRemoteTests/GDBRemoteCommunicationClientTest.WriteRegister (1228 of 2073)
PASS: lldb-api :: commands/expression/ir-interpreter/TestIRInterpreter.py (1229 of 2073)
UNSUPPORTED: lldb-shell :: SymbolFile/NativePDB/break-by-function.cpp (1230 of 2073)
PASS: lldb-unit :: Utility/./UtilityTests/ListenerTest.GetEventWait (1231 of 2073)
PASS: lldb-unit :: Utility/./UtilityTests/ArgsTest.ReplaceArgumentAtIndexLonger (1232 of 2073)
PASS: lldb-shell :: ObjectFile/PECOFF/sections.yaml (1233 of 2073)
PASS: lldb-api :: functionalities/breakpoint/hardware_breakpoints/hardware_breakpoint_on_multiple_threads/TestHWBreakMultiThread.py (1234 of 2073)
PASS: lldb-api :: functionalities/data-formatter/summary-string-onfail/Test-rdar-9974002.py (1235 of 2073)
PASS: lldb-unit :: Utility/./UtilityTests/ConstStringTest.YAML (1236 of 2073)
PASS: lldb-unit :: Host/./HostTests/MainLoopTest.DetectsEOF (1237 of 2073)
PASS: lldb-unit :: Symbol/./SymbolTests/TestClangASTImporter.ImportInvalidType (1238 of 2073)
PASS: lldb-unit :: Utility/./UtilityTests/ScalarTest.RightShiftOperator (1239 of 2073)
PASS: lldb-unit :: Utility/./UtilityTests/Flags.Test (1240 of 2073)
UNSUPPORTED: lldb-shell :: SymbolFile/DWARF/dwarf5-partial-index.cpp (1241 of 2073)
PASS: lldb-api :: python_api/findvalue_duplist/TestSBFrameFindValue.py (1242 of 2073)
PASS: lldb-api :: functionalities/data-formatter/refpointer-recursion/TestDataFormatterRefPtrRecursion.py (1243 of 2073)
UNSUPPORTED: lldb-shell :: SymbolFile/DWARF/find-variable-file.cpp (1244 of 2073)
PASS: lldb-unit :: Utility/./UtilityTests/UriParserTest.SchemeHostSeparator (1245 of 2073)
PASS: lldb-api :: lang/cpp/scope/TestCppScope.py (1246 of 2073)
PASS: lldb-unit :: Utility/./UtilityTests/EnvironmentTest.EnvpConversion (1247 of 2073)
PASS: lldb-api :: tools/lldb-vscode/launch/TestVSCode_launch.py (1248 of 2073)
PASS: lldb-api :: macosx/safe-to-func-call/TestSafeFuncCalls.py (1249 of 2073)
PASS: lldb-api :: commands/target/create-deps/TestTargetCreateDeps.py (1250 of 2073)
PASS: lldb-unit :: Expression/./ExpressionTests/DiagnosticManagerTest.GetStringPreserveOrder (1251 of 2073)
PASS: lldb-api :: lang/cpp/overloaded-functions/TestOverloadedFunctions.py (1252 of 2073)
PASS: lldb-shell :: Reproducer/TestReuseDirectory.test (1253 of 2073)
PASS: lldb-api :: commands/expression/completion-in-lambda-and-unnamed-class/TestCompletionInLambdaAndUnnamedClass.py (1254 of 2073)
PASS: lldb-unit :: Utility/./UtilityTests/StringExtractorTest.GetHexU8_InvalidHex (1255 of 2073)
PASS: lldb-unit :: ScriptInterpreter/Python/./ScriptInterpreterPythonTests/PythonDataObjectsTest.TestModuleNameResolutionNoDot (1256 of 2073)
PASS: lldb-unit :: Utility/./UtilityTests/FileSpecTest.EqualSeparator (1257 of 2073)
PASS: lldb-api :: macosx/duplicate-archive-members/TestDuplicateMembers.py (1258 of 2073)
UNSUPPORTED: lldb-shell :: SymbolFile/DWARF/dwarf5_locations.s (1259 of 2073)
PASS: lldb-api :: commands/expression/options/TestExprOptions.py (1260 of 2073)
PASS: lldb-unit :: Utility/./UtilityTests/TimeoutTest.Construction (1261 of 2073)
PASS: lldb-api :: lang/cpp/multiple-inheritance/TestCppMultipleInheritance.py (1262 of 2073)
PASS: lldb-unit :: Utility/./UtilityTests/ScalarTest.GetValue (1263 of 2073)
PASS: lldb-api :: lang/objc/unicode-string/TestUnicodeString.py (1264 of 2073)
PASS: lldb-shell :: Minidump/Windows/find-module.test (1265 of 2073)
PASS: lldb-unit :: UnwindAssembly/x86/./UnwindAssemblyx86Tests/Testx86AssemblyInspectionEngine.TestSpillRegToStackViaMOVx86_64 (1266 of 2073)
PASS: lldb-api :: functionalities/data-formatter/data-formatter-synthtype/TestDataFormatterSynthType.py (1267 of 2073)
PASS: lldb-shell :: SymbolFile/symbol-binding.test (1268 of 2073)
PASS: lldb-unit :: Utility/./UtilityTests/StructuredDataTest.StringDump (1269 of 2073)
PASS: lldb-api :: commands/command/script/TestCommandScript.py (1270 of 2073)
PASS: lldb-shell :: ObjectFile/Breakpad/sections-trailing-func.test (1271 of 2073)
PASS: lldb-shell :: SymbolFile/Breakpad/unwind-via-stack-win.test (1272 of 2073)
PASS: lldb-unit :: SymbolFile/DWARF/./SymbolFileDWARFTests/SymbolFileDWARFTests.TestAbbrevMissingTerminator (1273 of 2073)
PASS: lldb-unit :: Host/./HostTests/NativeProcessProtocolTest.SetBreakpointFailRead (1274 of 2073)
PASS: lldb-shell :: Breakpoint/split-dwarf5-debug-stroffsets.test (1275 of 2073)
PASS: lldb-unit :: Process/minidump/./LLDBMinidumpTests/MinidumpParserTest.MinidumpModuleOrder (1276 of 2073)
PASS: lldb-api :: functionalities/data-formatter/data-formatter-stl/libcxx/multimap/TestDataFormatterLibccMultiMap.py (1277 of 2073)
UNSUPPORTED: lldb-shell :: SymbolFile/DWARF/debug-types-basic.test (1278 of 2073)
PASS: lldb-unit :: Utility/./UtilityTests/OptionsWithRawTest.WhitespaceInput (1279 of 2073)
PASS: lldb-api :: functionalities/tail_call_frames/inlining_and_tail_calls/TestInliningAndTailCalls.py (1280 of 2073)
PASS: lldb-unit :: SymbolFile/DWARF/./SymbolFileDWARFTests/SymbolFileDWARFTests.TestAbbrevOrder1Start1 (1281 of 2073)
UNSUPPORTED: lldb-api :: android/platform/TestDefaultCacheLineSize.py (1282 of 2073)
PASS: lldb-unit :: Utility/./UtilityTests/StreamTest.ShiftOperatorChars (1283 of 2073)
PASS: lldb-unit :: Utility/./UtilityTests/StreamTeeTest.DefaultConstructor (1284 of 2073)
PASS: lldb-api :: macosx/DBGSourcePathRemapping/TestDSYMSourcePathRemapping.py (1285 of 2073)
PASS: lldb-unit :: Expression/./ExpressionTests/DWARFExpression.DW_OP_stack_value (1286 of 2073)
PASS: lldb-api :: commands/expression/radar_8638051/Test8638051.py (1287 of 2073)
PASS: lldb-api :: functionalities/tail_call_frames/ambiguous_tail_call_seq1/TestAmbiguousTailCallSeq1.py (1288 of 2073)
PASS: lldb-api :: lang/cpp/dynamic-value-same-basename/TestDynamicValueSameBase.py (1289 of 2073)
PASS: lldb-unit :: UnwindAssembly/x86/./UnwindAssemblyx86Tests/Testx86AssemblyInspectionEngine.Test64bitFramelessSmallStackFrame (1290 of 2073)
PASS: lldb-unit :: Utility/./UtilityTests/CompletionRequest.DuplicateFiltering (1291 of 2073)
PASS: lldb-shell :: Expr/TestMultilineExpr.test (1292 of 2073)
PASS: lldb-api :: functionalities/breakpoint/cpp_exception/TestCPPExceptionBreakpoint.py (1293 of 2073)
PASS: lldb-unit :: Process/gdb-remote/./ProcessGdbRemoteTests/GDBRemoteCommunicationServerTest.SendErrorResponse_StringError (1294 of 2073)
PASS: lldb-shell :: Settings/TestFrameFormatColor.test (1295 of 2073)
PASS: lldb-api :: python_api/value/linked_list/TestValueAPILinkedList.py (1296 of 2073)
PASS: lldb-unit :: Process/minidump/./LLDBMinidumpTests/MinidumpParserTest.GetPid (1297 of 2073)
PASS: lldb-unit :: Utility/./UtilityTests/DataExtractorTest.GetCStrEmpty (1298 of 2073)
PASS: lldb-unit :: Process/gdb-remote/./ProcessGdbRemoteTests/GDBRemoteClientBaseTest.InterruptNoResponse (1299 of 2073)
PASS: lldb-unit :: Utility/./UtilityTests/StreamTeeTest.Constructor1Stream (1300 of 2073)
PASS: lldb-unit :: UnwindAssembly/x86/./UnwindAssemblyx86Tests/Testx86AssemblyInspectionEngine.TestAddESP (1301 of 2073)
PASS: lldb-unit :: Utility/./UtilityTests/StreamTest.PutRawBytesToBigEndian (1302 of 2073)
PASS: lldb-unit :: Utility/./UtilityTests/UriParserTest.MinimalPort (1303 of 2073)
PASS: lldb-shell :: SymbolFile/DWARF/DW_OP_piece-struct.s (1304 of 2073)
PASS: lldb-unit :: Expression/./ExpressionTests/DWARFExpression.DW_OP_unknown (1305 of 2073)
PASS: lldb-unit :: Utility/./UtilityTests/ArgsTest.TestUnknownEscape (1306 of 2073)
PASS: lldb-unit :: UnwindAssembly/x86/./UnwindAssemblyx86Tests/Testx86AssemblyInspectionEngine.TestSubRSP (1307 of 2073)
PASS: lldb-api :: functionalities/data-formatter/data-formatter-objc/nsindexpath/TestDataFormatterNSIndexPath.py (1308 of 2073)
UNSUPPORTED: lldb-api :: commands/expression/namespace_local_var_same_name_cpp_and_c/TestNamespaceLocalVarSameNameCppAndC.py (1309 of 2073)
UNSUPPORTED: lldb-api :: python_api/watchpoint/condition/TestWatchpointConditionAPI.py (1310 of 2073)
UNSUPPORTED: lldb-api :: functionalities/signal/handle-segv/TestHandleSegv.py (1311 of 2073)
PASS: lldb-unit :: Symbol/./SymbolTests/TestTypeSystemClang.TestRemoveFastQualifiers (1312 of 2073)
PASS: lldb-api :: commands/expression/context-object-objc/TestContextObjectObjc.py (1313 of 2073)
PASS: lldb-api :: python_api/sbenvironment/TestSBEnvironment.py (1314 of 2073)
PASS: lldb-unit :: Utility/./UtilityTests/StringExtractorTest.GetHexBytesAvail_OddPair (1315 of 2073)
PASS: lldb-api :: lang/objc/single-entry-dictionary/TestObjCSingleEntryDictionary.py (1316 of 2073)
UNSUPPORTED: lldb-shell :: BuildScript/toolchain-clang-cl.test (1317 of 2073)
PASS: lldb-api :: sample_test/TestSampleInlineTest.py (1318 of 2073)
PASS: lldb-api :: functionalities/gdb_remote_client/TestqOffsets.py (1319 of 2073)
PASS: lldb-api :: functionalities/gdb_remote_client/TestWriteMemory.py (1320 of 2073)
PASS: lldb-unit :: Expression/./ExpressionTests/DiagnosticManagerTest.AppendMessageSubsequentDiags (1321 of 2073)
UNSUPPORTED: lldb-api :: linux/add-symbols/TestTargetSymbolsAddCommand.py (1322 of 2073)
PASS: lldb-unit :: Signals/./SignalsTests/UnixSignalsTest.Iteration (1323 of 2073)
PASS: lldb-unit :: Expression/./ExpressionTests/DiagnosticManagerTest.FixedExpression (1324 of 2073)
UNSUPPORTED: lldb-shell :: ScriptInterpreter/Lua/nested_sessions.test (1325 of 2073)
PASS: lldb-unit :: Utility/./UtilityTests/VMRange.ContainsRange (1326 of 2073)
PASS: lldb-api :: lang/objc/objc-optimized/TestObjcOptimized.py (1327 of 2073)
PASS: lldb-api :: functionalities/inferior-crashing/recursive-inferior/TestRecursiveInferiorStep.py (1328 of 2073)
PASS: lldb-api :: tools/lldb-server/commandline/TestStubSetSID.py (1329 of 2073)
PASS: lldb-unit :: Host/./HostTests/NativeProcessProtocolTest.ReadMemoryWithoutTrap (1330 of 2073)
PASS: lldb-unit :: Utility/./UtilityTests/ArgsTest.TestQuotedTrailingBackslash (1331 of 2073)
PASS: lldb-api :: commands/expression/rdar44436068/Test128BitsInteger.py (1332 of 2073)
PASS: lldb-api :: commands/expression/import-std-module/unique_ptr-dbg-info-content/TestUniquePtrDbgInfoContent.py (1333 of 2073)
PASS: lldb-api :: functionalities/data-formatter/data-formatter-named-summaries/TestDataFormatterNamedSummaries.py (1334 of 2073)
PASS: lldb-unit :: Utility/./UtilityTests/OptionsWithRawTest.LeadingSpaceArgs (1335 of 2073)
PASS: lldb-api :: functionalities/postmortem/elf-core/gcore/TestGCore.py (1336 of 2073)
PASS: lldb-shell :: SymbolFile/DWARF/debug-types-line-tables.s (1337 of 2073)
PASS: lldb-api :: commands/apropos/with-process/TestAproposWithProcess.py (1338 of 2073)
PASS: lldb-api :: functionalities/tail_call_frames/sbapi_support/TestTailCallFrameSBAPI.py (1339 of 2073)
PASS: lldb-api :: commands/expression/import-std-module/shared_ptr/TestSharedPtrFromStdModule.py (1340 of 2073)
PASS: lldb-unit :: Utility/./UtilityTests/StringListTest.GetSize (1341 of 2073)
PASS: lldb-api :: lang/cpp/trivial_abi/TestTrivialABI.py (1342 of 2073)
PASS: lldb-api :: lang/objc/modules-inline-functions/TestModulesInlineFunctions.py (1343 of 2073)
PASS: lldb-unit :: Utility/./UtilityTests/DataExtractorTest.PeekData (1344 of 2073)
PASS: lldb-unit :: Utility/./UtilityTests/StringListTest.GetMaxStringLengthMixed (1345 of 2073)
PASS: lldb-unit :: Utility/./UtilityTests/BinaryStreamTest.PutSLEB128FiveBytes (1346 of 2073)
PASS: lldb-unit :: Utility/./UtilityTests/UriParserTest.Minimal (1347 of 2073)
UNSUPPORTED: lldb-shell :: ScriptInterpreter/Lua/bindings.test (1348 of 2073)
PASS: lldb-unit :: Utility/./UtilityTests/ArgsTest.GetArgumentArrayRef (1349 of 2073)
PASS: lldb-api :: lang/objc/foundation/TestObjCMethodsNSError.py (1350 of 2073)
PASS: lldb-unit :: Utility/./UtilityTests/StringListTest.GetMaxStringLengthIncreasingSize (1351 of 2073)
PASS: lldb-unit :: Utility/./UtilityTests/StringListTest.DefaultConstructor (1352 of 2073)
PASS: lldb-api :: tools/lldb-vscode/step/TestVSCode_step.py (1353 of 2073)
PASS: lldb-shell :: SymbolFile/DWARF/debug_loc_and_loclists.s (1354 of 2073)
PASS: lldb-unit :: UnwindAssembly/x86/./UnwindAssemblyx86Tests/Testx86AssemblyInspectionEngine.TestReturnDetect (1355 of 2073)
PASS: lldb-api :: lang/objc/objc-property/TestObjCProperty.py (1356 of 2073)
PASS: lldb-unit :: ObjectFile/ELF/./ObjectFileELFTests/ObjectFileELFTest.GetSymtab_NoSymEntryPointArmThumbAddressClass (1357 of 2073)
PASS: lldb-unit :: Utility/./UtilityTests/CompletionRequest.ShiftArguments (1358 of 2073)
PASS: lldb-unit :: Core/./LLDBCoreTests/MangledTest.ResultForValidName (1359 of 2073)
PASS: lldb-api :: lang/cpp/virtual-overload/TestVirtualOverload.py (1360 of 2073)
PASS: lldb-unit :: Utility/./UtilityTests/ScalarTest.Getters (1361 of 2073)
PASS: lldb-api :: functionalities/data-formatter/data-formatter-objc/TestDataFormatterObjCPlain.py (1362 of 2073)
PASS: lldb-shell :: Commands/command-backtrace.test (1363 of 2073)
PASS: lldb-api :: commands/expression/radar_9673664/TestExprHelpExamples.py (1364 of 2073)
UNSUPPORTED: lldb-shell :: Register/arm-fp-read.test (1365 of 2073)
PASS: lldb-api :: lang/objc/orderedset/TestOrderedSet.py (1366 of 2073)
UNSUPPORTED: lldb-api :: lang/objc/modules-hash-mismatch/TestClangModulesHashMismatch.py (1367 of 2073)
PASS: lldb-unit :: Utility/./UtilityTests/EnvironmentTest.EnvpConstruction (1368 of 2073)
PASS: lldb-unit :: Utility/./UtilityTests/FileSpecTest.Yaml (1369 of 2073)
PASS: lldb-api :: functionalities/inferior-assert/TestInferiorAssert.py (1370 of 2073)
PASS: lldb-api :: functionalities/data-formatter/data-formatter-objc/cmtime/TestDataFormatterCMTime.py (1371 of 2073)
UNSUPPORTED: lldb-shell :: Register/x86-64-ymm16-read.test (1372 of 2073)
PASS: lldb-api :: commands/expression/test/TestExprs2.py (1373 of 2073)
PASS: lldb-shell :: Quit/TestQuitExitCode-30.test (1374 of 2073)
PASS: lldb-unit :: Host/./HostTests/Host.WaitStatusFormat (1375 of 2073)
PASS: lldb-unit :: Utility/./UtilityTests/TimerTest.CategoryTimesNested (1376 of 2073)
PASS: lldb-api :: commands/expression/multiline-navigation/TestMultilineNavigation.py (1377 of 2073)
PASS: lldb-api :: arm/emulation/TestEmulations.py (1378 of 2073)
PASS: lldb-api :: functionalities/completion/TestCompletion.py (1379 of 2073)
PASS: lldb-api :: functionalities/postmortem/minidump/TestMiniDump.py (1380 of 2073)
UNSUPPORTED: lldb-api :: tools/lldb-server/TestGdbRemoteModuleInfo.py (1381 of 2073)
PASS: lldb-unit :: Process/./ProcessEventDataTests/ProcessEventDataTest.ShouldStop (1382 of 2073)
PASS: lldb-shell :: ObjectFile/ELF/section-permissions.yaml (1383 of 2073)
PASS: lldb-unit :: Utility/./UtilityTests/UriParserTest.Empty (1384 of 2073)
UNSUPPORTED: lldb-api :: functionalities/asan/TestReportData.py (1385 of 2073)
PASS: lldb-api :: functionalities/breakpoint/breakpoint_conditions/TestBreakpointConditions.py (1386 of 2073)
UNSUPPORTED: lldb-api :: functionalities/data-formatter/data-formatter-stl/libstdcpp/unique_ptr/TestDataFormatterStdUniquePtr.py (1387 of 2073)
PASS: lldb-unit :: Utility/./UtilityTests/StreamTest.PutHex16ByteOrderLittle (1388 of 2073)
PASS: lldb-api :: commands/expression/char/TestExprsChar.py (1389 of 2073)
PASS: lldb-unit :: Utility/./UtilityTests/StreamTest.PutBytesAsRawHex8ToLittleEndian (1390 of 2073)
UNSUPPORTED: lldb-api :: benchmarks/startup/TestStartupDelays.py (1391 of 2073)
PASS: lldb-unit :: Utility/./UtilityTests/ArchSpecTest.TestSetTriple (1392 of 2073)
PASS: lldb-unit :: Utility/./UtilityTests/BinaryStreamTest.PutSLEB128SixBytes (1393 of 2073)
PASS: lldb-api :: commands/expression/import-std-module/list/TestListFromStdModule.py (1394 of 2073)
PASS: lldb-api :: lang/c/vla/TestVLA.py (1395 of 2073)
PASS: lldb-unit :: SymbolFile/NativePDB/./SymbolFileNativePDBTests/PDBFPOProgramToDWARFExpressionTests.UnknownOp (1396 of 2073)
PASS: lldb-unit :: SymbolFile/DWARF/./SymbolFileDWARFTests/DWARFASTParserClangTests.EnsureAllDIEsInDeclContextHaveBeenParsedParsesOnlyMatchingEntries (1397 of 2073)
PASS: lldb-unit :: Utility/./UtilityTests/StreamTest.AddressRange (1398 of 2073)
PASS: lldb-api :: lang/c/complex_int/TestComplexInt.py (1399 of 2073)
PASS: lldb-api :: commands/source/info/TestSourceInfo.py (1400 of 2073)
UNSUPPORTED: lldb-api :: functionalities/darwin_log/source/info/TestDarwinLogSourceInfo.py (1401 of 2073)
PASS: lldb-api :: tools/lldb-server/TestAppleSimulatorOSType.py (1402 of 2073)
PASS: lldb-unit :: Language/Highlighting/./HighlighterTests/HighlighterTest.ClangCursorPosInOtherToken (1403 of 2073)
PASS: lldb-api :: lang/c/struct_types/TestStructTypes.py (1404 of 2073)
PASS: lldb-unit :: Utility/./UtilityTests/FileSpecTest.IsRelative (1405 of 2073)
UNSUPPORTED: lldb-api :: functionalities/thread/concurrent_events/TestConcurrentDelayedCrashWithBreakpointWatchpoint.py (1406 of 2073)
PASS: lldb-unit :: debugserver/./debugserverTests/RNBSocket.LoopBackConnectIPv4 (1407 of 2073)
PASS: lldb-api :: functionalities/data-formatter/data-formatter-smart-array/TestDataFormatterSmartArray.py (1408 of 2073)
PASS: lldb-shell :: Driver/TestTarget.test (1409 of 2073)
PASS: lldb-unit :: Host/./HostTests/FileSystemTest.Exists (1410 of 2073)
PASS: lldb-unit :: Expression/./ExpressionTests/DWARFExpression.DW_OP_piece (1411 of 2073)
PASS: lldb-api :: lang/objc/foundation/TestObjCMethods2.py (1412 of 2073)
PASS: lldb-shell :: SymbolFile/Breakpad/line-table-edgecases.test (1413 of 2073)
PASS: lldb-unit :: Utility/./UtilityTests/FileSpecTest.EqualDotsPosix (1414 of 2073)
PASS: lldb-api :: functionalities/testid/TestTestId.py (1415 of 2073)
PASS: lldb-api :: commands/expression/deleting-implicit-copy-constructor/TestDeletingImplicitCopyConstructor.py (1416 of 2073)
PASS: lldb-shell :: Reproducer/TestVersionCheck.test (1417 of 2073)
PASS: lldb-unit :: Expression/./ExpressionTests/DiagnosticManagerTest.PutStringMultiple (1418 of 2073)
PASS: lldb-unit :: Utility/./UtilityTests/VASprintfTest.BufferResize (1419 of 2073)
PASS: lldb-unit :: Utility/./UtilityTests/FileSpecTest.OperatorBool (1420 of 2073)
UNSUPPORTED: lldb-api :: functionalities/thread/concurrent_events/TestConcurrentManyWatchpoints.py (1421 of 2073)
PASS: lldb-unit :: Language/Highlighting/./HighlighterTests/HighlighterTest.ClangTrailingBackslashWithWhitespace (1422 of 2073)
PASS: lldb-shell :: ObjectFile/wasm/basic.yaml (1423 of 2073)
PASS: lldb-api :: functionalities/breakpoint/breakpoint_ignore_count/TestBreakpointIgnoreCount.py (1424 of 2073)
PASS: lldb-api :: python_api/sblaunchinfo/TestSBLaunchInfo.py (1425 of 2073)
PASS: lldb-api :: commands/command/delete/TestCommandDelete.py (1426 of 2073)
PASS: lldb-shell :: SymbolFile/DWARF/debug_ranges.s (1427 of 2073)
PASS: lldb-api :: functionalities/data-formatter/ostypeformatting/TestFormattersOsType.py (1428 of 2073)
PASS: lldb-unit :: Utility/./UtilityTests/StringListTest.ShiftMove (1429 of 2073)
UNSUPPORTED: lldb-shell :: SymbolFile/DWARF/debug_ranges_and_rnglists.test (1430 of 2073)
PASS: lldb-unit :: Utility/./UtilityTests/Flags.AllSet (1431 of 2073)
FAIL: lldb-api :: commands/expression/weak_symbols/TestWeakSymbols.py (1432 of 2073)
******************** TEST 'lldb-api :: commands/expression/weak_symbols/TestWeakSymbols.py' FAILED ********************
Script:
--
/usr/local/Frameworks/Python.framework/Versions/3.7/bin/python3.7 /Users/buildslave/jenkins/workspace/lldb-cmake-matrix/llvm-project/lldb/test/API/dotest.py --arch x86_64 -s /Users/buildslave/jenkins/workspace/lldb-cmake-matrix/lldb-build/lldb-test-traces -S nm -u CXXFLAGS -u CFLAGS --codesign-identity lldb_codesign --server /Users/buildslave/jenkins/workspace/lldb-cmake-matrix/lldb-build/./bin/debugserver --arch x86_64 --build-dir /Users/buildslave/jenkins/workspace/lldb-cmake-matrix/lldb-build/lldb-test-build.noindex -s=/Users/buildslave/jenkins/workspace/lldb-cmake-matrix/test/logs -t --env TERM=vt100 --skip-category gmodules --skip-category watchpoint --arch=x86_64 --env LLVM_LIBS_DIR=/Users/buildslave/jenkins/workspace/lldb-cmake-matrix/lldb-build/./lib --build-dir /Users/buildslave/jenkins/workspace/lldb-cmake-matrix/lldb-build/lldb-test-build.noindex --lldb-module-cache-dir /Users/buildslave/jenkins/workspace/lldb-cmake-matrix/lldb-build/lldb-test-build.noindex/module-cache-lldb/lldb-api --clang-module-cache-dir /Users/buildslave/jenkins/workspace/lldb-cmake-matrix/lldb-build/lldb-test-build.noindex/module-cache-clang/lldb-api --executable /Users/buildslave/jenkins/workspace/lldb-cmake-matrix/lldb-build/./bin/lldb --compiler /Users/buildslave/jenkins/workspace/lldb-cmake-matrix/lldb-build/./bin/clang --dsymutil /Users/buildslave/jenkins/workspace/lldb-cmake-matrix/lldb-build/./bin/dsymutil --filecheck /Users/buildslave/jenkins/workspace/lldb-cmake-matrix/lldb-build/./bin/FileCheck --lldb-libs-dir /Users/buildslave/jenkins/workspace/lldb-cmake-matrix/lldb-build/./lib /Users/buildslave/jenkins/workspace/lldb-cmake-matrix/llvm-project/lldb/test/API/commands/expression/weak_symbols -p TestWeakSymbols.py
--
Exit Code: 1

Hide Details

Command Output (stdout): -- lldb version 11.0.99 clang revision a15d798594ae340b037efec2cdba5ec77221e7e7 llvm revision a15d798594ae340b037efec2cdba5ec77221e7e7 LLDB library dir: /Users/buildslave/jenkins/workspace/lldb-cmake-matrix/lldb-build/bin LLDB import library dir: /Users/buildslave/jenkins/workspace/lldb-cmake-matrix/lldb-build/./lib libstdcxx tests will not be run because: Don't know how to build with libstdcxx on macosx Skipping following debug info categories: ['dwo']

Hide Details

-- Command Output (stderr): --

Hide Details

Session logs for test failures/errors/unexpected successes will go into directory '/Users/buildslave/jenkins/workspace/lldb-cmake-matrix/test/logs' Change dir to: /Users/buildslave/jenkins/workspace/lldb-cmake-matrix/llvm-project/lldb/test/API/commands/expression/weak_symbols runCmd: settings clear -all output:

Hide Details

runCmd: settings set symbols.enable-external-lookup false output:

Hide Details

runCmd: settings set target.auto-apply-fixits false output:

Hide Details

runCmd: settings set plugin.process.gdb-remote.packet-timeout 60 output:

Hide Details

runCmd: settings set symbols.clang-modules-cache-path "/Users/buildslave/jenkins/workspace/lldb-cmake-matrix/lldb-build/lldb-test-build.noindex/module-cache-lldb/lldb-api" output:

Hide Details

runCmd: settings set use-color false output:

Hide Details

runCmd: setting set target.prefer-dynamic-value no-dynamic-values output:

Hide Details

FAIL: LLDB (/Users/buildslave/jenkins/workspace/lldb-cmake-matrix/lldb-build/bin/clang-11-x86_64) :: test_weak_symbol_in_expr (TestWeakSymbols.TestWeakSymbolsInExpressions) <bound method SBProcess.Kill of <lldb.SBProcess; proxy of <Swig Object of type 'lldb::SBProcess *' at 0x10807b930> >>: success

Hide Details

Restore dir to: /Users/buildslave/jenkins/workspace/lldb-cmake-matrix/lldb-build/tools/lldb/test ====================================================================== FAIL: test_weak_symbol_in_expr (TestWeakSymbols.TestWeakSymbolsInExpressions) Tests that we can refer to weak symbols in expressions. ---------------------------------------------------------------------- Traceback (most recent call last): File "/Users/buildslave/jenkins/workspace/lldb-cmake-matrix/llvm-project/lldb/test/API/commands/expression/weak_symbols/TestWeakSymbols.py", line 26, in test_weak_symbol_in_expr self.do_test() File "/Users/buildslave/jenkins/workspace/lldb-cmake-matrix/llvm-project/lldb/test/API/commands/expression/weak_symbols/TestWeakSymbols.py", line 74, in do_test self.run_weak_var_check("absent_weak_int", False) File "/Users/buildslave/jenkins/workspace/lldb-cmake-matrix/llvm-project/lldb/test/API/commands/expression/weak_symbols/TestWeakSymbols.py", line 43, in run_weak_var_check self.assertEqual(value.GetValueAsSigned(), correct_value, "Didn't change present_weak_int correctly.") AssertionError: 10 != 20 : Didn't change present_weak_int correctly. Config=x86_64-/Users/buildslave/jenkins/workspace/lldb-cmake-matrix/lldb-build/bin/clang-11 ---------------------------------------------------------------------- Ran 1 test in 2.682s

Hide Details

RESULT: FAILED (0 passes, 1 failures, 0 errors, 0 skipped, 0 expected failures, 0 unexpected successes)

Hide Details

--

Hide Details

******************** PASS: lldb-unit :: Process/minidump/./LLDBMinidumpTests/MinidumpParserTest.GetLinuxProcStatus (1433 of 2073) PASS: lldb-shell :: Breakpoint/single-file-split-dwarf.test (1434 of 2073) PASS: lldb-api :: commands/platform/file/close/TestPlatformFileClose.py (1435 of 2073) UNSUPPORTED: lldb-api :: functionalities/darwin_log/filter/regex/message/TestDarwinLogFilterRegexMessage.py (1436 of 2073) PASS: lldb-unit :: Utility/./UtilityTests/RangeTest.Constructor (1437 of 2073) PASS: lldb-api :: macosx/function-starts/TestFunctionStarts.py (1438 of 2073) PASS: lldb-shell :: Driver/TestProcessAttach.test (1439 of 2073) PASS: lldb-shell :: ScriptInterpreter/Python/sb_address_exception.test (1440 of 2073) PASS: lldb-unit :: Utility/./UtilityTests/RangeTest.Equal (1441 of 2073) PASS: lldb-unit :: Utility/./UtilityTests/NameMatchesTest.EndsWith (1442 of 2073) PASS: lldb-unit :: Utility/./UtilityTests/StreamTest.AddressPrefixAndSuffix (1443 of 2073) PASS: lldb-unit :: Target/./TargetTests/PathMappingListTest.RemapRoot (1444 of 2073) PASS: lldb-unit :: Utility/./UtilityTests/ArgsTest.ReplaceArgumentAtIndexEqual (1445 of 2073) PASS: lldb-api :: lang/mixed/TestMixedLanguages.py (1446 of 2073) PASS: lldb-unit :: Utility/./UtilityTests/OptionsWithRawTest.EmptyInput (1447 of 2073) PASS: lldb-unit :: UnwindAssembly/x86/./UnwindAssemblyx86Tests/Testx86AssemblyInspectionEngine.TestPopEBX (1448 of 2073) PASS: lldb-api :: functionalities/wrong_commands/TestWrongCommands.py (1449 of 2073) PASS: lldb-api :: commands/target/stop-hook/disable/TestTargetStopHookDisable.py (1450 of 2073) UNSUPPORTED: lldb-shell :: ObjectFile/ELF/basic-info.yaml (1451 of 2073) PASS: lldb-unit :: Utility/./UtilityTests/ScalarTest.CastOperations (1452 of 2073) UNSUPPORTED: lldb-shell :: SymbolFile/Breakpad/stack-cfi-arm.yaml (1453 of 2073) PASS: lldb-unit :: Utility/./UtilityTests/StringListTest.Assignment (1454 of 2073) PASS: lldb-unit :: Process/gdb-remote/./ProcessGdbRemoteTests/GDBRemoteCommunicationServerTest.SendErrorResponse_Status (1455 of 2073) PASS: lldb-api :: functionalities/inline-stepping/TestInlineStepping.py (1456 of 2073) PASS: lldb-unit :: Utility/./UtilityTests/StreamTest.AddressSize (1457 of 2073) PASS: lldb-unit :: Process/gdb-remote/./ProcessGdbRemoteTests/GDBRemoteCommunicationServerTest.SendErrorResponse_UnimplementedError (1458 of 2073) PASS: lldb-unit :: Utility/./UtilityTests/FileSpecTest.CopyByAppendingPathComponent (1459 of 2073) PASS: lldb-shell :: SymbolFile/DWARF/DW_AT_loclists_base.s (1460 of 2073) PASS: lldb-unit :: Utility/./UtilityTests/StreamTest.PutBytesAsRawHex8ToMixedEndian (1461 of 2073) PASS: lldb-unit :: Utility/./UtilityTests/RangeTest.Union (1462 of 2073) PASS: lldb-unit :: Utility/./UtilityTests/BinaryStreamTest.PutSLEB128MaxValue (1463 of 2073) PASS: lldb-unit :: Utility/./UtilityTests/FileSpecTest.GuessPathStyle (1464 of 2073) UNSUPPORTED: lldb-shell :: SymbolFile/PDB/class-layout.test (1465 of 2073) PASS: lldb-unit :: Symbol/./SymbolTests/SymbolsTest.TerminateLocateExecutableSymbolFileForUnknownExecutableAndUnknownSymbolFile (1466 of 2073) PASS: lldb-api :: functionalities/gdb_remote_client/TestStopPCs.py (1467 of 2073) PASS: lldb-unit :: Utility/./UtilityTests/RecordReplayTest.InstrumentedFooSameThis (1468 of 2073) PASS: lldb-shell :: ObjectFile/ELF/aarch64-relocations.yaml (1469 of 2073) PASS: lldb-api :: functionalities/data-formatter/hexcaps/TestDataFormatterHexCaps.py (1470 of 2073) UNSUPPORTED: lldb-api :: functionalities/thread/concurrent_events/TestConcurrentBreakpointsDelayedBreakpointOneWatchpoint.py (1471 of 2073) PASS: lldb-unit :: Symbol/./SymbolTests/LineEntryTest.GetSameLineContiguousAddressRangeNestedInline (1472 of 2073) PASS: lldb-api :: functionalities/thread/ignore_suspended/TestIgnoreSuspendedThread.py (1473 of 2073) PASS: lldb-api :: lang/c/shared_lib/TestSharedLib.py (1474 of 2073) PASS: lldb-api :: commands/expression/call-function/TestCallBuiltinFunction.py (1475 of 2073) PASS: lldb-api :: commands/expression/import-std-module/sysroot/TestStdModuleSysroot.py (1476 of 2073) PASS: lldb-unit :: Utility/./UtilityTests/StringListTest.CopyListEmpty (1477 of 2073) UNSUPPORTED: lldb-api :: tools/lldb-vscode/disconnect/TestVSCode_disconnect.py (1478 of 2073) PASS: lldb-api :: lang/cpp/symbols/TestSymbols.py (1479 of 2073) PASS: lldb-unit :: Utility/./UtilityTests/StringExtractorTest.GetNameColonValueNoSemicolon (1480 of 2073) UNSUPPORTED: lldb-shell :: SymbolFile/DWARF/DW_TAG_GNU_call_site-DW_AT_low_pc.s (1481 of 2073) PASS: lldb-unit :: Utility/./UtilityTests/StreamTest.PutHex32ByteOrderLittle (1482 of 2073) PASS: lldb-api :: functionalities/value_md5_crash/TestValueMD5Crash.py (1483 of 2073) PASS: lldb-api :: functionalities/data-formatter/data-formatter-stl/libcxx/map/TestDataFormatterLibccMap.py (1484 of 2073) PASS: lldb-api :: python_api/value/empty_class/TestValueAPIEmptyClass.py (1485 of 2073) PASS: lldb-api :: lang/objcxx/objcxx-ivar-vector/TestIvarVector.py (1486 of 2073) PASS: lldb-unit :: Platform/./LLDBPlatformTests/PlatformDarwinTest.TestParseVersionBuildDir (1487 of 2073) PASS: lldb-api :: functionalities/thread/concurrent_events/TestConcurrentCrashWithBreak.py (1488 of 2073) PASS: lldb-shell :: SymbolFile/Breakpad/line-table-mixed-path-styles.test (1489 of 2073) PASS: lldb-api :: functionalities/breakpoint/breakpoint_language/TestBreakpointLanguage.py (1490 of 2073) PASS: lldb-shell :: SymbolFile/DWARF/deterministic-build.cpp (1491 of 2073) PASS: lldb-unit :: Utility/./UtilityTests/StringListTest.RemoveBlankLines (1492 of 2073) PASS: lldb-api :: python_api/sbvalue_const_addrof/TestSBValueConstAddrOf.py (1493 of 2073) PASS: lldb-api :: functionalities/tail_call_frames/unambiguous_sequence/TestUnambiguousTailCalls.py (1494 of 2073) PASS: lldb-shell :: Recognizer/assert.test (1495 of 2073) PASS: lldb-unit :: Process/minidump/./LLDBMinidumpTests/MinidumpParserTest.MinidumpDuplicateModuleMinAddress (1496 of 2073) PASS: lldb-unit :: Utility/./UtilityTests/StreamTeeTest.SetStreamAtIndexOutOfBounds (1497 of 2073) PASS: lldb-api :: commands/gui/basic/TestGuiBasic.py (1498 of 2073) PASS: lldb-unit :: Utility/./UtilityTests/StatusTest.ErrorConversion (1499 of 2073) PASS: lldb-shell :: BuildScript/script-args.test (1500 of 2073) PASS: lldb-shell :: Minidump/Windows/broken-unwind.test (1501 of 2073) PASS: lldb-unit :: Utility/./UtilityTests/StreamTest.PutPtr (1502 of 2073) PASS: lldb-unit :: Utility/./UtilityTests/ProcessInstanceInfo.DumpTable_invalidUID (1503 of 2073) PASS: lldb-unit :: Host/./HostTests/HostInfoTest.GetAugmentedArchSpec (1504 of 2073) PASS: lldb-shell :: Expr/TestTypeOfDeclTypeExpr.test (1505 of 2073) PASS: lldb-unit :: Utility/./UtilityTests/OptionsWithRawTest.EmptyArgsOnlySuffix (1506 of 2073) PASS: lldb-unit :: ObjectFile/ELF/./ObjectFileELFTests/ObjectFileELFTest.GetModuleSpecifications_EarlySectionHeaders (1507 of 2073) UNSUPPORTED: lldb-api :: linux/thread/create_during_instruction_step/TestCreateDuringInstructionStep.py (1508 of 2073) PASS: lldb-unit :: Language/Highlighting/./HighlighterTests/HighlighterTest.ClangCursorPosEndOfLine (1509 of 2073) PASS: lldb-unit :: Utility/./UtilityTests/StreamTest.PutRawBytesToMixedEndian (1510 of 2073) PASS: lldb-shell :: ObjectFile/PECOFF/symbol.yaml (1511 of 2073) PASS: lldb-unit :: Utility/./UtilityTests/SubsystemRAIITest.SubsystemWithErrorFailure (1512 of 2073) PASS: lldb-unit :: Utility/./UtilityTests/LogTest.Unregister (1513 of 2073) PASS: lldb-unit :: Utility/./UtilityTests/XcodeSDKTest.GetSDKTypeForTriple (1514 of 2073) PASS: lldb-api :: types/TestIntegerTypeExpr.py (1515 of 2073) PASS: lldb-shell :: Reproducer/TestDSYM.test (1516 of 2073) PASS: lldb-api :: lang/cpp/template/TestTemplateArgs.py (1517 of 2073) PASS: lldb-api :: tools/lldb-server/TestLldbGdbServer.py (1518 of 2073) PASS: lldb-shell :: SymbolFile/Breakpad/unwind-via-raSearch.test (1519 of 2073) PASS: lldb-unit :: UnwindAssembly/x86/./UnwindAssemblyx86Tests/Testx86AssemblyInspectionEngine.TestSubESP (1520 of 2073) PASS: lldb-api :: functionalities/data-formatter/data-formatter-categories/TestDataFormatterCategories.py (1521 of 2073) PASS: lldb-unit :: Host/./HostTests/NativeProcessProtocolTest.SetBreakpoint (1522 of 2073) PASS: lldb-unit :: Target/./TargetTests/ExecutionContextTest.GetByteOrder (1523 of 2073) PASS: lldb-unit :: SymbolFile/DWARF/./SymbolFileDWARFTests/SymbolFileDWARFTests.TestAbbrevNullAttrValidForm (1524 of 2073) PASS: lldb-unit :: Utility/./UtilityTests/RangeTest.ContainsEndInclusive (1525 of 2073) PASS: lldb-unit :: Utility/./UtilityTests/ScalarTest.Division (1526 of 2073) XFAIL: lldb-shell :: Register/x86-64-ymm-write.test (1527 of 2073) PASS: lldb-api :: commands/frame/language/TestGuessLanguage.py (1528 of 2073) PASS: lldb-unit :: Utility/./UtilityTests/StringLexerTest.GetUnlexed (1529 of 2073) PASS: lldb-shell :: SymbolFile/DWARF/anon_class_w_and_wo_export_symbols.ll (1530 of 2073) PASS: lldb-unit :: Symbol/./SymbolTests/TestClangASTImporter.CopyTypeTagDecl (1531 of 2073) PASS: lldb-unit :: Target/./TargetTests/MCBasedABI.MapRegisterName (1532 of 2073) PASS: lldb-unit :: Language/Highlighting/./HighlighterTests/HighlighterTest.ClangPreserveNewLine (1533 of 2073) PASS: lldb-shell :: Driver/TestPositionalArgs.test (1534 of 2073) PASS: lldb-api :: functionalities/data-formatter/data-formatter-objc/TestDataFormatterObjCNSURL.py (1535 of 2073) PASS: lldb-shell :: SymbolFile/DWARF/debug-types-dwarf5.s (1536 of 2073) PASS: lldb-api :: commands/process/attach/attach_denied/TestAttachDenied.py (1537 of 2073) PASS: lldb-api :: functionalities/breakpoint/dummy_target_breakpoints/TestBreakpointsWithNoTargets.py (1538 of 2073) PASS: lldb-api :: functionalities/data-formatter/data-formatter-objc/TestDataFormatterObjNSException.py (1539 of 2073) PASS: lldb-unit :: Utility/./UtilityTests/ScalarTest.TruncOrExtendTo (1540 of 2073) UNSUPPORTED: lldb-shell :: Register/x86-gp-write.test (1541 of 2073) PASS: lldb-unit :: Utility/./UtilityTests/DataExtractorTest.GetDouble (1542 of 2073) UNSUPPORTED: lldb-shell :: ScriptInterpreter/Lua/lua.test (1543 of 2073) UNSUPPORTED: lldb-shell :: SymbolFile/PDB/variables.test (1544 of 2073) UNSUPPORTED: lldb-shell :: SymbolFile/dissassemble-entry-point.s (1545 of 2073) PASS: lldb-api :: functionalities/data-formatter/data-formatter-proper-plurals/TestFormattersOneIsSingular.py (1546 of 2073) UNSUPPORTED: lldb-shell :: SymbolFile/PDB/enums-layout.test (1547 of 2073) UNSUPPORTED: lldb-shell :: SymbolFile/NativePDB/typedefs.cpp (1548 of 2073) PASS: lldb-api :: lang/cpp/diamond/TestDiamond.py (1549 of 2073) PASS: lldb-shell :: BuildScript/modes.test (1550 of 2073) PASS: lldb-api :: functionalities/tail_call_frames/ambiguous_tail_call_seq2/TestAmbiguousTailCallSeq2.py (1551 of 2073) PASS: lldb-api :: tools/lldb-server/commandline/TestStubReverseConnect.py (1552 of 2073) UNSUPPORTED: lldb-shell :: SymbolFile/DWARF/find-method.cpp (1553 of 2073) PASS: lldb-api :: functionalities/gdb_remote_client/TestTargetXMLArch.py (1554 of 2073) PASS: lldb-unit :: ScriptInterpreter/Python/./ScriptInterpreterPythonTests/PythonDataObjectsTest.TestExtractingUInt64ThroughStructuredData (1555 of 2073) PASS: lldb-api :: lang/cpp/bool/TestCPPBool.py (1556 of 2073) PASS: lldb-shell :: ObjectFile/ELF/short-build-id.yaml (1557 of 2073) PASS: lldb-unit :: Utility/./UtilityTests/StreamTest.PutMaxHex64ByteOrderBig (1558 of 2073) PASS: lldb-unit :: Utility/./UtilityTests/UriParserTest.BracketedHostnameWithColon (1559 of 2073) PASS: lldb-unit :: Utility/./UtilityTests/RegularExpression.Invalid (1560 of 2073) PASS: lldb-unit :: ObjectFile/Breakpad/./ObjectFileBreakpadTests/FuncRecord.parse (1561 of 2073) PASS: lldb-unit :: Process/gdb-remote/./ProcessGdbRemoteTests/GDBRemoteCommunicationClientTest.SyncThreadState (1562 of 2073) PASS: lldb-unit :: Core/./LLDBCoreTests/RichManglingContextTest.FromCxxMethodName (1563 of 2073) PASS: lldb-unit :: Process/gdb-remote/./ProcessGdbRemoteTests/GDBRemoteClientBaseTest.SendContinueAndLateInterrupt (1564 of 2073) PASS: lldb-api :: lang/objc/modules-cache/TestClangModulesCache.py (1565 of 2073) PASS: lldb-api :: commands/expression/import-std-module/conflicts/TestStdModuleWithConflicts.py (1566 of 2073) PASS: lldb-api :: lang/cpp/unique-types/TestUniqueTypes.py (1567 of 2073) PASS: lldb-api :: commands/disassemble/basic/TestDisassembleBreakpoint.py (1568 of 2073) PASS: lldb-unit :: Language/Highlighting/./HighlighterTests/HighlighterTest.ClangIdentifiers (1569 of 2073) PASS: lldb-api :: sample_test/TestSampleTest.py (1570 of 2073) PASS: lldb-unit :: Expression/./ExpressionTests/CppModuleConfigurationTest.UnrelatedLibrary (1571 of 2073) PASS: lldb-api :: functionalities/postmortem/minidump-new/TestMiniDumpUUID.py (1572 of 2073) PASS: lldb-unit :: Process/gdb-remote/./ProcessGdbRemoteTests/GDBRemoteCommunicationClientTest.GetModulesInfoInvalidResponse (1573 of 2073) UNSUPPORTED: lldb-api :: python_api/watchpoint/TestWatchpointIgnoreCount.py (1574 of 2073) PASS: lldb-api :: commands/expression/dont_allow_jit/TestAllowJIT.py (1575 of 2073) PASS: lldb-api :: macosx/lc-note/kern-ver-str/TestKernVerStrLCNOTE.py (1576 of 2073) PASS: lldb-unit :: Utility/./UtilityTests/XcodeSDKTest.SDKSupportsSwift (1577 of 2073) PASS: lldb-unit :: Utility/./UtilityTests/StringExtractorTest.DecodeHexU8_Underflow (1578 of 2073) PASS: lldb-unit :: Utility/./UtilityTests/ArgsTest.TestMultipleArgs (1579 of 2073) PASS: lldb-unit :: UnwindAssembly/x86/./UnwindAssemblyx86Tests/Testx86AssemblyInspectionEngine.TestPopRBX (1580 of 2073) PASS: lldb-api :: lang/objc/foundation/TestObjCMethodsNSArray.py (1581 of 2073) PASS: lldb-unit :: Utility/./UtilityTests/ScalarTest.Promotion (1582 of 2073) PASS: lldb-unit :: Language/CPlusPlus/./LanguageCPlusPlusTests/CPlusPlusLanguage.MethodNameParsing (1583 of 2073) PASS: lldb-unit :: Utility/./UtilityTests/VMRange.IsValid (1584 of 2073) PASS: lldb-api :: functionalities/data-formatter/data-formatter-stl/libcxx/variant/TestDataFormatterLibcxxVariant.py (1585 of 2073) PASS: lldb-unit :: Language/Highlighting/./HighlighterTests/HighlighterTest.ClangUnterminatedString (1586 of 2073) PASS: lldb-shell :: Minidump/memory-region-from-module.yaml (1587 of 2073) PASS: lldb-unit :: Expression/./ExpressionTests/DWARFExpression.DW_OP_convert (1588 of 2073) PASS: lldb-api :: lang/objc/print-obj/TestPrintObj.py (1589 of 2073) UNSUPPORTED: lldb-api :: commands/watchpoints/watchpoint_count/TestWatchpointCount.py (1590 of 2073) PASS: lldb-unit :: tools/lldb-server/tests/./LLDBServerTests/TestBase.LaunchModePreservesEnvironment (1591 of 2073) PASS: lldb-unit :: ScriptInterpreter/Python/./ScriptInterpreterPythonTests/PythonDataObjectsTest.TestPythonInteger (1592 of 2073) PASS: lldb-unit :: Host/./HostTests/SocketTest.DecodeHostAndPort (1593 of 2073) PASS: lldb-unit :: Utility/./UtilityTests/EventTest.DumpEventDataBytes (1594 of 2073) PASS: lldb-unit :: Host/./HostTests/Host.GetEnvironment (1595 of 2073) PASS: lldb-api :: lang/cpp/lambdas/TestLambdas.py (1596 of 2073) PASS: lldb-shell :: SymbolFile/DWARF/find-method-local-struct.cpp (1597 of 2073) PASS: lldb-api :: lang/objcxx/class-name-clash/TestNameClash.py (1598 of 2073) PASS: lldb-unit :: Utility/./UtilityTests/ProcessInstanceInfo.DumpTable (1599 of 2073) PASS: lldb-shell :: Settings/TestSettingsWrite.test (1600 of 2073) UNSUPPORTED: lldb-api :: api/multiple-debuggers/TestMultipleDebuggers.py (1601 of 2073) PASS: lldb-unit :: Process/minidump/./LLDBMinidumpTests/MinidumpParserTest.GetMemory (1602 of 2073) PASS: lldb-api :: functionalities/unwind/zeroth_frame/TestZerothFrame.py (1603 of 2073) PASS: lldb-api :: commands/expression/rdar42038760/TestScalarURem.py (1604 of 2073) PASS: lldb-api :: functionalities/data-formatter/pyobjsynthprovider/TestPyObjSynthProvider.py (1605 of 2073) PASS: lldb-unit :: Process/minidump/./LLDBMinidumpTests/MinidumpParserTest.GetMemoryRegionInfoFromMemoryList (1606 of 2073) PASS: lldb-unit :: Process/minidump/./LLDBMinidumpTests/RegisterContextMinidump.CheckRegisterContextMinidump_ARM (1607 of 2073) PASS: lldb-api :: functionalities/data-formatter/data-formatter-stl/libcxx/queue/TestDataFormatterLibcxxQueue.py (1608 of 2073) PASS: lldb-unit :: Utility/./UtilityTests/RangeTest.Clear (1609 of 2073) PASS: lldb-api :: functionalities/gdb_remote_client/TestIOSSimulator.py (1610 of 2073) PASS: lldb-unit :: Utility/./UtilityTests/ArchSpecTest.MergeFromMachOUnknown (1611 of 2073) PASS: lldb-unit :: Utility/./UtilityTests/UriParserTest.BadPort2 (1612 of 2073) PASS: lldb-unit :: Language/Highlighting/./HighlighterTests/HighlighterTest.ClangScalarLiterals (1613 of 2073) PASS: lldb-unit :: Core/./LLDBCoreTests/SourceFileCache.FindSourceFileFound (1614 of 2073) PASS: lldb-shell :: Settings/TestEchoCommands.test (1615 of 2073) UNSUPPORTED: lldb-shell :: SymbolFile/PDB/typedefs.test (1616 of 2073) PASS: lldb-unit :: UnwindAssembly/x86/./UnwindAssemblyx86Tests/Testx86AssemblyInspectionEngine.TestPopR12 (1617 of 2073) PASS: lldb-unit :: Utility/./UtilityTests/RangeTest.NotEqual (1618 of 2073) PASS: lldb-api :: lang/c/complex/TestComplexC99.py (1619 of 2073) PASS: lldb-api :: lang/c/global_variables/TestGlobalVariables.py (1620 of 2073) UNSUPPORTED: lldb-api :: functionalities/data-formatter/data-formatter-stl/libstdcpp/iterator/TestDataFormatterStdIterator.py (1621 of 2073) PASS: lldb-unit :: Utility/./UtilityTests/StringListTest.CopyListSingle (1622 of 2073) PASS: lldb-api :: commands/expression/scoped_enums/TestScopedEnumType.py (1623 of 2073) PASS: lldb-unit :: Utility/./UtilityTests/UUIDTest.Validity (1624 of 2073) PASS: lldb-unit :: Host/./HostTests/FileActionTest.Open (1625 of 2073) PASS: lldb-unit :: ScriptInterpreter/Python/./ScriptInterpreterPythonTests/PythonDataObjectsTest.TestGlobalNameResolutionWithDot (1626 of 2073) PASS: lldb-api :: tools/lldb-server/TestGdbRemoteHostInfo.py (1627 of 2073) PASS: lldb-api :: python_api/sbtype_typeclass/TestSBTypeTypeClass.py (1628 of 2073) PASS: lldb-api :: commands/expression/import-std-module/vector-bool/TestVectorBoolFromStdModule.py (1629 of 2073) PASS: lldb-unit :: Language/Highlighting/./HighlighterTests/HighlighterTest.ClangCommas (1630 of 2073) PASS: lldb-api :: tools/lldb-server/TestGdbRemoteRegisterState.py (1631 of 2073) PASS: lldb-unit :: Host/./HostTests/NativeProcessProtocolTest.ReadCStringFromMemory (1632 of 2073) PASS: lldb-shell :: SymbolFile/Breakpad/unwind-via-stack-cfi.test (1633 of 2073) PASS: lldb-shell :: SymbolFile/DWARF/parallel-indexing-stress.s (1634 of 2073) UNSUPPORTED: lldb-api :: commands/expression/call-restarts/TestCallThatRestarts.py (1635 of 2073) PASS: lldb-shell :: SymbolFile/DWARF/childless-compile-unit.s (1636 of 2073) PASS: lldb-api :: python_api/value/TestValueAPI.py (1637 of 2073) PASS: lldb-unit :: Expression/./ExpressionTests/CppModuleConfigurationTest.UnknownLibCppFile (1638 of 2073) PASS: lldb-api :: functionalities/return-value/TestReturnValue.py (1639 of 2073) UNSUPPORTED: lldb-api :: functionalities/darwin_log/filter/regex/subsystem/TestDarwinLogFilterRegexSubsystem.py (1640 of 2073) PASS: lldb-api :: lang/cpp/auto/TestCPPAuto.py (1641 of 2073) PASS: lldb-api :: commands/frame/diagnose/dereference-this/TestDiagnoseDereferenceThis.py (1642 of 2073) UNSUPPORTED: lldb-api :: python_api/watchpoint/TestWatchpointIter.py (1643 of 2073) PASS: lldb-unit :: Utility/./UtilityTests/StreamTest.PutCharWhitespace (1644 of 2073) PASS: lldb-unit :: Process/minidump/./LLDBMinidumpTests/MinidumpParserTest.GetMemoryRegionInfoLinuxMaps (1645 of 2073) PASS: lldb-shell :: Commands/CommandScriptImmediateOutput/CommandScriptImmediateOutputConsole.test (1646 of 2073) PASS: lldb-api :: commands/expression/calculator_mode/TestCalculatorMode.py (1647 of 2073) UNSUPPORTED: lldb-shell :: Register/x86-64-zmm-read.test (1648 of 2073) PASS: lldb-unit :: Language/Highlighting/./HighlighterTests/HighlighterTest.HighlighterSelectionPath (1649 of 2073) PASS: lldb-unit :: Host/./HostTests/SocketTest.UDPConnect (1650 of 2073) PASS: lldb-api :: functionalities/param_entry_vals/basic_entry_values/TestBasicEntryValues.py (1651 of 2073) PASS: lldb-shell :: SymbolFile/DWARF/module-ownership.mm (1652 of 2073) PASS: lldb-shell :: Breakpoint/debug_rnglist_offset_pair.test (1653 of 2073) PASS: lldb-unit :: Utility/./UtilityTests/StreamTest.AddressEmptyPrefix (1654 of 2073) PASS: lldb-unit :: Utility/./UtilityTests/ArgsTest.GetQuotedCommandString (1655 of 2073) PASS: lldb-shell :: ObjectFile/ELF/avr-basic-info.yaml (1656 of 2073) PASS: lldb-api :: lang/cpp/extern_c/TestExternCSymbols.py (1657 of 2073) PASS: lldb-unit :: ScriptInterpreter/Python/./ScriptInterpreterPythonTests/PythonDataObjectsTest.TestTypeNameResolutionNoDot (1658 of 2073) PASS: lldb-unit :: Language/CLanguages/./LanguageCLanguagesTests/CLanguages.LookupCLanguagesByLanguageType (1659 of 2073) PASS: lldb-unit :: Utility/./UtilityTests/StringExtractorTest.GetHexU8_Extra_NoEof (1660 of 2073) PASS: lldb-api :: commands/platform/basic/TestPlatformCommand.py (1661 of 2073) PASS: lldb-api :: functionalities/lazy-loading/TestLazyLoading.py (1662 of 2073) UNSUPPORTED: lldb-shell :: ScriptInterpreter/Lua/persistent_state.test (1663 of 2073) PASS: lldb-api :: tools/lldb-server/inferior-crash/TestGdbRemoteSegFault.py (1664 of 2073) PASS: lldb-unit :: Utility/./UtilityTests/FileSpecTest.AppendPathComponent (1665 of 2073) UNSUPPORTED: lldb-api :: lang/cpp/gmodules/TestWithModuleDebugging.py (1666 of 2073) PASS: lldb-unit :: UnwindAssembly/x86/./UnwindAssemblyx86Tests/Testx86AssemblyInspectionEngine.TestStackRealign8BitDisp_i386 (1667 of 2073) PASS: lldb-api :: commands/expression/expr-in-syscall/TestExpressionInSyscall.py (1668 of 2073) PASS: lldb-api :: macosx/find-dsym/bundle-with-dot-in-filename/TestBundleWithDotInFilename.py (1669 of 2073) PASS: lldb-unit :: Language/Highlighting/./HighlighterTests/HighlighterTest.ClangCursorOutOfBounds (1670 of 2073) PASS: lldb-unit :: Utility/./UtilityTests/StringExtractorTest.GetU64BigEndian (1671 of 2073) PASS: lldb-api :: lang/objc/direct-dispatch-step/TestObjCDirectDispatchStepping.py (1672 of 2073) PASS: lldb-api :: functionalities/thread/crash_during_step/TestCrashDuringStep.py (1673 of 2073) PASS: lldb-unit :: Utility/./UtilityTests/StringListTest.LongestCommonPrefixEmpty (1674 of 2073) PASS: lldb-unit :: Utility/./UtilityTests/UriParserTest.BracketedHostnamePort (1675 of 2073) PASS: lldb-api :: functionalities/thread/concurrent_events/TestConcurrentDelaySignalBreak.py (1676 of 2073) PASS: lldb-api :: lang/cpp/function_refs/TestFunctionRefs.py (1677 of 2073) UNSUPPORTED: lldb-api :: functionalities/thread/concurrent_events/TestConcurrentSignalDelayWatch.py (1678 of 2073) PASS: lldb-api :: functionalities/breakpoint/breakpoint_callback_command_source/TestBreakpointCallbackCommandSource.py (1679 of 2073) PASS: lldb-unit :: Host/./HostTests/MainLoopTest.Signal (1680 of 2073) PASS: lldb-unit :: Host/./HostTests/SocketTest.DomainGetConnectURI (1681 of 2073) PASS: lldb-api :: commands/frame/diagnose/local-variable/TestLocalVariable.py (1682 of 2073) PASS: lldb-unit :: Utility/./UtilityTests/StringExtractorTest.GetNameColonValueSuccess (1683 of 2073) PASS: lldb-api :: commands/target/select/TestTargetSelect.py (1684 of 2073) PASS: lldb-unit :: Process/minidump/./LLDBMinidumpTests/MinidumpParserTest.GetLinuxProcStatus_no_stream (1685 of 2073) PASS: lldb-api :: functionalities/thread/num_threads/TestNumThreads.py (1686 of 2073) PASS: lldb-unit :: Expression/./ExpressionTests/CppModuleConfigurationTest.Linux (1687 of 2073) PASS: lldb-unit :: UnwindAssembly/x86/./UnwindAssemblyx86Tests/Testx86AssemblyInspectionEngine.TestPopEDI (1688 of 2073) PASS: lldb-unit :: SymbolFile/NativePDB/./SymbolFileNativePDBTests/PDBFPOProgramToDWARFExpressionTests.MultipleIndependentAssignments (1689 of 2073) PASS: lldb-unit :: Expression/./ExpressionTests/CppModuleConfigurationTest.AmbiguousCLib (1690 of 2073) PASS: lldb-api :: lang/cpp/bitfields/TestCppBitfields.py (1691 of 2073) PASS: lldb-api :: functionalities/data-formatter/data-formatter-objc/nsstring/TestDataFormatterNSString.py (1692 of 2073) PASS: lldb-api :: python_api/target/TestTargetAPI.py (1693 of 2073) PASS: lldb-api :: python_api/value/change_values/TestChangeValueAPI.py (1694 of 2073) PASS: lldb-unit :: Language/Highlighting/./HighlighterTests/HighlighterTest.DefaultHighlighterWithCursorOutOfBounds (1695 of 2073) PASS: lldb-unit :: Symbol/./SymbolTests/TestClangASTImporter.MetadataPropagationAfterCopying (1696 of 2073) PASS: lldb-unit :: Target/./TargetTests/StackFrameRecognizerTest.NullModuleRegex (1697 of 2073) PASS: lldb-api :: commands/expression/import-std-module/vector-dbg-info-content/TestDbgInfoContentVectorFromStdModule.py (1698 of 2073) PASS: lldb-unit :: Utility/./UtilityTests/RegularExpression.Valid (1699 of 2073) UNSUPPORTED: lldb-api :: python_api/watchpoint/watchlocation/TestTargetWatchAddress.py (1700 of 2073) PASS: lldb-api :: lang/cpp/nested-class-other-compilation-unit/TestNestedClassWithParentInAnotherCU.py (1701 of 2073) PASS: lldb-api :: functionalities/multidebugger_commands/TestMultipleDebuggersCommands.py (1702 of 2073) PASS: lldb-shell :: SymbolFile/Breakpad/stack-cfi-parsing.test (1703 of 2073) PASS: lldb-api :: lang/objc/self/TestObjCSelf.py (1704 of 2073) PASS: lldb-unit :: Utility/./UtilityTests/StreamTest.PutSLEB128 (1705 of 2073) PASS: lldb-api :: lang/cpp/nsimport/TestCppNsImport.py (1706 of 2073) PASS: lldb-unit :: Utility/./UtilityTests/NameMatchesTest.RegularExpression (1707 of 2073) PASS: lldb-api :: commands/expression/function_template_specialization_temp_args/TestFunctionTemplateSpecializationTempArgs.py (1708 of 2073) PASS: lldb-unit :: ScriptInterpreter/Python/./ScriptInterpreterPythonTests/PythonDataObjectsTest.TestPythonTupleInitializerList (1709 of 2073) PASS: lldb-unit :: Utility/./UtilityTests/VASprintfTest.EncodingError (1710 of 2073) PASS: lldb-unit :: Utility/./UtilityTests/ProcessInstanceInfoMatch.Name (1711 of 2073) PASS: lldb-api :: commands/frame/var/TestFrameVar.py (1712 of 2073) PASS: lldb-unit :: Symbol/./SymbolTests/SymbolsTest.LocateExecutableSymbolFileForUnknownExecutableAndMissingSymbolFile (1713 of 2073) PASS: lldb-api :: functionalities/data-formatter/data-formatter-stl/libcxx/atomic/TestLibCxxAtomic.py (1714 of 2073) PASS: lldb-shell :: SymbolFile/DWARF/debug_line-relative_path.s (1715 of 2073) UNSUPPORTED: lldb-api :: commands/watchpoints/watchpoint_events/TestWatchpointEvents.py (1716 of 2073) UNSUPPORTED: lldb-api :: python_api/disassemble-raw-data/TestDisassemble_VST1_64.py (1717 of 2073) PASS: lldb-api :: macosx/add-dsym/TestAddDsymMidExecutionCommand.py (1718 of 2073) UNSUPPORTED: lldb-shell :: SymbolFile/NativePDB/tag-types.cpp (1719 of 2073) PASS: lldb-unit :: Utility/./UtilityTests/ArgsTest.TestQuotedUnknownEscape (1720 of 2073) PASS: lldb-api :: macosx/nslog/TestDarwinNSLogOutput.py (1721 of 2073) PASS: lldb-api :: functionalities/thread/step_until/TestStepUntil.py (1722 of 2073) PASS: lldb-api :: lang/cpp/call-function/TestCallCPPFunction.py (1723 of 2073) PASS: lldb-api :: python_api/thread/TestThreadAPI.py (1724 of 2073) PASS: lldb-unit :: Process/minidump/./LLDBMinidumpTests/MinidumpParserTest.GetFilteredModuleList (1725 of 2073) PASS: lldb-unit :: ObjectFile/ELF/./ObjectFileELFTests/ObjectFileELFTest.GetSymtab_NoSymEntryPointArmAddressClass (1726 of 2073) PASS: lldb-api :: lang/objc/objc-class-method/TestObjCClassMethod.py (1727 of 2073) PASS: lldb-unit :: Language/Highlighting/./HighlighterTests/HighlighterTest.ClangTrailingBackslashMissingNewLine (1728 of 2073) PASS: lldb-unit :: Utility/./UtilityTests/LogChannelEnabledTest.LogVerboseThread (1729 of 2073) PASS: lldb-unit :: Utility/./UtilityTests/BinaryStreamTest.PutSLEB128EightBytes (1730 of 2073) PASS: lldb-shell :: ObjectFile/ELF/many-sections.s (1731 of 2073) PASS: lldb-unit :: UnwindAssembly/x86/./UnwindAssemblyx86Tests/Testx86AssemblyInspectionEngine.TestPopESI (1732 of 2073) PASS: lldb-unit :: Process/gdb-remote/./ProcessGdbRemoteTests/GDBRemoteCommunicationClientTest.ReadRegister (1733 of 2073) PASS: lldb-unit :: Utility/./UtilityTests/NameMatchesTest.StartsWith (1734 of 2073) PASS: lldb-api :: lang/c/forward/TestForwardDeclaration.py (1735 of 2073) PASS: lldb-api :: lang/objc/objc-runtime-ivars/TestRuntimeIvars.py (1736 of 2073) PASS: lldb-shell :: Commands/command-source.test (1737 of 2073) PASS: lldb-api :: tools/lldb-server/TestGdbRemoteProcessInfo.py (1738 of 2073) PASS: lldb-unit :: Utility/./UtilityTests/StreamTeeTest.GetStreamAtIndexOutOfBounds (1739 of 2073) PASS: lldb-shell :: SymbolFile/DWARF/dwarf5-debug_line.s (1740 of 2073) PASS: lldb-shell :: Watchpoint/SetErrorCases.test (1741 of 2073) PASS: lldb-unit :: Utility/./UtilityTests/StringLexerTest.Next (1742 of 2073) PASS: lldb-shell :: Process/TestEnvironment.test (1743 of 2073) PASS: lldb-unit :: Utility/./UtilityTests/BinaryStreamTest.PutULEB128Zero (1744 of 2073) PASS: lldb-shell :: SymbolFile/DWARF/clang-ast-from-dwarf-unamed-and-anon-structs.cpp (1745 of 2073) PASS: lldb-unit :: Utility/./UtilityTests/StringExtractorTest.GetHexU8_Underflow2 (1746 of 2073) UNSUPPORTED: lldb-shell :: SymbolFile/PDB/udt-layout.test (1747 of 2073) PASS: lldb-api :: functionalities/data-formatter/synthcapping/TestSyntheticCapping.py (1748 of 2073) PASS: lldb-unit :: UnwindAssembly/x86/./UnwindAssemblyx86Tests/Testx86AssemblyInspectionEngine.TestSpillRegToStackViaMOVi386 (1749 of 2073) PASS: lldb-unit :: UnwindAssembly/x86/./UnwindAssemblyx86Tests/Testx86AssemblyInspectionEngine.TestPushEAX (1750 of 2073) UNSUPPORTED: lldb-shell :: SymbolFile/DWARF/debug-names-compressed.cpp (1751 of 2073) PASS: lldb-api :: python_api/breakpoint/TestBreakpointAPI.py (1752 of 2073) UNSUPPORTED: lldb-shell :: Watchpoint/netbsd-nouserdbregs.test (1753 of 2073) PASS: lldb-api :: lang/c/stepping/TestThreadStepping.py (1754 of 2073) UNSUPPORTED: lldb-shell :: SymbolFile/DWARF/dir-separator-no-comp-dir.s (1755 of 2073) PASS: lldb-api :: commands/statistics/basic/TestStats.py (1756 of 2073) PASS: lldb-unit :: UnwindAssembly/x86/./UnwindAssemblyx86Tests/Testx86AssemblyInspectionEngine.Test32bitFramelessSmallStackFrame (1757 of 2073) PASS: lldb-unit :: Process/gdb-remote/./ProcessGdbRemoteTests/GDBRemoteClientBaseTest.SendContinueAndInterrupt2PacketBug (1758 of 2073) PASS: lldb-shell :: ObjectFile/ELF/gnu-debuglink.yaml (1759 of 2073) PASS: lldb-api :: functionalities/optimized_code/TestNoASanExceptionAfterEvalOP_piece.py (1760 of 2073) PASS: lldb-api :: functionalities/load_using_paths/TestLoadUsingPaths.py (1761 of 2073) PASS: lldb-unit :: Interpreter/./InterpreterTests/OptionArgParserTest.toBoolean (1762 of 2073) UNSUPPORTED: lldb-api :: functionalities/thread/concurrent_events/TestConcurrentWatchpointDelayWatchpointOneBreakpoint.py (1763 of 2073) PASS: lldb-unit :: Process/minidump/./LLDBMinidumpTests/MinidumpParserTest.GetPidWindows (1764 of 2073) PASS: lldb-api :: commands/settings/TestSettings.py (1765 of 2073) UNSUPPORTED: lldb-api :: commands/watchpoints/multiple_threads/TestWatchpointMultipleThreads.py (1766 of 2073) PASS: lldb-shell :: Quit/TestQuitExitCodeTooManyArgs.test (1767 of 2073) PASS: lldb-api :: lang/objc/objc_direct-methods/TestObjCDirectMethods.py (1768 of 2073) PASS: lldb-unit :: Utility/./UtilityTests/StringListTest.JoinSingle (1769 of 2073) PASS: lldb-unit :: Process/gdb-remote/./ProcessGdbRemoteTests/GDBRemoteCommunicationTest.ReadPacket_checksum (1770 of 2073) PASS: lldb-unit :: ScriptInterpreter/Python/./ScriptInterpreterPythonTests/PythonDataObjectsTest.TestPythonListToStructuredList (1771 of 2073) PASS: lldb-api :: commands/frame/diagnose/bad-reference/TestBadReference.py (1772 of 2073) UNSUPPORTED: lldb-api :: commands/watchpoints/hello_watchlocation/TestWatchLocation.py (1773 of 2073) PASS: lldb-unit :: Utility/./UtilityTests/StreamTest.PutCharNull (1774 of 2073) PASS: lldb-unit :: Language/CPlusPlus/./LanguageCPlusPlusTests/CPlusPlusLanguage.ExtractContextAndIdentifier (1775 of 2073) PASS: lldb-api :: macosx/save_crashlog/TestSaveCrashlog.py (1776 of 2073) PASS: lldb-api :: functionalities/plugins/python_os_plugin/stepping_plugin_threads/TestOSPluginStepping.py (1777 of 2073) PASS: lldb-api :: lang/objc/objc-ivar-protocols/TestIvarProtocols.py (1778 of 2073) PASS: lldb-unit :: Utility/./UtilityTests/StringExtractorTest.GetNameColonValueContainsColon (1779 of 2073) PASS: lldb-api :: commands/command/source/TestCommandSource.py (1780 of 2073) PASS: lldb-unit :: Expression/./ExpressionTests/DiagnosticManagerTest.HasFixits (1781 of 2073) PASS: lldb-unit :: UnwindAssembly/x86/./UnwindAssemblyx86Tests/Testx86AssemblyInspectionEngine.TestStackRealign32BitDisp_x86_64 (1782 of 2073) PASS: lldb-api :: functionalities/thread/concurrent_events/TestConcurrentSignalDelayBreak.py (1783 of 2073) PASS: lldb-unit :: Process/gdb-remote/./ProcessGdbRemoteTests/GDBRemoteCommunicationClientTest.SendGetTraceConfigPacket (1784 of 2073) PASS: lldb-unit :: Utility/./UtilityTests/OptionsWithRawTest.ArgsButNoDelimiter (1785 of 2073) PASS: lldb-unit :: Expression/./ExpressionTests/CppModuleConfigurationTest.MissingLibCpp (1786 of 2073) PASS: lldb-unit :: Expression/./ExpressionTests/DiagnosticManagerTest.PutStringSeverities (1787 of 2073) PASS: lldb-api :: functionalities/data-formatter/var-in-aggregate-misuse/TestVarInAggregateMisuse.py (1788 of 2073) PASS: lldb-api :: commands/expression/ir-interpreter-phi-nodes/TestIRInterpreterPHINodes.py (1789 of 2073) PASS: lldb-api :: commands/target/stop-hook/enable/TestTargetStopHookEnable.py (1790 of 2073) PASS: lldb-api :: functionalities/breakpoint/address_breakpoints/TestBadAddressBreakpoints.py (1791 of 2073) PASS: lldb-unit :: UnwindAssembly/x86/./UnwindAssemblyx86Tests/Testx86AssemblyInspectionEngine.TestPopRBP (1792 of 2073) PASS: lldb-unit :: ScriptInterpreter/Python/./ScriptInterpreterPythonTests/PythonDataObjectsTest.TestRun (1793 of 2073) PASS: lldb-unit :: ObjectFile/ELF/./ObjectFileELFTests/ObjectFileELFTest.SectionsResolveConsistently (1794 of 2073) PASS: lldb-unit :: Host/./HostTests/MainLoopTest.ReadObject (1795 of 2073) UNSUPPORTED: lldb-api :: benchmarks/turnaround/TestCompileRunToBreakpointTurnaround.py (1796 of 2073) UNSUPPORTED: lldb-api :: commands/expression/import_builtin_fileid/TestImportBuiltinFileID.py (1797 of 2073) PASS: lldb-api :: lang/cpp/global_variables/TestCPPGlobalVariables.py (1798 of 2073) PASS: lldb-api :: lang/objc/foundation/TestFoundationDisassembly.py (1799 of 2073) PASS: lldb-shell :: Quit/TestQuitExitCodeHexA.test (1800 of 2073) PASS: lldb-unit :: Utility/./UtilityTests/UriParserTest.LongPath (1801 of 2073) PASS: lldb-unit :: ObjectFile/PECOFF/./ObjectFilePECOFFTests/PECallFrameInfoTest.Frame_reg_eh (1802 of 2073) PASS: lldb-unit :: UnwindAssembly/x86/./UnwindAssemblyx86Tests/Testx86AssemblyInspectionEngine.TestPushRBP (1803 of 2073) PASS: lldb-unit :: UnwindAssembly/x86/./UnwindAssemblyx86Tests/Testx86AssemblyInspectionEngine.Test32BitOnlyInstruction (1804 of 2073) PASS: lldb-api :: functionalities/load_unload/TestLoadUnload.py (1805 of 2073) PASS: lldb-api :: types/TestShortTypeExpr.py (1806 of 2073) PASS: lldb-shell :: ObjectFile/MachO/lc_build_version_notools.yaml (1807 of 2073) PASS: lldb-unit :: Process/gdb-remote/./ProcessGdbRemoteTests/GDBRemoteCommunicationClientTest.WriteRegisterNoSuffix (1808 of 2073) PASS: lldb-unit :: Utility/./UtilityTests/StreamTeeTest.AppendStream (1809 of 2073) PASS: lldb-unit :: Utility/./UtilityTests/OptionsWithRawTest.ArgsButNoLeadingDash (1810 of 2073) PASS: lldb-unit :: Symbol/./SymbolTests/TestTypeSystemClang.TestNotDeletingUserCopyCstrDueToMoveCStr (1811 of 2073) PASS: lldb-unit :: Symbol/./SymbolTests/TestClangASTImporter.MetadataPropagationIndirectImport (1812 of 2073) PASS: lldb-unit :: Utility/./UtilityTests/FileSpecTest.FileAndDirectoryComponents (1813 of 2073) PASS: lldb-unit :: Process/minidump/./LLDBMinidumpTests/MinidumpParserTest.GetThreadContext_x86_64 (1814 of 2073) PASS: lldb-api :: commands/register/register/register_command/TestRegisters.py (1815 of 2073) PASS: lldb-unit :: Utility/./UtilityTests/CompletionRequest.FakeLastArg (1816 of 2073) PASS: lldb-unit :: Symbol/./SymbolTests/TestClangASTImporter.CompleteFwdDeclWithOtherOrigin (1817 of 2073) PASS: lldb-unit :: Utility/./UtilityTests/BinaryStreamTest.PutSLEB128ThreeBytes (1818 of 2073) PASS: lldb-api :: terminal/TestSTTYBeforeAndAfter.py (1819 of 2073) PASS: lldb-api :: functionalities/limit-debug-info/TestLimitDebugInfo.py (1820 of 2073) PASS: lldb-unit :: ObjectFile/Breakpad/./ObjectFileBreakpadTests/FileRecord.parse (1821 of 2073) PASS: lldb-api :: functionalities/data-formatter/cstring-utf8-summary/TestCstringUnicode.py (1822 of 2073) PASS: lldb-unit :: Utility/./UtilityTests/StringExtractorTest.GetHexU8_Underflow (1823 of 2073) PASS: lldb-unit :: Platform/Android/./AdbClientTests/AdbClientTest.CreateByDeviceId_ByEnvVar (1824 of 2073) PASS: lldb-unit :: Utility/./UtilityTests/ConstStringTest.UpdateMangledCounterpart (1825 of 2073) PASS: lldb-api :: commands/process/attach-resume/TestAttachResume.py (1826 of 2073) PASS: lldb-unit :: Utility/./UtilityTests/UriParserTest.SchemeHostSeparator4 (1827 of 2073) PASS: lldb-unit :: DataFormatter/./LLDBFormatterTests/StringPrinterTests.CxxASCII (1828 of 2073) PASS: lldb-api :: tools/lldb-server/inferior-crash/TestGdbRemoteAbort.py (1829 of 2073) PASS: lldb-unit :: Language/Highlighting/./HighlighterTests/HighlighterTest.ClangEmptyInput (1830 of 2073) PASS: lldb-unit :: Utility/./UtilityTests/LogChannelTest.Enable (1831 of 2073) UNSUPPORTED: lldb-api :: functionalities/data-formatter/data-formatter-stl/libstdcpp/list/TestDataFormatterStdList.py (1832 of 2073) PASS: lldb-unit :: Utility/./UtilityTests/DataExtractorTest.GetBitfield (1833 of 2073) PASS: lldb-unit :: Utility/./UtilityTests/AnsiTerminal.Incomplete (1834 of 2073) PASS: lldb-api :: types/TestShortType.py (1835 of 2073) PASS: lldb-unit :: SymbolFile/NativePDB/./SymbolFileNativePDBTests/PDBFPOProgramToDWARFExpressionTests.InvalidAssignmentMultiple (1836 of 2073) PASS: lldb-unit :: Utility/./UtilityTests/DataExtractorTest.GetCStrAtNullOffset (1837 of 2073) PASS: lldb-shell :: SymbolFile/DWARF/DW_TAG_basic_type_DW_ATE_UTF_nonC.ll (1838 of 2073) PASS: lldb-api :: tools/lldb-vscode/coreFile/TestVSCode_coreFile.py (1839 of 2073) PASS: lldb-unit :: Utility/./UtilityTests/XcodeSDKTest.MergeTest (1840 of 2073) UNSUPPORTED: lldb-api :: functionalities/thread/concurrent_events/TestConcurrentTwoWatchpointsOneSignal.py (1841 of 2073) PASS: lldb-unit :: SymbolFile/DWARF/./SymbolFileDWARFTests/SymbolFileDWARFTests.TestAbbrevValidAttrNullForm (1842 of 2073) PASS: lldb-api :: functionalities/gdb_remote_client/TestRegDefinitionInParts.py (1843 of 2073) UNSUPPORTED: lldb-api :: python_api/watchpoint/watchlocation/TestSetWatchlocation.py (1844 of 2073) PASS: lldb-api :: commands/settings/use_source_cache/TestUseSourceCache.py (1845 of 2073) PASS: lldb-unit :: Utility/./UtilityTests/PassiveReplayTest.InstrumentedBar (1846 of 2073) PASS: lldb-api :: commands/expression/import-std-module/empty-module/TestEmptyStdModule.py (1847 of 2073) PASS: lldb-unit :: Utility/./UtilityTests/RegularExpression.Empty (1848 of 2073) PASS: lldb-api :: lang/c/inlines/TestRedefinitionsInInlines.py (1849 of 2073) PASS: lldb-unit :: Platform/Android/./AdbClientTests/AdbClientTest.CreateByDeviceId (1850 of 2073) PASS: lldb-api :: functionalities/breakpoint/breakpoint_command/TestRegexpBreakCommand.py (1851 of 2073) UNSUPPORTED: lldb-shell :: SymbolFile/PDB/variables-locations.test (1852 of 2073) PASS: lldb-unit :: Utility/./UtilityTests/StringExtractorTest.GetHexU8_Exact_NoEof (1853 of 2073) PASS: lldb-api :: commands/settings/quoting/TestQuoting.py (1854 of 2073) PASS: lldb-unit :: Utility/./UtilityTests/BinaryStreamTest.PutSLEB128NineBytes (1855 of 2073) PASS: lldb-api :: functionalities/postmortem/netbsd-core/TestNetBSDCore.py (1856 of 2073) PASS: lldb-api :: functionalities/thread/exit_during_step/TestExitDuringStep.py (1857 of 2073) PASS: lldb-unit :: Utility/./UtilityTests/GeneratorTest.GetOrCreate (1858 of 2073) PASS: lldb-unit :: debugserver/./debugserverTests/RNBSocket.AnyListen (1859 of 2073) PASS: lldb-unit :: Expression/./ExpressionTests/DiagnosticManagerTest.AddDiagnostic (1860 of 2073) PASS: lldb-api :: functionalities/data-formatter/data-formatter-objc/TestDataFormatterObjCKVO.py (1861 of 2073) PASS: lldb-unit :: Expression/./ExpressionTests/CppModuleConfigurationTest.MissingUsrInclude (1862 of 2073) UNSUPPORTED: lldb-shell :: Register/x86-zmm-read.test (1863 of 2073) PASS: lldb-unit :: Utility/./UtilityTests/ReproducerTest.SetCapture (1864 of 2073) UNSUPPORTED: lldb-api :: functionalities/tty/TestTerminal.py (1865 of 2073) PASS: lldb-shell :: ObjectFile/ELF/build-id-case.yaml (1866 of 2073) PASS: lldb-unit :: Symbol/./SymbolTests/TestTypeSystemClang.TestIsClangType (1867 of 2073) PASS: lldb-unit :: Utility/./UtilityTests/XcodeSDKTest.SDKSupportsModules (1868 of 2073) PASS: lldb-api :: commands/expression/unicode-in-variable/TestUnicodeInVariable.py (1869 of 2073) UNSUPPORTED: lldb-api :: functionalities/process_save_core/TestProcessSaveCore.py (1870 of 2073) UNSUPPORTED: lldb-api :: functionalities/darwin_log/filter/regex/activity-chain/TestDarwinLogFilterRegexActivityChain.py (1871 of 2073) PASS: lldb-unit :: Utility/./UtilityTests/StreamTeeTest.CopyConstructor (1872 of 2073) PASS: lldb-api :: types/TestDoubleTypesExpr.py (1873 of 2073) UNSUPPORTED: lldb-api :: tools/lldb-server/TestGdbRemoteAuxvSupport.py (1874 of 2073) PASS: lldb-unit :: Utility/./UtilityTests/LogChannelTest.Disable (1875 of 2073) PASS: lldb-unit :: Utility/./UtilityTests/ArgsTest.ReplaceArgumentAtIndexOutOfRange (1876 of 2073) PASS: lldb-api :: commands/frame/diagnose/array/TestArray.py (1877 of 2073) UNSUPPORTED: lldb-api :: commands/watchpoints/multi_watchpoint_slots/TestWatchpointMultipleSlots.py (1878 of 2073) PASS: lldb-api :: functionalities/breakpoint/auto_continue/TestBreakpointAutoContinue.py (1879 of 2073) PASS: lldb-api :: commands/frame/select/TestFrameSelect.py (1880 of 2073) PASS: lldb-unit :: Utility/./UtilityTests/LogChannelEnabledTest.LLDB_LOG_ERROR (1881 of 2073) PASS: lldb-unit :: Expression/./ExpressionTests/DiagnosticManagerTest.GetStringSeverityLabels (1882 of 2073) PASS: lldb-api :: functionalities/thread/exit_during_expression/TestExitDuringExpression.py (1883 of 2073) PASS: lldb-unit :: Utility/./UtilityTests/VMRange.CollectionContains (1884 of 2073) PASS: lldb-api :: commands/expression/unwind_expression/TestUnwindExpression.py (1885 of 2073) PASS: lldb-unit :: Host/./HostTests/FileSystemTest.OpenErrno (1886 of 2073) PASS: lldb-unit :: UnwindAssembly/x86/./UnwindAssemblyx86Tests/Testx86AssemblyInspectionEngine.TestPushRBPWithREX (1887 of 2073) PASS: lldb-unit :: Utility/./UtilityTests/OptionsWithRawTest.UnterminatedQuote (1888 of 2073) PASS: lldb-api :: commands/expression/context-object/TestContextObject.py (1889 of 2073) PASS: lldb-api :: functionalities/var_path/TestVarPath.py (1890 of 2073) UNSUPPORTED: lldb-shell :: SymbolFile/NativePDB/function-types-builtins.cpp (1891 of 2073) PASS: lldb-api :: functionalities/data-formatter/data-formatter-skip-summary/TestDataFormatterSkipSummary.py (1892 of 2073) PASS: lldb-api :: functionalities/breakpoint/breakpoint_command/TestBreakpointCommand.py (1893 of 2073) PASS: lldb-unit :: Utility/./UtilityTests/ConstStringTest.FromMidOfBufferStringRef (1894 of 2073) PASS: lldb-api :: lang/cpp/class_types/TestClassTypes.py (1895 of 2073) PASS: lldb-shell :: ExecControl/StopHook/stop-hook.test (1896 of 2073) PASS: lldb-unit :: Utility/./UtilityTests/GeneratorTest.Create (1897 of 2073) PASS: lldb-api :: functionalities/data-formatter/data-formatter-objc/TestDataFormatterObjCNSDate.py (1898 of 2073) PASS: lldb-api :: python_api/process/TestProcessAPI.py (1899 of 2073) UNSUPPORTED: lldb-api :: lang/c/typedef/Testtypedef.py (1900 of 2073) PASS: lldb-unit :: Utility/./UtilityTests/DataExtractorTest.GetSLEB128_bit63 (1901 of 2073) PASS: lldb-shell :: ObjectFile/MachO/symtab.yaml (1902 of 2073) PASS: lldb-api :: functionalities/data-formatter/stringprinter/TestStringPrinter.py (1903 of 2073) PASS: lldb-unit :: Language/Highlighting/./HighlighterTests/HighlighterTest.ClangSquareBrackets (1904 of 2073) PASS: lldb-unit :: Utility/./UtilityTests/FileSpecTest.FormatFileSpec (1905 of 2073) PASS: lldb-unit :: SymbolFile/DWARF/./SymbolFileDWARFTests/SymbolFileDWARFTests.TestAbbrevOutOfOrder (1906 of 2073) PASS: lldb-shell :: Driver/TestHelp.test (1907 of 2073) UNSUPPORTED: lldb-api :: functionalities/darwin_log/filter/exact_match/message/TestDarwinLogFilterMatchMessage.py (1908 of 2073) PASS: lldb-unit :: Utility/./UtilityTests/RangeDataVector.FindEntryIndexesThatContain (1909 of 2073) PASS: lldb-unit :: Symbol/./SymbolTests/DWARFCallFrameInfoTest.Basic_dwarf3 (1910 of 2073) PASS: lldb-api :: lang/cpp/namespace/TestNamespaceLookup.py (1911 of 2073) UNSUPPORTED: lldb-api :: tools/intel-features/intel-pt/test/TestIntelPTSimpleBinary.py (1912 of 2073) PASS: lldb-api :: functionalities/mtc/simple/TestMTCSimple.py (1913 of 2073) UNSUPPORTED: lldb-api :: functionalities/tsan/cpp_global_location/TestTsanCPPGlobalLocation.py (1914 of 2073) PASS: lldb-api :: functionalities/breakpoint/global_constructor/TestBreakpointInGlobalConstructor.py (1915 of 2073) PASS: lldb-unit :: Symbol/./SymbolTests/TestTypeSystemClang.TestConvertAccessTypeToAccessSpecifier (1916 of 2073) PASS: lldb-api :: lang/cpp/function-qualifiers/TestCppFunctionQualifiers.py (1917 of 2073) PASS: lldb-unit :: UnwindAssembly/x86/./UnwindAssemblyx86Tests/Testx86AssemblyInspectionEngine.TestPushR14 (1918 of 2073) PASS: lldb-api :: functionalities/data-formatter/data-formatter-enum-format/TestDataFormatterEnumFormat.py (1919 of 2073) UNSUPPORTED: lldb-shell :: SymbolFile/NativePDB/ast-functions-msvc.cpp (1920 of 2073) UNSUPPORTED: lldb-api :: functionalities/thread/state/TestThreadStates.py (1921 of 2073) PASS: lldb-unit :: Utility/./UtilityTests/StreamTest.QuotedCString (1922 of 2073) PASS: lldb-api :: functionalities/ptr_refs/TestPtrRefs.py (1923 of 2073) PASS: lldb-unit :: Utility/./UtilityTests/StringExtractorTest.GetHexBytes_OddPair2 (1924 of 2073) UNSUPPORTED: lldb-api :: functionalities/thread/concurrent_events/TestConcurrentSignalWatchBreak.py (1925 of 2073) PASS: lldb-unit :: Process/minidump/./LLDBMinidumpTests/MinidumpParserTest.GetThreadsAndGetThreadContext (1926 of 2073) PASS: lldb-shell :: ObjectFile/MachO/lc_build_version.yaml (1927 of 2073) PASS: lldb-unit :: Utility/./UtilityTests/DataExtractorTest.UncommonAddressSize (1928 of 2073) PASS: lldb-unit :: Core/./LLDBCoreTests/MangledTest.EmptyForInvalidName (1929 of 2073) PASS: lldb-api :: python_api/sbstructureddata/TestStructuredDataAPI.py (1930 of 2073) PASS: lldb-unit :: Process/gdb-remote/./ProcessGdbRemoteTests/GDBRemoteCommunicationClientTest.SendGetMetaDataPacket (1931 of 2073) UNSUPPORTED: lldb-shell :: Register/aarch64-fp-read.test (1932 of 2073) UNSUPPORTED: lldb-api :: benchmarks/expression/TestRepeatedExprs.py (1933 of 2073) PASS: lldb-api :: commands/expression/radar_9531204/TestPrintfAfterUp.py (1934 of 2073) PASS: lldb-shell :: ObjectFile/PECOFF/sections-names.yaml (1935 of 2073) PASS: lldb-unit :: Utility/./UtilityTests/BinaryStreamTest.PutULEB128NineBytes (1936 of 2073) UNSUPPORTED: lldb-shell :: Register/x86-64-ymm16-write.test (1937 of 2073) PASS: lldb-api :: commands/log/invalid-args/TestInvalidArgsLog.py (1938 of 2073) PASS: lldb-shell :: Reproducer/TestMultipleTargets.test (1939 of 2073) PASS: lldb-api :: macosx/thread-names/TestInterruptThreadNames.py (1940 of 2073) PASS: lldb-unit :: Target/./TargetTests/ModuleCacheTest.GetAndPutUuidExists (1941 of 2073) PASS: lldb-unit :: Utility/./UtilityTests/StreamTest.SetIndentLevel (1942 of 2073) PASS: lldb-api :: functionalities/thread/concurrent_events/TestConcurrentTwoBreakpointsOneDelaySignal.py (1943 of 2073) PASS: lldb-unit :: Utility/./UtilityTests/CompletionRequest.TestCompletionOwnership (1944 of 2073) PASS: lldb-unit :: Expression/./ExpressionTests/DiagnosticManagerTest.AppendMessageAttachToLastDiag (1945 of 2073) UNSUPPORTED: lldb-api :: functionalities/data-formatter/data-formatter-stl/libstdcpp/vector/TestDataFormatterStdVector.py (1946 of 2073) PASS: lldb-api :: functionalities/data-formatter/data-formatter-synth/TestDataFormatterSynth.py (1947 of 2073) PASS: lldb-unit :: Utility/./UtilityTests/FileSpecTest.RemoveLastPathComponent (1948 of 2073) PASS: lldb-api :: commands/expression/import-std-module/shared_ptr-dbg-info-content/TestSharedPtrDbgInfoContentFromStdModule.py (1949 of 2073) PASS: lldb-unit :: Utility/./UtilityTests/UriParserTest.SchemeHostSeparator3 (1950 of 2073) PASS: lldb-unit :: Utility/./UtilityTests/ArgsTest.TestSingleArg (1951 of 2073) PASS: lldb-api :: tools/lldb-server/TestGdbRemoteSingleStep.py (1952 of 2073) PASS: lldb-shell :: ObjectFile/ELF/base-address.yaml (1953 of 2073) PASS: lldb-unit :: ScriptInterpreter/Python/./ScriptInterpreterPythonTests/PythonDataObjectsTest.TestBorrowedReferences (1954 of 2073) PASS: lldb-api :: python_api/interpreter/TestRunCommandInterpreterAPI.py (1955 of 2073) PASS: lldb-unit :: Host/./HostTests/MainLoopTest.UnmonitoredSignal (1956 of 2073) UNSUPPORTED: lldb-shell :: SymbolFile/DWARF/find-basic-function.cpp (1957 of 2073) PASS: lldb-api :: tools/lldb-vscode/breakpoint-events/TestVSCode_breakpointEvents.py (1958 of 2073) PASS: lldb-api :: lang/objc/ivar-IMP/TestObjCiVarIMP.py (1959 of 2073) PASS: lldb-unit :: Utility/./UtilityTests/RangeTest.ContainsAddrInvalid (1960 of 2073) PASS: lldb-api :: lang/objc/foundation/TestObjectDescriptionAPI.py (1961 of 2073) PASS: lldb-api :: functionalities/type_completion/TestTypeCompletion.py (1962 of 2073) PASS: lldb-unit :: Utility/./UtilityTests/ArgsTest.StringListConstructor (1963 of 2073) PASS: lldb-api :: python_api/disassemble-raw-data/TestDisassembleRawData.py (1964 of 2073) UNSUPPORTED: lldb-api :: benchmarks/libcxxmap/TestBenchmarkLibcxxMap.py (1965 of 2073) UNSUPPORTED: lldb-shell :: SymbolFile/PDB/func-symbols.test (1966 of 2073) PASS: lldb-api :: commands/expression/regression-access-function-template-in-record/TestRegressionAccessFunctionTemplateInRecord.py (1967 of 2073) PASS: lldb-shell :: Settings/TestSettingsSet.test (1968 of 2073) PASS: lldb-unit :: SymbolFile/NativePDB/./SymbolFileNativePDBTests/PDBFPOProgramToDWARFExpressionTests.UnsupportedRASearch (1969 of 2073) PASS: lldb-unit :: Utility/./UtilityTests/DataExtractorTest.GetMaxU64_unchecked (1970 of 2073) PASS: lldb-unit :: Utility/./UtilityTests/StringLexerTest.NextIf (1971 of 2073) PASS: lldb-shell :: ObjectFile/ELF/duplicate-section.yaml (1972 of 2073) PASS: lldb-shell :: SymbolFile/DWARF/debug_rnglists-dwo.s (1973 of 2073) UNSUPPORTED: lldb-api :: python_api/event/TestEvents.py (1974 of 2073) UNSUPPORTED: lldb-api :: commands/register/register/intel_xtended_registers/TestMPXRegisters.py (1975 of 2073) PASS: lldb-api :: functionalities/thread/concurrent_events/TestConcurrentBreakpointOneDelayBreakpointThreads.py (1976 of 2073) PASS: lldb-api :: lang/cpp/this/TestCPPThis.py (1977 of 2073) PASS: lldb-shell :: Driver/TestRepl.test (1978 of 2073) PASS: lldb-unit :: ScriptInterpreter/Python/./ScriptInterpreterPythonTests/PythonDataObjectsTest.TestOwnedReferences (1979 of 2073) PASS: lldb-shell :: Host/TestCustomShell.test (1980 of 2073) UNSUPPORTED: lldb-api :: functionalities/tsan/thread_numbers/TestTsanThreadNumbers.py (1981 of 2073) PASS: lldb-unit :: SymbolFile/NativePDB/./SymbolFileNativePDBTests/PDBFPOProgramToDWARFExpressionTests.InvalidAssignmentSingle (1982 of 2073) PASS: lldb-api :: python_api/function_symbol/TestSymbolAPI.py (1983 of 2073) PASS: lldb-api :: functionalities/breakpoint/step_over_breakpoint/TestStepOverBreakpoint.py (1984 of 2073) PASS: lldb-api :: iohandler/resize/TestIOHandlerResizeNoEditline.py (1985 of 2073) PASS: lldb-api :: lang/cpp/incomplete-types/TestCppIncompleteTypes.py (1986 of 2073) PASS: lldb-shell :: Minidump/no-process-id.yaml (1987 of 2073) PASS: lldb-unit :: Utility/./UtilityTests/StreamTest.PutRawBytesToLittleEndian (1988 of 2073) PASS: lldb-unit :: SymbolFile/NativePDB/./SymbolFileNativePDBTests/PDBFPOProgramToDWARFExpressionTests.MissingTargetRegister (1989 of 2073) PASS: lldb-api :: functionalities/data-formatter/data-formatter-advanced/TestDataFormatterAdv.py (1990 of 2073) PASS: lldb-unit :: Utility/./UtilityTests/VMRange.ContainsAddr (1991 of 2073) PASS: lldb-unit :: Utility/./UtilityTests/PassiveReplayTest.InstrumentedBarPtr (1992 of 2073) PASS: lldb-api :: functionalities/target_var/TestTargetVar.py (1993 of 2073) PASS: lldb-unit :: Utility/./UtilityTests/ScalarTest.ComparisonFloat (1994 of 2073) PASS: lldb-shell :: Settings/TestFrameFormatMangling.test (1995 of 2073) PASS: lldb-unit :: Utility/./UtilityTests/StateTest.Formatv (1996 of 2073) UNSUPPORTED: lldb-api :: benchmarks/stepping/TestSteppingSpeed.py (1997 of 2073) PASS: lldb-unit :: Utility/./UtilityTests/ArgsTest.TestSingleQuotedArgWithSpace (1998 of 2073) PASS: lldb-unit :: SymbolFile/DWARF/./SymbolFileDWARFTests/SymbolFileDWARFTests.TestAbbrevInvalidNULLTag (1999 of 2073) PASS: lldb-unit :: Core/./LLDBCoreTests/MangledTest.NameIndexes_FindFunctionSymbols (2000 of 2073) PASS: lldb-unit :: Utility/./UtilityTests/DataExtractorTest.GetULEB128_bit63 (2001 of 2073) PASS: lldb-unit :: Utility/./UtilityTests/VMRange.Ordering (2002 of 2073) PASS: lldb-unit :: ScriptInterpreter/Python/./ScriptInterpreterPythonTests/PythonDataObjectsTest.TestPythonIntegerToStructuredInteger (2003 of 2073) PASS: lldb-unit :: SymbolFile/DWARF/./SymbolFileDWARFTests/SymbolFileDWARFTests.TestAbilitiesForDWARF (2004 of 2073) PASS: lldb-unit :: Utility/./UtilityTests/StringListTest.LongestCommonPrefixNoPrefix (2005 of 2073) PASS: lldb-unit :: ScriptInterpreter/Python/./ScriptInterpreterPythonTests/PythonDataObjectsTest.TestGlobalNameResolutionNoDot (2006 of 2073) PASS: lldb-api :: commands/expression/vector_of_enums/TestVectorOfEnums.py (2007 of 2073) PASS: lldb-shell :: Breakpoint/debug_addrx.test (2008 of 2073) PASS: lldb-api :: lang/cpp/class-template-parameter-pack/TestClassTemplateParameterPack.py (2009 of 2073) PASS: lldb-api :: source-manager/TestSourceManager.py (2010 of 2073) PASS: lldb-api :: functionalities/gdb_remote_client/TestNestedRegDefinitions.py (2011 of 2073) PASS: lldb-api :: functionalities/stats_api/TestStatisticsAPI.py (2012 of 2073) PASS: lldb-shell :: Commands/command-regex-unalias.test (2013 of 2073) UNSUPPORTED: lldb-api :: functionalities/darwin_log/source/debug/TestDarwinLogSourceDebug.py (2014 of 2073) PASS: lldb-api :: functionalities/thread/jump/TestThreadJump.py (2015 of 2073) PASS: lldb-unit :: Utility/./UtilityTests/DataExtractorTest.GetMaxS64 (2016 of 2073) PASS: lldb-api :: commands/expression/import-std-module/forward_list/TestForwardListFromStdModule.py (2017 of 2073) PASS: lldb-api :: functionalities/gdb_remote_client/TestRecognizeBreakpoint.py (2018 of 2073) PASS: lldb-api :: lang/cpp/thread_local/TestThreadLocal.py (2019 of 2073) PASS: lldb-api :: lang/cpp/signed_types/TestSignedTypes.py (2020 of 2073) PASS: lldb-unit :: Utility/./UtilityTests/RangeDataVector.FindEntryIndexesThatContain_Overlap (2021 of 2073) PASS: lldb-unit :: UnwindAssembly/x86/./UnwindAssemblyx86Tests/Testx86AssemblyInspectionEngine.TestPush0 (2022 of 2073) PASS: lldb-unit :: Language/Highlighting/./HighlighterTests/HighlighterTest.DefaultHighlighter (2023 of 2073) PASS: lldb-api :: functionalities/data-formatter/vector-types/TestVectorTypesFormatting.py (2024 of 2073) PASS: lldb-unit :: Utility/./UtilityTests/StringListTest.InsertStringAtIndexStart (2025 of 2073) PASS: lldb-shell :: Minidump/memory-region.yaml (2026 of 2073) PASS: lldb-api :: lang/objc/foundation/TestRuntimeTypes.py (2027 of 2073) PASS: lldb-unit :: Utility/./UtilityTests/ScalarTest.Scalar_512 (2028 of 2073) UNSUPPORTED: lldb-api :: functionalities/darwin_log/filter/exact_match/activity/TestDarwinLogFilterMatchActivity.py (2029 of 2073) UNSUPPORTED: lldb-shell :: Unwind/unwind-plan-dwarf-dump.test (2030 of 2073) PASS: lldb-api :: functionalities/step_scripted/TestStepScripted.py (2031 of 2073) PASS: lldb-shell :: ObjectFile/PECOFF/basic-info.yaml (2032 of 2073) PASS: lldb-api :: functionalities/reproducers/attach/TestReproducerAttach.py (2033 of 2073) UNSUPPORTED: lldb-api :: lang/c/unicode/TestUnicodeSymbols.py (2034 of 2073) PASS: lldb-unit :: Utility/./UtilityTests/DataExtractorTest.GetCStrAtEnd (2035 of 2073) UNSUPPORTED: lldb-shell :: Unwind/eh-frame-small-fde.test (2036 of 2073) PASS: lldb-shell :: Unwind/trap_frame_sym_ctx.test (2037 of 2073) UNSUPPORTED: lldb-api :: lang/objc/rdar-12408181/TestRdar12408181.py (2038 of 2073) PASS: lldb-unit :: Utility/./UtilityTests/StringListTest.AppendStringStdString (2039 of 2073) UNSUPPORTED: lldb-api :: lang/cpp/static_members/TestCPPStaticMembers.py (2040 of 2073) PASS: lldb-unit :: Utility/./UtilityTests/StringListTest.SplitIntoLinesSingleTrailingCR (2041 of 2073) PASS: lldb-unit :: Host/./HostTests/SocketTest.TCPGetConnectURI (2042 of 2073) PASS: lldb-api :: lang/cpp/namespace/TestNamespace.py (2043 of 2073) PASS: lldb-shell :: Commands/command-breakpoint-col.test (2044 of 2073) PASS: lldb-unit :: Utility/./UtilityTests/StreamTest.PutHex32ByteOrderBig (2045 of 2073) PASS: lldb-unit :: Utility/./UtilityTests/StreamTest.AddressPrefix (2046 of 2073) PASS: lldb-api :: commands/expression/import-std-module/unique_ptr/TestUniquePtrFromStdModule.py (2047 of 2073) PASS: lldb-unit :: Utility/./UtilityTests/StatusTest.Formatv (2048 of 2073) PASS: lldb-unit :: Utility/./UtilityTests/BinaryStreamTest.PutSLEB128SevenBytes (2049 of 2073) PASS: lldb-api :: lang/c/local_types/TestUseClosestType.py (2050 of 2073) PASS: lldb-shell :: Quit/TestQuitExitCode30.test (2051 of 2073) PASS: lldb-unit :: Process/gdb-remote/./ProcessGdbRemoteTests/GDBRemoteCommunicationServerTest.SendErrorResponse_ErrorNumber (2052 of 2073) PASS: lldb-unit :: Utility/./UtilityTests/VMRange.SetEndAddress (2053 of 2073) PASS: lldb-api :: lang/c/local_variables/TestLocalVariables.py (2054 of 2073) PASS: lldb-unit :: Utility/./UtilityTests/StreamTeeTest.GetStreamAtIndexOutOfBoundsEmpty (2055 of 2073) PASS: lldb-unit :: UnwindAssembly/x86/./UnwindAssemblyx86Tests/Testx86AssemblyInspectionEngine.TestPushEBX (2056 of 2073) PASS: lldb-api :: functionalities/breakpoint/comp_dir_symlink/TestCompDirSymLink.py (2057 of 2073) PASS: lldb-api :: python_api/lldbutil/frame/TestFrameUtils.py (2058 of 2073) PASS: lldb-api :: lang/objc/blocks/TestObjCIvarsInBlocks.py (2059 of 2073) PASS: lldb-shell :: Reproducer/Functionalities/TestImageList.test (2060 of 2073) PASS: lldb-api :: lang/cpp/stl/TestStdCXXDisassembly.py (2061 of 2073) PASS: lldb-api :: functionalities/data-formatter/data-formatter-stl/libcxx/list/TestDataFormatterLibcxxList.py (2062 of 2073) PASS: lldb-shell :: Reproducer/TestDump.test (2063 of 2073) PASS: lldb-api :: types/TestFloatTypesExpr.py (2064 of 2073) PASS: lldb-api :: functionalities/breakpoint/breakpoint_set_restart/TestBreakpointSetRestart.py (2065 of 2073) PASS: lldb-api :: commands/expression/issue_11588/Test11588.py (2066 of 2073) PASS: lldb-api :: functionalities/type_lookup/TestTypeLookup.py (2067 of 2073) PASS: lldb-api :: lang/objc/rdar-11355592/TestRdar11355592.py (2068 of 2073) PASS: lldb-api :: lang/objc/exceptions/TestObjCExceptions.py (2069 of 2073) PASS: lldb-api :: lang/objc/objc-static-method/TestObjCStaticMethod.py (2070 of 2073) PASS: lldb-api :: commands/expression/persist_objc_pointeetype/TestPersistObjCPointeeType.py (2071 of 2073) PASS: lldb-api :: commands/target/basic/TestTargetCommand.py (2072 of 2073) UNSUPPORTED: lldb-api :: functionalities/thread/create_during_step/TestCreateDuringStep.py (2073 of 2073) Slowest Tests: -------------------------------------------------------------------------- 90.77s: lldb-api :: tools/lldb-server/TestLldbGdbServer.py 69.20s: lldb-api :: lang/objc/foundation/TestFoundationDisassembly.py 58.84s: lldb-api :: api/multithreaded/TestMultithreaded.py 58.63s: lldb-api :: lang/objc/hidden-ivars/TestHiddenIvars.py 53.13s: lldb-api :: lang/objc/foundation/TestObjCMethods.py 51.48s: lldb-api :: tools/lldb-server/TestAppleSimulatorOSType.py 45.01s: lldb-api :: lang/objc/exceptions/TestObjCExceptions.py 36.17s: lldb-api :: lang/objc/objc-new-syntax/TestObjCNewSyntaxLiteral.py 35.58s: lldb-api :: lang/objc/real-definition/TestRealDefinition.py 35.51s: lldb-api :: types/TestLongTypesExpr.py 32.97s: lldb-api :: tools/lldb-server/TestGdbRemoteThreadsInStopReply.py 30.91s: lldb-api :: lang/cpp/namespace/TestNamespaceLookup.py 27.69s: lldb-api :: lang/objc/foundation/TestObjCMethodsString.py 27.61s: lldb-api :: lang/objc/foundation/TestObjCMethodsNSError.py 26.93s: lldb-api :: lang/objc/objc-new-syntax/TestObjCNewSyntaxArray.py 26.74s: lldb-api :: lang/objc/objc-new-syntax/TestObjCNewSyntaxDictionary.py 26.04s: lldb-api :: commands/settings/TestSettings.py 25.51s: lldb-api :: functionalities/load_unload/TestLoadUnload.py 23.03s: lldb-api :: types/TestLongTypes.py 20.74s: lldb-api :: commands/register/register/register_command/TestRegisters.py

Hide Details

Tests Times: -------------------------------------------------------------------------- [ Range ] :: [ Percentage ] :: [ Count ] -------------------------------------------------------------------------- [90.0s,95.0s) :: [ ] :: [ 1/2073] [85.0s,90.0s) :: [ ] :: [ 0/2073] [80.0s,85.0s) :: [ ] :: [ 0/2073] [75.0s,80.0s) :: [ ] :: [ 0/2073] [70.0s,75.0s) :: [ ] :: [ 1/2073] [65.0s,70.0s) :: [ ] :: [ 0/2073] [60.0s,65.0s) :: [ ] :: [ 2/2073] [55.0s,60.0s) :: [ ] :: [ 1/2073] [50.0s,55.0s) :: [ ] :: [ 1/2073] [45.0s,50.0s) :: [ ] :: [ 1/2073] [40.0s,45.0s) :: [ ] :: [ 0/2073] [35.0s,40.0s) :: [ ] :: [ 3/2073] [30.0s,35.0s) :: [ ] :: [ 2/2073] [25.0s,30.0s) :: [ ] :: [ 6/2073] [20.0s,25.0s) :: [ ] :: [ 6/2073] [15.0s,20.0s) :: [ ] :: [ 18/2073] [10.0s,15.0s) :: [* ] :: [ 85/2073] [ 5.0s,10.0s) :: [*** ] :: [ 173/2073] [ 0.0s, 5.0s) :: [********************************** ] :: [1773/2073] -------------------------------------------------------------------------- ******************** Failed Tests (1): lldb-api :: commands/expression/weak_symbols/TestWeakSymbols.py

Hide Details

Hide Details

Testing Time: 286.75s Unsupported : 266 Passed : 1801 Expectedly Failed: 5 Failed : 1 FAILED: tools/lldb/test/CMakeFiles/check-lldb-lit cd /Users/buildslave/jenkins/workspace/lldb-cmake-matrix/lldb-build/tools/lldb/test && /usr/local/Frameworks/Python.framework/Versions/3.7/bin/python3.7 /Users/buildslave/jenkins/workspace/lldb-cmake-matrix/lldb-build/./bin/llvm-lit -v --time-tests --shuffle --xunit-xml-output=/Users/buildslave/jenkins/workspace/lldb-cmake-matrix/test/results.xml -v /Users/buildslave/jenkins/workspace/lldb-cmake-matrix/lldb-build/tools/lldb/test ninja: build stopped: subcommand failed. Command failed: Command '['/usr/bin/env', 'TERM=vt100', '/usr/local/bin/ninja', '-v', 'check-lldb']' returned non-zero exit status 1. Command: ['/usr/bin/env', 'TERM=vt100', '/usr/local/bin/ninja', '-v', 'check-lldb'] + set -e [Pipeline] } [Pipeline] // timeout [Pipeline] junit Recording test results [Pipeline] } [Pipeline] // stage [Pipeline] } [Pipeline] // withEnv [Pipeline] } [Pipeline] // node [Pipeline] End of Pipeline Finished: UNSTABLE