FailedConsole Output

Skipping 9,094 KB.. Full Log
emoryRegionInfoFromMemoryList (1552 of 2028)
FAIL: lldb-api :: commands/expression/call-throws/TestCallThatThrows.py (1553 of 2028)
******************** TEST 'lldb-api :: commands/expression/call-throws/TestCallThatThrows.py' FAILED ********************
Script:
--
/Users/buildslave/jenkins/workspace/lldb-cmake-sanitized/lldb-build/lldb-test-build.noindex/copied-system-python /Users/buildslave/jenkins/workspace/lldb-cmake-sanitized/llvm-project/lldb/test/API/dotest.py --arch x86_64 -s /Users/buildslave/jenkins/workspace/lldb-cmake-sanitized/lldb-build/lldb-test-traces -S nm -u CXXFLAGS -u CFLAGS --codesign-identity lldb_codesign --server /Users/buildslave/jenkins/workspace/lldb-cmake-sanitized/lldb-build/./bin/debugserver --arch x86_64 --build-dir /Users/buildslave/jenkins/workspace/lldb-cmake-sanitized/lldb-build/lldb-test-build.noindex -s=/Users/buildslave/jenkins/workspace/lldb-cmake-sanitized/test/logs -t --env TERM=vt100 --env LLVM_LIBS_DIR=/Users/buildslave/jenkins/workspace/lldb-cmake-sanitized/lldb-build/./lib --inferior-env ASAN_OPTIONS=detect_stack_use_after_return=1 --inferior-env DYLD_INSERT_LIBRARIES=/Users/buildslave/jenkins/workspace/lldb-cmake-sanitized/host-compiler/lib/clang/11.0.0/lib/darwin/libclang_rt.asan_osx_dynamic.dylib --build-dir /Users/buildslave/jenkins/workspace/lldb-cmake-sanitized/lldb-build/lldb-test-build.noindex --lldb-module-cache-dir /Users/buildslave/jenkins/workspace/lldb-cmake-sanitized/lldb-build/lldb-test-build.noindex/module-cache-lldb/lldb-api --clang-module-cache-dir /Users/buildslave/jenkins/workspace/lldb-cmake-sanitized/lldb-build/lldb-test-build.noindex/module-cache-clang/lldb-api --executable /Users/buildslave/jenkins/workspace/lldb-cmake-sanitized/lldb-build/./bin/lldb --compiler /Users/buildslave/jenkins/workspace/lldb-cmake-sanitized/lldb-build/./bin/clang --dsymutil /Users/buildslave/jenkins/workspace/lldb-cmake-sanitized/lldb-build/./bin/dsymutil --filecheck /Users/buildslave/jenkins/workspace/lldb-cmake-sanitized/lldb-build/./bin/FileCheck --lldb-libs-dir /Users/buildslave/jenkins/workspace/lldb-cmake-sanitized/lldb-build/./lib /Users/buildslave/jenkins/workspace/lldb-cmake-sanitized/llvm-project/lldb/test/API/commands/expression/call-throws -p TestCallThatThrows.py
--
Exit Code: -6

Hide Details

Command Output (stdout): -- lldb version 11.0.99 clang revision 2768edfff19a170faca35a8c63163c8bb1b67382 llvm revision 2768edfff19a170faca35a8c63163c8bb1b67382

Hide Details

-- Command Output (stderr): -- Assertion failed: (tokenKind == tok::kw___bridge_retain), function ParseParenExpression, file /Users/buildslave/jenkins/workspace/lldb-cmake-sanitized/llvm-project/clang/lib/Parse/ParseExpr.cpp, line 2804.

Hide Details

--

Hide Details

******************** PASS: lldb-unit :: Utility/./UtilityTests/ReproducerTest.SetCapture (1554 of 2028) PASS: lldb-unit :: Target/./TargetTests/MCBasedABI.MapRegisterName (1555 of 2028) PASS: lldb-shell :: ObjectFile/ELF/compressed-sections.yaml (1556 of 2028) PASS: lldb-shell :: SymbolFile/DWARF/find-inline-method.s (1557 of 2028) PASS: lldb-unit :: Utility/./UtilityTests/UUIDTest.StringConverion (1558 of 2028) PASS: lldb-unit :: Symbol/./SymbolTests/TestTypeSystemClang.AddMethodToObjCObjectType (1559 of 2028) PASS: lldb-api :: commands/expression/import-std-module/unique_ptr/TestUniquePtrFromStdModule.py (1560 of 2028) PASS: lldb-api :: functionalities/tail_call_frames/disambiguate_paths_to_common_sink/TestDisambiguatePathsToCommonSink.py (1561 of 2028) PASS: lldb-api :: lang/cpp/unique-types/TestUniqueTypes.py (1562 of 2028) PASS: lldb-api :: functionalities/optimized_code/TestNoASanExceptionAfterEvalOP_piece.py (1563 of 2028) PASS: lldb-api :: functionalities/thread/thread_specific_break/TestThreadSpecificBreakpoint.py (1564 of 2028) PASS: lldb-unit :: Process/gdb-remote/./ProcessGdbRemoteTests/GDBRemoteCommunicationClientTest.WriteRegister (1565 of 2028) PASS: lldb-unit :: Host/./HostTests/FileSystemTest.EmptyTest (1566 of 2028) PASS: lldb-unit :: Expression/./ExpressionTests/DiagnosticManagerTest.GetStringSeverityLabels (1567 of 2028) PASS: lldb-api :: functionalities/thread/exit_during_break/TestExitDuringBreak.py (1568 of 2028) PASS: lldb-unit :: UnwindAssembly/x86/./UnwindAssemblyx86Tests/Testx86AssemblyInspectionEngine.TestPushECX (1569 of 2028) PASS: lldb-api :: commands/expression/inline-namespace/TestInlineNamespace.py (1570 of 2028) PASS: lldb-unit :: UnwindAssembly/x86/./UnwindAssemblyx86Tests/Testx86AssemblyInspectionEngine.TestPopEDI (1571 of 2028) PASS: lldb-unit :: UnwindAssembly/x86/./UnwindAssemblyx86Tests/Testx86AssemblyInspectionEngine.TestSpillRegToStackViaMOVi386 (1572 of 2028) PASS: lldb-unit :: Utility/./UtilityTests/StreamTeeTest.AppendStream (1573 of 2028) PASS: lldb-api :: lang/objc/objc-static-method-stripped/TestObjCStaticMethodStripped.py (1574 of 2028) PASS: lldb-api :: functionalities/data-formatter/data-formatter-enum-format/TestDataFormatterEnumFormat.py (1575 of 2028) PASS: lldb-api :: functionalities/non-overlapping-index-variable-i/TestIndexVariable.py (1576 of 2028) PASS: lldb-unit :: Symbol/./SymbolTests/TestClangASTImporter.CanImportInvalidType (1577 of 2028) PASS: lldb-unit :: ScriptInterpreter/Python/./ScriptInterpreterPythonTests/PythonDataObjectsTest.TestPythonCallableCheck (1578 of 2028) PASS: lldb-unit :: Symbol/./SymbolTests/TestClangASTImporter.MetadataPropagationAfterCopying (1579 of 2028) UNSUPPORTED: lldb-shell :: SymbolFile/dissassemble-entry-point.s (1580 of 2028) PASS: lldb-api :: functionalities/thread_plan/TestThreadPlanCommands.py (1581 of 2028) PASS: lldb-api :: python_api/sbstructureddata/TestStructuredDataAPI.py (1582 of 2028) PASS: lldb-api :: functionalities/data-formatter/type_summary_list_script/TestTypeSummaryListScript.py (1583 of 2028) PASS: lldb-api :: lang/cpp/multiple-inheritance/TestCppMultipleInheritance.py (1584 of 2028) PASS: lldb-unit :: Utility/./UtilityTests/ScalarTest.Division (1585 of 2028) PASS: lldb-unit :: Language/Highlighting/./HighlighterTests/HighlighterTest.ClangBraces (1586 of 2028) PASS: lldb-api :: lang/c/shared_lib/TestSharedLib.py (1587 of 2028) PASS: lldb-api :: commands/expression/fixits/TestFixIts.py (1588 of 2028) PASS: lldb-api :: functionalities/load_using_paths/TestLoadUsingPaths.py (1589 of 2028) PASS: lldb-api :: python_api/value/empty_class/TestValueAPIEmptyClass.py (1590 of 2028) PASS: lldb-api :: lang/c/local_types/TestUseClosestType.py (1591 of 2028) UNSUPPORTED: lldb-shell :: SymbolFile/NativePDB/ast-functions-msvc.cpp (1592 of 2028) PASS: lldb-api :: functionalities/data-formatter/refpointer-recursion/TestDataFormatterRefPtrRecursion.py (1593 of 2028) PASS: lldb-unit :: UnwindAssembly/x86/./UnwindAssemblyx86Tests/Testx86AssemblyInspectionEngine.TestStackRealign8BitDisp_i386 (1594 of 2028) PASS: lldb-unit :: Signals/./SignalsTests/UnixSignalsTest.GetFilteredSignals (1595 of 2028) PASS: lldb-api :: lang/c/register_variables/TestRegisterVariables.py (1596 of 2028) PASS: lldb-api :: functionalities/thread/concurrent_events/TestConcurrentDelayedCrashWithBreakpointWatchpoint.py (1597 of 2028) PASS: lldb-api :: commands/expression/top-level/TestTopLevelExprs.py (1598 of 2028) PASS: lldb-unit :: Utility/./UtilityTests/StringExtractorTest.GetHexU8_Underflow (1599 of 2028) PASS: lldb-unit :: Utility/./UtilityTests/StringListTest.ShiftStdString (1600 of 2028) PASS: lldb-api :: lang/cpp/namespace/TestNamespaceLookup.py (1601 of 2028) PASS: lldb-unit :: ScriptInterpreter/Python/./ScriptInterpreterPythonTests/PythonDataObjectsTest.TestPythonByteArray (1602 of 2028) PASS: lldb-unit :: Utility/./UtilityTests/BinaryStreamTest.PutULEB128One (1603 of 2028) PASS: lldb-shell :: Driver/TestRepl.test (1604 of 2028) PASS: lldb-api :: lang/objc/foundation/TestSymbolTable.py (1605 of 2028) PASS: lldb-unit :: Expression/./ExpressionTests/DiagnosticManagerTest.PutStringMultiple (1606 of 2028) PASS: lldb-unit :: Utility/./UtilityTests/BinaryStreamTest.PutSLEB128SevenBytes (1607 of 2028) PASS: lldb-api :: types/TestDoubleTypes.py (1608 of 2028) PASS: lldb-api :: commands/expression/save_jit_objects/TestSaveJITObjects.py (1609 of 2028) PASS: lldb-unit :: Utility/./UtilityTests/AnsiTerminal.AtStart (1610 of 2028) PASS: lldb-unit :: Utility/./UtilityTests/OptionsWithRawTest.EmptyArgsOnlySuffix (1611 of 2028) PASS: lldb-shell :: Breakpoint/single-file-split-dwarf.test (1612 of 2028) PASS: lldb-api :: functionalities/data-formatter/dump_dynamic/TestDumpDynamic.py (1613 of 2028) PASS: lldb-unit :: Utility/./UtilityTests/RegisterValueTest.GetSet8 (1614 of 2028) PASS: lldb-api :: commands/expression/import-std-module/sysroot/TestStdModuleSysroot.py (1615 of 2028) PASS: lldb-unit :: Utility/./UtilityTests/OptionsWithRawTest.UnterminatedQuote (1616 of 2028) PASS: lldb-unit :: Utility/./UtilityTests/PassiveReplayTest.InstrumentedBarRef (1617 of 2028) PASS: lldb-unit :: UnwindAssembly/x86/./UnwindAssemblyx86Tests/Testx86AssemblyInspectionEngine.TestPopEBP (1618 of 2028) PASS: lldb-unit :: Utility/./UtilityTests/Flags.AnySet (1619 of 2028) PASS: lldb-api :: commands/expression/ir-interpreter/TestIRInterpreter.py (1620 of 2028) PASS: lldb-shell :: SymbolFile/DWARF/find-basic-function.cpp (1621 of 2028) PASS: lldb-api :: functionalities/unwind/zeroth_frame/TestZerothFrame.py (1622 of 2028) PASS: lldb-unit :: Utility/./UtilityTests/ArgsTest.TestSingleQuotedArgWithSpace (1623 of 2028) PASS: lldb-unit :: ScriptInterpreter/Python/./ScriptInterpreterPythonTests/PythonDataObjectsTest.TestPythonIntegerToStructuredInteger (1624 of 2028) PASS: lldb-shell :: Minidump/Windows/broken-unwind.test (1625 of 2028) PASS: lldb-unit :: ScriptInterpreter/Python/./ScriptInterpreterPythonTests/PythonDataObjectsTest.TestPythonCallableInvoke (1626 of 2028) PASS: lldb-api :: lang/cpp/static_methods/TestCPPStaticMethods.py (1627 of 2028) UNSUPPORTED: lldb-shell :: ScriptInterpreter/Lua/bindings.test (1628 of 2028) PASS: lldb-unit :: Utility/./UtilityTests/BinaryStreamTest.PutULEB128FourBytes (1629 of 2028) PASS: lldb-api :: functionalities/thread/concurrent_events/TestConcurrentTwoWatchpointThreads.py (1630 of 2028) PASS: lldb-api :: functionalities/breakpoint/cpp_exception/TestCPPExceptionBreakpoint.py (1631 of 2028) PASS: lldb-api :: functionalities/data-formatter/data-formatter-stl/libcxx/set/TestDataFormatterLibcxxSet.py (1632 of 2028) PASS: lldb-unit :: Utility/./UtilityTests/StringExtractorTest.GetNameColonValueNoSemicolon (1633 of 2028) PASS: lldb-shell :: Settings/TestModuleCacheSanity.test (1634 of 2028) PASS: lldb-unit :: Utility/./UtilityTests/StringListTest.SplitIntoLinesSingleTrailingCR (1635 of 2028) PASS: lldb-unit :: Utility/./UtilityTests/UriParserTest.LongPath (1636 of 2028) PASS: lldb-api :: commands/quit/TestQuit.py (1637 of 2028) PASS: lldb-unit :: ScriptInterpreter/Python/./ScriptInterpreterPythonTests/PythonDataObjectsTest.TestPythonBytes (1638 of 2028) PASS: lldb-shell :: ObjectFile/ELF/build-id-case.yaml (1639 of 2028) PASS: lldb-api :: python_api/hello_world/TestHelloWorld.py (1640 of 2028) PASS: lldb-unit :: Utility/./UtilityTests/CompletionRequest.ShiftArguments (1641 of 2028) UNSUPPORTED: lldb-shell :: ScriptInterpreter/Lua/persistent_state.test (1642 of 2028) PASS: lldb-unit :: Utility/./UtilityTests/StringLexerTest.Next (1643 of 2028) PASS: lldb-api :: lang/cpp/const_this/TestConstThis.py (1644 of 2028) PASS: lldb-unit :: Utility/./UtilityTests/StringListTest.GetMaxStringLengthIncreasingSize (1645 of 2028) PASS: lldb-api :: functionalities/value_md5_crash/TestValueMD5Crash.py (1646 of 2028) PASS: lldb-api :: python_api/process/io/TestProcessIO.py (1647 of 2028) PASS: lldb-shell :: SymbolFile/DWARF/find-basic-type.cpp (1648 of 2028) PASS: lldb-unit :: Utility/./UtilityTests/BinaryStreamTest.PutSLEB128FiveBytes (1649 of 2028) PASS: lldb-api :: functionalities/data-formatter/data-formatter-proper-plurals/TestFormattersOneIsSingular.py (1650 of 2028) PASS: lldb-api :: functionalities/gdb_remote_client/TestArmRegisterDefinition.py (1651 of 2028) PASS: lldb-unit :: Utility/./UtilityTests/ConstStringTest.NullAndEmptyStates (1652 of 2028) PASS: lldb-api :: sanity/TestSettingSkipping.py (1653 of 2028) PASS: lldb-api :: functionalities/breakpoint/breakpoint_options/TestBreakpointOptions.py (1654 of 2028) PASS: lldb-unit :: Language/CPlusPlus/./LanguageCPlusPlusTests/CPlusPlusLanguage.CPlusPlusNameParser (1655 of 2028) PASS: lldb-unit :: Utility/./UtilityTests/FileSpecTest.EqualSeparator (1656 of 2028) PASS: lldb-shell :: Breakpoint/jitbp_elf.test (1657 of 2028) PASS: lldb-api :: lang/c/tls_globals/TestTlsGlobals.py (1658 of 2028) PASS: lldb-unit :: SymbolFile/DWARF/./SymbolFileDWARFTests/SymbolFileDWARFTests.TestAbbrevOrder1Start1 (1659 of 2028) PASS: lldb-unit :: Utility/./UtilityTests/LogTest.Unregister (1660 of 2028) PASS: lldb-api :: functionalities/data-formatter/data-formatter-stl/libcxx/multimap/TestDataFormatterLibccMultiMap.py (1661 of 2028) PASS: lldb-api :: commands/frame/recognizer/TestFrameRecognizer.py (1662 of 2028) PASS: lldb-shell :: SymbolFile/DWARF/static_scope.s (1663 of 2028) PASS: lldb-unit :: Utility/./UtilityTests/RangeTest.DefaultConstructor (1664 of 2028) PASS: lldb-unit :: Utility/./UtilityTests/ScalarTest.Promotion (1665 of 2028) PASS: lldb-api :: lang/objcxx/hide-runtime-values/TestObjCXXHideRuntimeValues.py (1666 of 2028) PASS: lldb-api :: functionalities/gdb_remote_client/TestNoGPacketSupported.py (1667 of 2028) PASS: lldb-unit :: Host/./HostTests/FileSystemTest.GetPermissions (1668 of 2028) PASS: lldb-unit :: ScriptInterpreter/Python/./ScriptInterpreterPythonTests/PythonDataObjectsTest.TestRun (1669 of 2028) PASS: lldb-unit :: Utility/./UtilityTests/OptionsWithRawTest.TerminatedQuote (1670 of 2028) PASS: lldb-api :: functionalities/data-formatter/nsarraysynth/TestNSArraySynthetic.py (1671 of 2028) PASS: lldb-api :: tools/lldb-server/TestGdbRemoteRegisterState.py (1672 of 2028) PASS: lldb-unit :: Utility/./UtilityTests/NameMatchesTest.Ignore (1673 of 2028) PASS: lldb-unit :: Utility/./UtilityTests/Flags.AllSet (1674 of 2028) PASS: lldb-api :: functionalities/thread/concurrent_events/TestConcurrentManyBreakpoints.py (1675 of 2028) PASS: lldb-api :: lang/cpp/constructors/TestCppConstructors.py (1676 of 2028) PASS: lldb-unit :: Process/gdb-remote/./ProcessGdbRemoteTests/GDBRemoteCommunicationServerTest.SendErrorResponse_ErrorList (1677 of 2028) PASS: lldb-unit :: Symbol/./SymbolTests/TestClangASTImporter.ImportInvalidType (1678 of 2028) PASS: lldb-shell :: ObjectFile/ELF/avr-basic-info.yaml (1679 of 2028) PASS: lldb-unit :: Target/./TargetTests/ExecutionContextTest.GetByteOrder (1680 of 2028) PASS: lldb-unit :: Host/./HostTests/MainLoopTest.ReadObject (1681 of 2028) PASS: lldb-unit :: Utility/./UtilityTests/StringListTest.AppendListCStringArray (1682 of 2028) PASS: lldb-unit :: Breakpoint/./LLDBBreakpointTests/BreakpointIDTest.StringIsBreakpointName (1683 of 2028) PASS: lldb-unit :: Utility/./UtilityTests/RangeDataVector.FindEntryIndexesThatContain (1684 of 2028) PASS: lldb-api :: macosx/nslog/TestDarwinNSLogOutput.py (1685 of 2028) PASS: lldb-unit :: Utility/./UtilityTests/Flags.AllClear (1686 of 2028) PASS: lldb-unit :: Utility/./UtilityTests/IndexToObjectTest.ObjectForIndex (1687 of 2028) PASS: lldb-api :: functionalities/reproducers/attach/TestReproducerAttach.py (1688 of 2028) PASS: lldb-api :: functionalities/postmortem/elf-core/TestLinuxCore.py (1689 of 2028) UNSUPPORTED: lldb-api :: functionalities/darwin_log/source/info/TestDarwinLogSourceInfo.py (1690 of 2028) PASS: lldb-api :: lang/cpp/nested-class-other-compilation-unit/TestNestedClassWithParentInAnotherCU.py (1691 of 2028) PASS: lldb-unit :: ScriptInterpreter/Python/./ScriptInterpreterPythonTests/PythonDataObjectsTest.TestPythonInteger (1692 of 2028) PASS: lldb-unit :: Platform/./LLDBPlatformTests/PlatformDarwinTest.TestParseVersionBuildDir (1693 of 2028) PASS: lldb-unit :: Host/./HostTests/Host.WaitStatusFormat (1694 of 2028) PASS: lldb-api :: functionalities/tail_call_frames/thread_step_out_message/TestArtificialFrameStepOutMessage.py (1695 of 2028) PASS: lldb-unit :: Utility/./UtilityTests/ArgsTest.TestInsertArg (1696 of 2028) PASS: lldb-shell :: SymbolFile/DWARF/debug-types-dwo-cross-reference.cpp (1697 of 2028) PASS: lldb-unit :: Utility/./UtilityTests/UriParserTest.MinimalPortPath (1698 of 2028) PASS: lldb-api :: commands/expression/invalid-args/TestInvalidArgsExpression.py (1699 of 2028) PASS: lldb-shell :: ObjectFile/MachO/lc_build_version.yaml (1700 of 2028) PASS: lldb-api :: commands/expression/import-std-module/queue/TestQueueFromStdModule.py (1701 of 2028) PASS: lldb-api :: python_api/lldbutil/iter/TestRegistersIterator.py (1702 of 2028) PASS: lldb-api :: tools/lldb-vscode/coreFile/TestVSCode_coreFile.py (1703 of 2028) PASS: lldb-unit :: Utility/./UtilityTests/RangeTest.ContainsEndInclusiveInvalid (1704 of 2028) PASS: lldb-api :: python_api/debugger/TestDebuggerAPI.py (1705 of 2028) PASS: lldb-api :: functionalities/inferior-crashing/TestInferiorCrashingStep.py (1706 of 2028) PASS: lldb-unit :: Utility/./UtilityTests/StringListTest.InsertStringAtIndexMove (1707 of 2028) PASS: lldb-shell :: SymbolFile/Breakpad/stack-cfi-parsing.test (1708 of 2028) PASS: lldb-unit :: Utility/./UtilityTests/StreamTest.PutCStringWithStringRef (1709 of 2028) PASS: lldb-unit :: Utility/./UtilityTests/NameMatchesTest.Contains (1710 of 2028) PASS: lldb-unit :: ScriptInterpreter/Python/./ScriptInterpreterPythonTests/PythonDataObjectsTest.TestOwnedReferences (1711 of 2028) PASS: lldb-unit :: Utility/./UtilityTests/UriParserTest.BracketedHostnamePort (1712 of 2028) UNSUPPORTED: lldb-shell :: SymbolFile/PDB/function-level-linking.test (1713 of 2028) PASS: lldb-shell :: SymbolFile/NativePDB/break-by-function.cpp (1714 of 2028) PASS: lldb-shell :: SymbolFile/DWARF/dwarf5-debug_line.s (1715 of 2028) PASS: lldb-shell :: Breakpoint/debug_rnglist_offset_pair.test (1716 of 2028) PASS: lldb-unit :: Utility/./UtilityTests/StringListTest.PopBack (1717 of 2028) UNSUPPORTED: lldb-api :: functionalities/darwin_log/source/debug/TestDarwinLogSourceDebug.py (1718 of 2028) PASS: lldb-api :: commands/version/TestVersion.py (1719 of 2028) PASS: lldb-shell :: Reproducer/TestDiscard.test (1720 of 2028) PASS: lldb-unit :: ObjectFile/PECOFF/./ObjectFilePECOFFTests/PECallFrameInfoTest.Frame_reg_eh (1721 of 2028) UNSUPPORTED: lldb-shell :: Register/x86-gp-read.test (1722 of 2028) PASS: lldb-api :: commands/watchpoints/watchpoint_count/TestWatchpointCount.py (1723 of 2028) PASS: lldb-unit :: Process/minidump/./LLDBMinidumpTests/MinidumpParserTest.GetArchitecture (1724 of 2028) PASS: lldb-shell :: Commands/CommandScriptImmediateOutput/CommandScriptImmediateOutputConsole.test (1725 of 2028) PASS: lldb-unit :: UnwindAssembly/x86/./UnwindAssemblyx86Tests/Testx86AssemblyInspectionEngine.TestMovRSPtoRBP (1726 of 2028) PASS: lldb-api :: sample_test/TestSampleTest.py (1727 of 2028) PASS: lldb-api :: functionalities/conditional_break/TestConditionalBreak.py (1728 of 2028) PASS: lldb-api :: functionalities/data-formatter/data-formatter-objc/TestDataFormatterObjCNSBundle.py (1729 of 2028) PASS: lldb-unit :: Utility/./UtilityTests/StreamTest.AddressNoSuffix (1730 of 2028) PASS: lldb-unit :: Utility/./UtilityTests/StreamTeeTest.GetStreamAtIndexOutOfBoundsEmpty (1731 of 2028) UNSUPPORTED: lldb-shell :: ScriptInterpreter/Lua/lua.test (1732 of 2028) PASS: lldb-unit :: Process/gdb-remote/./ProcessGdbRemoteTests/GDBRemoteCommunicationClientTest.GetModulesInfoInvalidResponse (1733 of 2028) PASS: lldb-api :: lang/cpp/typedef/TestCppTypedef.py (1734 of 2028) PASS: lldb-api :: lang/cpp/covariant-return-types/TestCovariantReturnTypes.py (1735 of 2028) PASS: lldb-unit :: SymbolFile/NativePDB/./SymbolFileNativePDBTests/PDBFPOProgramToDWARFExpressionTests.MissingTargetRegister (1736 of 2028) UNSUPPORTED: lldb-api :: functionalities/data-formatter/data-formatter-stl/libstdcpp/vector/TestDataFormatterStdVector.py (1737 of 2028) UNSUPPORTED: lldb-api :: iohandler/unicode/TestUnicode.py (1738 of 2028) PASS: lldb-unit :: Utility/./UtilityTests/RangeTest.NotEqualInvalid (1739 of 2028) PASS: lldb-api :: functionalities/avoids-fd-leak/TestFdLeak.py (1740 of 2028) PASS: lldb-unit :: Utility/./UtilityTests/StringExtractorTest.GetHexBytesAvail (1741 of 2028) UNSUPPORTED: lldb-shell :: ObjectFile/ELF/minidebuginfo-set-and-hit-breakpoint.test (1742 of 2028) PASS: lldb-unit :: Utility/./UtilityTests/EventTest.DumpEventDataBytes (1743 of 2028) PASS: lldb-unit :: Process/minidump/./LLDBMinidumpTests/RegisterContextMinidump.CheckRegisterContextMinidump_ARM (1744 of 2028) PASS: lldb-shell :: SymbolFile/DWARF/debug_loc_and_loclists.s (1745 of 2028) PASS: lldb-unit :: Utility/./UtilityTests/OptionsWithRawTest.ArgsButNoDelimiter (1746 of 2028) PASS: lldb-api :: functionalities/process_crash_info/TestProcessCrashInfo.py (1747 of 2028) PASS: lldb-unit :: Symbol/./SymbolTests/TestTypeSystemClang.TestGetEnumIntegerTypeUnexpectedType (1748 of 2028) PASS: lldb-api :: commands/log/invalid-args/TestInvalidArgsLog.py (1749 of 2028) PASS: lldb-unit :: Utility/./UtilityTests/DataExtractorTest.GetCStr (1750 of 2028) PASS: lldb-shell :: SymbolFile/DWARF/find-variable-file.cpp (1751 of 2028) PASS: lldb-unit :: Utility/./UtilityTests/StringListTest.RemoveBlankLines (1752 of 2028) PASS: lldb-shell :: SymbolFile/DWARF/debug_loc.s (1753 of 2028) PASS: lldb-unit :: Utility/./UtilityTests/ArchSpecTest.TripleComponentsWereSpecified (1754 of 2028) PASS: lldb-api :: commands/add-dsym/uuid/TestAddDsymCommand.py (1755 of 2028) PASS: lldb-unit :: Utility/./UtilityTests/ArchSpecTest.OperatorBool (1756 of 2028) PASS: lldb-unit :: ScriptInterpreter/Python/./ScriptInterpreterPythonTests/PythonDataObjectsTest.TestPythonIntegerToStr (1757 of 2028) PASS: lldb-unit :: Utility/./UtilityTests/SerializationRountripTest.SerializeDeserializePodPointers (1758 of 2028) PASS: lldb-shell :: SymbolFile/NativePDB/globals-fundamental.cpp (1759 of 2028) PASS: lldb-api :: tools/lldb-server/TestGdbRemote_qThreadStopInfo.py (1760 of 2028) PASS: lldb-shell :: SymbolFile/DWARF/dwarf5-atomic.s (1761 of 2028) PASS: lldb-api :: functionalities/gdb_remote_client/TestGDBRemoteLoad.py (1762 of 2028) PASS: lldb-shell :: Process/UnsupportedLanguage.test (1763 of 2028) PASS: lldb-api :: functionalities/gdb_remote_client/TestRestartBug.py (1764 of 2028) PASS: lldb-api :: python_api/sbvalue_const_addrof/TestSBValueConstAddrOf.py (1765 of 2028) UNSUPPORTED: lldb-api :: functionalities/thread/thread_specific_break_plus_condition/TestThreadSpecificBpPlusCondition.py (1766 of 2028) PASS: lldb-api :: python_api/sbvalue_persist/TestSBValuePersist.py (1767 of 2028) UNSUPPORTED: lldb-api :: functionalities/darwin_log/filter/regex/category/TestDarwinLogFilterRegexCategory.py (1768 of 2028) PASS: lldb-unit :: Symbol/./SymbolTests/TestTypeSystemClang.TestConvertAccessTypeToAccessSpecifier (1769 of 2028) PASS: lldb-api :: commands/expression/call-function/TestCallStdStringFunction.py (1770 of 2028) PASS: lldb-unit :: Expression/./ExpressionTests/DWARFExpression.DW_OP_convert (1771 of 2028) PASS: lldb-unit :: Utility/./UtilityTests/StreamTest.AddressRangeInvalidRange (1772 of 2028) PASS: lldb-shell :: Commands/command-breakpoint-col.test (1773 of 2028) PASS: lldb-unit :: Symbol/./SymbolTests/DWARFCallFrameInfoTest.Basic_dwarf4 (1774 of 2028) PASS: lldb-shell :: Reproducer/Functionalities/TestExpressionEvaluation.test (1775 of 2028) PASS: lldb-unit :: UnwindAssembly/x86/./UnwindAssemblyx86Tests/Testx86AssemblyInspectionEngine.TestPopRBPWithREX (1776 of 2028) PASS: lldb-api :: functionalities/thread/concurrent_events/TestConcurrentDelayedCrashWithBreakpointSignal.py (1777 of 2028) PASS: lldb-unit :: Expression/./ExpressionTests/DiagnosticManagerTest.HasFixits (1778 of 2028) PASS: lldb-shell :: SymbolFile/NativePDB/ast-methods.cpp (1779 of 2028) PASS: lldb-shell :: Breakpoint/debug_rnglistx_rlex.test (1780 of 2028) PASS: lldb-unit :: SymbolFile/NativePDB/./SymbolFileNativePDBTests/PDBFPOProgramToDWARFExpressionTests.UnresolvedRegisterReference (1781 of 2028) PASS: lldb-unit :: Utility/./UtilityTests/BinaryStreamTest.PutSLEB128ThreeBytes (1782 of 2028) PASS: lldb-unit :: Language/Highlighting/./HighlighterTests/HighlighterTest.ClangTrailingBackslashWithWhitespace (1783 of 2028) UNSUPPORTED: lldb-shell :: Expr/TestIRMemoryMapWindows.test (1784 of 2028) PASS: lldb-api :: python_api/function_symbol/TestDisasmAPI.py (1785 of 2028) PASS: lldb-unit :: Utility/./UtilityTests/StringExtractorTest.GetHexBytesAvail_OddPair2 (1786 of 2028) PASS: lldb-unit :: Host/./HostTests/SocketTest.TCPGetAddress (1787 of 2028) PASS: lldb-api :: lang/cpp/template/TestTemplateArgs.py (1788 of 2028) PASS: lldb-api :: lang/objc/foundation/TestObjectDescriptionAPI.py (1789 of 2028) FAIL: lldb-api :: lang/objc/self/TestObjCSelf.py (1790 of 2028) ******************** TEST 'lldb-api :: lang/objc/self/TestObjCSelf.py' FAILED ******************** Script: -- /Users/buildslave/jenkins/workspace/lldb-cmake-sanitized/lldb-build/lldb-test-build.noindex/copied-system-python /Users/buildslave/jenkins/workspace/lldb-cmake-sanitized/llvm-project/lldb/test/API/dotest.py --arch x86_64 -s /Users/buildslave/jenkins/workspace/lldb-cmake-sanitized/lldb-build/lldb-test-traces -S nm -u CXXFLAGS -u CFLAGS --codesign-identity lldb_codesign --server /Users/buildslave/jenkins/workspace/lldb-cmake-sanitized/lldb-build/./bin/debugserver --arch x86_64 --build-dir /Users/buildslave/jenkins/workspace/lldb-cmake-sanitized/lldb-build/lldb-test-build.noindex -s=/Users/buildslave/jenkins/workspace/lldb-cmake-sanitized/test/logs -t --env TERM=vt100 --env LLVM_LIBS_DIR=/Users/buildslave/jenkins/workspace/lldb-cmake-sanitized/lldb-build/./lib --inferior-env ASAN_OPTIONS=detect_stack_use_after_return=1 --inferior-env DYLD_INSERT_LIBRARIES=/Users/buildslave/jenkins/workspace/lldb-cmake-sanitized/host-compiler/lib/clang/11.0.0/lib/darwin/libclang_rt.asan_osx_dynamic.dylib --build-dir /Users/buildslave/jenkins/workspace/lldb-cmake-sanitized/lldb-build/lldb-test-build.noindex --lldb-module-cache-dir /Users/buildslave/jenkins/workspace/lldb-cmake-sanitized/lldb-build/lldb-test-build.noindex/module-cache-lldb/lldb-api --clang-module-cache-dir /Users/buildslave/jenkins/workspace/lldb-cmake-sanitized/lldb-build/lldb-test-build.noindex/module-cache-clang/lldb-api --executable /Users/buildslave/jenkins/workspace/lldb-cmake-sanitized/lldb-build/./bin/lldb --compiler /Users/buildslave/jenkins/workspace/lldb-cmake-sanitized/lldb-build/./bin/clang --dsymutil /Users/buildslave/jenkins/workspace/lldb-cmake-sanitized/lldb-build/./bin/dsymutil --filecheck /Users/buildslave/jenkins/workspace/lldb-cmake-sanitized/lldb-build/./bin/FileCheck --lldb-libs-dir /Users/buildslave/jenkins/workspace/lldb-cmake-sanitized/lldb-build/./lib /Users/buildslave/jenkins/workspace/lldb-cmake-sanitized/llvm-project/lldb/test/API/lang/objc/self -p TestObjCSelf.py -- Exit Code: -6

Hide Details

Command Output (stdout): -- lldb version 11.0.99 clang revision 2768edfff19a170faca35a8c63163c8bb1b67382 llvm revision 2768edfff19a170faca35a8c63163c8bb1b67382

Hide Details

-- Command Output (stderr): -- Assertion failed: (tokenKind == tok::kw___bridge_retain), function ParseParenExpression, file /Users/buildslave/jenkins/workspace/lldb-cmake-sanitized/llvm-project/clang/lib/Parse/ParseExpr.cpp, line 2804.

Hide Details

--

Hide Details

******************** PASS: lldb-api :: functionalities/thread/concurrent_events/TestConcurrentWatchpointWithDelayWatchpointThreads.py (1791 of 2028) PASS: lldb-unit :: Utility/./UtilityTests/ArchSpecTest.TestParseMachCPUDashSubtypeTripleSimple (1792 of 2028) PASS: lldb-api :: commands/expression/import-std-module/forward_list-dbg-info-content/TestDbgInfoContentForwardListFromStdModule.py (1793 of 2028) PASS: lldb-api :: functionalities/postmortem/minidump/TestMiniDump.py (1794 of 2028) PASS: lldb-api :: lang/objc/single-entry-dictionary/TestObjCSingleEntryDictionary.py (1795 of 2028) PASS: lldb-unit :: ScriptInterpreter/Python/./ScriptInterpreterPythonTests/PythonDataObjectsTest.TestGlobalNameResolutionNoDot (1796 of 2028) PASS: lldb-api :: functionalities/data-formatter/data-formatter-synth/TestDataFormatterSynth.py (1797 of 2028) PASS: lldb-unit :: Utility/./UtilityTests/StringListTest.JoinEmpty (1798 of 2028) PASS: lldb-api :: lang/cpp/overloaded-functions/TestOverloadedFunctions.py (1799 of 2028) PASS: lldb-unit :: Utility/./UtilityTests/TildeExpressionResolver.ResolveFullPath (1800 of 2028) PASS: lldb-unit :: SymbolFile/DWARF/./SymbolFileDWARFTests/DWARFASTParserClangTests.EnsureAllDIEsInDeclContextHaveBeenParsedParsesOnlyMatchingEntries (1801 of 2028) PASS: lldb-api :: functionalities/lazy-loading/TestLazyLoading.py (1802 of 2028) PASS: lldb-api :: tools/lldb-vscode/breakpoint-events/TestVSCode_breakpointEvents.py (1803 of 2028) PASS: lldb-api :: functionalities/thread/step_until/TestStepUntil.py (1804 of 2028) PASS: lldb-shell :: Breakpoint/split-dwarf5-debug-stroffsets.test (1805 of 2028) PASS: lldb-unit :: SymbolFile/NativePDB/./SymbolFileNativePDBTests/PDBFPOProgramToDWARFExpressionTests.InvalidOpBinary (1806 of 2028) PASS: lldb-unit :: Utility/./UtilityTests/DataExtractorTest.GetMaxS64 (1807 of 2028) UNSUPPORTED: lldb-api :: functionalities/data-formatter/data-formatter-stl/libstdcpp/unique_ptr/TestDataFormatterStdUniquePtr.py (1808 of 2028) PASS: lldb-shell :: SymbolFile/DWARF/dwp-separate-debug-file.cpp (1809 of 2028) PASS: lldb-unit :: Language/Highlighting/./HighlighterTests/HighlighterTest.ClangOperators (1810 of 2028) PASS: lldb-api :: commands/target/create-deps/TestTargetCreateDeps.py (1811 of 2028) PASS: lldb-shell :: ObjectFile/PECOFF/basic-info-arm64.yaml (1812 of 2028) PASS: lldb-unit :: Utility/./UtilityTests/FileSpecTest.IsRelative (1813 of 2028) PASS: lldb-shell :: ObjectFile/ELF/many-sections.s (1814 of 2028) PASS: lldb-unit :: Utility/./UtilityTests/ArgsTest.TestAppendArg (1815 of 2028) PASS: lldb-unit :: SymbolFile/NativePDB/./SymbolFileNativePDBTests/PDBFPOProgramToDWARFExpressionTests.MultipleIndependentAssignments (1816 of 2028) UNSUPPORTED: lldb-shell :: Reproducer/TestLuaImport.test (1817 of 2028) UNSUPPORTED: lldb-api :: api/multiple-debuggers/TestMultipleDebuggers.py (1818 of 2028) PASS: lldb-unit :: Process/gdb-remote/./ProcessGdbRemoteTests/GDBRemoteCommunicationClientTest.GetMemoryRegionInfo (1819 of 2028) PASS: lldb-unit :: Expression/./ExpressionTests/DiagnosticManagerTest.GetStringMultiline (1820 of 2028) PASS: lldb-unit :: UnwindAssembly/x86/./UnwindAssemblyx86Tests/Testx86AssemblyInspectionEngine.Test32bitFramelessSmallStackFrame (1821 of 2028) PASS: lldb-unit :: Utility/./UtilityTests/BroadcasterTest.BroadcastEvent (1822 of 2028) PASS: lldb-api :: commands/apropos/basic/TestApropos.py (1823 of 2028) PASS: lldb-api :: functionalities/target_var/TestTargetVar.py (1824 of 2028) PASS: lldb-shell :: ScriptInterpreter/Python/crashlog.test (1825 of 2028) PASS: lldb-shell :: BuildScript/modes.test (1826 of 2028) PASS: lldb-unit :: Utility/./UtilityTests/BinaryStreamTest.PutULEB128EightBytes (1827 of 2028) PASS: lldb-api :: lang/cpp/gmodules-templates/TestGModules.py (1828 of 2028) PASS: lldb-api :: commands/disassemble/basic/TestDisassembleBreakpoint.py (1829 of 2028) PASS: lldb-unit :: Utility/./UtilityTests/DataExtractorTest.GetCStrAtEnd (1830 of 2028) PASS: lldb-api :: macosx/lc-note/kern-ver-str/TestKernVerStrLCNOTE.py (1831 of 2028) PASS: lldb-api :: commands/apropos/with-process/TestAproposWithProcess.py (1832 of 2028) XFAIL: lldb-shell :: SymbolFile/DWARF/find-type-in-function.cpp (1833 of 2028) PASS: lldb-unit :: Symbol/./SymbolTests/TestTypeSystemClang.TestUnifyAccessSpecifiers (1834 of 2028) PASS: lldb-api :: functionalities/inferior-crashing/recursive-inferior/TestRecursiveInferior.py (1835 of 2028) PASS: lldb-api :: functionalities/data-formatter/data-formatter-stl/libcxx/forward_list/TestDataFormatterLibcxxForwardList.py (1836 of 2028) PASS: lldb-unit :: Utility/./UtilityTests/RangeTest.Equal (1837 of 2028) PASS: lldb-api :: functionalities/thread/concurrent_events/TestConcurrentSignalDelayWatch.py (1838 of 2028) PASS: lldb-api :: functionalities/completion/TestCompletion.py (1839 of 2028) PASS: lldb-shell :: ObjectFile/Breakpad/sections-trailing-func.test (1840 of 2028) PASS: lldb-api :: macosx/find-app-in-bundle/TestFindAppInBundle.py (1841 of 2028) PASS: lldb-unit :: Utility/./UtilityTests/StreamTest.AddressRangeSize (1842 of 2028) PASS: lldb-unit :: Utility/./UtilityTests/StringLexerTest.NextIf (1843 of 2028) PASS: lldb-api :: functionalities/tail_call_frames/ambiguous_tail_call_seq2/TestAmbiguousTailCallSeq2.py (1844 of 2028) PASS: lldb-unit :: Utility/./UtilityTests/StringListTest.JoinMultiCharSeparator (1845 of 2028) UNSUPPORTED: lldb-shell :: Register/x86-ymm-write.test (1846 of 2028) PASS: lldb-api :: functionalities/stats_api/TestStatisticsAPI.py (1847 of 2028) PASS: lldb-unit :: Utility/./UtilityTests/StringExtractorTest.GetHexBytes_OddPair (1848 of 2028) UNSUPPORTED: lldb-shell :: SymbolFile/NativePDB/local-variables.cpp (1849 of 2028) PASS: lldb-unit :: Utility/./UtilityTests/StringListTest.ForRange (1850 of 2028) PASS: lldb-api :: commands/command/script/import/rdar-12586188/TestRdar12586188.py (1851 of 2028) UNSUPPORTED: lldb-api :: commands/register/register/intel_xtended_registers/mpx_bound_violation/TestBoundViolation.py (1852 of 2028) PASS: lldb-unit :: Utility/./UtilityTests/StringExtractorTest.GetHexU8_Underflow_NoEof (1853 of 2028) PASS: lldb-shell :: Quit/TestQuitExitCode-30.test (1854 of 2028) PASS: lldb-api :: lang/c/enum_types/TestEnumTypes.py (1855 of 2028) PASS: lldb-api :: functionalities/breakpoint/require_hw_breakpoints/TestRequireHWBreakpoints.py (1856 of 2028) PASS: lldb-shell :: SymbolFile/NativePDB/disassembly.cpp (1857 of 2028) PASS: lldb-unit :: Utility/./UtilityTests/BinaryStreamTest.PutULEB128SixBytes (1858 of 2028) UNSUPPORTED: lldb-shell :: SymbolFile/PDB/compilands.test (1859 of 2028) PASS: lldb-unit :: Symbol/./SymbolTests/TestClangASTImporter.DeportTypeTagDecl (1860 of 2028) PASS: lldb-unit :: Process/minidump/./LLDBMinidumpTests/MinidumpParserTest.FindMemoryRange (1861 of 2028) PASS: lldb-api :: functionalities/thread/backtrace_limit/TestBacktraceLimit.py (1862 of 2028) PASS: lldb-api :: functionalities/thread/concurrent_events/TestConcurrentSignalDelayBreak.py (1863 of 2028) PASS: lldb-api :: commands/expression/call-function/TestCallStopAndContinue.py (1864 of 2028) PASS: lldb-unit :: Process/gdb-remote/./ProcessGdbRemoteTests/GDBRemoteClientBaseTest.SendContinueAndLateInterrupt (1865 of 2028) PASS: lldb-unit :: Symbol/./SymbolTests/TestClangASTImporter.MetadataPropagationIndirectImport (1866 of 2028) PASS: lldb-api :: functionalities/plugins/command_plugin/TestPluginCommands.py (1867 of 2028) PASS: lldb-unit :: Language/Highlighting/./HighlighterTests/HighlighterTest.HighlighterSelectionType (1868 of 2028) PASS: lldb-unit :: Utility/./UtilityTests/StreamTest.PutBytesAsRawHex8ToMixedEndian (1869 of 2028) PASS: lldb-shell :: Unwind/trap_frame_sym_ctx.test (1870 of 2028) PASS: lldb-unit :: Utility/./UtilityTests/StringExtractorTest.GetNameColonValueNoColon (1871 of 2028) UNSUPPORTED: lldb-shell :: ScriptInterpreter/Lua/nested_sessions.test (1872 of 2028) PASS: lldb-unit :: Utility/./UtilityTests/ScalarTest.ComparisonFloat (1873 of 2028) PASS: lldb-shell :: Quit/TestQuitExitCode30.test (1874 of 2028) PASS: lldb-unit :: Utility/./UtilityTests/StreamTest.PutNHex8 (1875 of 2028) PASS: lldb-unit :: Utility/./UtilityTests/ScalarTest.GetBytes (1876 of 2028) PASS: lldb-unit :: Symbol/./SymbolTests/TestTypeSystemClang.TestFunctionTemplateConstruction (1877 of 2028) PASS: lldb-unit :: Language/CPlusPlus/./LanguageCPlusPlusTests/CPlusPlusLanguage.ExtractContextAndIdentifier (1878 of 2028) PASS: lldb-unit :: Utility/./UtilityTests/RangeDataVector.FindEntryThatContains (1879 of 2028) PASS: lldb-api :: functionalities/breakpoint/inlined_breakpoints/TestInlinedBreakpoints.py (1880 of 2028) UNSUPPORTED: lldb-shell :: SymbolFile/PDB/udt-layout.test (1881 of 2028) PASS: lldb-unit :: Host/./HostTests/SocketTest.TCPListen0GetPort (1882 of 2028) PASS: lldb-unit :: Symbol/./SymbolTests/LineEntryTest.GetSameLineContiguousAddressRangeOneInline (1883 of 2028) PASS: lldb-api :: functionalities/postmortem/mach-core/TestMachCore.py (1884 of 2028) PASS: lldb-api :: functionalities/data-formatter/data-formatter-script/TestDataFormatterScript.py (1885 of 2028) PASS: lldb-unit :: Utility/./UtilityTests/NameMatchesTest.Equals (1886 of 2028) FAIL: lldb-api :: lang/objc/objc++/TestObjCXX.py (1887 of 2028) ******************** TEST 'lldb-api :: lang/objc/objc++/TestObjCXX.py' FAILED ******************** Script: -- /Users/buildslave/jenkins/workspace/lldb-cmake-sanitized/lldb-build/lldb-test-build.noindex/copied-system-python /Users/buildslave/jenkins/workspace/lldb-cmake-sanitized/llvm-project/lldb/test/API/dotest.py --arch x86_64 -s /Users/buildslave/jenkins/workspace/lldb-cmake-sanitized/lldb-build/lldb-test-traces -S nm -u CXXFLAGS -u CFLAGS --codesign-identity lldb_codesign --server /Users/buildslave/jenkins/workspace/lldb-cmake-sanitized/lldb-build/./bin/debugserver --arch x86_64 --build-dir /Users/buildslave/jenkins/workspace/lldb-cmake-sanitized/lldb-build/lldb-test-build.noindex -s=/Users/buildslave/jenkins/workspace/lldb-cmake-sanitized/test/logs -t --env TERM=vt100 --env LLVM_LIBS_DIR=/Users/buildslave/jenkins/workspace/lldb-cmake-sanitized/lldb-build/./lib --inferior-env ASAN_OPTIONS=detect_stack_use_after_return=1 --inferior-env DYLD_INSERT_LIBRARIES=/Users/buildslave/jenkins/workspace/lldb-cmake-sanitized/host-compiler/lib/clang/11.0.0/lib/darwin/libclang_rt.asan_osx_dynamic.dylib --build-dir /Users/buildslave/jenkins/workspace/lldb-cmake-sanitized/lldb-build/lldb-test-build.noindex --lldb-module-cache-dir /Users/buildslave/jenkins/workspace/lldb-cmake-sanitized/lldb-build/lldb-test-build.noindex/module-cache-lldb/lldb-api --clang-module-cache-dir /Users/buildslave/jenkins/workspace/lldb-cmake-sanitized/lldb-build/lldb-test-build.noindex/module-cache-clang/lldb-api --executable /Users/buildslave/jenkins/workspace/lldb-cmake-sanitized/lldb-build/./bin/lldb --compiler /Users/buildslave/jenkins/workspace/lldb-cmake-sanitized/lldb-build/./bin/clang --dsymutil /Users/buildslave/jenkins/workspace/lldb-cmake-sanitized/lldb-build/./bin/dsymutil --filecheck /Users/buildslave/jenkins/workspace/lldb-cmake-sanitized/lldb-build/./bin/FileCheck --lldb-libs-dir /Users/buildslave/jenkins/workspace/lldb-cmake-sanitized/lldb-build/./lib /Users/buildslave/jenkins/workspace/lldb-cmake-sanitized/llvm-project/lldb/test/API/lang/objc/objc++ -p TestObjCXX.py -- Exit Code: -6

Hide Details

Command Output (stdout): -- lldb version 11.0.99 clang revision 2768edfff19a170faca35a8c63163c8bb1b67382 llvm revision 2768edfff19a170faca35a8c63163c8bb1b67382

Hide Details

-- Command Output (stderr): -- Assertion failed: (tokenKind == tok::kw___bridge_retain), function ParseParenExpression, file /Users/buildslave/jenkins/workspace/lldb-cmake-sanitized/llvm-project/clang/lib/Parse/ParseExpr.cpp, line 2804.

Hide Details

--

Hide Details

******************** PASS: lldb-api :: tools/lldb-vscode/stackTrace/TestVSCode_stackTrace.py (1888 of 2028) PASS: lldb-unit :: Utility/./UtilityTests/VMRange.CollectionContains (1889 of 2028) PASS: lldb-api :: functionalities/gdb_remote_client/TestRecognizeBreakpoint.py (1890 of 2028) UNSUPPORTED: lldb-shell :: ScriptInterpreter/Lua/breakpoint_callback.test (1891 of 2028) PASS: lldb-api :: lang/cpp/extern_c/TestExternCSymbols.py (1892 of 2028) PASS: lldb-api :: functionalities/thread/concurrent_events/TestConcurrentSignalWatchBreak.py (1893 of 2028) PASS: lldb-shell :: ObjectFile/ELF/section-types.yaml (1894 of 2028) PASS: lldb-shell :: Quit/TestQuitExitCodeImplicit0.test (1895 of 2028) PASS: lldb-unit :: tools/lldb-server/tests/./LLDBServerTests/StandardStartupTest.TestStopReplyContainsThreadPcs (1896 of 2028) PASS: lldb-unit :: Utility/./UtilityTests/SubsystemRAIITest.SubsystemWithErrorFailure (1897 of 2028) FAIL: lldb-api :: functionalities/data-formatter/data-formatter-objc/TestDataFormatterObjCCF.py (1898 of 2028) ******************** TEST 'lldb-api :: functionalities/data-formatter/data-formatter-objc/TestDataFormatterObjCCF.py' FAILED ******************** Script: -- /Users/buildslave/jenkins/workspace/lldb-cmake-sanitized/lldb-build/lldb-test-build.noindex/copied-system-python /Users/buildslave/jenkins/workspace/lldb-cmake-sanitized/llvm-project/lldb/test/API/dotest.py --arch x86_64 -s /Users/buildslave/jenkins/workspace/lldb-cmake-sanitized/lldb-build/lldb-test-traces -S nm -u CXXFLAGS -u CFLAGS --codesign-identity lldb_codesign --server /Users/buildslave/jenkins/workspace/lldb-cmake-sanitized/lldb-build/./bin/debugserver --arch x86_64 --build-dir /Users/buildslave/jenkins/workspace/lldb-cmake-sanitized/lldb-build/lldb-test-build.noindex -s=/Users/buildslave/jenkins/workspace/lldb-cmake-sanitized/test/logs -t --env TERM=vt100 --env LLVM_LIBS_DIR=/Users/buildslave/jenkins/workspace/lldb-cmake-sanitized/lldb-build/./lib --inferior-env ASAN_OPTIONS=detect_stack_use_after_return=1 --inferior-env DYLD_INSERT_LIBRARIES=/Users/buildslave/jenkins/workspace/lldb-cmake-sanitized/host-compiler/lib/clang/11.0.0/lib/darwin/libclang_rt.asan_osx_dynamic.dylib --build-dir /Users/buildslave/jenkins/workspace/lldb-cmake-sanitized/lldb-build/lldb-test-build.noindex --lldb-module-cache-dir /Users/buildslave/jenkins/workspace/lldb-cmake-sanitized/lldb-build/lldb-test-build.noindex/module-cache-lldb/lldb-api --clang-module-cache-dir /Users/buildslave/jenkins/workspace/lldb-cmake-sanitized/lldb-build/lldb-test-build.noindex/module-cache-clang/lldb-api --executable /Users/buildslave/jenkins/workspace/lldb-cmake-sanitized/lldb-build/./bin/lldb --compiler /Users/buildslave/jenkins/workspace/lldb-cmake-sanitized/lldb-build/./bin/clang --dsymutil /Users/buildslave/jenkins/workspace/lldb-cmake-sanitized/lldb-build/./bin/dsymutil --filecheck /Users/buildslave/jenkins/workspace/lldb-cmake-sanitized/lldb-build/./bin/FileCheck --lldb-libs-dir /Users/buildslave/jenkins/workspace/lldb-cmake-sanitized/lldb-build/./lib /Users/buildslave/jenkins/workspace/lldb-cmake-sanitized/llvm-project/lldb/test/API/functionalities/data-formatter/data-formatter-objc -p TestDataFormatterObjCCF.py -- Exit Code: -6

Hide Details

Command Output (stdout): -- lldb version 11.0.99 clang revision 2768edfff19a170faca35a8c63163c8bb1b67382 llvm revision 2768edfff19a170faca35a8c63163c8bb1b67382

Hide Details

-- Command Output (stderr): --

Hide Details

Session logs for test failures/errors/unexpected successes will go into directory '/Users/buildslave/jenkins/workspace/lldb-cmake-sanitized/test/logs' Command invoked: /Users/buildslave/jenkins/workspace/lldb-cmake-sanitized/llvm-project/lldb/test/API/dotest.py --arch x86_64 -s /Users/buildslave/jenkins/workspace/lldb-cmake-sanitized/lldb-build/lldb-test-traces -S nm -u CXXFLAGS -u CFLAGS --codesign-identity lldb_codesign --server /Users/buildslave/jenkins/workspace/lldb-cmake-sanitized/lldb-build/./bin/debugserver --arch x86_64 --build-dir /Users/buildslave/jenkins/workspace/lldb-cmake-sanitized/lldb-build/lldb-test-build.noindex -s=/Users/buildslave/jenkins/workspace/lldb-cmake-sanitized/test/logs -t --env TERM=vt100 --env LLVM_LIBS_DIR=/Users/buildslave/jenkins/workspace/lldb-cmake-sanitized/lldb-build/./lib --inferior-env ASAN_OPTIONS=detect_stack_use_after_return=1 --inferior-env DYLD_INSERT_LIBRARIES=/Users/buildslave/jenkins/workspace/lldb-cmake-sanitized/host-compiler/lib/clang/11.0.0/lib/darwin/libclang_rt.asan_osx_dynamic.dylib --build-dir /Users/buildslave/jenkins/workspace/lldb-cmake-sanitized/lldb-build/lldb-test-build.noindex --lldb-module-cache-dir /Users/buildslave/jenkins/workspace/lldb-cmake-sanitized/lldb-build/lldb-test-build.noindex/module-cache-lldb/lldb-api --clang-module-cache-dir /Users/buildslave/jenkins/workspace/lldb-cmake-sanitized/lldb-build/lldb-test-build.noindex/module-cache-clang/lldb-api --executable /Users/buildslave/jenkins/workspace/lldb-cmake-sanitized/lldb-build/./bin/lldb --compiler /Users/buildslave/jenkins/workspace/lldb-cmake-sanitized/lldb-build/./bin/clang --dsymutil /Users/buildslave/jenkins/workspace/lldb-cmake-sanitized/lldb-build/./bin/dsymutil --filecheck /Users/buildslave/jenkins/workspace/lldb-cmake-sanitized/lldb-build/./bin/FileCheck --lldb-libs-dir /Users/buildslave/jenkins/workspace/lldb-cmake-sanitized/lldb-build/./lib /Users/buildslave/jenkins/workspace/lldb-cmake-sanitized/llvm-project/lldb/test/API/functionalities/data-formatter/data-formatter-objc -p TestDataFormatterObjCCF.py Change dir to: /Users/buildslave/jenkins/workspace/lldb-cmake-sanitized/llvm-project/lldb/test/API/functionalities/data-formatter/data-formatter-objc runCmd: settings clear -all output:

Hide Details

runCmd: settings set symbols.enable-external-lookup false output:

Hide Details

runCmd: settings set target.auto-apply-fixits false output:

Hide Details

runCmd: settings set plugin.process.gdb-remote.packet-timeout 60 output:

Hide Details

runCmd: settings set symbols.clang-modules-cache-path "/Users/buildslave/jenkins/workspace/lldb-cmake-sanitized/lldb-build/lldb-test-build.noindex/module-cache-lldb/lldb-api" output:

Hide Details

runCmd: settings set use-color false output:

Hide Details

runCmd: setting set target.prefer-dynamic-value no-dynamic-values output:

Hide Details

runCmd: settings set target.env-vars ASAN_OPTIONS=detect_stack_use_after_return=1 DYLD_INSERT_LIBRARIES=/Users/buildslave/jenkins/workspace/lldb-cmake-sanitized/host-compiler/lib/clang/11.0.0/lib/darwin/libclang_rt.asan_osx_dynamic.dylib output:

Hide Details

runCmd: settings set target.env-vars ASAN_OPTIONS=detect_stack_use_after_return=1 DYLD_INSERT_LIBRARIES=/Users/buildslave/jenkins/workspace/lldb-cmake-sanitized/host-compiler/lib/clang/11.0.0/lib/darwin/libclang_rt.asan_osx_dynamic.dylib output:

Hide Details

runCmd: thread list output: Process 48872 stopped * thread #1: tid = 0x4997e0, 0x000000010000489b a.out`main(argc=1, argv=0x00007ffeefbff420) at main.m:770:4, queue = 'com.apple.main-thread', stop reason = breakpoint 1.1 thread #2: tid = 0x49980f, 0x00007fff794f85be libsystem_kernel.dylib`__workq_kernreturn + 10 thread #3: tid = 0x499810, 0x00007fff794f85be libsystem_kernel.dylib`__workq_kernreturn + 10

Hide Details

Hide Details

Expecting sub string: stopped Matched

Hide Details

Expecting sub string: stop reason = breakpoint Matched

Hide Details

runCmd: frame variable output: (int) argc = 1 (const char **) argv = 0x00007ffeefbff420 (NSAutoreleasePool *) pool = 0x00006040000016d0 (MyClass *) object = 0x0000603000002f20 (MyOtherClass *) object2 = 0x0000603000002f50 (NSNumber *) num1 = 0x2d9d4970bc9e654d (int)5 (NSNumber *) num2 = 0x0000603000002fe0 (float)3.140000 (NSNumber *) num3 = 0x0000603000003010 (double)3.14 (NSNumber *) num4 = 0x0000603000003040 (int128_t)18446744073709551614 (NSNumber *) num5 = 0x2d9d4970bc9e216d (char)65 (NSNumber *) num6 = 0x2d9d4970bc9e9f5d (long)255 (NSNumber *) num7 = 0x2d9d4970a21ae05d (long)2000000 (NSNumber *) num8_Y = 0x00007fffa3c4dc30 YES (NSNumber *) num8_N = 0x00007fffa3c4dc40 NO (NSNumber *) num9 = 0xd262b68f431ae07d (short)-31616 (NSNumber *) num_at1 = 0x2d9d4970bc9e6c4d (int)12 (NSNumber *) num_at2 = 0xd262b68f4361944d (int)-12 (NSNumber *) num_at3 = 0x0000603000003070 (double)12.5 (NSNumber *) num_at4 = 0x00006030000030a0 (double)-12.5 (NSDecimalNumber *) decimal_number = 0x00006030000030d0 123456 x 10^-10 (NSDecimalNumber *) decimal_number_neg = 0x0000603000003100 -123456 x 10^10 (NSDecimalNumber *) decimal_one = 0x0000603000003130 1 x 10^0 (NSDecimalNumber *) decimal_zero = 0x0000602000002370 0 (NSDecimalNumber *) decimal_nan = 0x0000602000002390 NaN (NSString *) str0 = 0x2d9d497089ab525f @"255" (NSString *) str1 = 0x0000606000008ba0 @"A rather short ASCII NSString object is here" (NSString *) str2 = 0x0000606000008c00 @"A rather short UTF8 NSString object is here" (NSString *) str3 = 0x0000000100006170 @"A string made with the at sign is here" (NSString *) str4 = 0x0000606000008c60 @"This is string number 4 right here" (NSRect) ns_rect_4str = (origin = (x = 1, y = 1), size = (width = 5, height = 5)) (NSString *) str5 = 0x0000604000001810 @"{{1, 1}, {5, 5}}" (NSString *) str6 = 0x0000603000003220 @"1ST" (const unichar [3]) myCharacters = { [0] = U+03c3 u'σ' [1] = U+0078 u'x' [2] = U+0078 u'x' } (NSString *) str7 = 0x0000603000003250 @"σxx" (NSString *) str8 = 0x000061b000000780 @"hasVeryLongExtensionThisTimehasVeryLongExtensionThisTimehasVeryLongExtensionThisTimehasVeryLongExtensionThisTimehasVeryLongExtensionThisTimehasVeryLongExtensionThisTimehasVeryLongExtensionThisTimehasVeryLongExtensionThisTimehasVeryLongExtensionThisTimehasVeryLongExtensionThisTimehasVeryLongExtensionThisTimehasVeryLongExtensionThisTimehasVeryLongExtensionThisTimehasVeryLongExtensionThisTimehasVeryLongExtensionThisTimehasVeryLongExtensionThisTimehasVeryLongExtensionThisTimehasVeryLongExtensionThisTimehasVeryLongExtensionThisTimehasVeryLongExtensionThisTimehasVeryLongExtensionThisTimehasVeryLongExtensionThisTimehasVeryLongExtensionThisTimehasVeryLongExtensionThisTimehasVeryLongExtensionThisTimehasVeryLongExtensionThisTimehasVeryLongExtensionThisTimehasVeryLongExtensionThisTime" (const unichar [54]) myOtherCharacters = { [0] = U+0061 u'a' [1] = U+0020 u' ' [2] = U+0076 u'v' [3] = U+0065 u'e' [4] = U+0072 u'r' [5] = U+0079 u'y' [6] = U+0020 u' ' [7] = U+006d u'm' [8] = U+0075 u'u' [9] = U+0063 u'c' [10] = U+0068 u'h' [11] = U+0020 u' ' [12] = U+0062 u'b' [13] = U+006f u'o' [14] = U+0072 u'r' [15] = U+0069 u'i' [16] = U+006e u'n' [17] = U+0067 u'g' [18] = U+0020 u' ' [19] = U+0074 u't' [20] = U+0061 u'a' [21] = U+0073 u's' [22] = U+006b u'k' [23] = U+0020 u' ' [24] = U+0074 u't' [25] = U+006f u'o' [26] = U+0020 u' ' [27] = U+0077 u'w' [28] = U+0072 u'r' [29] = U+0069 u'i' [30] = U+0074 u't' [31] = U+0065 u'e' [32] = U+0020 u' ' [33] = U+0061 u'a' [34] = U+0020 u' ' [35] = U+0073 u's' [36] = U+0074 u't' [37] = U+0072 u'r' [38] = U+0069 u'i' [39] = U+006e u'n' [40] = U+0067 u'g' [41] = U+0020 u' ' [42] = U+0074 u't' [43] = U+0068 u'h' [44] = U+0069 u'i' [45] = U+0073 u's' [46] = U+0020 u' ' [47] = U+0077 u'w' [48] = U+0061 u'a' [49] = U+0079 u'y' [50] = U+0021 u'!' [51] = U+0021 u'!' [52] = U+03c3 u'σ' [53] = U+0000 u'\0' } (NSString *) str9 = 0x000060d000001be0 @"a very much boring task to write a string this way!!σ\0" (const unichar [2]) myNextCharacters = { [0] = U+03c3 u'σ' [1] = U+0000 u'\0' } (NSString *) str10 = 0x000060c000002200 @"This is a Unicode string σ number 4 right here" (NSString *) str11 = 0x0000603000003280 @"__NSCFString" (NSString *) label1 = 0x0000000100006210 @"Process Name: " (NSString *) label2 = 0x0000000100006230 @"Process Id: " (NSString *) processName = 0x2d9d3d05d3b0013f @"a.out" (NSString *) processID = 0x2d9d7b4784a6543f @"48872" (NSString *) str12 = 0x0000606000008f00 @"Process Name: a.out Process Id: 48872" (NSString *) strA1 = 0x0000606000008f60 @"A rather short ASCII NSString object is here" (NSString *) strA2 = 0x0000606000008fc0 @"A rather short UTF8 NSString object is here" (NSString *) strA3 = 0x0000000100006170 @"A string made with the at sign is here" (NSString *) strA4 = 0x0000606000009020 @"This is string number 4 right here" (NSString *) strA5 = 0x00006040000019d0 @"{{1, 1}, {5, 5}}" (NSString *) strA6 = 0x0000603000003310 @"1ST" (NSString *) strA7 = 0x0000603000003340 @"σxx" (NSString *) strA8 = 0x000061b000001580 @"hasVeryLongExtensionThisTimehasVeryLongExtensionThisTimehasVeryLongExtensionThisTimehasVeryLongExtensionThisTimehasVeryLongExtensionThisTimehasVeryLongExtensionThisTimehasVeryLongExtensionThisTimehasVeryLongExtensionThisTimehasVeryLongExtensionThisTimehasVeryLongExtensionThisTimehasVeryLongExtensionThisTimehasVeryLongExtensionThisTimehasVeryLongExtensionThisTimehasVeryLongExtensionThisTimehasVeryLongExtensionThisTimehasVeryLongExtensionThisTimehasVeryLongExtensionThisTimehasVeryLongExtensionThisTimehasVeryLongExtensionThisTimehasVeryLongExtensionThisTimehasVeryLongExtensionThisTimehasVeryLongExtensionThisTimehasVeryLongExtensionThisTimehasVeryLongExtensionThisTimehasVeryLongExtensionThisTimehasVeryLongExtensionThisTimehasVeryLongExtensionThisTimehasVeryLongExtensionThisTime" (NSString *) strA9 = 0x000060d000001e50 @"a very much boring task to write a string this way!!σ\0" (NSString *) strA10 = 0x000060c000002680 @"This is a Unicode string σ number 4 right here" (NSString *) strA11 = 0x0000603000003370 @"__NSCFString" (NSString *) strA12 = 0x0000606000009080 @"Process Name: a.out Process Id: 48872" (NSString *) strB1 = 0x00006060000090e0 @"A rather short ASCII NSString object is here" (NSString *) strB2 = 0x0000606000009140 @"A rather short UTF8 NSString object is here" (NSString *) strB3 = 0x0000000100006170 @"A string made with the at sign is here" (NSString *) strB4 = 0x00006060000091a0 @"This is string number 4 right here" (NSString *) strB5 = 0x0000604000001b10 @"{{1, 1}, {5, 5}}" (NSString *) strB6 = 0x00006030000033a0 @"1ST" (NSString *) strB7 = 0x00006030000033d0 @"σxx" (NSString *) strB8 = 0x000061b000002380 @"hasVeryLongExtensionThisTimehasVeryLongExtensionThisTimehasVeryLongExtensionThisTimehasVeryLongExtensionThisTimehasVeryLongExtensionThisTimehasVeryLongExtensionThisTimehasVeryLongExtensionThisTimehasVeryLongExtensionThisTimehasVeryLongExtensionThisTimehasVeryLongExtensionThisTimehasVeryLongExtensionThisTimehasVeryLongExtensionThisTimehasVeryLongExtensionThisTimehasVeryLongExtensionThisTimehasVeryLongExtensionThisTimehasVeryLongExtensionThisTimehasVeryLongExtensionThisTimehasVeryLongExtensionThisTimehasVeryLongExtensionThisTimehasVeryLongExtensionThisTimehasVeryLongExtensionThisTimehasVeryLongExtensionThisTimehasVeryLongExtensionThisTimehasVeryLongExtensionThisTimehasVeryLongExtensionThisTimehasVeryLongExtensionThisTimehasVeryLongExtensionThisTimehasVeryLongExtensionThisTime" (NSString *) strB9 = 0x000060d000001f20 @"a very much boring task to write a string this way!!σ\0" (NSString *) strB10 = 0x000060c000002a40 @"This is a Unicode string σ number 4 right here" (NSString *) strB11 = 0x0000603000003400 @"__NSCFString" (NSString *) strB12 = 0x0000606000009200 @"Process Name: a.out Process Id: 48872" (NSString *) strC11 = 0x0000603000003430 @"__NSCFString" (NSString *) strC12 = 0x0000606000009260 @"Process Name: a.out Process Id: 48872" (NSString *) strC1 = 0x00006060000092c0 @"A rather short ASCII NSString object is here" (NSString *) strC2 = 0x0000606000009320 @"A rather short UTF8 NSString object is here" (NSString *) strC3 = 0x0000000100006170 @"A string made with the at sign is here" (NSString *) strC4 = 0x0000606000009380 @"This is string number 4 right here" (NSString *) strC5 = 0x0000604000001c90 @"{{1, 1}, {5, 5}}" (NSString *) strC6 = 0x0000603000003460 @"1ST" (NSString *) strC7 = 0x0000603000003490 @"σxx" (NSString *) strC8 = 0x000061b000003180 @"hasVeryLongExtensionThisTimehasVeryLongExtensionThisTimehasVeryLongExtensionThisTimehasVeryLongExtensionThisTimehasVeryLongExtensionThisTimehasVeryLongExtensionThisTimehasVeryLongExtensionThisTimehasVeryLongExtensionThisTimehasVeryLongExtensionThisTimehasVeryLongExtensionThisTimehasVeryLongExtensionThisTimehasVeryLongExtensionThisTimehasVeryLongExtensionThisTimehasVeryLongExtensionThisTimehasVeryLongExtensionThisTimehasVeryLongExtensionThisTimehasVeryLongExtensionThisTimehasVeryLongExtensionThisTimehasVeryLongExtensionThisTimehasVeryLongExtensionThisTimehasVeryLongExtensionThisTimehasVeryLongExtensionThisTimehasVeryLongExtensionThisTimehasVeryLongExtensionThisTimehasVeryLongExtensionThisTimehasVeryLongExtensionThisTimehasVeryLongExtensionThisTimehasVeryLongExtensionThisTime" (NSString *) strC9 = 0x000060d000001ff0 @"a very much boring task to write a string this way!!σ\0" (NSString *) strC10 = 0x000060c000002ec0 @"This is a Unicode string σ number 4 right here" (NSString *) strD11 = 0x00006030000034c0 @"__NSCFString" (NSString *) strD12 = 0x00006060000093e0 @"Process Name: a.out Process Id: 48872" (NSString *) eAcute = 0x0000603000003520 @"é" (NSString *) randomHaziChar = 0x0000603000003580 @"鷅" (NSString *) japanese = 0x00000001000062b0 @"色は匂へど散りぬるを" (NSString *) italian = 0x00000001000062d0 @"L'Italia è una Repubblica democratica, fondata sul lavoro. La sovranità appartiene al popolo, che la esercita nelle forme e nei limiti della Costituzione." (NSString *) french = 0x00000001000062f0 @"Que veut cette horde d'esclaves, De traîtres, de rois conjurés?" (NSString *) german = 0x0000000100006310 @"Über-Ich und aus den Ansprüchen der sozialen Umwelt" (void *[3]) data_set = ([0] = 0x0000606000008ba0, [1] = 0x0000606000008c00, [2] = 0x0000000100006170) (NSString *) hebrew = 0x0000000100006330 @"לילה טוב" (NSArray *) newArray = 0x0000604000001dd0 @"50 elements" (NSDictionary *) newDictionary = 0x0000619000001980 12 key/value pairs (NSDictionary *) newMutableDictionary = 0x0000603000003640 21 key/value pairs (id [4]) cfKeys = { [0] = 0x0000000100006350 [1] = 0x0000000100006610 [2] = 0x0000000100006630 [3] = 0x0000000100006650 } (id [4]) cfValues = { [0] = 0x0000000100006350 [1] = 0x0000000100006610 [2] = 0x0000000100006630 [3] = 0x0000000100006650 } (NSDictionary *) nsDictionary = 0x00006060000095c0 2 key/value pairs (NSDictionary *) nscfDictionary = 0x0000606000009620 4 key/value pairs (CFDictionaryRef) cfDictionaryRef = 0x00006060000095c0 2 key/value pairs (NSAttributedString *) attrString = 0x00006030000036d0 @"hello world from foo" (NSAttributedString *) mutableAttrString = 0x0000603000003820 @"hello world from foo" (NSString *) mutableString = 0x0000604000001f90 @"foo said this string needs to be very long so much longer than whatever other string has been seen ever before by anyone of the mankind that of course this is still not long enough given what foo our friend foo our lovely dearly friend foo desired of us so i am adding more stuff here for the sake of it and for the joy of our friend who is named guess what just foo. hence, dear friend foo, stay safe, your string is now long enough to accommodate your testing need and I will make sure that if not we extend it with even more fuzzy random meaningless words pasted one after the other from a long tiresome friday evening spent working in my office. my office mate went home but I am still randomly typing just for the fun of seeing what happens of the length of a Mutable String in Cocoa if it goes beyond one byte.. so be it, dear foo" (NSString *) mutableGetConst = 0x0000618000000080 @"foo said this string needs to be very long so much longer than whatever other string has been seen ever before by anyone of the mankind that of course this is still not long enough given what foo our friend foo our lovely dearly friend foo desired of us so i am adding more stuff here for the sake of it and for the joy of our friend who is named guess what just foo. hence, dear friend foo, stay safe, your string is now long enough to accommodate your testing need and I will make sure that if not we extend it with even more fuzzy random meaningless words pasted one after the other from a long tiresome friday evening spent working in my office. my office mate went home but I am still randomly typing just for the fun of seeing what happens of the length of a Mutable String in Cocoa if it goes beyond one byte.. so be it, dear foo" (NSData *) immutableData = 0x0000603000003880 5 bytes (NSData *) mutableData = 0x0000604000002010 14 bytes (unsigned int) concreteLength = 100000 (void *) zeroes1 = 0x0000633000000800 (NSData *) concreteData = 0x00006030000038b0 100000 bytes (void *) zeroes2 = 0x000063300001c800 (NSMutableData *) concreteMutableData = 0x0000604000002050 100000 bytes (NSSet *) nsset = 0x0000604000002090 3 elements (NSSet *) nsmutableset = 0x0000603000003910 4 elements (NSSet *) nscfSet = 0x00006040000020d0 2 elements (CFSetRef) cfSetRef = 0x00006040000020d0 2 elements (CFDataRef) data_ref = 0x0000607000003f20 @"5 bytes" (CFMutableDataRef) mutable_data_ref = 0x0000607000003f90 @"5 bytes" (CFMutableStringRef) mutable_string_ref = 0x0000604000002110 @"Wish ya knew" (CFStringRef) cfstring_ref = 0x00000001000066d0 @"HELLO WORLD" (CFArrayRef) cfarray_ref = 0x0000607000004000 @"3 elements" (CFMutableArrayRef) mutable_array_ref = 0x0000604000002150 @"11 elements" (CFBinaryHeapRef) binheap_ref = 0x000060c000003640 @"21 items" (CFURLRef) cfurl_ref = 0x000060b000002350 @"http://www.foo.bar/" (CFURLRef) cfchildurl_ref = 0x00006070000040e0 @"page.html -- http://www.foo.bar/" (CFURLRef) cfgchildurl_ref = 0x0000607000004150 @"?whatever -- http://www.foo.bar/page.html" (NSDictionary *) error_userInfo = 0x0000606000009e60 2 key/value pairs (NSError *) nserror = 0x0000604000002290 domain: @"Foobar" - code: 12 (NSError **) nserrorptr = 0x00007ffeefbfee28 domain: @"Foobar" - code: 12 (NSBundle *) bundle_string = 0x0000607000004310 @"/System/Library/Frameworks/Accelerate.framework" (NSBundle *) bundle_url = 0x0000607000004af0 @"/System/Library/Frameworks/Foundation.framework" (NSBundle *) main_bundle = 0x0000607000004cb0 @"/Users/buildslave/jenkins/workspace/lldb-cmake-sanitized/lldb-build/lldb-test-build.noindex/functionalities/data-formatter/data-formatter-objc/TestDataFormatterObjCCF.test_coreframeworks_and_run_command_dsym" (NSArray *) bundles = 0x0000604000002450 @"1 element" (NSURL *) nsurl0 = 0x0000608000001320 @"file:///Users/buildslave/jenkins/workspace/lldb-cmake-sanitized/lldb-build/lldb-test-build.noindex/functionalities/data-formatter/data-formatter-objc/TestDataFormatterObjCCF.test_coreframeworks_and_run_command_dsym/" (NSException *) except0 = 0x00006040000024d0 @"First" (NSException *) except1 = 0x0000604000002510 @"Second" (NSException *) except2 = 0x0000604000002550 @"Third" (NSException *) except3 = 0x0000604000002590 @"Fourth" (NSURL *) nsurl = 0x000060b0000028d0 @"http://www.foo.bar" (NSURL *) nsurl2 = 0x0000607000004ee0 @"page.html -- http://www.foo.bar" (NSURL *) nsurl3 = 0x0000607000004f50 @"?whatever -- http://www.foo.bar/page.html" (NSDate *) date1 = 0xec20dd8cdc9e6067 1985-04-10 18:00:00 UTC (NSDate *) date2 = 0x0000604000008e90 2011-01-01 08:00:00 UTC (NSDate *) date3 = 0x0000602000003bb0 2020-05-31 08:56:46 UTC (NSDate *) date4 = 0xec506e4b3c9e6067 1970-01-02 00:00:00 UTC (NSDate *) date5 = 0x6c5f08a4db9e6067 2020-05-31 08:56:46 UTC (CFAbsoluteTime) date1_abs = 1985-04-10 10:00:00 PST (CFAbsoluteTime) date2_abs = 2011-01-01 00:00:00 PST (CFAbsoluteTime) date3_abs = 2020-05-31 01:56:46 PDT (CFAbsoluteTime) date4_abs = 1970-01-01 16:00:00 PST (CFAbsoluteTime) date5_abs = 2020-05-31 01:56:46 PDT (NSIndexSet *) iset1 = 0x0000603000009820 4 indexes (NSIndexSet *) iset2 = 0x0000603000009850 512 indexes (NSMutableIndexSet *) imset = 0x0000604000008f10 10 indexes (CFTimeZoneRef) cupertino = 0x0000608000001a20 @"America/Los_Angeles" (CFTimeZoneRef) home = 0x0000608000001ba0 @"Europe/Rome" (CFTimeZoneRef) europe = 0x0000608000001d20 @"Europe/Paris" (NSTimeZone *) cupertino_ns = 0x0000608000001a20 @"America/Los_Angeles" (NSTimeZone *) home_ns = 0x0000608000001ba0 @"Europe/Rome" (NSTimeZone *) europe_ns = 0x0000608000001d20 @"Europe/Paris" (CFGregorianUnits) cf_greg_units = 1 years, 3 months, 5 days, 12 hours, 5 minutes 7 seconds (CFGregorianDate) cf_greg_date = @"4/10/1985 18:0:0" (CFRange) cf_range = location=4 length=4 (NSPoint) ns_point = (x = 4, y = 4) (NSRange) ns_range = location=4, length=4 (NSRect) ns_rect = (origin = (x = 1, y = 1), size = (width = 5, height = 5)) (NSRect *) ns_rect_ptr = (origin = (x = 1, y = 1), size = (width = 5, height = 5)) (NSRectArray) ns_rect_arr = ((x = 1, y = 1), (width = 5, height = 5)), ... (NSSize) ns_size = (width = 5, height = 7) (NSSize *) ns_size_ptr = (width = 5, height = 7) (CGSize) cg_size = (width = 1, height = 6) (CGPoint) cg_point = (x = 2, y = 7) (CGRect) cg_rect = (origin = (x = 1, y = 2), size = (width = 7, height = 7)) (RGBColor) rgb_color = red=3 green=56 blue=35 (RGBColor *) rgb_color_ptr = red=3 green=56 blue=35 (Rect) rect = (t=4, l=8, b=4, r=7) (Rect *) rect_ptr = (t=4, l=8, b=4, r=7) (Point) point = (v=7, h=12) (Point *) point_ptr = (v=7, h=12) (HIPoint) hi_point = (x=7, y=12) (HIRect) hi_rect = origin=(x = 3, y = 5) size=(width = 4, height = 6) (SEL) foo_selector = "foo_selector_impl" (CFMutableBitVectorRef) mut_bv = 0x0000604000009490 1110 0110 1011 0000 1101 1010 1000 1111 0011 0101 1101 0001 00 (Molecule *) molecule = 0x0000602000003c50 (Class) myclass = NSValue (Class) myclass2 = NSTaggedPointerString (Class) myclass3 = Molecule (Class) myclass4 = NSMutableArray (Class) myclass5 = nil (NSArray *) components = 0x00006040000094d0 @"3 elements" (NSString *) path = 0x0000604000009510 @"usr/blah/stuff"

Hide Details

Hide Details

Expecting sub string: (CFGregorianUnits) cf_greg_units = 1 years, 3 months, 5 days, 12 hours, 5 minutes 7 seconds Matched

Hide Details

Expecting sub string: (CFGregorianDate) cf_greg_date = @"4/10/1985 18:0:0" Matched

Hide Details

Expecting sub string: (CFRange) cf_range = location=4 length=4 Matched

Hide Details

Expecting sub string: (NSPoint) ns_point = (x = 4, y = 4) Matched

Hide Details

Expecting sub string: (NSRange) ns_range = location=4, length=4 Matched

Hide Details

Expecting sub string: (NSRect) ns_rect = (origin = (x = 1, y = 1), size = (width = 5, height = 5)) Matched

Hide Details

Expecting sub string: (NSRectArray) ns_rect_arr = ((x = 1, y = 1), (width = 5, height = 5)), ... Matched

Hide Details

Expecting sub string: (NSSize) ns_size = (width = 5, height = 7) Matched

Hide Details

Expecting sub string: (CGSize) cg_size = (width = 1, height = 6) Matched

Hide Details

Expecting sub string: (CGPoint) cg_point = (x = 2, y = 7) Matched

Hide Details

Expecting sub string: (CGRect) cg_rect = (origin = (x = 1, y = 2), size = (width = 7, height = 7)) Matched

Hide Details

Expecting sub string: (Rect) rect = (t=4, l=8, b=4, r=7) Matched

Hide Details

Expecting sub string: (Rect *) rect_ptr = (t=4, l=8, b=4, r=7) Matched

Hide Details

Expecting sub string: (Point) point = (v=7, h=12) Matched

Hide Details

Expecting sub string: (Point *) point_ptr = (v=7, h=12) Matched

Hide Details

Expecting sub string: (SEL) foo_selector = "foo_selector_impl" Matched

Hide Details

runCmd: frame variable output: (int) argc = 1 (const char **) argv = 0x00007ffeefbff420 (NSAutoreleasePool *) pool = 0x00006040000016d0 (MyClass *) object = 0x0000603000002f20 (MyOtherClass *) object2 = 0x0000603000002f50 (NSNumber *) num1 = 0x2d9d4970bc9e654d (int)5 (NSNumber *) num2 = 0x0000603000002fe0 (float)3.140000 (NSNumber *) num3 = 0x0000603000003010 (double)3.14 (NSNumber *) num4 = 0x0000603000003040 (int128_t)18446744073709551614 (NSNumber *) num5 = 0x2d9d4970bc9e216d (char)65 (NSNumber *) num6 = 0x2d9d4970bc9e9f5d (long)255 (NSNumber *) num7 = 0x2d9d4970a21ae05d (long)2000000 (NSNumber *) num8_Y = 0x00007fffa3c4dc30 YES (NSNumber *) num8_N = 0x00007fffa3c4dc40 NO (NSNumber *) num9 = 0xd262b68f431ae07d (short)-31616 (NSNumber *) num_at1 = 0x2d9d4970bc9e6c4d (int)12 (NSNumber *) num_at2 = 0xd262b68f4361944d (int)-12 (NSNumber *) num_at3 = 0x0000603000003070 (double)12.5 (NSNumber *) num_at4 = 0x00006030000030a0 (double)-12.5 (NSDecimalNumber *) decimal_number = 0x00006030000030d0 123456 x 10^-10 (NSDecimalNumber *) decimal_number_neg = 0x0000603000003100 -123456 x 10^10 (NSDecimalNumber *) decimal_one = 0x0000603000003130 1 x 10^0 (NSDecimalNumber *) decimal_zero = 0x0000602000002370 0 (NSDecimalNumber *) decimal_nan = 0x0000602000002390 NaN (NSString *) str0 = 0x2d9d497089ab525f @"255" (NSString *) str1 = 0x0000606000008ba0 @"A rather short ASCII NSString object is here" (NSString *) str2 = 0x0000606000008c00 @"A rather short UTF8 NSString object is here" (NSString *) str3 = 0x0000000100006170 @"A string made with the at sign is here" (NSString *) str4 = 0x0000606000008c60 @"This is string number 4 right here" (NSRect) ns_rect_4str = (origin = (x = 1, y = 1), size = (width = 5, height = 5)) (NSString *) str5 = 0x0000604000001810 @"{{1, 1}, {5, 5}}" (NSString *) str6 = 0x0000603000003220 @"1ST" (const unichar [3]) myCharacters = { [0] = U+03c3 u'σ' [1] = U+0078 u'x' [2] = U+0078 u'x' } (NSString *) str7 = 0x0000603000003250 @"σxx" (NSString *) str8 = 0x000061b000000780 @"hasVeryLongExtensionThisTimehasVeryLongExtensionThisTimehasVeryLongExtensionThisTimehasVeryLongExtensionThisTimehasVeryLongExtensionThisTimehasVeryLongExtensionThisTimehasVeryLongExtensionThisTimehasVeryLongExtensionThisTimehasVeryLongExtensionThisTimehasVeryLongExtensionThisTimehasVeryLongExtensionThisTimehasVeryLongExtensionThisTimehasVeryLongExtensionThisTimehasVeryLongExtensionThisTimehasVeryLongExtensionThisTimehasVeryLongExtensionThisTimehasVeryLongExtensionThisTimehasVeryLongExtensionThisTimehasVeryLongExtensionThisTimehasVeryLongExtensionThisTimehasVeryLongExtensionThisTimehasVeryLongExtensionThisTimehasVeryLongExtensionThisTimehasVeryLongExtensionThisTimehasVeryLongExtensionThisTimehasVeryLongExtensionThisTimehasVeryLongExtensionThisTimehasVeryLongExtensionThisTime" (const unichar [54]) myOtherCharacters = { [0] = U+0061 u'a' [1] = U+0020 u' ' [2] = U+0076 u'v' [3] = U+0065 u'e' [4] = U+0072 u'r' [5] = U+0079 u'y' [6] = U+0020 u' ' [7] = U+006d u'm' [8] = U+0075 u'u' [9] = U+0063 u'c' [10] = U+0068 u'h' [11] = U+0020 u' ' [12] = U+0062 u'b' [13] = U+006f u'o' [14] = U+0072 u'r' [15] = U+0069 u'i' [16] = U+006e u'n' [17] = U+0067 u'g' [18] = U+0020 u' ' [19] = U+0074 u't' [20] = U+0061 u'a' [21] = U+0073 u's' [22] = U+006b u'k' [23] = U+0020 u' ' [24] = U+0074 u't' [25] = U+006f u'o' [26] = U+0020 u' ' [27] = U+0077 u'w' [28] = U+0072 u'r' [29] = U+0069 u'i' [30] = U+0074 u't' [31] = U+0065 u'e' [32] = U+0020 u' ' [33] = U+0061 u'a' [34] = U+0020 u' ' [35] = U+0073 u's' [36] = U+0074 u't' [37] = U+0072 u'r' [38] = U+0069 u'i' [39] = U+006e u'n' [40] = U+0067 u'g' [41] = U+0020 u' ' [42] = U+0074 u't' [43] = U+0068 u'h' [44] = U+0069 u'i' [45] = U+0073 u's' [46] = U+0020 u' ' [47] = U+0077 u'w' [48] = U+0061 u'a' [49] = U+0079 u'y' [50] = U+0021 u'!' [51] = U+0021 u'!' [52] = U+03c3 u'σ' [53] = U+0000 u'\0' } (NSString *) str9 = 0x000060d000001be0 @"a very much boring task to write a string this way!!σ\0" (const unichar [2]) myNextCharacters = { [0] = U+03c3 u'σ' [1] = U+0000 u'\0' } (NSString *) str10 = 0x000060c000002200 @"This is a Unicode string σ number 4 right here" (NSString *) str11 = 0x0000603000003280 @"__NSCFString" (NSString *) label1 = 0x0000000100006210 @"Process Name: " (NSString *) label2 = 0x0000000100006230 @"Process Id: " (NSString *) processName = 0x2d9d3d05d3b0013f @"a.out" (NSString *) processID = 0x2d9d7b4784a6543f @"48872" (NSString *) str12 = 0x0000606000008f00 @"Process Name: a.out Process Id: 48872" (NSString *) strA1 = 0x0000606000008f60 @"A rather short ASCII NSString object is here" (NSString *) strA2 = 0x0000606000008fc0 @"A rather short UTF8 NSString object is here" (NSString *) strA3 = 0x0000000100006170 @"A string made with the at sign is here" (NSString *) strA4 = 0x0000606000009020 @"This is string number 4 right here" (NSString *) strA5 = 0x00006040000019d0 @"{{1, 1}, {5, 5}}" (NSString *) strA6 = 0x0000603000003310 @"1ST" (NSString *) strA7 = 0x0000603000003340 @"σxx" (NSString *) strA8 = 0x000061b000001580 @"hasVeryLongExtensionThisTimehasVeryLongExtensionThisTimehasVeryLongExtensionThisTimehasVeryLongExtensionThisTimehasVeryLongExtensionThisTimehasVeryLongExtensionThisTimehasVeryLongExtensionThisTimehasVeryLongExtensionThisTimehasVeryLongExtensionThisTimehasVeryLongExtensionThisTimehasVeryLongExtensionThisTimehasVeryLongExtensionThisTimehasVeryLongExtensionThisTimehasVeryLongExtensionThisTimehasVeryLongExtensionThisTimehasVeryLongExtensionThisTimehasVeryLongExtensionThisTimehasVeryLongExtensionThisTimehasVeryLongExtensionThisTimehasVeryLongExtensionThisTimehasVeryLongExtensionThisTimehasVeryLongExtensionThisTimehasVeryLongExtensionThisTimehasVeryLongExtensionThisTimehasVeryLongExtensionThisTimehasVeryLongExtensionThisTimehasVeryLongExtensionThisTimehasVeryLongExtensionThisTime" (NSString *) strA9 = 0x000060d000001e50 @"a very much boring task to write a string this way!!σ\0" (NSString *) strA10 = 0x000060c000002680 @"This is a Unicode string σ number 4 right here" (NSString *) strA11 = 0x0000603000003370 @"__NSCFString" (NSString *) strA12 = 0x0000606000009080 @"Process Name: a.out Process Id: 48872" (NSString *) strB1 = 0x00006060000090e0 @"A rather short ASCII NSString object is here" (NSString *) strB2 = 0x0000606000009140 @"A rather short UTF8 NSString object is here" (NSString *) strB3 = 0x0000000100006170 @"A string made with the at sign is here" (NSString *) strB4 = 0x00006060000091a0 @"This is string number 4 right here" (NSString *) strB5 = 0x0000604000001b10 @"{{1, 1}, {5, 5}}" (NSString *) strB6 = 0x00006030000033a0 @"1ST" (NSString *) strB7 = 0x00006030000033d0 @"σxx" (NSString *) strB8 = 0x000061b000002380 @"hasVeryLongExtensionThisTimehasVeryLongExtensionThisTimehasVeryLongExtensionThisTimehasVeryLongExtensionThisTimehasVeryLongExtensionThisTimehasVeryLongExtensionThisTimehasVeryLongExtensionThisTimehasVeryLongExtensionThisTimehasVeryLongExtensionThisTimehasVeryLongExtensionThisTimehasVeryLongExtensionThisTimehasVeryLongExtensionThisTimehasVeryLongExtensionThisTimehasVeryLongExtensionThisTimehasVeryLongExtensionThisTimehasVeryLongExtensionThisTimehasVeryLongExtensionThisTimehasVeryLongExtensionThisTimehasVeryLongExtensionThisTimehasVeryLongExtensionThisTimehasVeryLongExtensionThisTimehasVeryLongExtensionThisTimehasVeryLongExtensionThisTimehasVeryLongExtensionThisTimehasVeryLongExtensionThisTimehasVeryLongExtensionThisTimehasVeryLongExtensionThisTimehasVeryLongExtensionThisTime" (NSString *) strB9 = 0x000060d000001f20 @"a very much boring task to write a string this way!!σ\0" (NSString *) strB10 = 0x000060c000002a40 @"This is a Unicode string σ number 4 right here" (NSString *) strB11 = 0x0000603000003400 @"__NSCFString" (NSString *) strB12 = 0x0000606000009200 @"Process Name: a.out Process Id: 48872" (NSString *) strC11 = 0x0000603000003430 @"__NSCFString" (NSString *) strC12 = 0x0000606000009260 @"Process Name: a.out Process Id: 48872" (NSString *) strC1 = 0x00006060000092c0 @"A rather short ASCII NSString object is here" (NSString *) strC2 = 0x0000606000009320 @"A rather short UTF8 NSString object is here" (NSString *) strC3 = 0x0000000100006170 @"A string made with the at sign is here" (NSString *) strC4 = 0x0000606000009380 @"This is string number 4 right here" (NSString *) strC5 = 0x0000604000001c90 @"{{1, 1}, {5, 5}}" (NSString *) strC6 = 0x0000603000003460 @"1ST" (NSString *) strC7 = 0x0000603000003490 @"σxx" (NSString *) strC8 = 0x000061b000003180 @"hasVeryLongExtensionThisTimehasVeryLongExtensionThisTimehasVeryLongExtensionThisTimehasVeryLongExtensionThisTimehasVeryLongExtensionThisTimehasVeryLongExtensionThisTimehasVeryLongExtensionThisTimehasVeryLongExtensionThisTimehasVeryLongExtensionThisTimehasVeryLongExtensionThisTimehasVeryLongExtensionThisTimehasVeryLongExtensionThisTimehasVeryLongExtensionThisTimehasVeryLongExtensionThisTimehasVeryLongExtensionThisTimehasVeryLongExtensionThisTimehasVeryLongExtensionThisTimehasVeryLongExtensionThisTimehasVeryLongExtensionThisTimehasVeryLongExtensionThisTimehasVeryLongExtensionThisTimehasVeryLongExtensionThisTimehasVeryLongExtensionThisTimehasVeryLongExtensionThisTimehasVeryLongExtensionThisTimehasVeryLongExtensionThisTimehasVeryLongExtensionThisTimehasVeryLongExtensionThisTime" (NSString *) strC9 = 0x000060d000001ff0 @"a very much boring task to write a string this way!!σ\0" (NSString *) strC10 = 0x000060c000002ec0 @"This is a Unicode string σ number 4 right here" (NSString *) strD11 = 0x00006030000034c0 @"__NSCFString" (NSString *) strD12 = 0x00006060000093e0 @"Process Name: a.out Process Id: 48872" (NSString *) eAcute = 0x0000603000003520 @"é" (NSString *) randomHaziChar = 0x0000603000003580 @"鷅" (NSString *) japanese = 0x00000001000062b0 @"色は匂へど散りぬるを" (NSString *) italian = 0x00000001000062d0 @"L'Italia è una Repubblica democratica, fondata sul lavoro. La sovranità appartiene al popolo, che la esercita nelle forme e nei limiti della Costituzione." (NSString *) french = 0x00000001000062f0 @"Que veut cette horde d'esclaves, De traîtres, de rois conjurés?" (NSString *) german = 0x0000000100006310 @"Über-Ich und aus den Ansprüchen der sozialen Umwelt" (void *[3]) data_set = ([0] = 0x0000606000008ba0, [1] = 0x0000606000008c00, [2] = 0x0000000100006170) (NSString *) hebrew = 0x0000000100006330 @"לילה טוב" (NSArray *) newArray = 0x0000604000001dd0 @"50 elements" (NSDictionary *) newDictionary = 0x0000619000001980 12 key/value pairs (NSDictionary *) newMutableDictionary = 0x0000603000003640 21 key/value pairs (id [4]) cfKeys = { [0] = 0x0000000100006350 [1] = 0x0000000100006610 [2] = 0x0000000100006630 [3] = 0x0000000100006650 } (id [4]) cfValues = { [0] = 0x0000000100006350 [1] = 0x0000000100006610 [2] = 0x0000000100006630 [3] = 0x0000000100006650 } (NSDictionary *) nsDictionary = 0x00006060000095c0 2 key/value pairs (NSDictionary *) nscfDictionary = 0x0000606000009620 4 key/value pairs (CFDictionaryRef) cfDictionaryRef = 0x00006060000095c0 2 key/value pairs (NSAttributedString *) attrString = 0x00006030000036d0 @"hello world from foo" (NSAttributedString *) mutableAttrString = 0x0000603000003820 @"hello world from foo" (NSString *) mutableString = 0x0000604000001f90 @"foo said this string needs to be very long so much longer than whatever other string has been seen ever before by anyone of the mankind that of course this is still not long enough given what foo our friend foo our lovely dearly friend foo desired of us so i am adding more stuff here for the sake of it and for the joy of our friend who is named guess what just foo. hence, dear friend foo, stay safe, your string is now long enough to accommodate your testing need and I will make sure that if not we extend it with even more fuzzy random meaningless words pasted one after the other from a long tiresome friday evening spent working in my office. my office mate went home but I am still randomly typing just for the fun of seeing what happens of the length of a Mutable String in Cocoa if it goes beyond one byte.. so be it, dear foo" (NSString *) mutableGetConst = 0x0000618000000080 @"foo said this string needs to be very long so much longer than whatever other string has been seen ever before by anyone of the mankind that of course this is still not long enough given what foo our friend foo our lovely dearly friend foo desired of us so i am adding more stuff here for the sake of it and for the joy of our friend who is named guess what just foo. hence, dear friend foo, stay safe, your string is now long enough to accommodate your testing need and I will make sure that if not we extend it with even more fuzzy random meaningless words pasted one after the other from a long tiresome friday evening spent working in my office. my office mate went home but I am still randomly typing just for the fun of seeing what happens of the length of a Mutable String in Cocoa if it goes beyond one byte.. so be it, dear foo" (NSData *) immutableData = 0x0000603000003880 5 bytes (NSData *) mutableData = 0x0000604000002010 14 bytes (unsigned int) concreteLength = 100000 (void *) zeroes1 = 0x0000633000000800 (NSData *) concreteData = 0x00006030000038b0 100000 bytes (void *) zeroes2 = 0x000063300001c800 (NSMutableData *) concreteMutableData = 0x0000604000002050 100000 bytes (NSSet *) nsset = 0x0000604000002090 3 elements (NSSet *) nsmutableset = 0x0000603000003910 4 elements (NSSet *) nscfSet = 0x00006040000020d0 2 elements (CFSetRef) cfSetRef = 0x00006040000020d0 2 elements (CFDataRef) data_ref = 0x0000607000003f20 @"5 bytes" (CFMutableDataRef) mutable_data_ref = 0x0000607000003f90 @"5 bytes" (CFMutableStringRef) mutable_string_ref = 0x0000604000002110 @"Wish ya knew" (CFStringRef) cfstring_ref = 0x00000001000066d0 @"HELLO WORLD" (CFArrayRef) cfarray_ref = 0x0000607000004000 @"3 elements" (CFMutableArrayRef) mutable_array_ref = 0x0000604000002150 @"11 elements" (CFBinaryHeapRef) binheap_ref = 0x000060c000003640 @"21 items" (CFURLRef) cfurl_ref = 0x000060b000002350 @"http://www.foo.bar/" (CFURLRef) cfchildurl_ref = 0x00006070000040e0 @"page.html -- http://www.foo.bar/" (CFURLRef) cfgchildurl_ref = 0x0000607000004150 @"?whatever -- http://www.foo.bar/page.html" (NSDictionary *) error_userInfo = 0x0000606000009e60 2 key/value pairs (NSError *) nserror = 0x0000604000002290 domain: @"Foobar" - code: 12 (NSError **) nserrorptr = 0x00007ffeefbfee28 domain: @"Foobar" - code: 12 (NSBundle *) bundle_string = 0x0000607000004310 @"/System/Library/Frameworks/Accelerate.framework" (NSBundle *) bundle_url = 0x0000607000004af0 @"/System/Library/Frameworks/Foundation.framework" (NSBundle *) main_bundle = 0x0000607000004cb0 @"/Users/buildslave/jenkins/workspace/lldb-cmake-sanitized/lldb-build/lldb-test-build.noindex/functionalities/data-formatter/data-formatter-objc/TestDataFormatterObjCCF.test_coreframeworks_and_run_command_dsym" (NSArray *) bundles = 0x0000604000002450 @"1 element" (NSURL *) nsurl0 = 0x0000608000001320 @"file:///Users/buildslave/jenkins/workspace/lldb-cmake-sanitized/lldb-build/lldb-test-build.noindex/functionalities/data-formatter/data-formatter-objc/TestDataFormatterObjCCF.test_coreframeworks_and_run_command_dsym/" (NSException *) except0 = 0x00006040000024d0 @"First" (NSException *) except1 = 0x0000604000002510 @"Second" (NSException *) except2 = 0x0000604000002550 @"Third" (NSException *) except3 = 0x0000604000002590 @"Fourth" (NSURL *) nsurl = 0x000060b0000028d0 @"http://www.foo.bar" (NSURL *) nsurl2 = 0x0000607000004ee0 @"page.html -- http://www.foo.bar" (NSURL *) nsurl3 = 0x0000607000004f50 @"?whatever -- http://www.foo.bar/page.html" (NSDate *) date1 = 0xec20dd8cdc9e6067 1985-04-10 18:00:00 UTC (NSDate *) date2 = 0x0000604000008e90 2011-01-01 08:00:00 UTC (NSDate *) date3 = 0x0000602000003bb0 2020-05-31 08:56:46 UTC (NSDate *) date4 = 0xec506e4b3c9e6067 1970-01-02 00:00:00 UTC (NSDate *) date5 = 0x6c5f08a4db9e6067 2020-05-31 08:56:46 UTC (CFAbsoluteTime) date1_abs = 1985-04-10 10:00:00 PST (CFAbsoluteTime) date2_abs = 2011-01-01 00:00:00 PST (CFAbsoluteTime) date3_abs = 2020-05-31 01:56:46 PDT (CFAbsoluteTime) date4_abs = 1970-01-01 16:00:00 PST (CFAbsoluteTime) date5_abs = 2020-05-31 01:56:46 PDT (NSIndexSet *) iset1 = 0x0000603000009820 4 indexes (NSIndexSet *) iset2 = 0x0000603000009850 512 indexes (NSMutableIndexSet *) imset = 0x0000604000008f10 10 indexes (CFTimeZoneRef) cupertino = 0x0000608000001a20 @"America/Los_Angeles" (CFTimeZoneRef) home = 0x0000608000001ba0 @"Europe/Rome" (CFTimeZoneRef) europe = 0x0000608000001d20 @"Europe/Paris" (NSTimeZone *) cupertino_ns = 0x0000608000001a20 @"America/Los_Angeles" (NSTimeZone *) home_ns = 0x0000608000001ba0 @"Europe/Rome" (NSTimeZone *) europe_ns = 0x0000608000001d20 @"Europe/Paris" (CFGregorianUnits) cf_greg_units = 1 years, 3 months, 5 days, 12 hours, 5 minutes 7 seconds (CFGregorianDate) cf_greg_date = @"4/10/1985 18:0:0" (CFRange) cf_range = location=4 length=4 (NSPoint) ns_point = (x = 4, y = 4) (NSRange) ns_range = location=4, length=4 (NSRect) ns_rect = (origin = (x = 1, y = 1), size = (width = 5, height = 5)) (NSRect *) ns_rect_ptr = (origin = (x = 1, y = 1), size = (width = 5, height = 5)) (NSRectArray) ns_rect_arr = ((x = 1, y = 1), (width = 5, height = 5)), ... (NSSize) ns_size = (width = 5, height = 7) (NSSize *) ns_size_ptr = (width = 5, height = 7) (CGSize) cg_size = (width = 1, height = 6) (CGPoint) cg_point = (x = 2, y = 7) (CGRect) cg_rect = (origin = (x = 1, y = 2), size = (width = 7, height = 7)) (RGBColor) rgb_color = red=3 green=56 blue=35 (RGBColor *) rgb_color_ptr = red=3 green=56 blue=35 (Rect) rect = (t=4, l=8, b=4, r=7) (Rect *) rect_ptr = (t=4, l=8, b=4, r=7) (Point) point = (v=7, h=12) (Point *) point_ptr = (v=7, h=12) (HIPoint) hi_point = (x=7, y=12) (HIRect) hi_rect = origin=(x = 3, y = 5) size=(width = 4, height = 6) (SEL) foo_selector = "foo_selector_impl" (CFMutableBitVectorRef) mut_bv = 0x0000604000009490 1110 0110 1011 0000 1101 1010 1000 1111 0011 0101 1101 0001 00 (Molecule *) molecule = 0x0000602000003c50 (Class) myclass = NSValue (Class) myclass2 = NSTaggedPointerString (Class) myclass3 = Molecule (Class) myclass4 = NSMutableArray (Class) myclass5 = nil (NSArray *) components = 0x00006040000094d0 @"3 elements" (NSString *) path = 0x0000604000009510 @"usr/blah/stuff"

Hide Details

Hide Details

Expecting sub string: (RGBColor) rgb_color = red=3 green=56 blue=35 Matched

Hide Details

Expecting sub string: (RGBColor *) rgb_color_ptr = red=3 green=56 blue=35 Matched

Hide Details

Expecting sub string: (HIPoint) hi_point = (x=7, y=12) Matched

Hide Details

Expecting sub string: (HIRect) hi_rect = origin=(x = 3, y = 5) size=(width = 4, height = 6) Matched

Hide Details

<bound method SBProcess.Kill of <lldb.SBProcess; proxy of <Swig Object of type 'lldb::SBProcess *' at 0x112f8d390> >>: success

Hide Details

PASS: LLDB (/Users/buildslave/jenkins/workspace/lldb-cmake-sanitized/lldb-build/bin/clang-11-x86_64) :: test_coreframeworks_and_run_command_dsym (TestDataFormatterObjCCF.ObjCDataFormatterCF) runCmd: settings clear -all output:

Hide Details

runCmd: settings set symbols.enable-external-lookup false output:

Hide Details

runCmd: settings set target.auto-apply-fixits false output:

Hide Details

runCmd: settings set plugin.process.gdb-remote.packet-timeout 60 output:

Hide Details

runCmd: settings set symbols.clang-modules-cache-path "/Users/buildslave/jenkins/workspace/lldb-cmake-sanitized/lldb-build/lldb-test-build.noindex/module-cache-lldb/lldb-api" output:

Hide Details

runCmd: settings set use-color false output:

Hide Details

runCmd: setting set target.prefer-dynamic-value no-dynamic-values output:

Hide Details

runCmd: settings set target.env-vars ASAN_OPTIONS=detect_stack_use_after_return=1 DYLD_INSERT_LIBRARIES=/Users/buildslave/jenkins/workspace/lldb-cmake-sanitized/host-compiler/lib/clang/11.0.0/lib/darwin/libclang_rt.asan_osx_dynamic.dylib output:

Hide Details

runCmd: settings set target.env-vars ASAN_OPTIONS=detect_stack_use_after_return=1 DYLD_INSERT_LIBRARIES=/Users/buildslave/jenkins/workspace/lldb-cmake-sanitized/host-compiler/lib/clang/11.0.0/lib/darwin/libclang_rt.asan_osx_dynamic.dylib output:

Hide Details

runCmd: thread list output: Process 49395 stopped * thread #1: tid = 0x499b99, 0x000000010000489b a.out`main(argc=1, argv=0x00007ffeefbff420) at main.m:770:4, queue = 'com.apple.main-thread', stop reason = breakpoint 1.1 thread #2: tid = 0x499bc6, 0x00007fff794f85be libsystem_kernel.dylib`__workq_kernreturn + 10 thread #3: tid = 0x499bc7, 0x00007fff794f85be libsystem_kernel.dylib`__workq_kernreturn + 10

Hide Details

Hide Details

Expecting sub string: stopped Matched

Hide Details

Expecting sub string: stop reason = breakpoint Matched

Hide Details

runCmd: frame variable output: (int) argc = 1 (const char **) argv = 0x00007ffeefbff420 (NSAutoreleasePool *) pool = 0x00006040000016d0 (MyClass *) object = 0x0000603000002f20 (MyOtherClass *) object2 = 0x0000603000002f50 (NSNumber *) num1 = 0xf24cc2aec1154175 (int)5 (NSNumber *) num2 = 0x0000603000002fe0 (float)3.140000 (NSNumber *) num3 = 0x0000603000003010 (double)3.14 (NSNumber *) num4 = 0x0000603000003040 (int128_t)18446744073709551614 (NSNumber *) num5 = 0xf24cc2aec1150555 (char)65 (NSNumber *) num6 = 0xf24cc2aec115bb65 (long)255 (NSNumber *) num7 = 0xf24cc2aedf91c465 (long)2000000 (NSNumber *) num8_Y = 0x00007fffa3c4dc30 YES (NSNumber *) num8_N = 0x00007fffa3c4dc40 NO (NSNumber *) num9 = 0x0db33d513e91c445 (short)-31616 (NSNumber *) num_at1 = 0xf24cc2aec1154875 (int)12 (NSNumber *) num_at2 = 0x0db33d513eeab075 (int)-12 (NSNumber *) num_at3 = 0x0000603000003070 (double)12.5 (NSNumber *) num_at4 = 0x00006030000030a0 (double)-12.5 (NSDecimalNumber *) decimal_number = 0x00006030000030d0 123456 x 10^-10 (NSDecimalNumber *) decimal_number_neg = 0x0000603000003100 -123456 x 10^10 (NSDecimalNumber *) decimal_one = 0x0000603000003130 1 x 10^0 (NSDecimalNumber *) decimal_zero = 0x0000602000002370 0 (NSDecimalNumber *) decimal_nan = 0x0000602000002390 NaN (NSString *) str0 = 0xf24cc2aef4207667 @"255" (NSString *) str1 = 0x0000606000008ba0 @"A rather short ASCII NSString object is here" (NSString *) str2 = 0x0000606000008c00 @"A rather short UTF8 NSString object is here" (NSString *) str3 = 0x0000000100006170 @"A string made with the at sign is here" (NSString *) str4 = 0x0000606000008c60 @"This is string number 4 right here" (NSRect) ns_rect_4str = (origin = (x = 1, y = 1), size = (width = 5, height = 5)) (NSString *) str5 = 0x0000604000001810 @"{{1, 1}, {5, 5}}" (NSString *) str6 = 0x0000603000003220 @"1ST" (const unichar [3]) myCharacters = { [0] = U+03c3 u'σ' [1] = U+0078 u'x' [2] = U+0078 u'x' } (NSString *) str7 = 0x0000603000003250 @"σxx" (NSString *) str8 = 0x000061b000000780 @"hasVeryLongExtensionThisTimehasVeryLongExtensionThisTimehasVeryLongExtensionThisTimehasVeryLongExtensionThisTimehasVeryLongExtensionThisTimehasVeryLongExtensionThisTimehasVeryLongExtensionThisTimehasVeryLongExtensionThisTimehasVeryLongExtensionThisTimehasVeryLongExtensionThisTimehasVeryLongExtensionThisTimehasVeryLongExtensionThisTimehasVeryLongExtensionThisTimehasVeryLongExtensionThisTimehasVeryLongExtensionThisTimehasVeryLongExtensionThisTimehasVeryLongExtensionThisTimehasVeryLongExtensionThisTimehasVeryLongExtensionThisTimehasVeryLongExtensionThisTimehasVeryLongExtensionThisTimehasVeryLongExtensionThisTimehasVeryLongExtensionThisTimehasVeryLongExtensionThisTimehasVeryLongExtensionThisTimehasVeryLongExtensionThisTimehasVeryLongExtensionThisTimehasVeryLongExtensionThisTime" (const unichar [54]) myOtherCharacters = { [0] = U+0061 u'a' [1] = U+0020 u' ' [2] = U+0076 u'v' [3] = U+0065 u'e' [4] = U+0072 u'r' [5] = U+0079 u'y' [6] = U+0020 u' ' [7] = U+006d u'm' [8] = U+0075 u'u' [9] = U+0063 u'c' [10] = U+0068 u'h' [11] = U+0020 u' ' [12] = U+0062 u'b' [13] = U+006f u'o' [14] = U+0072 u'r' [15] = U+0069 u'i' [16] = U+006e u'n' [17] = U+0067 u'g' [18] = U+0020 u' ' [19] = U+0074 u't' [20] = U+0061 u'a' [21] = U+0073 u's' [22] = U+006b u'k' [23] = U+0020 u' ' [24] = U+0074 u't' [25] = U+006f u'o' [26] = U+0020 u' ' [27] = U+0077 u'w' [28] = U+0072 u'r' [29] = U+0069 u'i' [30] = U+0074 u't' [31] = U+0065 u'e' [32] = U+0020 u' ' [33] = U+0061 u'a' [34] = U+0020 u' ' [35] = U+0073 u's' [36] = U+0074 u't' [37] = U+0072 u'r' [38] = U+0069 u'i' [39] = U+006e u'n' [40] = U+0067 u'g' [41] = U+0020 u' ' [42] = U+0074 u't' [43] = U+0068 u'h' [44] = U+0069 u'i' [45] = U+0073 u's' [46] = U+0020 u' ' [47] = U+0077 u'w' [48] = U+0061 u'a' [49] = U+0079 u'y' [50] = U+0021 u'!' [51] = U+0021 u'!' [52] = U+03c3 u'σ' [53] = U+0000 u'\0' } (NSString *) str9 = 0x000060d000001be0 @"a very much boring task to write a string this way!!σ\0" (const unichar [2]) myNextCharacters = { [0] = U+03c3 u'σ' [1] = U+0000 u'\0' } (NSString *) str10 = 0x000060c000002200 @"This is a Unicode string σ number 4 right here" (NSString *) str11 = 0x0000603000003280 @"__NSCFString" (NSString *) label1 = 0x0000000100006210 @"Process Name: " (NSString *) label2 = 0x0000000100006230 @"Process Id: " (NSString *) processName = 0xf24cb6dbae3b2507 @"a.out" (NSString *) processID = 0xf24cf797f22c7007 @"49395" (NSString *) str12 = 0x0000606000008f00 @"Process Name: a.out Process Id: 49395" (NSString *) strA1 = 0x0000606000008f60 @"A rather short ASCII NSString object is here" (NSString *) strA2 = 0x0000606000008fc0 @"A rather short UTF8 NSString object is here" (NSString *) strA3 = 0x0000000100006170 @"A string made with the at sign is here" (NSString *) strA4 = 0x0000606000009020 @"This is string number 4 right here" (NSString *) strA5 = 0x00006040000019d0 @"{{1, 1}, {5, 5}}" (NSString *) strA6 = 0x0000603000003310 @"1ST" (NSString *) strA7 = 0x0000603000003340 @"σxx" (NSString *) strA8 = 0x000061b000001580 @"hasVeryLongExtensionThisTimehasVeryLongExtensionThisTimehasVeryLongExtensionThisTimehasVeryLongExtensionThisTimehasVeryLongExtensionThisTimehasVeryLongExtensionThisTimehasVeryLongExtensionThisTimehasVeryLongExtensionThisTimehasVeryLongExtensionThisTimehasVeryLongExtensionThisTimehasVeryLongExtensionThisTimehasVeryLongExtensionThisTimehasVeryLongExtensionThisTimehasVeryLongExtensionThisTimehasVeryLongExtensionThisTimehasVeryLongExtensionThisTimehasVeryLongExtensionThisTimehasVeryLongExtensionThisTimehasVeryLongExtensionThisTimehasVeryLongExtensionThisTimehasVeryLongExtensionThisTimehasVeryLongExtensionThisTimehasVeryLongExtensionThisTimehasVeryLongExtensionThisTimehasVeryLongExtensionThisTimehasVeryLongExtensionThisTimehasVeryLongExtensionThisTimehasVeryLongExtensionThisTime" (NSString *) strA9 = 0x000060d000001e50 @"a very much boring task to write a string this way!!σ\0" (NSString *) strA10 = 0x000060c000002680 @"This is a Unicode string σ number 4 right here" (NSString *) strA11 = 0x0000603000003370 @"__NSCFString" (NSString *) strA12 = 0x0000606000009080 @"Process Name: a.out Process Id: 49395" (NSString *) strB1 = 0x00006060000090e0 @"A rather short ASCII NSString object is here" (NSString *) strB2 = 0x0000606000009140 @"A rather short UTF8 NSString object is here" (NSString *) strB3 = 0x0000000100006170 @"A string made with the at sign is here" (NSString *) strB4 = 0x00006060000091a0 @"This is string number 4 right here" (NSString *) strB5 = 0x0000604000001b10 @"{{1, 1}, {5, 5}}" (NSString *) strB6 = 0x00006030000033a0 @"1ST" (NSString *) strB7 = 0x00006030000033d0 @"σxx" (NSString *) strB8 = 0x000061b000002380 @"hasVeryLongExtensionThisTimehasVeryLongExtensionThisTimehasVeryLongExtensionThisTimehasVeryLongExtensionThisTimehasVeryLongExtensionThisTimehasVeryLongExtensionThisTimehasVeryLongExtensionThisTimehasVeryLongExtensionThisTimehasVeryLongExtensionThisTimehasVeryLongExtensionThisTimehasVeryLongExtensionThisTimehasVeryLongExtensionThisTimehasVeryLongExtensionThisTimehasVeryLongExtensionThisTimehasVeryLongExtensionThisTimehasVeryLongExtensionThisTimehasVeryLongExtensionThisTimehasVeryLongExtensionThisTimehasVeryLongExtensionThisTimehasVeryLongExtensionThisTimehasVeryLongExtensionThisTimehasVeryLongExtensionThisTimehasVeryLongExtensionThisTimehasVeryLongExtensionThisTimehasVeryLongExtensionThisTimehasVeryLongExtensionThisTimehasVeryLongExtensionThisTimehasVeryLongExtensionThisTime" (NSString *) strB9 = 0x000060d000001f20 @"a very much boring task to write a string this way!!σ\0" (NSString *) strB10 = 0x000060c000002a40 @"This is a Unicode string σ number 4 right here" (NSString *) strB11 = 0x0000603000003400 @"__NSCFString" (NSString *) strB12 = 0x0000606000009200 @"Process Name: a.out Process Id: 49395" (NSString *) strC11 = 0x0000603000003430 @"__NSCFString" (NSString *) strC12 = 0x0000606000009260 @"Process Name: a.out Process Id: 49395" (NSString *) strC1 = 0x00006060000092c0 @"A rather short ASCII NSString object is here" (NSString *) strC2 = 0x0000606000009320 @"A rather short UTF8 NSString object is here" (NSString *) strC3 = 0x0000000100006170 @"A string made with the at sign is here" (NSString *) strC4 = 0x0000606000009380 @"This is string number 4 right here" (NSString *) strC5 = 0x0000604000001c90 @"{{1, 1}, {5, 5}}" (NSString *) strC6 = 0x0000603000003460 @"1ST" (NSString *) strC7 = 0x0000603000003490 @"σxx" (NSString *) strC8 = 0x000061b000003180 @"hasVeryLongExtensionThisTimehasVeryLongExtensionThisTimehasVeryLongExtensionThisTimehasVeryLongExtensionThisTimehasVeryLongExtensionThisTimehasVeryLongExtensionThisTimehasVeryLongExtensionThisTimehasVeryLongExtensionThisTimehasVeryLongExtensionThisTimehasVeryLongExtensionThisTimehasVeryLongExtensionThisTimehasVeryLongExtensionThisTimehasVeryLongExtensionThisTimehasVeryLongExtensionThisTimehasVeryLongExtensionThisTimehasVeryLongExtensionThisTimehasVeryLongExtensionThisTimehasVeryLongExtensionThisTimehasVeryLongExtensionThisTimehasVeryLongExtensionThisTimehasVeryLongExtensionThisTimehasVeryLongExtensionThisTimehasVeryLongExtensionThisTimehasVeryLongExtensionThisTimehasVeryLongExtensionThisTimehasVeryLongExtensionThisTimehasVeryLongExtensionThisTimehasVeryLongExtensionThisTime" (NSString *) strC9 = 0x000060d000001ff0 @"a very much boring task to write a string this way!!σ\0" (NSString *) strC10 = 0x000060c000002ec0 @"This is a Unicode string σ number 4 right here" (NSString *) strD11 = 0x00006030000034c0 @"__NSCFString" (NSString *) strD12 = 0x00006060000093e0 @"Process Name: a.out Process Id: 49395" (NSString *) eAcute = 0x0000603000003520 @"é" (NSString *) randomHaziChar = 0x0000603000003580 @"鷅" (NSString *) japanese = 0x00000001000062b0 @"色は匂へど散りぬるを" (NSString *) italian = 0x00000001000062d0 @"L'Italia è una Repubblica democratica, fondata sul lavoro. La sovranità appartiene al popolo, che la esercita nelle forme e nei limiti della Costituzione." (NSString *) french = 0x00000001000062f0 @"Que veut cette horde d'esclaves, De traîtres, de rois conjurés?" (NSString *) german = 0x0000000100006310 @"Über-Ich und aus den Ansprüchen der sozialen Umwelt" (void *[3]) data_set = ([0] = 0x0000606000008ba0, [1] = 0x0000606000008c00, [2] = 0x0000000100006170) (NSString *) hebrew = 0x0000000100006330 @"לילה טוב" (NSArray *) newArray = 0x0000604000001dd0 @"50 elements" (NSDictionary *) newDictionary = 0x0000619000001980 12 key/value pairs (NSDictionary *) newMutableDictionary = 0x0000603000003640 21 key/value pairs (id [4]) cfKeys = { [0] = 0x0000000100006350 [1] = 0x0000000100006610 [2] = 0x0000000100006630 [3] = 0x0000000100006650 } (id [4]) cfValues = { [0] = 0x0000000100006350 [1] = 0x0000000100006610 [2] = 0x0000000100006630 [3] = 0x0000000100006650 } (NSDictionary *) nsDictionary = 0x00006060000095c0 2 key/value pairs (NSDictionary *) nscfDictionary = 0x0000606000009620 4 key/value pairs (CFDictionaryRef) cfDictionaryRef = 0x00006060000095c0 2 key/value pairs (NSAttributedString *) attrString = 0x00006030000036d0 @"hello world from foo" (NSAttributedString *) mutableAttrString = 0x00006030000037c0 @"hello world from foo" (NSString *) mutableString = 0x0000604000001f90 @"foo said this string needs to be very long so much longer than whatever other string has been seen ever before by anyone of the mankind that of course this is still not long enough given what foo our friend foo our lovely dearly friend foo desired of us so i am adding more stuff here for the sake of it and for the joy of our friend who is named guess what just foo. hence, dear friend foo, stay safe, your string is now long enough to accommodate your testing need and I will make sure that if not we extend it with even more fuzzy random meaningless words pasted one after the other from a long tiresome friday evening spent working in my office. my office mate went home but I am still randomly typing just for the fun of seeing what happens of the length of a Mutable String in Cocoa if it goes beyond one byte.. so be it, dear foo" (NSString *) mutableGetConst = 0x0000618000000080 @"foo said this string needs to be very long so much longer than whatever other string has been seen ever before by anyone of the mankind that of course this is still not long enough given what foo our friend foo our lovely dearly friend foo desired of us so i am adding more stuff here for the sake of it and for the joy of our friend who is named guess what just foo. hence, dear friend foo, stay safe, your string is now long enough to accommodate your testing need and I will make sure that if not we extend it with even more fuzzy random meaningless words pasted one after the other from a long tiresome friday evening spent working in my office. my office mate went home but I am still randomly typing just for the fun of seeing what happens of the length of a Mutable String in Cocoa if it goes beyond one byte.. so be it, dear foo" (NSData *) immutableData = 0x0000603000003820 5 bytes (NSData *) mutableData = 0x0000604000002010 14 bytes (unsigned int) concreteLength = 100000 (void *) zeroes1 = 0x0000633000000800 (NSData *) concreteData = 0x0000603000003850 100000 bytes (void *) zeroes2 = 0x000063300001c800 (NSMutableData *) concreteMutableData = 0x0000604000002050 100000 bytes (NSSet *) nsset = 0x0000604000002090 3 elements (NSSet *) nsmutableset = 0x00006030000038b0 4 elements (NSSet *) nscfSet = 0x00006040000020d0 2 elements (CFSetRef) cfSetRef = 0x00006040000020d0 2 elements (CFDataRef) data_ref = 0x0000607000003f20 @"5 bytes" (CFMutableDataRef) mutable_data_ref = 0x0000607000003f90 @"5 bytes" (CFMutableStringRef) mutable_string_ref = 0x0000604000002110 @"Wish ya knew" (CFStringRef) cfstring_ref = 0x00000001000066d0 @"HELLO WORLD" (CFArrayRef) cfarray_ref = 0x0000607000004000 @"3 elements" (CFMutableArrayRef) mutable_array_ref = 0x0000604000002150 @"11 elements" (CFBinaryHeapRef) binheap_ref = 0x000060c000003640 @"21 items" (CFURLRef) cfurl_ref = 0x000060b000002350 @"http://www.foo.bar/" (CFURLRef) cfchildurl_ref = 0x00006070000040e0 @"page.html -- http://www.foo.bar/" (CFURLRef) cfgchildurl_ref = 0x0000607000004150 @"?whatever -- http://www.foo.bar/page.html" (NSDictionary *) error_userInfo = 0x0000606000009e60 2 key/value pairs (NSError *) nserror = 0x0000604000002290 domain: @"Foobar" - code: 12 (NSError **) nserrorptr = 0x00007ffeefbfee28 domain: @"Foobar" - code: 12 (NSBundle *) bundle_string = 0x0000607000004310 @"/System/Library/Frameworks/Accelerate.framework" (NSBundle *) bundle_url = 0x0000607000004af0 @"/System/Library/Frameworks/Foundation.framework" (NSBundle *) main_bundle = 0x0000607000004cb0 @"/Users/buildslave/jenkins/workspace/lldb-cmake-sanitized/lldb-build/lldb-test-build.noindex/functionalities/data-formatter/data-formatter-objc/TestDataFormatterObjCCF.test_coreframeworks_and_run_command_dwarf" (NSArray *) bundles = 0x0000604000002450 @"1 element" (NSURL *) nsurl0 = 0x0000608000001320 @"file:///Users/buildslave/jenkins/workspace/lldb-cmake-sanitized/lldb-build/lldb-test-build.noindex/functionalities/data-formatter/data-formatter-objc/TestDataFormatterObjCCF.test_coreframeworks_and_run_command_dwarf/" (NSException *) except0 = 0x00006040000024d0 @"First" (NSException *) except1 = 0x0000604000002510 @"Second" (NSException *) except2 = 0x0000604000002550 @"Third" (NSException *) except3 = 0x0000604000002590 @"Fourth" (NSURL *) nsurl = 0x000060b0000028d0 @"http://www.foo.bar" (NSURL *) nsurl2 = 0x0000607000004ee0 @"page.html -- http://www.foo.bar" (NSURL *) nsurl3 = 0x0000607000004f50 @"?whatever -- http://www.foo.bar/page.html" (NSDate *) date1 = 0x33f15652a115445f 1985-04-10 18:00:00 UTC (NSDate *) date2 = 0x0000604000008e90 2011-01-01 08:00:00 UTC (NSDate *) date3 = 0x0000602000003bb0 2020-05-31 08:57:02 UTC (NSDate *) date4 = 0x3381e5954115445f 1970-01-02 00:00:00 UTC (NSDate *) date5 = 0xb38e837aae15445f 2020-05-31 08:57:02 UTC (CFAbsoluteTime) date1_abs = 1985-04-10 10:00:00 PST (CFAbsoluteTime) date2_abs = 2011-01-01 00:00:00 PST (CFAbsoluteTime) date3_abs = 2020-05-31 01:57:02 PDT (CFAbsoluteTime) date4_abs = 1970-01-01 16:00:00 PST (CFAbsoluteTime) date5_abs = 2020-05-31 01:57:02 PDT (NSIndexSet *) iset1 = 0x0000603000009790 4 indexes (NSIndexSet *) iset2 = 0x00006030000097c0 512 indexes (NSMutableIndexSet *) imset = 0x0000604000008f10 10 indexes (CFTimeZoneRef) cupertino = 0x0000608000001a20 @"America/Los_Angeles" (CFTimeZoneRef) home = 0x0000608000001ba0 @"Europe/Rome" (CFTimeZoneRef) europe = 0x0000608000001d20 @"Europe/Paris" (NSTimeZone *) cupertino_ns = 0x0000608000001a20 @"America/Los_Angeles" (NSTimeZone *) home_ns = 0x0000608000001ba0 @"Europe/Rome" (NSTimeZone *) europe_ns = 0x0000608000001d20 @"Europe/Paris" (CFGregorianUnits) cf_greg_units = 1 years, 3 months, 5 days, 12 hours, 5 minutes 7 seconds (CFGregorianDate) cf_greg_date = @"4/10/1985 18:0:0" (CFRange) cf_range = location=4 length=4 (NSPoint) ns_point = (x = 4, y = 4) (NSRange) ns_range = location=4, length=4 (NSRect) ns_rect = (origin = (x = 1, y = 1), size = (width = 5, height = 5)) (NSRect *) ns_rect_ptr = (origin = (x = 1, y = 1), size = (width = 5, height = 5)) (NSRectArray) ns_rect_arr = ((x = 1, y = 1), (width = 5, height = 5)), ... (NSSize) ns_size = (width = 5, height = 7) (NSSize *) ns_size_ptr = (width = 5, height = 7) (CGSize) cg_size = (width = 1, height = 6) (CGPoint) cg_point = (x = 2, y = 7) (CGRect) cg_rect = (origin = (x = 1, y = 2), size = (width = 7, height = 7)) (RGBColor) rgb_color = red=3 green=56 blue=35 (RGBColor *) rgb_color_ptr = red=3 green=56 blue=35 (Rect) rect = (t=4, l=8, b=4, r=7) (Rect *) rect_ptr = (t=4, l=8, b=4, r=7) (Point) point = (v=7, h=12) (Point *) point_ptr = (v=7, h=12) (HIPoint) hi_point = (x=7, y=12) (HIRect) hi_rect = origin=(x = 3, y = 5) size=(width = 4, height = 6) (SEL) foo_selector = "foo_selector_impl" (CFMutableBitVectorRef) mut_bv = 0x0000604000009490 1110 0110 1011 0000 1101 1010 1000 1111 0011 0101 1101 0001 00 (Molecule *) molecule = 0x0000602000003c50 (Class) myclass = NSValue (Class) myclass2 = NSTaggedPointerString (Class) myclass3 = Molecule (Class) myclass4 = NSMutableArray (Class) myclass5 = nil (NSArray *) components = 0x00006040000094d0 @"3 elements" (NSString *) path = 0x0000604000009510 @"usr/blah/stuff"

Hide Details

Hide Details

Expecting sub string: (CFGregorianUnits) cf_greg_units = 1 years, 3 months, 5 days, 12 hours, 5 minutes 7 seconds Matched

Hide Details

Expecting sub string: (CFGregorianDate) cf_greg_date = @"4/10/1985 18:0:0" Matched

Hide Details

Expecting sub string: (CFRange) cf_range = location=4 length=4 Matched

Hide Details

Expecting sub string: (NSPoint) ns_point = (x = 4, y = 4) Matched

Hide Details

Expecting sub string: (NSRange) ns_range = location=4, length=4 Matched

Hide Details

Expecting sub string: (NSRect) ns_rect = (origin = (x = 1, y = 1), size = (width = 5, height = 5)) Matched

Hide Details

Expecting sub string: (NSRectArray) ns_rect_arr = ((x = 1, y = 1), (width = 5, height = 5)), ... Matched

Hide Details

Expecting sub string: (NSSize) ns_size = (width = 5, height = 7) Matched

Hide Details

Expecting sub string: (CGSize) cg_size = (width = 1, height = 6) Matched

Hide Details

Expecting sub string: (CGPoint) cg_point = (x = 2, y = 7) Matched

Hide Details

Expecting sub string: (CGRect) cg_rect = (origin = (x = 1, y = 2), size = (width = 7, height = 7)) Matched

Hide Details

Expecting sub string: (Rect) rect = (t=4, l=8, b=4, r=7) Matched

Hide Details

Expecting sub string: (Rect *) rect_ptr = (t=4, l=8, b=4, r=7) Matched

Hide Details

Expecting sub string: (Point) point = (v=7, h=12) Matched

Hide Details

Expecting sub string: (Point *) point_ptr = (v=7, h=12) Matched

Hide Details

Expecting sub string: (SEL) foo_selector = "foo_selector_impl" Matched

Hide Details

runCmd: frame variable output: (int) argc = 1 (const char **) argv = 0x00007ffeefbff420 (NSAutoreleasePool *) pool = 0x00006040000016d0 (MyClass *) object = 0x0000603000002f20 (MyOtherClass *) object2 = 0x0000603000002f50 (NSNumber *) num1 = 0xf24cc2aec1154175 (int)5 (NSNumber *) num2 = 0x0000603000002fe0 (float)3.140000 (NSNumber *) num3 = 0x0000603000003010 (double)3.14 (NSNumber *) num4 = 0x0000603000003040 (int128_t)18446744073709551614 (NSNumber *) num5 = 0xf24cc2aec1150555 (char)65 (NSNumber *) num6 = 0xf24cc2aec115bb65 (long)255 (NSNumber *) num7 = 0xf24cc2aedf91c465 (long)2000000 (NSNumber *) num8_Y = 0x00007fffa3c4dc30 YES (NSNumber *) num8_N = 0x00007fffa3c4dc40 NO (NSNumber *) num9 = 0x0db33d513e91c445 (short)-31616 (NSNumber *) num_at1 = 0xf24cc2aec1154875 (int)12 (NSNumber *) num_at2 = 0x0db33d513eeab075 (int)-12 (NSNumber *) num_at3 = 0x0000603000003070 (double)12.5 (NSNumber *) num_at4 = 0x00006030000030a0 (double)-12.5 (NSDecimalNumber *) decimal_number = 0x00006030000030d0 123456 x 10^-10 (NSDecimalNumber *) decimal_number_neg = 0x0000603000003100 -123456 x 10^10 (NSDecimalNumber *) decimal_one = 0x0000603000003130 1 x 10^0 (NSDecimalNumber *) decimal_zero = 0x0000602000002370 0 (NSDecimalNumber *) decimal_nan = 0x0000602000002390 NaN (NSString *) str0 = 0xf24cc2aef4207667 @"255" (NSString *) str1 = 0x0000606000008ba0 @"A rather short ASCII NSString object is here" (NSString *) str2 = 0x0000606000008c00 @"A rather short UTF8 NSString object is here" (NSString *) str3 = 0x0000000100006170 @"A string made with the at sign is here" (NSString *) str4 = 0x0000606000008c60 @"This is string number 4 right here" (NSRect) ns_rect_4str = (origin = (x = 1, y = 1), size = (width = 5, height = 5)) (NSString *) str5 = 0x0000604000001810 @"{{1, 1}, {5, 5}}" (NSString *) str6 = 0x0000603000003220 @"1ST" (const unichar [3]) myCharacters = { [0] = U+03c3 u'σ' [1] = U+0078 u'x' [2] = U+0078 u'x' } (NSString *) str7 = 0x0000603000003250 @"σxx" (NSString *) str8 = 0x000061b000000780 @"hasVeryLongExtensionThisTimehasVeryLongExtensionThisTimehasVeryLongExtensionThisTimehasVeryLongExtensionThisTimehasVeryLongExtensionThisTimehasVeryLongExtensionThisTimehasVeryLongExtensionThisTimehasVeryLongExtensionThisTimehasVeryLongExtensionThisTimehasVeryLongExtensionThisTimehasVeryLongExtensionThisTimehasVeryLongExtensionThisTimehasVeryLongExtensionThisTimehasVeryLongExtensionThisTimehasVeryLongExtensionThisTimehasVeryLongExtensionThisTimehasVeryLongExtensionThisTimehasVeryLongExtensionThisTimehasVeryLongExtensionThisTimehasVeryLongExtensionThisTimehasVeryLongExtensionThisTimehasVeryLongExtensionThisTimehasVeryLongExtensionThisTimehasVeryLongExtensionThisTimehasVeryLongExtensionThisTimehasVeryLongExtensionThisTimehasVeryLongExtensionThisTimehasVeryLongExtensionThisTime" (const unichar [54]) myOtherCharacters = { [0] = U+0061 u'a' [1] = U+0020 u' ' [2] = U+0076 u'v' [3] = U+0065 u'e' [4] = U+0072 u'r' [5] = U+0079 u'y' [6] = U+0020 u' ' [7] = U+006d u'm' [8] = U+0075 u'u' [9] = U+0063 u'c' [10] = U+0068 u'h' [11] = U+0020 u' ' [12] = U+0062 u'b' [13] = U+006f u'o' [14] = U+0072 u'r' [15] = U+0069 u'i' [16] = U+006e u'n' [17] = U+0067 u'g' [18] = U+0020 u' ' [19] = U+0074 u't' [20] = U+0061 u'a' [21] = U+0073 u's' [22] = U+006b u'k' [23] = U+0020 u' ' [24] = U+0074 u't' [25] = U+006f u'o' [26] = U+0020 u' ' [27] = U+0077 u'w' [28] = U+0072 u'r' [29] = U+0069 u'i' [30] = U+0074 u't' [31] = U+0065 u'e' [32] = U+0020 u' ' [33] = U+0061 u'a' [34] = U+0020 u' ' [35] = U+0073 u's' [36] = U+0074 u't' [37] = U+0072 u'r' [38] = U+0069 u'i' [39] = U+006e u'n' [40] = U+0067 u'g' [41] = U+0020 u' ' [42] = U+0074 u't' [43] = U+0068 u'h' [44] = U+0069 u'i' [45] = U+0073 u's' [46] = U+0020 u' ' [47] = U+0077 u'w' [48] = U+0061 u'a' [49] = U+0079 u'y' [50] = U+0021 u'!' [51] = U+0021 u'!' [52] = U+03c3 u'σ' [53] = U+0000 u'\0' } (NSString *) str9 = 0x000060d000001be0 @"a very much boring task to write a string this way!!σ\0" (const unichar [2]) myNextCharacters = { [0] = U+03c3 u'σ' [1] = U+0000 u'\0' } (NSString *) str10 = 0x000060c000002200 @"This is a Unicode string σ number 4 right here" (NSString *) str11 = 0x0000603000003280 @"__NSCFString" (NSString *) label1 = 0x0000000100006210 @"Process Name: " (NSString *) label2 = 0x0000000100006230 @"Process Id: " (NSString *) processName = 0xf24cb6dbae3b2507 @"a.out" (NSString *) processID = 0xf24cf797f22c7007 @"49395" (NSString *) str12 = 0x0000606000008f00 @"Process Name: a.out Process Id: 49395" (NSString *) strA1 = 0x0000606000008f60 @"A rather short ASCII NSString object is here" (NSString *) strA2 = 0x0000606000008fc0 @"A rather short UTF8 NSString object is here" (NSString *) strA3 = 0x0000000100006170 @"A string made with the at sign is here" (NSString *) strA4 = 0x0000606000009020 @"This is string number 4 right here" (NSString *) strA5 = 0x00006040000019d0 @"{{1, 1}, {5, 5}}" (NSString *) strA6 = 0x0000603000003310 @"1ST" (NSString *) strA7 = 0x0000603000003340 @"σxx" (NSString *) strA8 = 0x000061b000001580 @"hasVeryLongExtensionThisTimehasVeryLongExtensionThisTimehasVeryLongExtensionThisTimehasVeryLongExtensionThisTimehasVeryLongExtensionThisTimehasVeryLongExtensionThisTimehasVeryLongExtensionThisTimehasVeryLongExtensionThisTimehasVeryLongExtensionThisTimehasVeryLongExtensionThisTimehasVeryLongExtensionThisTimehasVeryLongExtensionThisTimehasVeryLongExtensionThisTimehasVeryLongExtensionThisTimehasVeryLongExtensionThisTimehasVeryLongExtensionThisTimehasVeryLongExtensionThisTimehasVeryLongExtensionThisTimehasVeryLongExtensionThisTimehasVeryLongExtensionThisTimehasVeryLongExtensionThisTimehasVeryLongExtensionThisTimehasVeryLongExtensionThisTimehasVeryLongExtensionThisTimehasVeryLongExtensionThisTimehasVeryLongExtensionThisTimehasVeryLongExtensionThisTimehasVeryLongExtensionThisTime" (NSString *) strA9 = 0x000060d000001e50 @"a very much boring task to write a string this way!!σ\0" (NSString *) strA10 = 0x000060c000002680 @"This is a Unicode string σ number 4 right here" (NSString *) strA11 = 0x0000603000003370 @"__NSCFString" (NSString *) strA12 = 0x0000606000009080 @"Process Name: a.out Process Id: 49395" (NSString *) strB1 = 0x00006060000090e0 @"A rather short ASCII NSString object is here" (NSString *) strB2 = 0x0000606000009140 @"A rather short UTF8 NSString object is here" (NSString *) strB3 = 0x0000000100006170 @"A string made with the at sign is here" (NSString *) strB4 = 0x00006060000091a0 @"This is string number 4 right here" (NSString *) strB5 = 0x0000604000001b10 @"{{1, 1}, {5, 5}}" (NSString *) strB6 = 0x00006030000033a0 @"1ST" (NSString *) strB7 = 0x00006030000033d0 @"σxx" (NSString *) strB8 = 0x000061b000002380 @"hasVeryLongExtensionThisTimehasVeryLongExtensionThisTimehasVeryLongExtensionThisTimehasVeryLongExtensionThisTimehasVeryLongExtensionThisTimehasVeryLongExtensionThisTimehasVeryLongExtensionThisTimehasVeryLongExtensionThisTimehasVeryLongExtensionThisTimehasVeryLongExtensionThisTimehasVeryLongExtensionThisTimehasVeryLongExtensionThisTimehasVeryLongExtensionThisTimehasVeryLongExtensionThisTimehasVeryLongExtensionThisTimehasVeryLongExtensionThisTimehasVeryLongExtensionThisTimehasVeryLongExtensionThisTimehasVeryLongExtensionThisTimehasVeryLongExtensionThisTimehasVeryLongExtensionThisTimehasVeryLongExtensionThisTimehasVeryLongExtensionThisTimehasVeryLongExtensionThisTimehasVeryLongExtensionThisTimehasVeryLongExtensionThisTimehasVeryLongExtensionThisTimehasVeryLongExtensionThisTime" (NSString *) strB9 = 0x000060d000001f20 @"a very much boring task to write a string this way!!σ\0" (NSString *) strB10 = 0x000060c000002a40 @"This is a Unicode string σ number 4 right here" (NSString *) strB11 = 0x0000603000003400 @"__NSCFString" (NSString *) strB12 = 0x0000606000009200 @"Process Name: a.out Process Id: 49395" (NSString *) strC11 = 0x0000603000003430 @"__NSCFString" (NSString *) strC12 = 0x0000606000009260 @"Process Name: a.out Process Id: 49395" (NSString *) strC1 = 0x00006060000092c0 @"A rather short ASCII NSString object is here" (NSString *) strC2 = 0x0000606000009320 @"A rather short UTF8 NSString object is here" (NSString *) strC3 = 0x0000000100006170 @"A string made with the at sign is here" (NSString *) strC4 = 0x0000606000009380 @"This is string number 4 right here" (NSString *) strC5 = 0x0000604000001c90 @"{{1, 1}, {5, 5}}" (NSString *) strC6 = 0x0000603000003460 @"1ST" (NSString *) strC7 = 0x0000603000003490 @"σxx" (NSString *) strC8 = 0x000061b000003180 @"hasVeryLongExtensionThisTimehasVeryLongExtensionThisTimehasVeryLongExtensionThisTimehasVeryLongExtensionThisTimehasVeryLongExtensionThisTimehasVeryLongExtensionThisTimehasVeryLongExtensionThisTimehasVeryLongExtensionThisTimehasVeryLongExtensionThisTimehasVeryLongExtensionThisTimehasVeryLongExtensionThisTimehasVeryLongExtensionThisTimehasVeryLongExtensionThisTimehasVeryLongExtensionThisTimehasVeryLongExtensionThisTimehasVeryLongExtensionThisTimehasVeryLongExtensionThisTimehasVeryLongExtensionThisTimehasVeryLongExtensionThisTimehasVeryLongExtensionThisTimehasVeryLongExtensionThisTimehasVeryLongExtensionThisTimehasVeryLongExtensionThisTimehasVeryLongExtensionThisTimehasVeryLongExtensionThisTimehasVeryLongExtensionThisTimehasVeryLongExtensionThisTimehasVeryLongExtensionThisTime" (NSString *) strC9 = 0x000060d000001ff0 @"a very much boring task to write a string this way!!σ\0" (NSString *) strC10 = 0x000060c000002ec0 @"This is a Unicode string σ number 4 right here" (NSString *) strD11 = 0x00006030000034c0 @"__NSCFString" (NSString *) strD12 = 0x00006060000093e0 @"Process Name: a.out Process Id: 49395" (NSString *) eAcute = 0x0000603000003520 @"é" (NSString *) randomHaziChar = 0x0000603000003580 @"鷅" (NSString *) japanese = 0x00000001000062b0 @"色は匂へど散りぬるを" (NSString *) italian = 0x00000001000062d0 @"L'Italia è una Repubblica democratica, fondata sul lavoro. La sovranità appartiene al popolo, che la esercita nelle forme e nei limiti della Costituzione." (NSString *) french = 0x00000001000062f0 @"Que veut cette horde d'esclaves, De traîtres, de rois conjurés?" (NSString *) german = 0x0000000100006310 @"Über-Ich und aus den Ansprüchen der sozialen Umwelt" (void *[3]) data_set = ([0] = 0x0000606000008ba0, [1] = 0x0000606000008c00, [2] = 0x0000000100006170) (NSString *) hebrew = 0x0000000100006330 @"לילה טוב" (NSArray *) newArray = 0x0000604000001dd0 @"50 elements" (NSDictionary *) newDictionary = 0x0000619000001980 12 key/value pairs (NSDictionary *) newMutableDictionary = 0x0000603000003640 21 key/value pairs (id [4]) cfKeys = { [0] = 0x0000000100006350 [1] = 0x0000000100006610 [2] = 0x0000000100006630 [3] = 0x0000000100006650 } (id [4]) cfValues = { [0] = 0x0000000100006350 [1] = 0x0000000100006610 [2] = 0x0000000100006630 [3] = 0x0000000100006650 } (NSDictionary *) nsDictionary = 0x00006060000095c0 2 key/value pairs (NSDictionary *) nscfDictionary = 0x0000606000009620 4 key/value pairs (CFDictionaryRef) cfDictionaryRef = 0x00006060000095c0 2 key/value pairs (NSAttributedString *) attrString = 0x00006030000036d0 @"hello world from foo" (NSAttributedString *) mutableAttrString = 0x00006030000037c0 @"hello world from foo" (NSString *) mutableString = 0x0000604000001f90 @"foo said this string needs to be very long so much longer than whatever other string has been seen ever before by anyone of the mankind that of course this is still not long enough given what foo our friend foo our lovely dearly friend foo desired of us so i am adding more stuff here for the sake of it and for the joy of our friend who is named guess what just foo. hence, dear friend foo, stay safe, your string is now long enough to accommodate your testing need and I will make sure that if not we extend it with even more fuzzy random meaningless words pasted one after the other from a long tiresome friday evening spent working in my office. my office mate went home but I am still randomly typing just for the fun of seeing what happens of the length of a Mutable String in Cocoa if it goes beyond one byte.. so be it, dear foo" (NSString *) mutableGetConst = 0x0000618000000080 @"foo said this string needs to be very long so much longer than whatever other string has been seen ever before by anyone of the mankind that of course this is still not long enough given what foo our friend foo our lovely dearly friend foo desired of us so i am adding more stuff here for the sake of it and for the joy of our friend who is named guess what just foo. hence, dear friend foo, stay safe, your string is now long enough to accommodate your testing need and I will make sure that if not we extend it with even more fuzzy random meaningless words pasted one after the other from a long tiresome friday evening spent working in my office. my office mate went home but I am still randomly typing just for the fun of seeing what happens of the length of a Mutable String in Cocoa if it goes beyond one byte.. so be it, dear foo" (NSData *) immutableData = 0x0000603000003820 5 bytes (NSData *) mutableData = 0x0000604000002010 14 bytes (unsigned int) concreteLength = 100000 (void *) zeroes1 = 0x0000633000000800 (NSData *) concreteData = 0x0000603000003850 100000 bytes (void *) zeroes2 = 0x000063300001c800 (NSMutableData *) concreteMutableData = 0x0000604000002050 100000 bytes (NSSet *) nsset = 0x0000604000002090 3 elements (NSSet *) nsmutableset = 0x00006030000038b0 4 elements (NSSet *) nscfSet = 0x00006040000020d0 2 elements (CFSetRef) cfSetRef = 0x00006040000020d0 2 elements (CFDataRef) data_ref = 0x0000607000003f20 @"5 bytes" (CFMutableDataRef) mutable_data_ref = 0x0000607000003f90 @"5 bytes" (CFMutableStringRef) mutable_string_ref = 0x0000604000002110 @"Wish ya knew" (CFStringRef) cfstring_ref = 0x00000001000066d0 @"HELLO WORLD" (CFArrayRef) cfarray_ref = 0x0000607000004000 @"3 elements" (CFMutableArrayRef) mutable_array_ref = 0x0000604000002150 @"11 elements" (CFBinaryHeapRef) binheap_ref = 0x000060c000003640 @"21 items" (CFURLRef) cfurl_ref = 0x000060b000002350 @"http://www.foo.bar/" (CFURLRef) cfchildurl_ref = 0x00006070000040e0 @"page.html -- http://www.foo.bar/" (CFURLRef) cfgchildurl_ref = 0x0000607000004150 @"?whatever -- http://www.foo.bar/page.html" (NSDictionary *) error_userInfo = 0x0000606000009e60 2 key/value pairs (NSError *) nserror = 0x0000604000002290 domain: @"Foobar" - code: 12 (NSError **) nserrorptr = 0x00007ffeefbfee28 domain: @"Foobar" - code: 12 (NSBundle *) bundle_string = 0x0000607000004310 @"/System/Library/Frameworks/Accelerate.framework" (NSBundle *) bundle_url = 0x0000607000004af0 @"/System/Library/Frameworks/Foundation.framework" (NSBundle *) main_bundle = 0x0000607000004cb0 @"/Users/buildslave/jenkins/workspace/lldb-cmake-sanitized/lldb-build/lldb-test-build.noindex/functionalities/data-formatter/data-formatter-objc/TestDataFormatterObjCCF.test_coreframeworks_and_run_command_dwarf" (NSArray *) bundles = 0x0000604000002450 @"1 element" (NSURL *) nsurl0 = 0x0000608000001320 @"file:///Users/buildslave/jenkins/workspace/lldb-cmake-sanitized/lldb-build/lldb-test-build.noindex/functionalities/data-formatter/data-formatter-objc/TestDataFormatterObjCCF.test_coreframeworks_and_run_command_dwarf/" (NSException *) except0 = 0x00006040000024d0 @"First" (NSException *) except1 = 0x0000604000002510 @"Second" (NSException *) except2 = 0x0000604000002550 @"Third" (NSException *) except3 = 0x0000604000002590 @"Fourth" (NSURL *) nsurl = 0x000060b0000028d0 @"http://www.foo.bar" (NSURL *) nsurl2 = 0x0000607000004ee0 @"page.html -- http://www.foo.bar" (NSURL *) nsurl3 = 0x0000607000004f50 @"?whatever -- http://www.foo.bar/page.html" (NSDate *) date1 = 0x33f15652a115445f 1985-04-10 18:00:00 UTC (NSDate *) date2 = 0x0000604000008e90 2011-01-01 08:00:00 UTC (NSDate *) date3 = 0x0000602000003bb0 2020-05-31 08:57:02 UTC (NSDate *) date4 = 0x3381e5954115445f 1970-01-02 00:00:00 UTC (NSDate *) date5 = 0xb38e837aae15445f 2020-05-31 08:57:02 UTC (CFAbsoluteTime) date1_abs = 1985-04-10 10:00:00 PST (CFAbsoluteTime) date2_abs = 2011-01-01 00:00:00 PST (CFAbsoluteTime) date3_abs = 2020-05-31 01:57:02 PDT (CFAbsoluteTime) date4_abs = 1970-01-01 16:00:00 PST (CFAbsoluteTime) date5_abs = 2020-05-31 01:57:02 PDT (NSIndexSet *) iset1 = 0x0000603000009790 4 indexes (NSIndexSet *) iset2 = 0x00006030000097c0 512 indexes (NSMutableIndexSet *) imset = 0x0000604000008f10 10 indexes (CFTimeZoneRef) cupertino = 0x0000608000001a20 @"America/Los_Angeles" (CFTimeZoneRef) home = 0x0000608000001ba0 @"Europe/Rome" (CFTimeZoneRef) europe = 0x0000608000001d20 @"Europe/Paris" (NSTimeZone *) cupertino_ns = 0x0000608000001a20 @"America/Los_Angeles" (NSTimeZone *) home_ns = 0x0000608000001ba0 @"Europe/Rome" (NSTimeZone *) europe_ns = 0x0000608000001d20 @"Europe/Paris" (CFGregorianUnits) cf_greg_units = 1 years, 3 months, 5 days, 12 hours, 5 minutes 7 seconds (CFGregorianDate) cf_greg_date = @"4/10/1985 18:0:0" (CFRange) cf_range = location=4 length=4 (NSPoint) ns_point = (x = 4, y = 4) (NSRange) ns_range = location=4, length=4 (NSRect) ns_rect = (origin = (x = 1, y = 1), size = (width = 5, height = 5)) (NSRect *) ns_rect_ptr = (origin = (x = 1, y = 1), size = (width = 5, height = 5)) (NSRectArray) ns_rect_arr = ((x = 1, y = 1), (width = 5, height = 5)), ... (NSSize) ns_size = (width = 5, height = 7) (NSSize *) ns_size_ptr = (width = 5, height = 7) (CGSize) cg_size = (width = 1, height = 6) (CGPoint) cg_point = (x = 2, y = 7) (CGRect) cg_rect = (origin = (x = 1, y = 2), size = (width = 7, height = 7)) (RGBColor) rgb_color = red=3 green=56 blue=35 (RGBColor *) rgb_color_ptr = red=3 green=56 blue=35 (Rect) rect = (t=4, l=8, b=4, r=7) (Rect *) rect_ptr = (t=4, l=8, b=4, r=7) (Point) point = (v=7, h=12) (Point *) point_ptr = (v=7, h=12) (HIPoint) hi_point = (x=7, y=12) (HIRect) hi_rect = origin=(x = 3, y = 5) size=(width = 4, height = 6) (SEL) foo_selector = "foo_selector_impl" (CFMutableBitVectorRef) mut_bv = 0x0000604000009490 1110 0110 1011 0000 1101 1010 1000 1111 0011 0101 1101 0001 00 (Molecule *) molecule = 0x0000602000003c50 (Class) myclass = NSValue (Class) myclass2 = NSTaggedPointerString (Class) myclass3 = Molecule (Class) myclass4 = NSMutableArray (Class) myclass5 = nil (NSArray *) components = 0x00006040000094d0 @"3 elements" (NSString *) path = 0x0000604000009510 @"usr/blah/stuff"

Hide Details

Assertion failed: (tokenKind == tok::kw___bridge_retain), function ParseParenExpression, file /Users/buildslave/jenkins/workspace/lldb-cmake-sanitized/llvm-project/clang/lib/Parse/ParseExpr.cpp, line 2804.

Hide Details

--

Hide Details

******************** UNSUPPORTED: lldb-api :: functionalities/thread/break_after_join/TestBreakAfterJoin.py (1899 of 2028) PASS: lldb-unit :: Host/./HostTests/NativeProcessProtocolTest.ReadCStringFromMemory_CrossPageBoundary (1900 of 2028) PASS: lldb-unit :: Utility/./UtilityTests/StringListTest.SplitIntoLinesEmpty (1901 of 2028) PASS: lldb-shell :: Expr/TestTypeOfDeclTypeExpr.test (1902 of 2028) PASS: lldb-unit :: Utility/./UtilityTests/RangeDataVector.CustomSort (1903 of 2028) PASS: lldb-shell :: Settings/TestSettingsWrite.test (1904 of 2028) PASS: lldb-shell :: Heap/heap-cstr.test (1905 of 2028) PASS: lldb-api :: functionalities/plugins/python_os_plugin/stepping_plugin_threads/TestOSPluginStepping.py (1906 of 2028) PASS: lldb-unit :: Utility/./UtilityTests/ArgsTest.TestUnknownEscape (1907 of 2028) UNSUPPORTED: lldb-api :: tools/lldb-vscode/completions/TestVSCode_completions.py (1908 of 2028) UNSUPPORTED: lldb-api :: arm/breakpoint-thumb-codesection/TestBreakpointThumbCodesection.py (1909 of 2028) PASS: lldb-api :: lang/objc/ivar-IMP/TestObjCiVarIMP.py (1910 of 2028) UNSUPPORTED: lldb-shell :: SymbolFile/DWARF/split-dwarf-expression-eval-bug.cpp (1911 of 2028) PASS: lldb-unit :: Expression/./ExpressionTests/CppModuleConfigurationTest.MissingLibCpp (1912 of 2028) PASS: lldb-api :: lang/c/global_variables/TestGlobalVariables.py (1913 of 2028) PASS: lldb-api :: functionalities/thread/concurrent_events/TestConcurrentBreakpointDelayBreakpointOneSignal.py (1914 of 2028) PASS: lldb-api :: functionalities/mtc/simple/TestMTCSimple.py (1915 of 2028) PASS: lldb-unit :: Process/gdb-remote/./ProcessGdbRemoteTests/GDBRemoteCommunicationServerTest.SendErrorResponse_StringError (1916 of 2028) PASS: lldb-unit :: Host/./HostTests/NativeProcessProtocolTest.ReadCStringFromMemory_MaxSize (1917 of 2028) PASS: lldb-shell :: SymbolFile/NativePDB/bitfields.cpp (1918 of 2028) PASS: lldb-shell :: Unwind/eh-frame-dwarf-unwind.test (1919 of 2028) PASS: lldb-unit :: Host/./HostTests/MainLoopTest.Signal (1920 of 2028) PASS: lldb-unit :: Utility/./UtilityTests/StatusTest.ErrorCodeConstructor (1921 of 2028) UNSUPPORTED: lldb-api :: functionalities/data-formatter/data-formatter-stl/libstdcpp/string/TestDataFormatterStdString.py (1922 of 2028) PASS: lldb-unit :: Utility/./UtilityTests/StreamTest.PutCharNull (1923 of 2028) PASS: lldb-api :: commands/expression/import-std-module/list/TestListFromStdModule.py (1924 of 2028) PASS: lldb-unit :: Symbol/./SymbolTests/TestTypeSystemClang.TestDisplayName (1925 of 2028) PASS: lldb-unit :: Utility/./UtilityTests/StreamTest.PutMaxHex64ByteOrderBig (1926 of 2028) PASS: lldb-shell :: SymbolFile/DWARF/debug-types-address-ranges.s (1927 of 2028) PASS: lldb-api :: tools/lldb-vscode/step/TestVSCode_step.py (1928 of 2028) PASS: lldb-shell :: Settings/TestEchoCommands.test (1929 of 2028) PASS: lldb-api :: python_api/symbol-context/two-files/TestSymbolContextTwoFiles.py (1930 of 2028) PASS: lldb-unit :: Utility/./UtilityTests/CompletionRequest.DuplicateFilteringWithComments (1931 of 2028) UNSUPPORTED: lldb-api :: functionalities/ubsan/user-expression/TestUbsanUserExpression.py (1932 of 2028) PASS: lldb-api :: functionalities/data-formatter/data-formatter-synthtype/TestDataFormatterSynthType.py (1933 of 2028) FAIL: lldb-api :: lang/objcxx/objcxx-ivar-vector/TestIvarVector.py (1934 of 2028) ******************** TEST 'lldb-api :: lang/objcxx/objcxx-ivar-vector/TestIvarVector.py' FAILED ******************** Script: -- /Users/buildslave/jenkins/workspace/lldb-cmake-sanitized/lldb-build/lldb-test-build.noindex/copied-system-python /Users/buildslave/jenkins/workspace/lldb-cmake-sanitized/llvm-project/lldb/test/API/dotest.py --arch x86_64 -s /Users/buildslave/jenkins/workspace/lldb-cmake-sanitized/lldb-build/lldb-test-traces -S nm -u CXXFLAGS -u CFLAGS --codesign-identity lldb_codesign --server /Users/buildslave/jenkins/workspace/lldb-cmake-sanitized/lldb-build/./bin/debugserver --arch x86_64 --build-dir /Users/buildslave/jenkins/workspace/lldb-cmake-sanitized/lldb-build/lldb-test-build.noindex -s=/Users/buildslave/jenkins/workspace/lldb-cmake-sanitized/test/logs -t --env TERM=vt100 --env LLVM_LIBS_DIR=/Users/buildslave/jenkins/workspace/lldb-cmake-sanitized/lldb-build/./lib --inferior-env ASAN_OPTIONS=detect_stack_use_after_return=1 --inferior-env DYLD_INSERT_LIBRARIES=/Users/buildslave/jenkins/workspace/lldb-cmake-sanitized/host-compiler/lib/clang/11.0.0/lib/darwin/libclang_rt.asan_osx_dynamic.dylib --build-dir /Users/buildslave/jenkins/workspace/lldb-cmake-sanitized/lldb-build/lldb-test-build.noindex --lldb-module-cache-dir /Users/buildslave/jenkins/workspace/lldb-cmake-sanitized/lldb-build/lldb-test-build.noindex/module-cache-lldb/lldb-api --clang-module-cache-dir /Users/buildslave/jenkins/workspace/lldb-cmake-sanitized/lldb-build/lldb-test-build.noindex/module-cache-clang/lldb-api --executable /Users/buildslave/jenkins/workspace/lldb-cmake-sanitized/lldb-build/./bin/lldb --compiler /Users/buildslave/jenkins/workspace/lldb-cmake-sanitized/lldb-build/./bin/clang --dsymutil /Users/buildslave/jenkins/workspace/lldb-cmake-sanitized/lldb-build/./bin/dsymutil --filecheck /Users/buildslave/jenkins/workspace/lldb-cmake-sanitized/lldb-build/./bin/FileCheck --lldb-libs-dir /Users/buildslave/jenkins/workspace/lldb-cmake-sanitized/lldb-build/./lib /Users/buildslave/jenkins/workspace/lldb-cmake-sanitized/llvm-project/lldb/test/API/lang/objcxx/objcxx-ivar-vector -p TestIvarVector.py -- Exit Code: -6

Hide Details

Command Output (stdout): -- lldb version 11.0.99 clang revision 2768edfff19a170faca35a8c63163c8bb1b67382 llvm revision 2768edfff19a170faca35a8c63163c8bb1b67382

Hide Details

-- Command Output (stderr): -- Assertion failed: (tokenKind == tok::kw___bridge_retain), function ParseParenExpression, file /Users/buildslave/jenkins/workspace/lldb-cmake-sanitized/llvm-project/clang/lib/Parse/ParseExpr.cpp, line 2804.

Hide Details

--

Hide Details

******************** PASS: lldb-api :: functionalities/data-formatter/data-formatter-stl/libcxx/list/loop/TestDataFormatterLibcxxListLoop.py (1935 of 2028) PASS: lldb-api :: functionalities/thread/concurrent_events/TestConcurrentBreakpointsDelayedBreakpointOneWatchpoint.py (1936 of 2028) PASS: lldb-unit :: Utility/./UtilityTests/TimerTest.CategoryTimesStats (1937 of 2028) PASS: lldb-unit :: Symbol/./SymbolTests/TestClangASTImporter.CompleteFwdDeclWithOtherOrigin (1938 of 2028) PASS: lldb-unit :: Utility/./UtilityTests/ArgsTest.GetQuotedCommandString (1939 of 2028) PASS: lldb-shell :: BuildScript/compiler-full-path.test (1940 of 2028) PASS: lldb-api :: commands/expression/dont_allow_jit/TestAllowJIT.py (1941 of 2028) PASS: lldb-unit :: Host/./HostTests/MainLoopTest.TerminatesImmediately (1942 of 2028) PASS: lldb-api :: types/TestLongTypesExpr.py (1943 of 2028) PASS: lldb-unit :: SymbolFile/NativePDB/./SymbolFileNativePDBTests/PDBFPOProgramToDWARFExpressionTests.UnresolvedDependentCyclicRegisterAssignmentReference (1944 of 2028) PASS: lldb-unit :: ObjectFile/ELF/./ObjectFileELFTests/ObjectFileELFTest.GetSymtab_NoSymEntryPointArmThumbAddressClass (1945 of 2028) PASS: lldb-unit :: Host/./HostTests/HostInfoTest.GetHostname (1946 of 2028) PASS: lldb-api :: lang/c/shared_lib_stripped_symbols/TestSharedLibStrippedSymbols.py (1947 of 2028) PASS: lldb-shell :: Breakpoint/debug_rnglist_rlestartend.test (1948 of 2028) PASS: lldb-api :: functionalities/thread/concurrent_events/TestConcurrentSignalNWatchNBreak.py (1949 of 2028) PASS: lldb-shell :: Commands/command-script-import.test (1950 of 2028) PASS: lldb-unit :: Utility/./UtilityTests/Flags.Reset (1951 of 2028) PASS: lldb-unit :: Utility/./UtilityTests/ProcessInstanceInfo.Dump (1952 of 2028) PASS: lldb-unit :: Utility/./UtilityTests/DataExtractorTest.GetBitfield (1953 of 2028) PASS: lldb-api :: lang/c/const_variables/TestConstVariables.py (1954 of 2028) PASS: lldb-api :: functionalities/breakpoint/breakpoint_locations/TestBreakpointLocations.py (1955 of 2028) PASS: lldb-unit :: Utility/./UtilityTests/StringExtractorTest.DecodeHexU8_InvalidHex2 (1956 of 2028) UNSUPPORTED: lldb-shell :: ExecControl/StopHook/stop-hook-threads.test (1957 of 2028) PASS: lldb-api :: commands/expression/anonymous-struct/TestCallUserAnonTypedef.py (1958 of 2028) PASS: lldb-shell :: SymbolFile/DWARF/module-ownership.mm (1959 of 2028) PASS: lldb-unit :: Utility/./UtilityTests/RegularExpression.Empty (1960 of 2028) PASS: lldb-shell :: Reproducer/TestCaptureEnvOverride.test (1961 of 2028) PASS: lldb-unit :: Utility/./UtilityTests/OptionsWithRawTest.SingleWordSuffix (1962 of 2028) PASS: lldb-api :: functionalities/dead-strip/TestDeadStrip.py (1963 of 2028) PASS: lldb-unit :: Utility/./UtilityTests/StringListTest.GetMaxStringLengthEqualSize (1964 of 2028) PASS: lldb-api :: lang/cpp/this/TestCPPThis.py (1965 of 2028) UNSUPPORTED: lldb-api :: functionalities/ubsan/basic/TestUbsanBasic.py (1966 of 2028) PASS: lldb-api :: lang/cpp/dynamic-value/TestCppValueCast.py (1967 of 2028) PASS: lldb-shell :: SymbolFile/DWARF/debug_rnglists-dwo.s (1968 of 2028) PASS: lldb-unit :: DataFormatter/./LLDBFormatterTests/StringPrinterTests.CxxASCII (1969 of 2028) PASS: lldb-api :: commands/watchpoints/watchpoint_commands/TestWatchpointCommands.py (1970 of 2028) PASS: lldb-unit :: Symbol/./SymbolTests/PostfixExpression.ToDWARF (1971 of 2028) PASS: lldb-unit :: Utility/./UtilityTests/StringListTest.Clear (1972 of 2028) PASS: lldb-unit :: Utility/./UtilityTests/FileSpecTest.Yaml (1973 of 2028) PASS: lldb-unit :: Utility/./UtilityTests/ScalarTest.ExtractBitfield (1974 of 2028) PASS: lldb-unit :: UnwindAssembly/x86/./UnwindAssemblyx86Tests/Testx86AssemblyInspectionEngine.TestPushR14 (1975 of 2028) PASS: lldb-unit :: Utility/./UtilityTests/SerializationRountripTest.SerializeDeserializePod (1976 of 2028) PASS: lldb-unit :: Platform/./LLDBPlatformTests/PlatformDarwinTest.FindXcodeContentsDirectoryInPath (1977 of 2028) PASS: lldb-unit :: Symbol/./SymbolTests/LineEntryTest.GetSameLineContiguousAddressRangeNestedInline (1978 of 2028) PASS: lldb-api :: commands/expression/static-initializers/TestStaticInitializers.py (1979 of 2028) UNSUPPORTED: lldb-api :: functionalities/tsan/multiple/TestTsanMultiple.py (1980 of 2028) UNSUPPORTED: lldb-api :: functionalities/thread/state/TestThreadStates.py (1981 of 2028) PASS: lldb-api :: functionalities/data-formatter/nsdictionarysynth/TestNSDictionarySynthetic.py (1982 of 2028) PASS: lldb-api :: lang/cpp/function_refs/TestFunctionRefs.py (1983 of 2028) PASS: lldb-shell :: SymbolFile/DWARF/find-basic-namespace.cpp (1984 of 2028) PASS: lldb-unit :: Utility/./UtilityTests/StringExtractorTest.GetU32BigEndian (1985 of 2028) PASS: lldb-unit :: Utility/./UtilityTests/PassiveReplayTest.InstrumentedFooInvalid (1986 of 2028) PASS: lldb-api :: commands/watchpoints/multiple_hits/TestMultipleHits.py (1987 of 2028) PASS: lldb-shell :: ObjectFile/ELF/gnu-debuglink.yaml (1988 of 2028) PASS: lldb-unit :: Symbol/./SymbolTests/Type.GetTypeScopeAndBasename (1989 of 2028) PASS: lldb-api :: functionalities/data-formatter/data-formatter-stl/libcxx/initializerlist/TestInitializerList.py (1990 of 2028) PASS: lldb-api :: lang/cpp/llvm-style/TestLLVMStyle.py (1991 of 2028) UNSUPPORTED: lldb-shell :: SymbolFile/PDB/ast-restore.test (1992 of 2028) PASS: lldb-api :: tools/lldb-vscode/attach/TestVSCode_attach.py (1993 of 2028) PASS: lldb-api :: functionalities/data-formatter/data-formatter-advanced/TestDataFormatterAdv.py (1994 of 2028) PASS: lldb-api :: lang/objc/exceptions/TestObjCExceptions.py (1995 of 2028) PASS: lldb-unit :: Utility/./UtilityTests/StatusTest.ErrorConstructor (1996 of 2028) PASS: lldb-unit :: Utility/./UtilityTests/ArgsTest.DoubleQuotedItem (1997 of 2028) PASS: lldb-unit :: Language/Highlighting/./HighlighterTests/HighlighterTest.ClangPreserveNewLine (1998 of 2028) PASS: lldb-unit :: Language/Highlighting/./HighlighterTests/HighlighterTest.ClangPPDirectives (1999 of 2028) PASS: lldb-shell :: Settings/TestDisassemblyFormat.test (2000 of 2028) UNSUPPORTED: lldb-api :: benchmarks/libcxxmap/TestBenchmarkLibcxxMap.py (2001 of 2028) PASS: lldb-shell :: SymbolFile/Breakpad/unwind-via-stack-win.test (2002 of 2028) PASS: lldb-unit :: Process/minidump/./LLDBMinidumpTests/MinidumpParserTest.GetThreadContext_x86_32 (2003 of 2028) PASS: lldb-unit :: Utility/./UtilityTests/StreamTeeTest.SetStreamAtIndexOverwrite (2004 of 2028) PASS: lldb-unit :: Utility/./UtilityTests/ReproducerTest.SetReplay (2005 of 2028) UNSUPPORTED: lldb-api :: commands/register/register/intel_xtended_registers/TestMPXRegisters.py (2006 of 2028) PASS: lldb-unit :: Utility/./UtilityTests/SerializationRountripTest.SerializeDeserializeCStringArrayNullptrElem (2007 of 2028) PASS: lldb-api :: lang/cpp/bool/TestCPPBool.py (2008 of 2028) PASS: lldb-unit :: Utility/./UtilityTests/StringExtractorTest.DecodeHexU8_Underflow (2009 of 2028) PASS: lldb-unit :: Utility/./UtilityTests/BinaryStreamTest.PutSLEB128OneByte (2010 of 2028) PASS: lldb-api :: commands/expression/import_base_class_when_class_has_derived_member/TestImportBaseClassWhenClassHasDerivedMember.py (2011 of 2028) UNSUPPORTED: lldb-shell :: Process/Windows/exception_access_violation.cpp (2012 of 2028) PASS: lldb-unit :: Utility/./UtilityTests/Flags.Test (2013 of 2028) PASS: lldb-unit :: Utility/./UtilityTests/PassiveReplayTest.InstrumentedBarPtr (2014 of 2028) PASS: lldb-unit :: UnwindAssembly/x86/./UnwindAssemblyx86Tests/Testx86AssemblyInspectionEngine.TestDisassemblyMidFunctionEpilogues (2015 of 2028) PASS: lldb-unit :: Utility/./UtilityTests/StreamTest.ShiftOperatorPtr (2016 of 2028) PASS: lldb-unit :: Utility/./UtilityTests/RangeTest.SizeTypes (2017 of 2028) PASS: lldb-shell :: Reproducer/Modules/TestModuleCXX.test (2018 of 2028) UNSUPPORTED: lldb-api :: functionalities/darwin_log/filter/regex/message/TestDarwinLogFilterRegexMessage.py (2019 of 2028) UNSUPPORTED: lldb-api :: functionalities/tsan/basic/TestTsanBasic.py (2020 of 2028) PASS: lldb-api :: functionalities/data-formatter/data-formatter-globals/TestDataFormatterGlobals.py (2021 of 2028) PASS: lldb-unit :: Utility/./UtilityTests/StreamTest.PutHex32ByteOrderBig (2022 of 2028) PASS: lldb-api :: lang/objc/objc-dyn-sbtype/TestObjCDynamicSBType.py (2023 of 2028) PASS: lldb-api :: lang/cpp/signed_types/TestSignedTypes.py (2024 of 2028) UNSUPPORTED: lldb-api :: functionalities/breakpoint/breakpoint_in_delayslot/TestAvoidBreakpointInDelaySlot.py (2025 of 2028) PASS: lldb-api :: commands/reproducer/invalid-args/TestInvalidArgsReproducer.py (2026 of 2028) PASS: lldb-api :: commands/expression/import-std-module/unique_ptr-dbg-info-content/TestUniquePtrDbgInfoContent.py (2027 of 2028) PASS: lldb-api :: functionalities/data-formatter/data-formatter-stl/libcxx/map/TestDataFormatterLibccMap.py (2028 of 2028) Slowest Tests: -------------------------------------------------------------------------- 352.50s: lldb-api :: tools/lldb-server/TestLldbGdbServer.py 264.27s: lldb-api :: lang/cpp/enum_types/TestCPP11EnumTypes.py 252.25s: lldb-api :: api/multithreaded/TestMultithreaded.py 246.10s: lldb-api :: tools/lldb-server/TestGdbRemoteThreadsInStopReply.py 157.77s: lldb-api :: lang/objc/exceptions/TestObjCExceptions.py 156.75s: lldb-api :: lang/cpp/namespace/TestNamespaceLookup.py 140.20s: lldb-api :: lang/objc/real-definition/TestRealDefinition.py 120.27s: lldb-api :: types/TestLongTypesExpr.py 119.57s: lldb-api :: tools/lldb-server/TestGdbRemote_qThreadStopInfo.py 110.80s: lldb-api :: lang/objc/foundation/TestObjCMethods.py 109.84s: lldb-api :: lang/objc/conflicting-definition/TestConflictingDefinition.py 104.89s: lldb-api :: types/TestLongTypes.py 100.95s: lldb-api :: python_api/lldbutil/iter/TestLLDBIterator.py 92.20s: lldb-api :: functionalities/data-formatter/poarray/TestPrintObjectArray.py 91.73s: lldb-api :: functionalities/gdb_remote_client/TestWasm.py 89.66s: lldb-api :: commands/settings/TestSettings.py 85.99s: lldb-api :: functionalities/data-formatter/compactvectors/TestCompactVectors.py 79.01s: lldb-api :: api/check_public_api_headers/TestPublicAPIHeaders.py 78.97s: lldb-api :: lang/objc/forward-decl/TestForwardDecl.py 76.39s: lldb-api :: types/TestIntegerTypeExpr.py

Hide Details

Tests Times: -------------------------------------------------------------------------- [ Range ] :: [ Percentage ] :: [ Count ] -------------------------------------------------------------------------- [340s,360s) :: [ ] :: [ 1/2028] [320s,340s) :: [ ] :: [ 0/2028] [300s,320s) :: [ ] :: [ 0/2028] [280s,300s) :: [ ] :: [ 0/2028] [260s,280s) :: [ ] :: [ 1/2028] [240s,260s) :: [ ] :: [ 2/2028] [220s,240s) :: [ ] :: [ 0/2028] [200s,220s) :: [ ] :: [ 0/2028] [180s,200s) :: [ ] :: [ 0/2028] [160s,180s) :: [ ] :: [ 2/2028] [140s,160s) :: [ ] :: [ 1/2028] [120s,140s) :: [ ] :: [ 2/2028] [100s,120s) :: [ ] :: [ 4/2028] [ 80s,100s) :: [ ] :: [ 6/2028] [ 60s, 80s) :: [ ] :: [ 15/2028] [ 40s, 60s) :: [* ] :: [ 86/2028] [ 20s, 40s) :: [** ] :: [ 127/2028] [ 0s, 20s) :: [*********************************** ] :: [1781/2028] -------------------------------------------------------------------------- ******************** Failing Tests (53): lldb-api :: functionalities/data-formatter/poarray/TestPrintObjectArray.py lldb-api :: lang/objc/conflicting-definition/TestConflictingDefinition.py lldb-api :: commands/expression/diagnostics/TestExprDiagnostics.py lldb-api :: lang/objc/objc-super/TestObjCSuper.py lldb-api :: functionalities/data-formatter/synthupdate/TestSyntheticFilterRecompute.py lldb-api :: lang/objc/foundation/TestRuntimeTypes.py lldb-api :: commands/expression/persist_objc_pointeetype/TestPersistObjCPointeeType.py lldb-api :: lang/objc/bitfield_ivars/TestBitfieldIvars.py lldb-api :: lang/objc/objc-runtime-ivars/TestRuntimeIvars.py lldb-api :: lang/objc/objc-new-syntax/TestObjCNewSyntaxArray.py lldb-api :: lang/objc/unicode-string/TestUnicodeString.py lldb-api :: lang/objc/radar-9691614/TestObjCMethodReturningBOOL.py lldb-api :: functionalities/set-data/TestSetData.py lldb-api :: functionalities/data-formatter/data-formatter-objc/TestDataFormatterObjCExpr.py lldb-api :: lang/objc/print-obj/TestPrintObj.py lldb-api :: lang/objc/variadic_methods/TestVariadicMethods.py lldb-api :: lang/objc/foundation/TestObjCMethodsString.py lldb-api :: lang/objc/hidden-ivars/TestHiddenIvars.py lldb-api :: lang/objc/objc-struct-argument/TestObjCStructArgument.py lldb-api :: lang/objc/objc-optimized/TestObjcOptimized.py lldb-api :: functionalities/data-formatter/data-formatter-objc/nsindexpath/TestDataFormatterNSIndexPath.py lldb-api :: commands/expression/po_verbosity/TestPoVerbosity.py lldb-api :: functionalities/data-formatter/data-formatter-objc/TestDataFormatterObjCNSError.py lldb-api :: lang/objc/objc_direct-methods/TestObjCDirectMethods.py lldb-api :: lang/objc/foundation/TestObjCMethodsNSError.py lldb-api :: lang/objc/modules/TestObjCModules.py lldb-api :: lang/objc/objc-new-syntax/TestObjCNewSyntaxDictionary.py lldb-api :: lang/objc/forward-decl/TestForwardDecl.py lldb-api :: commands/expression/import_builtin_fileid/TestImportBuiltinFileID.py lldb-api :: lang/objc/foundation/TestObjCMethods.py lldb-api :: lang/objcxx/cxx-bridged-po/TestObjCXXBridgedPO.py lldb-api :: lang/objc/objc-class-method/TestObjCClassMethod.py lldb-api :: lang/objc/rdar-11355592/TestRdar11355592.py lldb-api :: lang/objc/objc-property/TestObjCProperty.py lldb-api :: commands/expression/two-files/TestObjCTypeQueryFromOtherCompileUnit.py lldb-api :: python_api/exprpath_synthetic/TestExprPathSynthetic.py lldb-api :: lang/objc/foundation/TestObjCMethodsNSArray.py lldb-api :: functionalities/data-formatter/data-formatter-objc/TestDataFormatterObjCNSContainer.py lldb-api :: lang/objc/modules-non-objc-target/TestObjCModulesNonObjCTarget.py lldb-api :: lang/objc/objc-new-syntax/TestObjCNewSyntaxLiteral.py lldb-api :: lang/objc/orderedset/TestOrderedSet.py lldb-api :: lang/objc/blocks/TestObjCIvarsInBlocks.py lldb-api :: lang/objc/objc-ivar-protocols/TestIvarProtocols.py lldb-api :: lang/objc/foundation/TestConstStrings.py lldb-api :: commands/expression/context-object-objc/TestContextObjectObjc.py lldb-api :: lang/objc/objc-struct-return/TestObjCStructReturn.py lldb-api :: lang/objc/objc-static-method/TestObjCStaticMethod.py lldb-api :: commands/expression/namespace_local_var_same_name_obj_c/TestNamespaceLocalVarSameNameObjC.py lldb-api :: commands/expression/call-throws/TestCallThatThrows.py lldb-api :: lang/objc/self/TestObjCSelf.py lldb-api :: functionalities/data-formatter/data-formatter-objc/TestDataFormatterObjCCF.py lldb-api :: lang/objc/objc++/TestObjCXX.py lldb-api :: lang/objcxx/objcxx-ivar-vector/TestIvarVector.py

Hide Details

Hide Details

Testing Time: 4149.82s Unsupported Tests : 170 Expected Passes : 1799 Expected Failures : 6 Unexpected Failures: 53 FAILED: tools/lldb/test/CMakeFiles/check-lldb-lit cd /Users/buildslave/jenkins/workspace/lldb-cmake-sanitized/lldb-build/tools/lldb/test && /usr/local/Frameworks/Python.framework/Versions/3.7/bin/python3.7 /Users/buildslave/jenkins/workspace/lldb-cmake-sanitized/lldb-build/./bin/llvm-lit -v --time-tests --shuffle --xunit-xml-output=/Users/buildslave/jenkins/workspace/lldb-cmake-sanitized/test/results.xml -v -j 4 --timeout 1200 /Users/buildslave/jenkins/workspace/lldb-cmake-sanitized/lldb-build/tools/lldb/test ninja: build stopped: subcommand failed. Command failed: Command '['/usr/bin/env', 'TERM=vt100', '/usr/local/bin/ninja', '-v', 'check-lldb']' returned non-zero exit status 1. Command: ['/usr/bin/env', 'TERM=vt100', '/usr/local/bin/ninja', '-v', 'check-lldb'] [Pipeline] } [Pipeline] // timeout [Pipeline] } [Pipeline] // stage [Pipeline] stage [Pipeline] { (Declarative: Post Actions) [Pipeline] scanForIssues [Clang (LLVM based)] Sleeping for 5 seconds due to JENKINS-32191... [Clang (LLVM based)] Parsing console log (workspace: '/Users/buildslave/jenkins/workspace/lldb-cmake-sanitized') [Clang (LLVM based)] Successfully parsed console log [Clang (LLVM based)] -> found 2 issues (skipped 0 duplicates) [Clang (LLVM based)] Post processing issues on 'green-dragon-23' with source code encoding 'UTF-8' [Clang (LLVM based)] Creating SCM blamer to obtain author and commit information for affected files [Clang (LLVM based)] Creating SCM miner to obtain statistics for affected repository files [Clang (LLVM based)] Resolving file names for all issues in source directory '/Users/buildslave/jenkins/workspace/lldb-cmake-sanitized' [Clang (LLVM based)] -> resolved paths in source directory (1 found, 0 not found) [Clang (LLVM based)] Resolving module names from module definitions (build.xml, pom.xml, or Manifest.mf files) [Clang (LLVM based)] -> resolved module names for 2 issues [Clang (LLVM based)] Resolving package names (or namespaces) by parsing the affected files [Clang (LLVM based)] -> resolved package names of 1 affected files [Clang (LLVM based)] No filter has been set, publishing all 2 issues [Clang (LLVM based)] Creating fingerprints for all affected code blocks to track issues over different builds [Clang (LLVM based)] -> created fingerprints for 2 issues (skipped 0 issues) [Clang (LLVM based)] Copying affected files to Jenkins' build folder '/Users/Shared/Jenkins/Home/jobs/lldb-cmake-sanitized/builds/1494/files-with-issues' [Clang (LLVM based)] -> 1 copied, 0 not in workspace, 0 not-found, 0 with I/O error [Pipeline] junit Recording test results [Pipeline] } [Pipeline] // stage [Pipeline] } [Pipeline] // withEnv [Pipeline] } [Pipeline] // node [Pipeline] End of Pipeline ERROR: script returned exit code 1 Finished: FAILURE