FailedConsole Output

Skipping 1,918 KB.. Full Log
runtime-ivars/TestRuntimeIvars.py' FAILED ********************
Script:
--
/Users/buildslave/jenkins/workspace/lldb-cmake-sanitized/lldb-build/lldb-test-build.noindex/copied-system-python /Users/buildslave/jenkins/workspace/lldb-cmake-sanitized/llvm-project/lldb/test/API/dotest.py --arch x86_64 -s /Users/buildslave/jenkins/workspace/lldb-cmake-sanitized/lldb-build/lldb-test-traces -S nm -u CXXFLAGS -u CFLAGS --codesign-identity lldb_codesign --server /Users/buildslave/jenkins/workspace/lldb-cmake-sanitized/lldb-build/./bin/debugserver --arch x86_64 --build-dir /Users/buildslave/jenkins/workspace/lldb-cmake-sanitized/lldb-build/lldb-test-build.noindex -s=/Users/buildslave/jenkins/workspace/lldb-cmake-sanitized/test/logs -t --env TERM=vt100 --env LLVM_LIBS_DIR=/Users/buildslave/jenkins/workspace/lldb-cmake-sanitized/lldb-build/./lib --inferior-env ASAN_OPTIONS=detect_stack_use_after_return=1 --inferior-env DYLD_INSERT_LIBRARIES=/Users/buildslave/jenkins/workspace/lldb-cmake-sanitized/host-compiler/lib/clang/11.0.0/lib/darwin/libclang_rt.asan_osx_dynamic.dylib --build-dir /Users/buildslave/jenkins/workspace/lldb-cmake-sanitized/lldb-build/lldb-test-build.noindex --lldb-module-cache-dir /Users/buildslave/jenkins/workspace/lldb-cmake-sanitized/lldb-build/lldb-test-build.noindex/module-cache-lldb/lldb-api --clang-module-cache-dir /Users/buildslave/jenkins/workspace/lldb-cmake-sanitized/lldb-build/lldb-test-build.noindex/module-cache-clang/lldb-api --executable /Users/buildslave/jenkins/workspace/lldb-cmake-sanitized/lldb-build/./bin/lldb --compiler /Users/buildslave/jenkins/workspace/lldb-cmake-sanitized/lldb-build/./bin/clang --dsymutil /Users/buildslave/jenkins/workspace/lldb-cmake-sanitized/lldb-build/./bin/dsymutil --filecheck /Users/buildslave/jenkins/workspace/lldb-cmake-sanitized/lldb-build/./bin/FileCheck --lldb-libs-dir /Users/buildslave/jenkins/workspace/lldb-cmake-sanitized/lldb-build/./lib /Users/buildslave/jenkins/workspace/lldb-cmake-sanitized/llvm-project/lldb/test/API/lang/objc/objc-runtime-ivars -p TestRuntimeIvars.py
--
Exit Code: -6

Hide Details

Command Output (stdout): -- lldb version 11.0.99 clang revision ec25a71eb7fc72440149784951d62453301cc960 llvm revision ec25a71eb7fc72440149784951d62453301cc960

Hide Details

-- Command Output (stderr): -- Assertion failed: (tokenKind == tok::kw___bridge_retain), function ParseParenExpression, file /Users/buildslave/jenkins/workspace/lldb-cmake-sanitized/llvm-project/clang/lib/Parse/ParseExpr.cpp, line 2804.

Hide Details

--

Hide Details

******************** UNSUPPORTED: lldb-shell :: SymbolFile/PDB/variables.test (1594 of 2028) PASS: lldb-unit :: Utility/./UtilityTests/StringExtractorTest.GetHexU8_Extra (1595 of 2028) PASS: lldb-shell :: SymbolFile/DWARF/dwarf5_locations.s (1596 of 2028) UNSUPPORTED: lldb-shell :: ScriptInterpreter/Lua/persistent_state.test (1597 of 2028) PASS: lldb-shell :: SymbolFile/NativePDB/disassembly.cpp (1598 of 2028) PASS: lldb-shell :: ObjectFile/ELF/aarch64-relocations.yaml (1599 of 2028) UNSUPPORTED: lldb-shell :: ScriptInterpreter/Lua/watchpoint_callback.test (1600 of 2028) PASS: lldb-api :: lang/c/conflicting-symbol/TestConflictingSymbol.py (1601 of 2028) PASS: lldb-api :: functionalities/data-formatter/data-formatter-ptr-to-array/TestPtrToArrayFormatting.py (1602 of 2028) PASS: lldb-unit :: Process/gdb-remote/./ProcessGdbRemoteTests/GDBRemoteCommunicationClientTest.SendGetDataPacket (1603 of 2028) PASS: lldb-shell :: Reproducer/TestDriverOptions.test (1604 of 2028) PASS: lldb-api :: python_api/value/change_values/TestChangeValueAPI.py (1605 of 2028) PASS: lldb-unit :: Utility/./UtilityTests/StreamTeeTest.Constructor1Stream (1606 of 2028) UNSUPPORTED: lldb-api :: tools/lldb-server/TestGdbRemoteAuxvSupport.py (1607 of 2028) PASS: lldb-unit :: UnwindAssembly/x86/./UnwindAssemblyx86Tests/Testx86AssemblyInspectionEngine.TestMovRSPtoRBP (1608 of 2028) UNSUPPORTED: lldb-api :: tools/lldb-vscode/completions/TestVSCode_completions.py (1609 of 2028) PASS: lldb-shell :: SymbolFile/DWARF/childless-compile-unit.s (1610 of 2028) UNSUPPORTED: lldb-shell :: Register/x86-zmm-write.test (1611 of 2028) PASS: lldb-api :: lang/cpp/accelerator-table/TestCPPAccelerator.py (1612 of 2028) PASS: lldb-api :: functionalities/thread/concurrent_events/TestConcurrentManyCrash.py (1613 of 2028) PASS: lldb-unit :: Utility/./UtilityTests/UriParserTest.PortOverflow (1614 of 2028) PASS: lldb-api :: functionalities/thread/backtrace_all/TestBacktraceAll.py (1615 of 2028) PASS: lldb-api :: lang/objc/modules-update/TestClangModulesUpdate.py (1616 of 2028) PASS: lldb-shell :: Process/TestEnvironment.test (1617 of 2028) PASS: lldb-shell :: Breakpoint/dummy-target.test (1618 of 2028) PASS: lldb-unit :: Utility/./UtilityTests/RangeTest.NotEqualInvalid (1619 of 2028) PASS: lldb-api :: functionalities/breakpoint/step_over_breakpoint/TestStepOverBreakpoint.py (1620 of 2028) UNSUPPORTED: lldb-shell :: Breakpoint/ppc64-localentry.test (1621 of 2028) PASS: lldb-unit :: Utility/./UtilityTests/OptionsWithRawTest.TerminatedQuote (1622 of 2028) UNSUPPORTED: lldb-shell :: Register/x86-ymm-read.test (1623 of 2028) PASS: lldb-shell :: Commands/command-regex-unalias.test (1624 of 2028) UNSUPPORTED: lldb-shell :: Register/x86-zmm-read.test (1625 of 2028) PASS: lldb-shell :: SymbolFile/NativePDB/break-by-function.cpp (1626 of 2028) PASS: lldb-api :: python_api/interpreter/TestCommandInterpreterAPI.py (1627 of 2028) PASS: lldb-unit :: Utility/./UtilityTests/ScalarTest.ComparisonFloat (1628 of 2028) PASS: lldb-unit :: UnwindAssembly/x86/./UnwindAssemblyx86Tests/Testx86AssemblyInspectionEngine.TestPushR15 (1629 of 2028) PASS: lldb-api :: functionalities/data-formatter/data-formatter-stl/libcxx/bitset/TestDataFormatterLibcxxBitset.py (1630 of 2028) PASS: lldb-unit :: Utility/./UtilityTests/StreamTest.AddressSuffix (1631 of 2028) PASS: lldb-unit :: Utility/./UtilityTests/StringListTest.InsertStringAtIndexStart (1632 of 2028) PASS: lldb-api :: commands/expression/unicode-in-variable/TestUnicodeInVariable.py (1633 of 2028) PASS: lldb-unit :: Utility/./UtilityTests/StreamTest.PutMaxHex64ByteOrderLittle (1634 of 2028) PASS: lldb-unit :: Symbol/./SymbolTests/TestClangASTImporter.MetadataPropagationAfterCopying (1635 of 2028) PASS: lldb-api :: tools/lldb-server/TestGdbRemoteProcessInfo.py (1636 of 2028) UNSUPPORTED: lldb-api :: commands/register/register/intel_xtended_registers/mpx_offset_intersection/TestMPXOffsetIntersection.py (1637 of 2028) PASS: lldb-api :: functionalities/data-formatter/array_typedef/TestArrayTypedef.py (1638 of 2028) PASS: lldb-unit :: Utility/./UtilityTests/ArgsTest.GetArgumentArrayRef (1639 of 2028) PASS: lldb-api :: functionalities/pre_run_dylibs/TestPreRunDylibs.py (1640 of 2028) PASS: lldb-api :: functionalities/thread/concurrent_events/TestConcurrentSignalDelayBreak.py (1641 of 2028) PASS: lldb-api :: python_api/lldbutil/frame/TestFrameUtils.py (1642 of 2028) PASS: lldb-unit :: Utility/./UtilityTests/UriParserTest.TypicalPortPathIPv6 (1643 of 2028) PASS: lldb-api :: functionalities/tail_call_frames/disambiguate_paths_to_common_sink/TestDisambiguatePathsToCommonSink.py (1644 of 2028) PASS: lldb-shell :: Settings/TestDisassemblyFormat.test (1645 of 2028) UNSUPPORTED: lldb-shell :: ExecControl/StopHook/stop-hook-threads.test (1646 of 2028) PASS: lldb-api :: lang/c/array_types/TestArrayTypes.py (1647 of 2028) PASS: lldb-shell :: ObjectFile/ELF/build-id-case.yaml (1648 of 2028) UNSUPPORTED: lldb-api :: commands/expression/multiline-completion/TestMultilineCompletion.py (1649 of 2028) PASS: lldb-unit :: Expression/./ExpressionTests/DiagnosticManagerTest.GetStringNoDiags (1650 of 2028) PASS: lldb-unit :: Symbol/./SymbolTests/SymbolsTest.TerminateLocateExecutableSymbolFileForUnknownExecutableAndUnknownSymbolFile (1651 of 2028) PASS: lldb-unit :: Utility/./UtilityTests/StringListTest.GetMaxStringLengthDecreasingSize (1652 of 2028) PASS: lldb-unit :: Host/./HostTests/FileSystemTest.EmptyTest (1653 of 2028) PASS: lldb-unit :: Utility/./UtilityTests/RangeTest.Equal (1654 of 2028) PASS: lldb-api :: functionalities/data-formatter/data-formatter-objc/nsstring/TestDataFormatterNSString.py (1655 of 2028) PASS: lldb-unit :: UnwindAssembly/x86/./UnwindAssemblyx86Tests/Testx86AssemblyInspectionEngine.TestStackRealign32BitDisp_x86_64 (1656 of 2028) PASS: lldb-unit :: Utility/./UtilityTests/ScalarTest.GetBytes (1657 of 2028) PASS: lldb-unit :: Process/minidump/./LLDBMinidumpTests/RegisterContextMinidump.ConvertMinidumpContext_x86_64 (1658 of 2028) PASS: lldb-api :: python_api/signals/TestSignalsAPI.py (1659 of 2028) PASS: lldb-unit :: ScriptInterpreter/Python/./ScriptInterpreterPythonTests/PythonDataObjectsTest.TestPythonInteger (1660 of 2028) PASS: lldb-api :: python_api/class_members/TestSBTypeClassMembers.py (1661 of 2028) PASS: lldb-unit :: ScriptInterpreter/Python/./ScriptInterpreterPythonTests/PythonDataObjectsTest.TestScript (1662 of 2028) PASS: lldb-api :: lang/objc/objc-builtin-types/TestObjCBuiltinTypes.py (1663 of 2028) PASS: lldb-unit :: Process/gdb-remote/./ProcessGdbRemoteTests/GDBRemoteCommunicationClientTest.WriteRegisterNoSuffix (1664 of 2028) PASS: lldb-api :: functionalities/tail_call_frames/ambiguous_tail_call_seq2/TestAmbiguousTailCallSeq2.py (1665 of 2028) PASS: lldb-unit :: Utility/./UtilityTests/OptionsWithRawTest.EmptySuffixSingleWhitespace (1666 of 2028) PASS: lldb-api :: lang/objc/modules-cache/TestClangModulesCache.py (1667 of 2028) PASS: lldb-unit :: Utility/./UtilityTests/StreamTest.ShiftOperatorPtr (1668 of 2028) PASS: lldb-api :: functionalities/target-new-solib-notifications/TestModuleLoadedNotifys.py (1669 of 2028) PASS: lldb-unit :: Expression/./ExpressionTests/CppModuleConfigurationTest.UnrelatedLibrary (1670 of 2028) PASS: lldb-unit :: Utility/./UtilityTests/AnsiTerminal.Incomplete (1671 of 2028) PASS: lldb-unit :: Utility/./UtilityTests/StringListTest.JoinThree (1672 of 2028) PASS: lldb-api :: functionalities/data-formatter/data-formatter-synth/TestDataFormatterSynth.py (1673 of 2028) PASS: lldb-api :: sanity/TestModuleCacheSanity.py (1674 of 2028) PASS: lldb-api :: python_api/frame/get-variables/TestGetVariables.py (1675 of 2028) PASS: lldb-unit :: Utility/./UtilityTests/ConstStringTest.FromMidOfBufferStringRef (1676 of 2028) PASS: lldb-unit :: UnwindAssembly/x86/./UnwindAssemblyx86Tests/Testx86AssemblyInspectionEngine.Test32BitOnlyInstruction (1677 of 2028) PASS: lldb-unit :: Utility/./UtilityTests/SerializationRountripTest.SerializeDeserializeCStringNull (1678 of 2028) PASS: lldb-unit :: Process/gdb-remote/./ProcessGdbRemoteTests/GDBRemoteCommunicationClientTest.SendGetTraceConfigPacket (1679 of 2028) PASS: lldb-unit :: Symbol/./SymbolTests/TestTypeSystemClang.TestUnifyAccessSpecifiers (1680 of 2028) PASS: lldb-unit :: SymbolFile/DWARF/./SymbolFileDWARFTests/XcodeSDKModuleTests.TestModuleGetXcodeSDK (1681 of 2028) PASS: lldb-shell :: Commands/command-breakpoint-col.test (1682 of 2028) PASS: lldb-api :: functionalities/data-formatter/nsdictionarysynth/TestNSDictionarySynthetic.py (1683 of 2028) PASS: lldb-api :: functionalities/jitloader_gdb/TestJITLoaderGDB.py (1684 of 2028) PASS: lldb-unit :: Utility/./UtilityTests/StringListTest.Assignment (1685 of 2028) UNSUPPORTED: lldb-api :: lang/objc/objc-dynamic-value/TestObjCDynamicValue.py (1686 of 2028) PASS: lldb-unit :: Utility/./UtilityTests/RegisterValueTest.GetSet8 (1687 of 2028) FAIL: lldb-api :: functionalities/data-formatter/data-formatter-objc/TestDataFormatterObjCExpr.py (1688 of 2028) ******************** TEST 'lldb-api :: functionalities/data-formatter/data-formatter-objc/TestDataFormatterObjCExpr.py' FAILED ******************** Script: -- /Users/buildslave/jenkins/workspace/lldb-cmake-sanitized/lldb-build/lldb-test-build.noindex/copied-system-python /Users/buildslave/jenkins/workspace/lldb-cmake-sanitized/llvm-project/lldb/test/API/dotest.py --arch x86_64 -s /Users/buildslave/jenkins/workspace/lldb-cmake-sanitized/lldb-build/lldb-test-traces -S nm -u CXXFLAGS -u CFLAGS --codesign-identity lldb_codesign --server /Users/buildslave/jenkins/workspace/lldb-cmake-sanitized/lldb-build/./bin/debugserver --arch x86_64 --build-dir /Users/buildslave/jenkins/workspace/lldb-cmake-sanitized/lldb-build/lldb-test-build.noindex -s=/Users/buildslave/jenkins/workspace/lldb-cmake-sanitized/test/logs -t --env TERM=vt100 --env LLVM_LIBS_DIR=/Users/buildslave/jenkins/workspace/lldb-cmake-sanitized/lldb-build/./lib --inferior-env ASAN_OPTIONS=detect_stack_use_after_return=1 --inferior-env DYLD_INSERT_LIBRARIES=/Users/buildslave/jenkins/workspace/lldb-cmake-sanitized/host-compiler/lib/clang/11.0.0/lib/darwin/libclang_rt.asan_osx_dynamic.dylib --build-dir /Users/buildslave/jenkins/workspace/lldb-cmake-sanitized/lldb-build/lldb-test-build.noindex --lldb-module-cache-dir /Users/buildslave/jenkins/workspace/lldb-cmake-sanitized/lldb-build/lldb-test-build.noindex/module-cache-lldb/lldb-api --clang-module-cache-dir /Users/buildslave/jenkins/workspace/lldb-cmake-sanitized/lldb-build/lldb-test-build.noindex/module-cache-clang/lldb-api --executable /Users/buildslave/jenkins/workspace/lldb-cmake-sanitized/lldb-build/./bin/lldb --compiler /Users/buildslave/jenkins/workspace/lldb-cmake-sanitized/lldb-build/./bin/clang --dsymutil /Users/buildslave/jenkins/workspace/lldb-cmake-sanitized/lldb-build/./bin/dsymutil --filecheck /Users/buildslave/jenkins/workspace/lldb-cmake-sanitized/lldb-build/./bin/FileCheck --lldb-libs-dir /Users/buildslave/jenkins/workspace/lldb-cmake-sanitized/lldb-build/./lib /Users/buildslave/jenkins/workspace/lldb-cmake-sanitized/llvm-project/lldb/test/API/functionalities/data-formatter/data-formatter-objc -p TestDataFormatterObjCExpr.py -- Exit Code: -6

Hide Details

Command Output (stdout): -- lldb version 11.0.99 clang revision ec25a71eb7fc72440149784951d62453301cc960 llvm revision ec25a71eb7fc72440149784951d62453301cc960

Hide Details

-- Command Output (stderr): -- Assertion failed: (tokenKind == tok::kw___bridge_retain), function ParseParenExpression, file /Users/buildslave/jenkins/workspace/lldb-cmake-sanitized/llvm-project/clang/lib/Parse/ParseExpr.cpp, line 2804.

Hide Details

--

Hide Details

******************** PASS: lldb-unit :: ScriptInterpreter/Python/./ScriptInterpreterPythonTests/PythonDataObjectsTest.TestPythonTupleInitializerList (1689 of 2028) PASS: lldb-unit :: Utility/./UtilityTests/CompletionRequest.ShiftArguments (1690 of 2028) PASS: lldb-unit :: Utility/./UtilityTests/OptionsWithRawTest.WhitespaceInput (1691 of 2028) PASS: lldb-unit :: Utility/./UtilityTests/ListenerTest.GetEventWait (1692 of 2028) PASS: lldb-unit :: Utility/./UtilityTests/DataExtractorTest.GetMaxU64 (1693 of 2028) PASS: lldb-unit :: ScriptInterpreter/Python/./ScriptInterpreterPythonTests/PythonDataObjectsTest.TestPythonBytes (1694 of 2028) PASS: lldb-unit :: Utility/./UtilityTests/BinaryStreamTest.PutSLEB128SixBytes (1695 of 2028) PASS: lldb-unit :: ObjectFile/PECOFF/./ObjectFilePECOFFTests/PECallFrameInfoTest.Basic_eh (1696 of 2028) PASS: lldb-api :: tools/lldb-server/TestGdbRemoteRegisterState.py (1697 of 2028) PASS: lldb-shell :: SymbolFile/DWARF/split-dwarf-inlining.cpp (1698 of 2028) UNSUPPORTED: lldb-api :: functionalities/data-formatter/data-formatter-stl/libstdcpp/iterator/TestDataFormatterStdIterator.py (1699 of 2028) UNSUPPORTED: lldb-api :: functionalities/darwin_log/filter/exact_match/subsystem/TestDarwinLogFilterMatchSubsystem.py (1700 of 2028) PASS: lldb-unit :: Utility/./UtilityTests/AnsiTerminal.Twice (1701 of 2028) PASS: lldb-api :: python_api/function_symbol/TestDisasmAPI.py (1702 of 2028) PASS: lldb-unit :: Utility/./UtilityTests/ArgsTest.EscapeLLDBCommandArgument (1703 of 2028) PASS: lldb-unit :: Utility/./UtilityTests/StatusTest.ErrorCodeConstructor (1704 of 2028) PASS: lldb-shell :: Register/x86-64-read.test (1705 of 2028) PASS: lldb-api :: sample_test/TestSampleInlineTest.py (1706 of 2028) PASS: lldb-shell :: Reproducer/TestFileRepro.test (1707 of 2028) PASS: lldb-shell :: Watchpoint/SetErrorCases.test (1708 of 2028) UNSUPPORTED: lldb-shell :: SymbolFile/PDB/pointers.test (1709 of 2028) PASS: lldb-unit :: Utility/./UtilityTests/UriParserTest.SchemeHostSeparator3 (1710 of 2028) PASS: lldb-api :: functionalities/breakpoint/serialize/TestBreakpointSerialization.py (1711 of 2028) FAIL: lldb-api :: lang/objcxx/objcxx-ivar-vector/TestIvarVector.py (1712 of 2028) ******************** TEST 'lldb-api :: lang/objcxx/objcxx-ivar-vector/TestIvarVector.py' FAILED ******************** Script: -- /Users/buildslave/jenkins/workspace/lldb-cmake-sanitized/lldb-build/lldb-test-build.noindex/copied-system-python /Users/buildslave/jenkins/workspace/lldb-cmake-sanitized/llvm-project/lldb/test/API/dotest.py --arch x86_64 -s /Users/buildslave/jenkins/workspace/lldb-cmake-sanitized/lldb-build/lldb-test-traces -S nm -u CXXFLAGS -u CFLAGS --codesign-identity lldb_codesign --server /Users/buildslave/jenkins/workspace/lldb-cmake-sanitized/lldb-build/./bin/debugserver --arch x86_64 --build-dir /Users/buildslave/jenkins/workspace/lldb-cmake-sanitized/lldb-build/lldb-test-build.noindex -s=/Users/buildslave/jenkins/workspace/lldb-cmake-sanitized/test/logs -t --env TERM=vt100 --env LLVM_LIBS_DIR=/Users/buildslave/jenkins/workspace/lldb-cmake-sanitized/lldb-build/./lib --inferior-env ASAN_OPTIONS=detect_stack_use_after_return=1 --inferior-env DYLD_INSERT_LIBRARIES=/Users/buildslave/jenkins/workspace/lldb-cmake-sanitized/host-compiler/lib/clang/11.0.0/lib/darwin/libclang_rt.asan_osx_dynamic.dylib --build-dir /Users/buildslave/jenkins/workspace/lldb-cmake-sanitized/lldb-build/lldb-test-build.noindex --lldb-module-cache-dir /Users/buildslave/jenkins/workspace/lldb-cmake-sanitized/lldb-build/lldb-test-build.noindex/module-cache-lldb/lldb-api --clang-module-cache-dir /Users/buildslave/jenkins/workspace/lldb-cmake-sanitized/lldb-build/lldb-test-build.noindex/module-cache-clang/lldb-api --executable /Users/buildslave/jenkins/workspace/lldb-cmake-sanitized/lldb-build/./bin/lldb --compiler /Users/buildslave/jenkins/workspace/lldb-cmake-sanitized/lldb-build/./bin/clang --dsymutil /Users/buildslave/jenkins/workspace/lldb-cmake-sanitized/lldb-build/./bin/dsymutil --filecheck /Users/buildslave/jenkins/workspace/lldb-cmake-sanitized/lldb-build/./bin/FileCheck --lldb-libs-dir /Users/buildslave/jenkins/workspace/lldb-cmake-sanitized/lldb-build/./lib /Users/buildslave/jenkins/workspace/lldb-cmake-sanitized/llvm-project/lldb/test/API/lang/objcxx/objcxx-ivar-vector -p TestIvarVector.py -- Exit Code: -6

Hide Details

Command Output (stdout): -- lldb version 11.0.99 clang revision ec25a71eb7fc72440149784951d62453301cc960 llvm revision ec25a71eb7fc72440149784951d62453301cc960

Hide Details

-- Command Output (stderr): -- Assertion failed: (tokenKind == tok::kw___bridge_retain), function ParseParenExpression, file /Users/buildslave/jenkins/workspace/lldb-cmake-sanitized/llvm-project/clang/lib/Parse/ParseExpr.cpp, line 2804.

Hide Details

--

Hide Details

******************** PASS: lldb-api :: functionalities/gdb_remote_client/TestIOSSimulator.py (1713 of 2028) PASS: lldb-unit :: Utility/./UtilityTests/DataExtractorTest.GetMaxU64_unchecked (1714 of 2028) PASS: lldb-api :: commands/command/history/TestCommandHistory.py (1715 of 2028) PASS: lldb-api :: commands/expression/fixits/TestFixIts.py (1716 of 2028) PASS: lldb-unit :: Utility/./UtilityTests/Flags.Reset (1717 of 2028) PASS: lldb-api :: api/listeners/TestListener.py (1718 of 2028) PASS: lldb-api :: functionalities/data-formatter/data-formatter-stl/libcxx/queue/TestDataFormatterLibcxxQueue.py (1719 of 2028) PASS: lldb-api :: functionalities/data-formatter/stringprinter/TestStringPrinter.py (1720 of 2028) PASS: lldb-shell :: SymbolFile/DWARF/dwp-debug-types.s (1721 of 2028) PASS: lldb-unit :: SymbolFile/NativePDB/./SymbolFileNativePDBTests/PDBFPOProgramToDWARFExpressionTests.UnknownOp (1722 of 2028) PASS: lldb-shell :: Driver/TestSingleQuote.test (1723 of 2028) PASS: lldb-unit :: UnwindAssembly/x86/./UnwindAssemblyx86Tests/Testx86AssemblyInspectionEngine.TestPopEDI (1724 of 2028) PASS: lldb-unit :: Utility/./UtilityTests/RangeTest.SizeTypes (1725 of 2028) PASS: lldb-api :: macosx/indirect_symbol/TestIndirectSymbols.py (1726 of 2028) PASS: lldb-shell :: SymbolFile/DWARF/dwarf5-atomic.s (1727 of 2028) PASS: lldb-unit :: Target/./TargetTests/StackFrameRecognizerTest.NullModuleRegex (1728 of 2028) PASS: lldb-unit :: UnwindAssembly/x86/./UnwindAssemblyx86Tests/Testx86AssemblyInspectionEngine.TestPushR13 (1729 of 2028) PASS: lldb-unit :: Target/./TargetTests/PathMappingListTest.RemapRoot (1730 of 2028) PASS: lldb-api :: lang/c/stepping/TestStepAndBreakpoints.py (1731 of 2028) PASS: lldb-api :: functionalities/thread/concurrent_events/TestConcurrentDelayedCrashWithBreakpointSignal.py (1732 of 2028) PASS: lldb-unit :: Expression/./ExpressionTests/DiagnosticManagerTest.AppendMessageNoDiag (1733 of 2028) PASS: lldb-shell :: Reproducer/TestMultipleTargets.test (1734 of 2028) PASS: lldb-api :: functionalities/data-formatter/ptr_ref_typedef/TestPtrRef2Typedef.py (1735 of 2028) PASS: lldb-unit :: Utility/./UtilityTests/TimerTest.CategoryTimesNested (1736 of 2028) PASS: lldb-api :: lang/c/strings/TestCStrings.py (1737 of 2028) PASS: lldb-unit :: Utility/./UtilityTests/StreamTest.PutBytesAsRawHex8ToBigEndian (1738 of 2028) PASS: lldb-api :: macosx/thread-names/TestInterruptThreadNames.py (1739 of 2028) PASS: lldb-api :: commands/expression/context-object/TestContextObject.py (1740 of 2028) PASS: lldb-api :: commands/expression/options/TestExprOptions.py (1741 of 2028) PASS: lldb-api :: tools/lldb-vscode/variables/TestVSCode_variables.py (1742 of 2028) PASS: lldb-api :: functionalities/thread/concurrent_events/TestConcurrentWatchBreak.py (1743 of 2028) PASS: lldb-api :: functionalities/data-formatter/parray/TestPrintArray.py (1744 of 2028) FAIL: lldb-api :: commands/expression/diagnostics/TestExprDiagnostics.py (1745 of 2028) ******************** TEST 'lldb-api :: commands/expression/diagnostics/TestExprDiagnostics.py' FAILED ******************** Script: -- /Users/buildslave/jenkins/workspace/lldb-cmake-sanitized/lldb-build/lldb-test-build.noindex/copied-system-python /Users/buildslave/jenkins/workspace/lldb-cmake-sanitized/llvm-project/lldb/test/API/dotest.py --arch x86_64 -s /Users/buildslave/jenkins/workspace/lldb-cmake-sanitized/lldb-build/lldb-test-traces -S nm -u CXXFLAGS -u CFLAGS --codesign-identity lldb_codesign --server /Users/buildslave/jenkins/workspace/lldb-cmake-sanitized/lldb-build/./bin/debugserver --arch x86_64 --build-dir /Users/buildslave/jenkins/workspace/lldb-cmake-sanitized/lldb-build/lldb-test-build.noindex -s=/Users/buildslave/jenkins/workspace/lldb-cmake-sanitized/test/logs -t --env TERM=vt100 --env LLVM_LIBS_DIR=/Users/buildslave/jenkins/workspace/lldb-cmake-sanitized/lldb-build/./lib --inferior-env ASAN_OPTIONS=detect_stack_use_after_return=1 --inferior-env DYLD_INSERT_LIBRARIES=/Users/buildslave/jenkins/workspace/lldb-cmake-sanitized/host-compiler/lib/clang/11.0.0/lib/darwin/libclang_rt.asan_osx_dynamic.dylib --build-dir /Users/buildslave/jenkins/workspace/lldb-cmake-sanitized/lldb-build/lldb-test-build.noindex --lldb-module-cache-dir /Users/buildslave/jenkins/workspace/lldb-cmake-sanitized/lldb-build/lldb-test-build.noindex/module-cache-lldb/lldb-api --clang-module-cache-dir /Users/buildslave/jenkins/workspace/lldb-cmake-sanitized/lldb-build/lldb-test-build.noindex/module-cache-clang/lldb-api --executable /Users/buildslave/jenkins/workspace/lldb-cmake-sanitized/lldb-build/./bin/lldb --compiler /Users/buildslave/jenkins/workspace/lldb-cmake-sanitized/lldb-build/./bin/clang --dsymutil /Users/buildslave/jenkins/workspace/lldb-cmake-sanitized/lldb-build/./bin/dsymutil --filecheck /Users/buildslave/jenkins/workspace/lldb-cmake-sanitized/lldb-build/./bin/FileCheck --lldb-libs-dir /Users/buildslave/jenkins/workspace/lldb-cmake-sanitized/lldb-build/./lib /Users/buildslave/jenkins/workspace/lldb-cmake-sanitized/llvm-project/lldb/test/API/commands/expression/diagnostics -p TestExprDiagnostics.py -- Exit Code: -6

Hide Details

Command Output (stdout): -- lldb version 11.0.99 clang revision ec25a71eb7fc72440149784951d62453301cc960 llvm revision ec25a71eb7fc72440149784951d62453301cc960

Hide Details

-- Command Output (stderr): -- Assertion failed: (tokenKind == tok::kw___bridge_retain), function ParseParenExpression, file /Users/buildslave/jenkins/workspace/lldb-cmake-sanitized/llvm-project/clang/lib/Parse/ParseExpr.cpp, line 2804.

Hide Details

--

Hide Details

******************** PASS: lldb-unit :: Symbol/./SymbolTests/TestTypeSystemClang.TestRecordHasFields (1746 of 2028) PASS: lldb-api :: commands/expression/dollar-in-variable/TestDollarInVariable.py (1747 of 2028) PASS: lldb-api :: functionalities/wrong_commands/TestWrongCommands.py (1748 of 2028) PASS: lldb-unit :: Process/gdb-remote/./ProcessGdbRemoteTests/GDBRemoteCommunicationClientTest.SendStartTracePacket (1749 of 2028) PASS: lldb-unit :: Utility/./UtilityTests/ArgsTest.TestTrailingBackslash (1750 of 2028) PASS: lldb-unit :: Utility/./UtilityTests/FileSpecTest.Yaml (1751 of 2028) PASS: lldb-shell :: SymbolFile/DWARF/debug_loc-aslr.s (1752 of 2028) PASS: lldb-unit :: UnwindAssembly/x86/./UnwindAssemblyx86Tests/Testx86AssemblyInspectionEngine.TestReturnDetect (1753 of 2028) PASS: lldb-api :: functionalities/thread/exit_during_break/TestExitDuringBreak.py (1754 of 2028) PASS: lldb-api :: lang/objc/modules-inline-functions/TestModulesInlineFunctions.py (1755 of 2028) PASS: lldb-api :: lang/cpp/chained-calls/TestCppChainedCalls.py (1756 of 2028) PASS: lldb-unit :: Target/./TargetTests/ExecutionContextTest.GetByteOrderTarget (1757 of 2028) PASS: lldb-api :: commands/expression/vector_of_enums/TestVectorOfEnums.py (1758 of 2028) UNSUPPORTED: lldb-shell :: ScriptInterpreter/Lua/lua.test (1759 of 2028) PASS: lldb-api :: lang/objc/single-entry-dictionary/TestObjCSingleEntryDictionary.py (1760 of 2028) PASS: lldb-unit :: Utility/./UtilityTests/LogChannelTest.EnableOptions (1761 of 2028) PASS: lldb-api :: functionalities/tail_call_frames/unambiguous_sequence/TestUnambiguousTailCalls.py (1762 of 2028) PASS: lldb-api :: lang/cpp/frame-var-anon-unions/TestFrameVariableAnonymousUnions.py (1763 of 2028) PASS: lldb-api :: commands/process/launch/TestProcessLaunch.py (1764 of 2028) PASS: lldb-api :: macosx/find-dsym/deep-bundle/TestDeepBundle.py (1765 of 2028) UNSUPPORTED: lldb-shell :: SymbolFile/PDB/function-nested-block.test (1766 of 2028) PASS: lldb-shell :: Settings/TestLineMarkerColor.test (1767 of 2028) PASS: lldb-unit :: Host/./HostTests/FileSystemTest.GetByteSize (1768 of 2028) PASS: lldb-unit :: Core/./LLDBCoreTests/RichManglingContextTest.IPDRealloc (1769 of 2028) PASS: lldb-shell :: ObjectFile/ELF/basic-info.yaml (1770 of 2028) PASS: lldb-unit :: Utility/./UtilityTests/StreamTest.ShiftOperatorStrings (1771 of 2028) PASS: lldb-api :: lang/c/enum_types/TestEnumTypes.py (1772 of 2028) UNSUPPORTED: lldb-api :: commands/gui/basic/TestGuiBasic.py (1773 of 2028) PASS: lldb-unit :: SymbolFile/DWARF/./SymbolFileDWARFTests/SymbolFileDWARFTests.TestAbbrevInvalidNULLTag (1774 of 2028) PASS: lldb-api :: tools/lldb-vscode/attach/TestVSCode_attach.py (1775 of 2028) PASS: lldb-unit :: UnwindAssembly/x86/./UnwindAssemblyx86Tests/Testx86AssemblyInspectionEngine.TestSpArithx86_64Augmented (1776 of 2028) PASS: lldb-api :: lang/cpp/template/TestTemplateArgs.py (1777 of 2028) PASS: lldb-unit :: ScriptInterpreter/Python/./ScriptInterpreterPythonTests/PythonDataObjectsTest.TestPythonCallableCheck (1778 of 2028) PASS: lldb-shell :: Driver/TestPositionalArgs.test (1779 of 2028) PASS: lldb-shell :: Quit/TestQuitExitCode30.test (1780 of 2028) PASS: lldb-shell :: ObjectFile/PECOFF/section-types.yaml (1781 of 2028) UNSUPPORTED: lldb-shell :: Unwind/unwind-plan-dwarf-dump.test (1782 of 2028) PASS: lldb-api :: commands/log/basic/TestLogging.py (1783 of 2028) PASS: lldb-api :: lang/cpp/breakpoint-commands/TestCPPBreakpointCommands.py (1784 of 2028) PASS: lldb-unit :: Utility/./UtilityTests/StringLexerTest.AdvanceIf (1785 of 2028) PASS: lldb-unit :: Host/./HostTests/SocketTest.DomainGetConnectURI (1786 of 2028) PASS: lldb-unit :: Utility/./UtilityTests/RangeDataVector.FindEntryThatContains_Overlap (1787 of 2028) PASS: lldb-api :: commands/expression/dont_allow_jit/TestAllowJIT.py (1788 of 2028) PASS: lldb-shell :: SymbolFile/NativePDB/ast-functions.cpp (1789 of 2028) PASS: lldb-unit :: Expression/./ExpressionTests/ClangHostTest.ComputeClangResourceDirectory (1790 of 2028) PASS: lldb-api :: macosx/DBGSourcePathRemapping/TestDSYMSourcePathRemapping.py (1791 of 2028) PASS: lldb-unit :: Utility/./UtilityTests/StringLexerTest.GetUnlexed (1792 of 2028) PASS: lldb-unit :: Host/./HostTests/FileSystemTest.Readable (1793 of 2028) PASS: lldb-unit :: Utility/./UtilityTests/StringExtractorTest.GetHexU8_Underflow_NoEof (1794 of 2028) PASS: lldb-api :: functionalities/show_location/TestShowLocationDwarf5.py (1795 of 2028) PASS: lldb-api :: commands/platform/process/list/TestProcessList.py (1796 of 2028) PASS: lldb-unit :: UnwindAssembly/x86/./UnwindAssemblyx86Tests/Testx86AssemblyInspectionEngine.TestPushR12 (1797 of 2028) PASS: lldb-api :: commands/watchpoints/hello_watchpoint/TestMyFirstWatchpoint.py (1798 of 2028) PASS: lldb-api :: types/TestLongTypes.py (1799 of 2028) PASS: lldb-api :: lang/c/anonymous/TestAnonymous.py (1800 of 2028) PASS: lldb-api :: commands/expression/pr35310/TestExprsBug35310.py (1801 of 2028) PASS: lldb-api :: lang/cpp/stl/TestSTL.py (1802 of 2028) PASS: lldb-unit :: Process/gdb-remote/./ProcessGdbRemoteTests/GDBRemoteCommunicationClientTest.SendSignalsToIgnore (1803 of 2028) PASS: lldb-api :: commands/expression/scoped_enums/TestScopedEnumType.py (1804 of 2028) PASS: lldb-api :: commands/expression/anonymous-struct/TestCallUserAnonTypedef.py (1805 of 2028) PASS: lldb-api :: functionalities/data-formatter/cstring-utf8-summary/TestCstringUnicode.py (1806 of 2028) PASS: lldb-unit :: Host/./HostTests/NativeProcessProtocolTest.ReadCStringFromMemory_CrossPageBoundary (1807 of 2028) PASS: lldb-unit :: Process/minidump/./LLDBMinidumpTests/MinidumpParserTest.FindMemoryRangeWithFullMemoryMinidump (1808 of 2028) PASS: lldb-api :: lang/c/global_variables/TestGlobalVariables.py (1809 of 2028) PASS: lldb-unit :: ScriptInterpreter/Python/./ScriptInterpreterPythonTests/PythonDataObjectsTest.TestRun (1810 of 2028) PASS: lldb-unit :: Utility/./UtilityTests/Flags.AnyClear (1811 of 2028) PASS: lldb-unit :: Process/gdb-remote/./ProcessGdbRemoteTests/GDBRemoteCommunicationServerTest.SendErrorResponse_ErrorList (1812 of 2028) PASS: lldb-unit :: ScriptInterpreter/Python/./ScriptInterpreterPythonTests/PythonDataObjectsTest.TestExtractingUInt64ThroughStructuredData (1813 of 2028) PASS: lldb-api :: functionalities/data-formatter/data-formatter-python-synth/TestDataFormatterPythonSynth.py (1814 of 2028) PASS: lldb-unit :: Symbol/./SymbolTests/PostfixExpression.ParseFPOProgram (1815 of 2028) UNSUPPORTED: lldb-api :: python_api/disassemble-raw-data/TestDisassemble_VST1_64.py (1816 of 2028) PASS: lldb-unit :: Utility/./UtilityTests/ConstStringTest.CompareStringRef (1817 of 2028) PASS: lldb-api :: functionalities/breakpoint/breakpoint_command/TestBreakpointCommandsFromPython.py (1818 of 2028) PASS: lldb-unit :: UnwindAssembly/x86/./UnwindAssemblyx86Tests/Testx86AssemblyInspectionEngine.TestPushRBPWithREX (1819 of 2028) PASS: lldb-api :: commands/expression/import-std-module/deque-dbg-info-content/TestDbgInfoContentDequeFromStdModule.py (1820 of 2028) PASS: lldb-unit :: Core/./LLDBCoreTests/RichManglingContextTest.FromCxxMethodName (1821 of 2028) PASS: lldb-unit :: Symbol/./SymbolTests/LineEntryTest.GetSameLineContiguousAddressRangeOneInline (1822 of 2028) PASS: lldb-unit :: Utility/./UtilityTests/FileSpecTest.EqualSeparator (1823 of 2028) PASS: lldb-api :: lang/cpp/virtual-functions/TestCppVirtualFunctions.py (1824 of 2028) PASS: lldb-api :: lang/cpp/dynamic-value-same-basename/TestDynamicValueSameBase.py (1825 of 2028) PASS: lldb-unit :: Utility/./UtilityTests/StreamTest.PutCStringWithStringRef (1826 of 2028) PASS: lldb-unit :: Symbol/./SymbolTests/TestTypeSystemClang.TemplateArguments (1827 of 2028) PASS: lldb-unit :: Host/./HostTests/NativeProcessProtocolTest.SetBreakpoint (1828 of 2028) PASS: lldb-unit :: Language/Highlighting/./HighlighterTests/HighlighterTest.ClangCursorPosInOtherToken (1829 of 2028) PASS: lldb-unit :: UnwindAssembly/x86/./UnwindAssemblyx86Tests/Testx86AssemblyInspectionEngine.TestPushECX (1830 of 2028) PASS: lldb-api :: commands/expression/codegen-crash-typedefdecl-not-in_declcontext/TestCodegenCrashTypedefDeclNotInDeclContext.py (1831 of 2028) PASS: lldb-unit :: Utility/./UtilityTests/StructuredDataTest.ParseJSONFromFile (1832 of 2028) PASS: lldb-unit :: Utility/./UtilityTests/ArgsTest.Yaml (1833 of 2028) FAIL: lldb-api :: lang/objc/foundation/TestRuntimeTypes.py (1834 of 2028) ******************** TEST 'lldb-api :: lang/objc/foundation/TestRuntimeTypes.py' FAILED ******************** Script: -- /Users/buildslave/jenkins/workspace/lldb-cmake-sanitized/lldb-build/lldb-test-build.noindex/copied-system-python /Users/buildslave/jenkins/workspace/lldb-cmake-sanitized/llvm-project/lldb/test/API/dotest.py --arch x86_64 -s /Users/buildslave/jenkins/workspace/lldb-cmake-sanitized/lldb-build/lldb-test-traces -S nm -u CXXFLAGS -u CFLAGS --codesign-identity lldb_codesign --server /Users/buildslave/jenkins/workspace/lldb-cmake-sanitized/lldb-build/./bin/debugserver --arch x86_64 --build-dir /Users/buildslave/jenkins/workspace/lldb-cmake-sanitized/lldb-build/lldb-test-build.noindex -s=/Users/buildslave/jenkins/workspace/lldb-cmake-sanitized/test/logs -t --env TERM=vt100 --env LLVM_LIBS_DIR=/Users/buildslave/jenkins/workspace/lldb-cmake-sanitized/lldb-build/./lib --inferior-env ASAN_OPTIONS=detect_stack_use_after_return=1 --inferior-env DYLD_INSERT_LIBRARIES=/Users/buildslave/jenkins/workspace/lldb-cmake-sanitized/host-compiler/lib/clang/11.0.0/lib/darwin/libclang_rt.asan_osx_dynamic.dylib --build-dir /Users/buildslave/jenkins/workspace/lldb-cmake-sanitized/lldb-build/lldb-test-build.noindex --lldb-module-cache-dir /Users/buildslave/jenkins/workspace/lldb-cmake-sanitized/lldb-build/lldb-test-build.noindex/module-cache-lldb/lldb-api --clang-module-cache-dir /Users/buildslave/jenkins/workspace/lldb-cmake-sanitized/lldb-build/lldb-test-build.noindex/module-cache-clang/lldb-api --executable /Users/buildslave/jenkins/workspace/lldb-cmake-sanitized/lldb-build/./bin/lldb --compiler /Users/buildslave/jenkins/workspace/lldb-cmake-sanitized/lldb-build/./bin/clang --dsymutil /Users/buildslave/jenkins/workspace/lldb-cmake-sanitized/lldb-build/./bin/dsymutil --filecheck /Users/buildslave/jenkins/workspace/lldb-cmake-sanitized/lldb-build/./bin/FileCheck --lldb-libs-dir /Users/buildslave/jenkins/workspace/lldb-cmake-sanitized/lldb-build/./lib /Users/buildslave/jenkins/workspace/lldb-cmake-sanitized/llvm-project/lldb/test/API/lang/objc/foundation -p TestRuntimeTypes.py -- Exit Code: -6

Hide Details

Command Output (stdout): -- lldb version 11.0.99 clang revision ec25a71eb7fc72440149784951d62453301cc960 llvm revision ec25a71eb7fc72440149784951d62453301cc960

Hide Details

-- Command Output (stderr): -- Assertion failed: (tokenKind == tok::kw___bridge_retain), function ParseParenExpression, file /Users/buildslave/jenkins/workspace/lldb-cmake-sanitized/llvm-project/clang/lib/Parse/ParseExpr.cpp, line 2804.

Hide Details

--

Hide Details

******************** PASS: lldb-shell :: SymbolFile/DWARF/dwo-type-in-main-file.s (1835 of 2028) PASS: lldb-unit :: UnwindAssembly/x86/./UnwindAssemblyx86Tests/Testx86AssemblyInspectionEngine.Test32bitFramelessSmallStackFrame (1836 of 2028) PASS: lldb-unit :: Interpreter/./InterpreterTests/CompletionTest.DirCompletionUsername (1837 of 2028) UNSUPPORTED: lldb-shell :: Watchpoint/netbsd-nouserdbregs.test (1838 of 2028) PASS: lldb-unit :: Utility/./UtilityTests/ProcessInstanceInfo.DumpTable_invalidUID (1839 of 2028) PASS: lldb-unit :: Utility/./UtilityTests/FileSpecTest.Equal (1840 of 2028) PASS: lldb-unit :: Utility/./UtilityTests/StringExtractorTest.GetHexU8_Underflow2 (1841 of 2028) PASS: lldb-api :: functionalities/stats_api/TestStatisticsAPI.py (1842 of 2028) PASS: lldb-api :: commands/expression/import-std-module/basic/TestImportStdModule.py (1843 of 2028) PASS: lldb-unit :: Utility/./UtilityTests/ArchSpecTest.YAML (1844 of 2028) PASS: lldb-api :: commands/expression/ir-interpreter/TestIRInterpreter.py (1845 of 2028) UNSUPPORTED: lldb-shell :: ObjectFile/ELF/minidebuginfo-set-and-hit-breakpoint.test (1846 of 2028) PASS: lldb-shell :: SymbolFile/DWARF/find-basic-type.cpp (1847 of 2028) PASS: lldb-unit :: ObjectFile/Breakpad/./ObjectFileBreakpadTests/StackCFIRecord.parse (1848 of 2028) PASS: lldb-api :: lang/objc/rdar-10967107/TestRdar10967107.py (1849 of 2028) PASS: lldb-unit :: Language/Highlighting/./HighlighterTests/HighlighterTest.ClangSquareBrackets (1850 of 2028) PASS: lldb-unit :: Utility/./UtilityTests/StreamTest.PutStringAsRawHex8 (1851 of 2028) UNSUPPORTED: lldb-api :: commands/watchpoints/multi_watchpoint_slots/TestWatchpointMultipleSlots.py (1852 of 2028) PASS: lldb-shell :: SymbolFile/DWARF/find-method.cpp (1853 of 2028) PASS: lldb-unit :: ObjectFile/PECOFF/./ObjectFilePECOFFTests/PECallFrameInfoTest.Frame_reg_eh (1854 of 2028) PASS: lldb-unit :: Target/./TargetTests/ModuleCacheTest.GetAndPutUuidExists (1855 of 2028) PASS: lldb-unit :: Utility/./UtilityTests/RegularExpression.Match (1856 of 2028) UNSUPPORTED: lldb-api :: functionalities/thread/concurrent_events/TestConcurrentManySignals.py (1857 of 2028) UNSUPPORTED: lldb-api :: iohandler/completion/TestIOHandlerCompletion.py (1858 of 2028) PASS: lldb-unit :: Host/./HostTests/HostInfoTest.GetHostname (1859 of 2028) UNSUPPORTED: lldb-api :: functionalities/signal/handle-segv/TestHandleSegv.py (1860 of 2028) UNSUPPORTED: lldb-shell :: Register/arm-fp-read.test (1861 of 2028) PASS: lldb-shell :: Quit/TestQuitExitCode0.test (1862 of 2028) PASS: lldb-api :: lang/cpp/global_operators/TestCppGlobalOperators.py (1863 of 2028) PASS: lldb-shell :: SymbolFile/Breakpad/line-table-edgecases.test (1864 of 2028) PASS: lldb-api :: commands/breakpoint/command/list/TestBreakpointCommandList.py (1865 of 2028) PASS: lldb-unit :: Utility/./UtilityTests/SerializationRountripTest.SerializeDeserializePodPointers (1866 of 2028) PASS: lldb-unit :: Utility/./UtilityTests/DataExtractorTest.GetCStr (1867 of 2028) PASS: lldb-api :: commands/expression/ignore-artificial-constructors/TestIgnoreArtificialConstructors.py (1868 of 2028) PASS: lldb-unit :: Symbol/./SymbolTests/DWARFCallFrameInfoTest.Basic_dwarf3 (1869 of 2028) PASS: lldb-unit :: Utility/./UtilityTests/VMRange.Reset (1870 of 2028) PASS: lldb-unit :: ScriptInterpreter/Python/./ScriptInterpreterPythonTests/PythonDataObjectsTest.TestPythonStringToStructuredString (1871 of 2028) PASS: lldb-api :: commands/help/TestHelp.py (1872 of 2028) PASS: lldb-unit :: Expression/./ExpressionTests/CppModuleConfigurationTest.UnknownLibCppFile (1873 of 2028) PASS: lldb-api :: lang/objc/modules-compile-error/TestModulesCompileError.py (1874 of 2028) PASS: lldb-shell :: ObjectFile/ELF/section-permissions.yaml (1875 of 2028) UNSUPPORTED: lldb-api :: benchmarks/expression/TestExpressionCmd.py (1876 of 2028) PASS: lldb-api :: functionalities/plugins/python_os_plugin/TestPythonOSPlugin.py (1877 of 2028) PASS: lldb-api :: functionalities/memory/read/TestMemoryRead.py (1878 of 2028) PASS: lldb-shell :: SymbolFile/Breakpad/unwind-via-stack-win.test (1879 of 2028) PASS: lldb-unit :: Utility/./UtilityTests/BroadcasterTest.EventTypeHasListeners (1880 of 2028) PASS: lldb-api :: lang/cpp/gmodules-templates/TestGModules.py (1881 of 2028) PASS: lldb-api :: functionalities/tail_call_frames/disambiguate_call_site/TestDisambiguateCallSite.py (1882 of 2028) UNSUPPORTED: lldb-api :: functionalities/tsan/thread_numbers/TestTsanThreadNumbers.py (1883 of 2028) PASS: lldb-api :: lang/objc/ivar-IMP/TestObjCiVarIMP.py (1884 of 2028) PASS: lldb-shell :: SymbolFile/DWARF/dwarf5-index-is-used.cpp (1885 of 2028) PASS: lldb-shell :: Reproducer/Modules/TestModuleCXX.test (1886 of 2028) PASS: lldb-unit :: Core/./LLDBCoreTests/UniqueCStringMap.NoDefaultConstructor (1887 of 2028) PASS: lldb-unit :: Utility/./UtilityTests/StreamTest.AddressNoSuffix (1888 of 2028) PASS: lldb-api :: lang/objc/real-definition/TestRealDefinition.py (1889 of 2028) PASS: lldb-api :: functionalities/data-formatter/data-formatter-caching/TestDataFormatterCaching.py (1890 of 2028) PASS: lldb-shell :: Reproducer/TestCaptureEnvOverride.test (1891 of 2028) PASS: lldb-api :: commands/expression/xvalue/TestXValuePrinting.py (1892 of 2028) UNSUPPORTED: lldb-api :: functionalities/asan/TestMemoryHistory.py (1893 of 2028) FAIL: lldb-api :: lang/objc/foundation/TestObjCMethods.py (1894 of 2028) ******************** TEST 'lldb-api :: lang/objc/foundation/TestObjCMethods.py' FAILED ******************** Script: -- /Users/buildslave/jenkins/workspace/lldb-cmake-sanitized/lldb-build/lldb-test-build.noindex/copied-system-python /Users/buildslave/jenkins/workspace/lldb-cmake-sanitized/llvm-project/lldb/test/API/dotest.py --arch x86_64 -s /Users/buildslave/jenkins/workspace/lldb-cmake-sanitized/lldb-build/lldb-test-traces -S nm -u CXXFLAGS -u CFLAGS --codesign-identity lldb_codesign --server /Users/buildslave/jenkins/workspace/lldb-cmake-sanitized/lldb-build/./bin/debugserver --arch x86_64 --build-dir /Users/buildslave/jenkins/workspace/lldb-cmake-sanitized/lldb-build/lldb-test-build.noindex -s=/Users/buildslave/jenkins/workspace/lldb-cmake-sanitized/test/logs -t --env TERM=vt100 --env LLVM_LIBS_DIR=/Users/buildslave/jenkins/workspace/lldb-cmake-sanitized/lldb-build/./lib --inferior-env ASAN_OPTIONS=detect_stack_use_after_return=1 --inferior-env DYLD_INSERT_LIBRARIES=/Users/buildslave/jenkins/workspace/lldb-cmake-sanitized/host-compiler/lib/clang/11.0.0/lib/darwin/libclang_rt.asan_osx_dynamic.dylib --build-dir /Users/buildslave/jenkins/workspace/lldb-cmake-sanitized/lldb-build/lldb-test-build.noindex --lldb-module-cache-dir /Users/buildslave/jenkins/workspace/lldb-cmake-sanitized/lldb-build/lldb-test-build.noindex/module-cache-lldb/lldb-api --clang-module-cache-dir /Users/buildslave/jenkins/workspace/lldb-cmake-sanitized/lldb-build/lldb-test-build.noindex/module-cache-clang/lldb-api --executable /Users/buildslave/jenkins/workspace/lldb-cmake-sanitized/lldb-build/./bin/lldb --compiler /Users/buildslave/jenkins/workspace/lldb-cmake-sanitized/lldb-build/./bin/clang --dsymutil /Users/buildslave/jenkins/workspace/lldb-cmake-sanitized/lldb-build/./bin/dsymutil --filecheck /Users/buildslave/jenkins/workspace/lldb-cmake-sanitized/lldb-build/./bin/FileCheck --lldb-libs-dir /Users/buildslave/jenkins/workspace/lldb-cmake-sanitized/lldb-build/./lib /Users/buildslave/jenkins/workspace/lldb-cmake-sanitized/llvm-project/lldb/test/API/lang/objc/foundation -p TestObjCMethods.py -- Exit Code: -6

Hide Details

Command Output (stdout): -- lldb version 11.0.99 clang revision ec25a71eb7fc72440149784951d62453301cc960 llvm revision ec25a71eb7fc72440149784951d62453301cc960

Hide Details

-- Command Output (stderr): --

Hide Details

Session logs for test failures/errors/unexpected successes will go into directory '/Users/buildslave/jenkins/workspace/lldb-cmake-sanitized/test/logs' Command invoked: /Users/buildslave/jenkins/workspace/lldb-cmake-sanitized/llvm-project/lldb/test/API/dotest.py --arch x86_64 -s /Users/buildslave/jenkins/workspace/lldb-cmake-sanitized/lldb-build/lldb-test-traces -S nm -u CXXFLAGS -u CFLAGS --codesign-identity lldb_codesign --server /Users/buildslave/jenkins/workspace/lldb-cmake-sanitized/lldb-build/./bin/debugserver --arch x86_64 --build-dir /Users/buildslave/jenkins/workspace/lldb-cmake-sanitized/lldb-build/lldb-test-build.noindex -s=/Users/buildslave/jenkins/workspace/lldb-cmake-sanitized/test/logs -t --env TERM=vt100 --env LLVM_LIBS_DIR=/Users/buildslave/jenkins/workspace/lldb-cmake-sanitized/lldb-build/./lib --inferior-env ASAN_OPTIONS=detect_stack_use_after_return=1 --inferior-env DYLD_INSERT_LIBRARIES=/Users/buildslave/jenkins/workspace/lldb-cmake-sanitized/host-compiler/lib/clang/11.0.0/lib/darwin/libclang_rt.asan_osx_dynamic.dylib --build-dir /Users/buildslave/jenkins/workspace/lldb-cmake-sanitized/lldb-build/lldb-test-build.noindex --lldb-module-cache-dir /Users/buildslave/jenkins/workspace/lldb-cmake-sanitized/lldb-build/lldb-test-build.noindex/module-cache-lldb/lldb-api --clang-module-cache-dir /Users/buildslave/jenkins/workspace/lldb-cmake-sanitized/lldb-build/lldb-test-build.noindex/module-cache-clang/lldb-api --executable /Users/buildslave/jenkins/workspace/lldb-cmake-sanitized/lldb-build/./bin/lldb --compiler /Users/buildslave/jenkins/workspace/lldb-cmake-sanitized/lldb-build/./bin/clang --dsymutil /Users/buildslave/jenkins/workspace/lldb-cmake-sanitized/lldb-build/./bin/dsymutil --filecheck /Users/buildslave/jenkins/workspace/lldb-cmake-sanitized/lldb-build/./bin/FileCheck --lldb-libs-dir /Users/buildslave/jenkins/workspace/lldb-cmake-sanitized/lldb-build/./lib /Users/buildslave/jenkins/workspace/lldb-cmake-sanitized/llvm-project/lldb/test/API/lang/objc/foundation -p TestObjCMethods.py Change dir to: /Users/buildslave/jenkins/workspace/lldb-cmake-sanitized/llvm-project/lldb/test/API/lang/objc/foundation runCmd: settings clear -all output:

Hide Details

runCmd: settings set symbols.enable-external-lookup false output:

Hide Details

runCmd: settings set target.auto-apply-fixits false output:

Hide Details

runCmd: settings set plugin.process.gdb-remote.packet-timeout 60 output:

Hide Details

runCmd: settings set symbols.clang-modules-cache-path "/Users/buildslave/jenkins/workspace/lldb-cmake-sanitized/lldb-build/lldb-test-build.noindex/module-cache-lldb/lldb-api" output:

Hide Details

runCmd: settings set use-color false output:

Hide Details

runCmd: setting set target.prefer-dynamic-value no-dynamic-values output:

Hide Details

runCmd: settings set target.env-vars ASAN_OPTIONS=detect_stack_use_after_return=1 DYLD_INSERT_LIBRARIES=/Users/buildslave/jenkins/workspace/lldb-cmake-sanitized/host-compiler/lib/clang/11.0.0/lib/darwin/libclang_rt.asan_osx_dynamic.dylib output:

Hide Details

runCmd: file /Users/buildslave/jenkins/workspace/lldb-cmake-sanitized/lldb-build/lldb-test-build.noindex/lang/objc/foundation/TestObjCMethods.test_break_dsym/a.out output: Current executable set to '/Users/buildslave/jenkins/workspace/lldb-cmake-sanitized/lldb-build/lldb-test-build.noindex/lang/objc/foundation/TestObjCMethods.test_break_dsym/a.out' (x86_64).

Hide Details

Hide Details

runCmd: _regexp-break +[NSString stringWithFormat:] output: Breakpoint 1: where = Foundation`+[NSString stringWithFormat:], address = 0x0000000000004708

Hide Details

Hide Details

Expecting pattern: ^Breakpoint (?P<bpno>[0-9]+): (?P<num_locations>[0-9]+) locations\.$ Not matched

Hide Details

Expecting pattern: ^Breakpoint (?P<bpno>[0-9]+): (?P<num_locations>no) locations \(pending\)\. Not matched

Hide Details

Expecting pattern: ^Breakpoint (?P<bpno>[0-9]+): where = (?P<module>.*)`(?P<symbol>[+\-]{0,1}[^+]+)( \+ (?P<offset>[0-9]+)){0,1}( \[inlined\] (?P<inline_symbol>.*)){0,1} at (?P<file>[^:]+):(?P<line_no>[0-9]+)(?P<column>(:[0-9]+)?), address = (?P<address>0x[0-9a-fA-F]+)$ Not matched

Hide Details

Expecting pattern: ^Breakpoint (?P<bpno>[0-9]+): where = (?P<module>.*)`(?P<symbol>.*)( \+ (?P<offset>[0-9]+)){0,1}, address = (?P<address>0x[0-9a-fA-F]+)$ Matched

Hide Details

runCmd: breakpoint set -n "-[MyString initWithNSString:]" output: Breakpoint 2: where = a.out`-[MyString initWithNSString:] + 20 at main.m:23:16, address = 0x00000001000014b4

Hide Details

Hide Details

Expecting pattern: ^Breakpoint (?P<bpno>[0-9]+): (?P<num_locations>[0-9]+) locations\.$ Not matched

Hide Details

Expecting pattern: ^Breakpoint (?P<bpno>[0-9]+): (?P<num_locations>no) locations \(pending\)\. Not matched

Hide Details

Expecting pattern: ^Breakpoint (?P<bpno>[0-9]+): where = (?P<module>.*)`(?P<symbol>[+\-]{0,1}[^+]+)( \+ (?P<offset>[0-9]+)){0,1}( \[inlined\] (?P<inline_symbol>.*)){0,1} at (?P<file>[^:]+):(?P<line_no>[0-9]+)(?P<column>(:[0-9]+)?), address = (?P<address>0x[0-9a-fA-F]+)$ Matched

Hide Details

runCmd: breakpoint set -S "description" --shlib "a.out" output: Breakpoint 3: where = a.out`-[MyString description] + 16 at main.m:43:7, address = 0x00000001000015e0

Hide Details

Hide Details

Expecting pattern: ^Breakpoint (?P<bpno>[0-9]+): (?P<num_locations>[0-9]+) locations\.$ Not matched

Hide Details

Expecting pattern: ^Breakpoint (?P<bpno>[0-9]+): (?P<num_locations>no) locations \(pending\)\. Not matched

Hide Details

Expecting pattern: ^Breakpoint (?P<bpno>[0-9]+): where = (?P<module>.*)`(?P<symbol>[+\-]{0,1}[^+]+)( \+ (?P<offset>[0-9]+)){0,1}( \[inlined\] (?P<inline_symbol>.*)){0,1} at (?P<file>[^:]+):(?P<line_no>[0-9]+)(?P<column>(:[0-9]+)?), address = (?P<address>0x[0-9a-fA-F]+)$ Matched

Hide Details

runCmd: _regexp-break -[NSAutoreleasePool release] output: Breakpoint 4: where = Foundation`-[NSAutoreleasePool release], address = 0x0000000000003cee

Hide Details

Hide Details

Expecting pattern: ^Breakpoint (?P<bpno>[0-9]+): (?P<num_locations>[0-9]+) locations\.$ Not matched

Hide Details

Expecting pattern: ^Breakpoint (?P<bpno>[0-9]+): (?P<num_locations>no) locations \(pending\)\. Not matched

Hide Details

Expecting pattern: ^Breakpoint (?P<bpno>[0-9]+): where = (?P<module>.*)`(?P<symbol>[+\-]{0,1}[^+]+)( \+ (?P<offset>[0-9]+)){0,1}( \[inlined\] (?P<inline_symbol>.*)){0,1} at (?P<file>[^:]+):(?P<line_no>[0-9]+)(?P<column>(:[0-9]+)?), address = (?P<address>0x[0-9a-fA-F]+)$ Not matched

Hide Details

Expecting pattern: ^Breakpoint (?P<bpno>[0-9]+): where = (?P<module>.*)`(?P<symbol>.*)( \+ (?P<offset>[0-9]+)){0,1}, address = (?P<address>0x[0-9a-fA-F]+)$ Matched

Hide Details

runCmd: run output: Process 52681 stopped * thread #1, queue = 'com.apple.main-thread', stop reason = breakpoint 1.1 frame #0: 0x00007fff4e5f1708 Foundation`+[NSString stringWithFormat:] Foundation`+[NSString stringWithFormat:]: -> 0x7fff4e5f1708 <+0>: pushq %rbp 0x7fff4e5f1709 <+1>: movq %rsp, %rbp 0x7fff4e5f170c <+4>: pushq %r15 0x7fff4e5f170e <+6>: pushq %r14

Hide Details

Process 52681 launched: '/Users/buildslave/jenkins/workspace/lldb-cmake-sanitized/lldb-build/lldb-test-build.noindex/lang/objc/foundation/TestObjCMethods.test_break_dsym/a.out' (x86_64)

Hide Details

Hide Details

runCmd: thread backtrace output: * thread #1, queue = 'com.apple.main-thread', stop reason = breakpoint 1.1 * frame #0: 0x00007fff4e5f1708 Foundation`+[NSString stringWithFormat:] frame #1: 0x000000010000179b a.out`Test_NSString(program="/Users/buildslave/jenkins/workspace/lldb-cmake-sanitized/lldb-build/lldb-test-build.noindex/lang/objc/foundation/TestObjCMethods.test_break_dsym/a.out") at main.m:69:21 frame #2: 0x0000000100001b45 a.out`main(argc=1, argv=0x00007ffeefbff4a0) at main.m:132:5 frame #3: 0x00007fff793be085 libdyld.dylib`start + 1

Hide Details

Hide Details

Expecting sub string: Foundation`+[NSString stringWithFormat:] Matched

Hide Details

runCmd: process continue output: Process 52681 resuming Process 52681 stopped * thread #1, queue = 'com.apple.main-thread', stop reason = breakpoint 1.1 frame #0: 0x00007fff4e5f1708 Foundation`+[NSString stringWithFormat:] Foundation`+[NSString stringWithFormat:]: -> 0x7fff4e5f1708 <+0>: pushq %rbp 0x7fff4e5f1709 <+1>: movq %rsp, %rbp 0x7fff4e5f170c <+4>: pushq %r15 0x7fff4e5f170e <+6>: pushq %r14

Hide Details

Hide Details

Hide Details

runCmd: thread backtrace output: * thread #1, queue = 'com.apple.main-thread', stop reason = breakpoint 1.1 * frame #0: 0x00007fff4e5f1708 Foundation`+[NSString stringWithFormat:] frame #1: 0x00000001000018c9 a.out`Test_MyString(program="/Users/buildslave/jenkins/workspace/lldb-cmake-sanitized/lldb-build/lldb-test-build.noindex/lang/objc/foundation/TestObjCMethods.test_break_dsym/a.out") at main.m:94:21 frame #2: 0x0000000100001b54 a.out`main(argc=1, argv=0x00007ffeefbff4a0) at main.m:133:5 frame #3: 0x00007fff793be085 libdyld.dylib`start + 1

Hide Details

Hide Details

Expecting sub string: Foundation`+[NSString stringWithFormat:] Matched

Hide Details

runCmd: process continue output: Process 52681 resuming Process 52681 stopped * thread #1, queue = 'com.apple.main-thread', stop reason = breakpoint 2.1 frame #0: 0x00000001000014b4 a.out`-[MyString initWithNSString:](self=0x0000604000001cd0, _cmd="initWithNSString:", string=@"Hello from '/Users/buildslave/jenkins/workspace/lldb-cmake-sanitized/lldb-build/lldb-test-build.noindex/lang/objc/foundation/TestObjCMethods.test_break_dsym/a.out'") at main.m:23:16 20 21 - (id)initWithNSString:(NSString *)string 22 { -> 23 if (self = [super init]) ^ 24 { 25 str = [NSString stringWithString:string]; 26 date = [NSDate date];

Hide Details

Hide Details

Hide Details

runCmd: thread backtrace output: * thread #1, queue = 'com.apple.main-thread', stop reason = breakpoint 2.1 * frame #0: 0x00000001000014b4 a.out`-[MyString initWithNSString:](self=0x0000604000001cd0, _cmd="initWithNSString:", string=@"Hello from '/Users/buildslave/jenkins/workspace/lldb-cmake-sanitized/lldb-build/lldb-test-build.noindex/lang/objc/foundation/TestObjCMethods.test_break_dsym/a.out'") at main.m:23:16 frame #1: 0x00000001000018f0 a.out`Test_MyString(program="/Users/buildslave/jenkins/workspace/lldb-cmake-sanitized/lldb-build/lldb-test-build.noindex/lang/objc/foundation/TestObjCMethods.test_break_dsym/a.out") at main.m:95:20 frame #2: 0x0000000100001b54 a.out`main(argc=1, argv=0x00007ffeefbff4a0) at main.m:133:5 frame #3: 0x00007fff793be085 libdyld.dylib`start + 1

Hide Details

Hide Details

Expecting sub string: a.out`-[MyString initWithNSString:] Matched

Hide Details

runCmd: process continue output: Process 52681 resuming Process 52681 stopped * thread #1, queue = 'com.apple.main-thread', stop reason = breakpoint 3.1 frame #0: 0x00000001000015e0 a.out`-[MyString description](self=0x0000604000001cd0, _cmd="description") at main.m:43:7 40 { 41 // Set a breakpoint on '-[MyString description]' and test expressions: 42 // expression (char *)sel_getName(_cmd) -> 43 if (self.descriptionPauses) // Break here for description test ^ 44 { 45 printf ("\nAbout to sleep.\n"); 46 usleep(100000);

Hide Details

Hide Details

Hide Details

runCmd: thread backtrace output: * thread #1, queue = 'com.apple.main-thread', stop reason = breakpoint 3.1 * frame #0: 0x00000001000015e0 a.out`-[MyString description](self=0x0000604000001cd0, _cmd="description") at main.m:43:7 frame #1: 0x0000000100001908 a.out`Test_MyString(program="/Users/buildslave/jenkins/workspace/lldb-cmake-sanitized/lldb-build/lldb-test-build.noindex/lang/objc/foundation/TestObjCMethods.test_break_dsym/a.out") at main.m:96:37 frame #2: 0x0000000100001b54 a.out`main(argc=1, argv=0x00007ffeefbff4a0) at main.m:133:5 frame #3: 0x00007fff793be085 libdyld.dylib`start + 1

Hide Details

Hide Details

Expecting sub string: a.out`-[MyString description] Matched

Hide Details

runCmd: process continue output: Process 52681 resuming Process 52681 stopped * thread #1, queue = 'com.apple.main-thread', stop reason = breakpoint 3.1 frame #0: 0x00000001000015e0 a.out`-[MyString description](self=0x0000604000001cd0, _cmd="description") at main.m:43:7 40 { 41 // Set a breakpoint on '-[MyString description]' and test expressions: 42 // expression (char *)sel_getName(_cmd) -> 43 if (self.descriptionPauses) // Break here for description test ^ 44 { 45 printf ("\nAbout to sleep.\n"); 46 usleep(100000);

Hide Details

Hide Details

Hide Details

runCmd: thread backtrace output: * thread #1, queue = 'com.apple.main-thread', stop reason = breakpoint 3.1 * frame #0: 0x00000001000015e0 a.out`-[MyString description](self=0x0000604000001cd0, _cmd="description") at main.m:43:7 frame #1: 0x0000000100001949 a.out`Test_MyString(program="/Users/buildslave/jenkins/workspace/lldb-cmake-sanitized/lldb-build/lldb-test-build.noindex/lang/objc/foundation/TestObjCMethods.test_break_dsym/a.out") at main.m:98:37 frame #2: 0x0000000100001b54 a.out`main(argc=1, argv=0x00007ffeefbff4a0) at main.m:133:5 frame #3: 0x00007fff793be085 libdyld.dylib`start + 1

Hide Details

Hide Details

Expecting sub string: a.out`-[MyString description] Matched

Hide Details

runCmd: process continue output: Process 52681 resuming Process 52681 stopped * thread #1, queue = 'com.apple.main-thread', stop reason = breakpoint 4.1 frame #0: 0x00007fff4e5f0cee Foundation`-[NSAutoreleasePool release] Foundation`-[NSAutoreleasePool release]: -> 0x7fff4e5f0cee <+0>: pushq %rbp 0x7fff4e5f0cef <+1>: movq %rsp, %rbp 0x7fff4e5f0cf2 <+4>: pushq %r15 0x7fff4e5f0cf4 <+6>: pushq %r14

Hide Details

Hide Details

Hide Details

runCmd: thread backtrace output: * thread #1, queue = 'com.apple.main-thread', stop reason = breakpoint 4.1 * frame #0: 0x00007fff4e5f0cee Foundation`-[NSAutoreleasePool release] frame #1: 0x0000000100001ba3 a.out`main(argc=1, argv=0x00007ffeefbff4a0) at main.m:139:5 frame #2: 0x00007fff793be085 libdyld.dylib`start + 1

Hide Details

Hide Details

Expecting sub string: Foundation`-[NSAutoreleasePool release] Matched

Hide Details

<bound method SBProcess.Kill of <lldb.SBProcess; proxy of <Swig Object of type 'lldb::SBProcess *' at 0x10a831cf0> >>: success

Hide Details

PASS: LLDB (/Users/buildslave/jenkins/workspace/lldb-cmake-sanitized/lldb-build/bin/clang-11-x86_64) :: test_break_dsym (TestObjCMethods.FoundationTestCase) runCmd: settings clear -all output:

Hide Details

runCmd: settings set symbols.enable-external-lookup false output:

Hide Details

runCmd: settings set target.auto-apply-fixits false output:

Hide Details

runCmd: settings set plugin.process.gdb-remote.packet-timeout 60 output:

Hide Details

runCmd: settings set symbols.clang-modules-cache-path "/Users/buildslave/jenkins/workspace/lldb-cmake-sanitized/lldb-build/lldb-test-build.noindex/module-cache-lldb/lldb-api" output:

Hide Details

runCmd: settings set use-color false output:

Hide Details

runCmd: setting set target.prefer-dynamic-value no-dynamic-values output:

Hide Details

runCmd: settings set target.env-vars ASAN_OPTIONS=detect_stack_use_after_return=1 DYLD_INSERT_LIBRARIES=/Users/buildslave/jenkins/workspace/lldb-cmake-sanitized/host-compiler/lib/clang/11.0.0/lib/darwin/libclang_rt.asan_osx_dynamic.dylib output:

Hide Details

runCmd: file /Users/buildslave/jenkins/workspace/lldb-cmake-sanitized/lldb-build/lldb-test-build.noindex/lang/objc/foundation/TestObjCMethods.test_break_dwarf/a.out output: Current executable set to '/Users/buildslave/jenkins/workspace/lldb-cmake-sanitized/lldb-build/lldb-test-build.noindex/lang/objc/foundation/TestObjCMethods.test_break_dwarf/a.out' (x86_64).

Hide Details

Hide Details

runCmd: _regexp-break +[NSString stringWithFormat:] output: Breakpoint 1: where = Foundation`+[NSString stringWithFormat:], address = 0x0000000000004708

Hide Details

Hide Details

Expecting pattern: ^Breakpoint (?P<bpno>[0-9]+): (?P<num_locations>[0-9]+) locations\.$ Not matched

Hide Details

Expecting pattern: ^Breakpoint (?P<bpno>[0-9]+): (?P<num_locations>no) locations \(pending\)\. Not matched

Hide Details

Expecting pattern: ^Breakpoint (?P<bpno>[0-9]+): where = (?P<module>.*)`(?P<symbol>[+\-]{0,1}[^+]+)( \+ (?P<offset>[0-9]+)){0,1}( \[inlined\] (?P<inline_symbol>.*)){0,1} at (?P<file>[^:]+):(?P<line_no>[0-9]+)(?P<column>(:[0-9]+)?), address = (?P<address>0x[0-9a-fA-F]+)$ Not matched

Hide Details

Expecting pattern: ^Breakpoint (?P<bpno>[0-9]+): where = (?P<module>.*)`(?P<symbol>.*)( \+ (?P<offset>[0-9]+)){0,1}, address = (?P<address>0x[0-9a-fA-F]+)$ Matched

Hide Details

runCmd: breakpoint set -n "-[MyString initWithNSString:]" output: Breakpoint 2: where = a.out`-[MyString initWithNSString:] + 20 at main.m:23:16, address = 0x00000001000014b4

Hide Details

Hide Details

Expecting pattern: ^Breakpoint (?P<bpno>[0-9]+): (?P<num_locations>[0-9]+) locations\.$ Not matched

Hide Details

Expecting pattern: ^Breakpoint (?P<bpno>[0-9]+): (?P<num_locations>no) locations \(pending\)\. Not matched

Hide Details

Expecting pattern: ^Breakpoint (?P<bpno>[0-9]+): where = (?P<module>.*)`(?P<symbol>[+\-]{0,1}[^+]+)( \+ (?P<offset>[0-9]+)){0,1}( \[inlined\] (?P<inline_symbol>.*)){0,1} at (?P<file>[^:]+):(?P<line_no>[0-9]+)(?P<column>(:[0-9]+)?), address = (?P<address>0x[0-9a-fA-F]+)$ Matched

Hide Details

runCmd: breakpoint set -S "description" --shlib "a.out" output: Breakpoint 3: where = a.out`-[MyString description] + 16 at main.m:43:7, address = 0x00000001000015e0

Hide Details

Hide Details

Expecting pattern: ^Breakpoint (?P<bpno>[0-9]+): (?P<num_locations>[0-9]+) locations\.$ Not matched

Hide Details

Expecting pattern: ^Breakpoint (?P<bpno>[0-9]+): (?P<num_locations>no) locations \(pending\)\. Not matched

Hide Details

Expecting pattern: ^Breakpoint (?P<bpno>[0-9]+): where = (?P<module>.*)`(?P<symbol>[+\-]{0,1}[^+]+)( \+ (?P<offset>[0-9]+)){0,1}( \[inlined\] (?P<inline_symbol>.*)){0,1} at (?P<file>[^:]+):(?P<line_no>[0-9]+)(?P<column>(:[0-9]+)?), address = (?P<address>0x[0-9a-fA-F]+)$ Matched

Hide Details

runCmd: _regexp-break -[NSAutoreleasePool release] output: Breakpoint 4: where = Foundation`-[NSAutoreleasePool release], address = 0x0000000000003cee

Hide Details

Hide Details

Expecting pattern: ^Breakpoint (?P<bpno>[0-9]+): (?P<num_locations>[0-9]+) locations\.$ Not matched

Hide Details

Expecting pattern: ^Breakpoint (?P<bpno>[0-9]+): (?P<num_locations>no) locations \(pending\)\. Not matched

Hide Details

Expecting pattern: ^Breakpoint (?P<bpno>[0-9]+): where = (?P<module>.*)`(?P<symbol>[+\-]{0,1}[^+]+)( \+ (?P<offset>[0-9]+)){0,1}( \[inlined\] (?P<inline_symbol>.*)){0,1} at (?P<file>[^:]+):(?P<line_no>[0-9]+)(?P<column>(:[0-9]+)?), address = (?P<address>0x[0-9a-fA-F]+)$ Not matched

Hide Details

Expecting pattern: ^Breakpoint (?P<bpno>[0-9]+): where = (?P<module>.*)`(?P<symbol>.*)( \+ (?P<offset>[0-9]+)){0,1}, address = (?P<address>0x[0-9a-fA-F]+)$ Matched

Hide Details

runCmd: run output: Process 53342 stopped * thread #1, queue = 'com.apple.main-thread', stop reason = breakpoint 1.1 frame #0: 0x00007fff4e5f1708 Foundation`+[NSString stringWithFormat:] Foundation`+[NSString stringWithFormat:]: -> 0x7fff4e5f1708 <+0>: pushq %rbp 0x7fff4e5f1709 <+1>: movq %rsp, %rbp 0x7fff4e5f170c <+4>: pushq %r15 0x7fff4e5f170e <+6>: pushq %r14

Hide Details

Process 53342 launched: '/Users/buildslave/jenkins/workspace/lldb-cmake-sanitized/lldb-build/lldb-test-build.noindex/lang/objc/foundation/TestObjCMethods.test_break_dwarf/a.out' (x86_64)

Hide Details

Hide Details

runCmd: thread backtrace output: * thread #1, queue = 'com.apple.main-thread', stop reason = breakpoint 1.1 * frame #0: 0x00007fff4e5f1708 Foundation`+[NSString stringWithFormat:] frame #1: 0x000000010000179b a.out`Test_NSString(program="/Users/buildslave/jenkins/workspace/lldb-cmake-sanitized/lldb-build/lldb-test-build.noindex/lang/objc/foundation/TestObjCMethods.test_break_dwarf/a.out") at main.m:69:21 frame #2: 0x0000000100001b45 a.out`main(argc=1, argv=0x00007ffeefbff4a0) at main.m:132:5 frame #3: 0x00007fff793be085 libdyld.dylib`start + 1

Hide Details

Hide Details

Expecting sub string: Foundation`+[NSString stringWithFormat:] Matched

Hide Details

runCmd: process continue output: Process 53342 resuming Process 53342 stopped * thread #1, queue = 'com.apple.main-thread', stop reason = breakpoint 1.1 frame #0: 0x00007fff4e5f1708 Foundation`+[NSString stringWithFormat:] Foundation`+[NSString stringWithFormat:]: -> 0x7fff4e5f1708 <+0>: pushq %rbp 0x7fff4e5f1709 <+1>: movq %rsp, %rbp 0x7fff4e5f170c <+4>: pushq %r15 0x7fff4e5f170e <+6>: pushq %r14

Hide Details

Hide Details

Hide Details

runCmd: thread backtrace output: * thread #1, queue = 'com.apple.main-thread', stop reason = breakpoint 1.1 * frame #0: 0x00007fff4e5f1708 Foundation`+[NSString stringWithFormat:] frame #1: 0x00000001000018c9 a.out`Test_MyString(program="/Users/buildslave/jenkins/workspace/lldb-cmake-sanitized/lldb-build/lldb-test-build.noindex/lang/objc/foundation/TestObjCMethods.test_break_dwarf/a.out") at main.m:94:21 frame #2: 0x0000000100001b54 a.out`main(argc=1, argv=0x00007ffeefbff4a0) at main.m:133:5 frame #3: 0x00007fff793be085 libdyld.dylib`start + 1

Hide Details

Hide Details

Expecting sub string: Foundation`+[NSString stringWithFormat:] Matched

Hide Details

runCmd: process continue output: Process 53342 resuming Process 53342 stopped * thread #1, queue = 'com.apple.main-thread', stop reason = breakpoint 2.1 frame #0: 0x00000001000014b4 a.out`-[MyString initWithNSString:](self=0x0000604000001cd0, _cmd="initWithNSString:", string=@"Hello from '/Users/buildslave/jenkins/workspace/lldb-cmake-sanitized/lldb-build/lldb-test-build.noindex/lang/objc/foundation/TestObjCMethods.test_break_dwarf/a.out'") at main.m:23:16 20 21 - (id)initWithNSString:(NSString *)string 22 { -> 23 if (self = [super init]) ^ 24 { 25 str = [NSString stringWithString:string]; 26 date = [NSDate date];

Hide Details

Hide Details

Hide Details

runCmd: thread backtrace output: * thread #1, queue = 'com.apple.main-thread', stop reason = breakpoint 2.1 * frame #0: 0x00000001000014b4 a.out`-[MyString initWithNSString:](self=0x0000604000001cd0, _cmd="initWithNSString:", string=@"Hello from '/Users/buildslave/jenkins/workspace/lldb-cmake-sanitized/lldb-build/lldb-test-build.noindex/lang/objc/foundation/TestObjCMethods.test_break_dwarf/a.out'") at main.m:23:16 frame #1: 0x00000001000018f0 a.out`Test_MyString(program="/Users/buildslave/jenkins/workspace/lldb-cmake-sanitized/lldb-build/lldb-test-build.noindex/lang/objc/foundation/TestObjCMethods.test_break_dwarf/a.out") at main.m:95:20 frame #2: 0x0000000100001b54 a.out`main(argc=1, argv=0x00007ffeefbff4a0) at main.m:133:5 frame #3: 0x00007fff793be085 libdyld.dylib`start + 1

Hide Details

Hide Details

Expecting sub string: a.out`-[MyString initWithNSString:] Matched

Hide Details

runCmd: process continue output: Process 53342 resuming Process 53342 stopped * thread #1, queue = 'com.apple.main-thread', stop reason = breakpoint 3.1 frame #0: 0x00000001000015e0 a.out`-[MyString description](self=0x0000604000001cd0, _cmd="description") at main.m:43:7 40 { 41 // Set a breakpoint on '-[MyString description]' and test expressions: 42 // expression (char *)sel_getName(_cmd) -> 43 if (self.descriptionPauses) // Break here for description test ^ 44 { 45 printf ("\nAbout to sleep.\n"); 46 usleep(100000);

Hide Details

Hide Details

Hide Details

runCmd: thread backtrace output: * thread #1, queue = 'com.apple.main-thread', stop reason = breakpoint 3.1 * frame #0: 0x00000001000015e0 a.out`-[MyString description](self=0x0000604000001cd0, _cmd="description") at main.m:43:7 frame #1: 0x0000000100001908 a.out`Test_MyString(program="/Users/buildslave/jenkins/workspace/lldb-cmake-sanitized/lldb-build/lldb-test-build.noindex/lang/objc/foundation/TestObjCMethods.test_break_dwarf/a.out") at main.m:96:37 frame #2: 0x0000000100001b54 a.out`main(argc=1, argv=0x00007ffeefbff4a0) at main.m:133:5 frame #3: 0x00007fff793be085 libdyld.dylib`start + 1

Hide Details

Hide Details

Expecting sub string: a.out`-[MyString description] Matched

Hide Details

runCmd: process continue output: Process 53342 resuming Process 53342 stopped * thread #1, queue = 'com.apple.main-thread', stop reason = breakpoint 3.1 frame #0: 0x00000001000015e0 a.out`-[MyString description](self=0x0000604000001cd0, _cmd="description") at main.m:43:7 40 { 41 // Set a breakpoint on '-[MyString description]' and test expressions: 42 // expression (char *)sel_getName(_cmd) -> 43 if (self.descriptionPauses) // Break here for description test ^ 44 { 45 printf ("\nAbout to sleep.\n"); 46 usleep(100000);

Hide Details

Hide Details

Hide Details

runCmd: thread backtrace output: * thread #1, queue = 'com.apple.main-thread', stop reason = breakpoint 3.1 * frame #0: 0x00000001000015e0 a.out`-[MyString description](self=0x0000604000001cd0, _cmd="description") at main.m:43:7 frame #1: 0x0000000100001949 a.out`Test_MyString(program="/Users/buildslave/jenkins/workspace/lldb-cmake-sanitized/lldb-build/lldb-test-build.noindex/lang/objc/foundation/TestObjCMethods.test_break_dwarf/a.out") at main.m:98:37 frame #2: 0x0000000100001b54 a.out`main(argc=1, argv=0x00007ffeefbff4a0) at main.m:133:5 frame #3: 0x00007fff793be085 libdyld.dylib`start + 1

Hide Details

Hide Details

Expecting sub string: a.out`-[MyString description] Matched

Hide Details

runCmd: process continue output: Process 53342 resuming Process 53342 stopped * thread #1, queue = 'com.apple.main-thread', stop reason = breakpoint 4.1 frame #0: 0x00007fff4e5f0cee Foundation`-[NSAutoreleasePool release] Foundation`-[NSAutoreleasePool release]: -> 0x7fff4e5f0cee <+0>: pushq %rbp 0x7fff4e5f0cef <+1>: movq %rsp, %rbp 0x7fff4e5f0cf2 <+4>: pushq %r15 0x7fff4e5f0cf4 <+6>: pushq %r14

Hide Details

Hide Details

Hide Details

runCmd: thread backtrace output: * thread #1, queue = 'com.apple.main-thread', stop reason = breakpoint 4.1 * frame #0: 0x00007fff4e5f0cee Foundation`-[NSAutoreleasePool release] frame #1: 0x0000000100001ba3 a.out`main(argc=1, argv=0x00007ffeefbff4a0) at main.m:139:5 frame #2: 0x00007fff793be085 libdyld.dylib`start + 1

Hide Details

Hide Details

Expecting sub string: Foundation`-[NSAutoreleasePool release] Matched

Hide Details

<bound method SBProcess.Kill of <lldb.SBProcess; proxy of <Swig Object of type 'lldb::SBProcess *' at 0x10a3831e0> >>: success

Hide Details

PASS: LLDB (/Users/buildslave/jenkins/workspace/lldb-cmake-sanitized/lldb-build/bin/clang-11-x86_64) :: test_break_dwarf (TestObjCMethods.FoundationTestCase) UNSUPPORTED: LLDB (/Users/buildslave/jenkins/workspace/lldb-cmake-sanitized/lldb-build/bin/clang-11-x86_64) :: test_break_dwo (TestObjCMethods.FoundationTestCase) (test case does not fall in any category of interest for this run) runCmd: settings clear -all output:

Hide Details

runCmd: settings set symbols.enable-external-lookup false output:

Hide Details

runCmd: settings set target.auto-apply-fixits false output:

Hide Details

runCmd: settings set plugin.process.gdb-remote.packet-timeout 60 output:

Hide Details

runCmd: settings set symbols.clang-modules-cache-path "/Users/buildslave/jenkins/workspace/lldb-cmake-sanitized/lldb-build/lldb-test-build.noindex/module-cache-lldb/lldb-api" output:

Hide Details

runCmd: settings set use-color false output:

Hide Details

runCmd: setting set target.prefer-dynamic-value no-dynamic-values output:

Hide Details

runCmd: settings set target.env-vars ASAN_OPTIONS=detect_stack_use_after_return=1 DYLD_INSERT_LIBRARIES=/Users/buildslave/jenkins/workspace/lldb-cmake-sanitized/host-compiler/lib/clang/11.0.0/lib/darwin/libclang_rt.asan_osx_dynamic.dylib output:

Hide Details

runCmd: file /Users/buildslave/jenkins/workspace/lldb-cmake-sanitized/lldb-build/lldb-test-build.noindex/lang/objc/foundation/TestObjCMethods.test_break_gmodules/a.out output: Current executable set to '/Users/buildslave/jenkins/workspace/lldb-cmake-sanitized/lldb-build/lldb-test-build.noindex/lang/objc/foundation/TestObjCMethods.test_break_gmodules/a.out' (x86_64).

Hide Details

Hide Details

runCmd: _regexp-break +[NSString stringWithFormat:] output: Breakpoint 1: where = Foundation`+[NSString stringWithFormat:], address = 0x0000000000004708

Hide Details

Hide Details

Expecting pattern: ^Breakpoint (?P<bpno>[0-9]+): (?P<num_locations>[0-9]+) locations\.$ Not matched

Hide Details

Expecting pattern: ^Breakpoint (?P<bpno>[0-9]+): (?P<num_locations>no) locations \(pending\)\. Not matched

Hide Details

Expecting pattern: ^Breakpoint (?P<bpno>[0-9]+): where = (?P<module>.*)`(?P<symbol>[+\-]{0,1}[^+]+)( \+ (?P<offset>[0-9]+)){0,1}( \[inlined\] (?P<inline_symbol>.*)){0,1} at (?P<file>[^:]+):(?P<line_no>[0-9]+)(?P<column>(:[0-9]+)?), address = (?P<address>0x[0-9a-fA-F]+)$ Not matched

Hide Details

Expecting pattern: ^Breakpoint (?P<bpno>[0-9]+): where = (?P<module>.*)`(?P<symbol>.*)( \+ (?P<offset>[0-9]+)){0,1}, address = (?P<address>0x[0-9a-fA-F]+)$ Matched

Hide Details

runCmd: breakpoint set -n "-[MyString initWithNSString:]" output: Breakpoint 2: where = a.out`-[MyString initWithNSString:] + 20 at main.m:23:16, address = 0x00000001000014b4

Hide Details

Hide Details

Expecting pattern: ^Breakpoint (?P<bpno>[0-9]+): (?P<num_locations>[0-9]+) locations\.$ Not matched

Hide Details

Expecting pattern: ^Breakpoint (?P<bpno>[0-9]+): (?P<num_locations>no) locations \(pending\)\. Not matched

Hide Details

Expecting pattern: ^Breakpoint (?P<bpno>[0-9]+): where = (?P<module>.*)`(?P<symbol>[+\-]{0,1}[^+]+)( \+ (?P<offset>[0-9]+)){0,1}( \[inlined\] (?P<inline_symbol>.*)){0,1} at (?P<file>[^:]+):(?P<line_no>[0-9]+)(?P<column>(:[0-9]+)?), address = (?P<address>0x[0-9a-fA-F]+)$ Matched

Hide Details

runCmd: breakpoint set -S "description" --shlib "a.out" output: Breakpoint 3: where = a.out`-[MyString description] + 16 at main.m:43:7, address = 0x00000001000015e0

Hide Details

Hide Details

Expecting pattern: ^Breakpoint (?P<bpno>[0-9]+): (?P<num_locations>[0-9]+) locations\.$ Not matched

Hide Details

Expecting pattern: ^Breakpoint (?P<bpno>[0-9]+): (?P<num_locations>no) locations \(pending\)\. Not matched

Hide Details

Expecting pattern: ^Breakpoint (?P<bpno>[0-9]+): where = (?P<module>.*)`(?P<symbol>[+\-]{0,1}[^+]+)( \+ (?P<offset>[0-9]+)){0,1}( \[inlined\] (?P<inline_symbol>.*)){0,1} at (?P<file>[^:]+):(?P<line_no>[0-9]+)(?P<column>(:[0-9]+)?), address = (?P<address>0x[0-9a-fA-F]+)$ Matched

Hide Details

runCmd: _regexp-break -[NSAutoreleasePool release] output: Breakpoint 4: where = Foundation`-[NSAutoreleasePool release], address = 0x0000000000003cee

Hide Details

Hide Details

Expecting pattern: ^Breakpoint (?P<bpno>[0-9]+): (?P<num_locations>[0-9]+) locations\.$ Not matched

Hide Details

Expecting pattern: ^Breakpoint (?P<bpno>[0-9]+): (?P<num_locations>no) locations \(pending\)\. Not matched

Hide Details

Expecting pattern: ^Breakpoint (?P<bpno>[0-9]+): where = (?P<module>.*)`(?P<symbol>[+\-]{0,1}[^+]+)( \+ (?P<offset>[0-9]+)){0,1}( \[inlined\] (?P<inline_symbol>.*)){0,1} at (?P<file>[^:]+):(?P<line_no>[0-9]+)(?P<column>(:[0-9]+)?), address = (?P<address>0x[0-9a-fA-F]+)$ Not matched

Hide Details

Expecting pattern: ^Breakpoint (?P<bpno>[0-9]+): where = (?P<module>.*)`(?P<symbol>.*)( \+ (?P<offset>[0-9]+)){0,1}, address = (?P<address>0x[0-9a-fA-F]+)$ Matched

Hide Details

runCmd: run output: Process 53754 stopped * thread #1, queue = 'com.apple.main-thread', stop reason = breakpoint 1.1 frame #0: 0x00007fff4e5f1708 Foundation`+[NSString stringWithFormat:] Foundation`+[NSString stringWithFormat:]: -> 0x7fff4e5f1708 <+0>: pushq %rbp 0x7fff4e5f1709 <+1>: movq %rsp, %rbp 0x7fff4e5f170c <+4>: pushq %r15 0x7fff4e5f170e <+6>: pushq %r14

Hide Details

Process 53754 launched: '/Users/buildslave/jenkins/workspace/lldb-cmake-sanitized/lldb-build/lldb-test-build.noindex/lang/objc/foundation/TestObjCMethods.test_break_gmodules/a.out' (x86_64)

Hide Details

Hide Details

runCmd: thread backtrace output: * thread #1, queue = 'com.apple.main-thread', stop reason = breakpoint 1.1 * frame #0: 0x00007fff4e5f1708 Foundation`+[NSString stringWithFormat:] frame #1: 0x000000010000179b a.out`Test_NSString(program="/Users/buildslave/jenkins/workspace/lldb-cmake-sanitized/lldb-build/lldb-test-build.noindex/lang/objc/foundation/TestObjCMethods.test_break_gmodules/a.out") at main.m:69:21 frame #2: 0x0000000100001b45 a.out`main(argc=1, argv=0x00007ffeefbff498) at main.m:132:5 frame #3: 0x00007fff793be085 libdyld.dylib`start + 1 frame #4: 0x00007fff793be085 libdyld.dylib`start + 1

Hide Details

Hide Details

Expecting sub string: Foundation`+[NSString stringWithFormat:] Matched

Hide Details

runCmd: process continue output: Process 53754 resuming Process 53754 stopped * thread #1, queue = 'com.apple.main-thread', stop reason = breakpoint 1.1 frame #0: 0x00007fff4e5f1708 Foundation`+[NSString stringWithFormat:] Foundation`+[NSString stringWithFormat:]: -> 0x7fff4e5f1708 <+0>: pushq %rbp 0x7fff4e5f1709 <+1>: movq %rsp, %rbp 0x7fff4e5f170c <+4>: pushq %r15 0x7fff4e5f170e <+6>: pushq %r14

Hide Details

Hide Details

Hide Details

runCmd: thread backtrace output: * thread #1, queue = 'com.apple.main-thread', stop reason = breakpoint 1.1 * frame #0: 0x00007fff4e5f1708 Foundation`+[NSString stringWithFormat:] frame #1: 0x00000001000018c9 a.out`Test_MyString(program="/Users/buildslave/jenkins/workspace/lldb-cmake-sanitized/lldb-build/lldb-test-build.noindex/lang/objc/foundation/TestObjCMethods.test_break_gmodules/a.out") at main.m:94:21 frame #2: 0x0000000100001b54 a.out`main(argc=1, argv=0x00007ffeefbff498) at main.m:133:5 frame #3: 0x00007fff793be085 libdyld.dylib`start + 1 frame #4: 0x00007fff793be085 libdyld.dylib`start + 1

Hide Details

Hide Details

Expecting sub string: Foundation`+[NSString stringWithFormat:] Matched

Hide Details

runCmd: process continue output: Process 53754 resuming Process 53754 stopped * thread #1, queue = 'com.apple.main-thread', stop reason = breakpoint 2.1 frame #0: 0x00000001000014b4 a.out`-[MyString initWithNSString:](self=0x0000604000001cd0, _cmd="initWithNSString:", string=@"Hello from '/Users/buildslave/jenkins/workspace/lldb-cmake-sanitized/lldb-build/lldb-test-build.noindex/lang/objc/foundation/TestObjCMethods.test_break_gmodules/a.out'") at main.m:23:16 20 21 - (id)initWithNSString:(NSString *)string 22 { -> 23 if (self = [super init]) ^ 24 { 25 str = [NSString stringWithString:string]; 26 date = [NSDate date];

Hide Details

Hide Details

Hide Details

runCmd: thread backtrace output: * thread #1, queue = 'com.apple.main-thread', stop reason = breakpoint 2.1 * frame #0: 0x00000001000014b4 a.out`-[MyString initWithNSString:](self=0x0000604000001cd0, _cmd="initWithNSString:", string=@"Hello from '/Users/buildslave/jenkins/workspace/lldb-cmake-sanitized/lldb-build/lldb-test-build.noindex/lang/objc/foundation/TestObjCMethods.test_break_gmodules/a.out'") at main.m:23:16 frame #1: 0x00000001000018f0 a.out`Test_MyString(program="/Users/buildslave/jenkins/workspace/lldb-cmake-sanitized/lldb-build/lldb-test-build.noindex/lang/objc/foundation/TestObjCMethods.test_break_gmodules/a.out") at main.m:95:20 frame #2: 0x0000000100001b54 a.out`main(argc=1, argv=0x00007ffeefbff498) at main.m:133:5 frame #3: 0x00007fff793be085 libdyld.dylib`start + 1 frame #4: 0x00007fff793be085 libdyld.dylib`start + 1

Hide Details

Hide Details

Expecting sub string: a.out`-[MyString initWithNSString:] Matched

Hide Details

runCmd: process continue output: Process 53754 resuming Process 53754 stopped * thread #1, queue = 'com.apple.main-thread', stop reason = breakpoint 3.1 frame #0: 0x00000001000015e0 a.out`-[MyString description](self=0x0000604000001cd0, _cmd="description") at main.m:43:7 40 { 41 // Set a breakpoint on '-[MyString description]' and test expressions: 42 // expression (char *)sel_getName(_cmd) -> 43 if (self.descriptionPauses) // Break here for description test ^ 44 { 45 printf ("\nAbout to sleep.\n"); 46 usleep(100000);

Hide Details

Hide Details

Hide Details

runCmd: thread backtrace output: * thread #1, queue = 'com.apple.main-thread', stop reason = breakpoint 3.1 * frame #0: 0x00000001000015e0 a.out`-[MyString description](self=0x0000604000001cd0, _cmd="description") at main.m:43:7 frame #1: 0x0000000100001908 a.out`Test_MyString(program="/Users/buildslave/jenkins/workspace/lldb-cmake-sanitized/lldb-build/lldb-test-build.noindex/lang/objc/foundation/TestObjCMethods.test_break_gmodules/a.out") at main.m:96:37 frame #2: 0x0000000100001b54 a.out`main(argc=1, argv=0x00007ffeefbff498) at main.m:133:5 frame #3: 0x00007fff793be085 libdyld.dylib`start + 1 frame #4: 0x00007fff793be085 libdyld.dylib`start + 1

Hide Details

Hide Details

Expecting sub string: a.out`-[MyString description] Matched

Hide Details

runCmd: process continue output: Process 53754 resuming Process 53754 stopped * thread #1, queue = 'com.apple.main-thread', stop reason = breakpoint 3.1 frame #0: 0x00000001000015e0 a.out`-[MyString description](self=0x0000604000001cd0, _cmd="description") at main.m:43:7 40 { 41 // Set a breakpoint on '-[MyString description]' and test expressions: 42 // expression (char *)sel_getName(_cmd) -> 43 if (self.descriptionPauses) // Break here for description test ^ 44 { 45 printf ("\nAbout to sleep.\n"); 46 usleep(100000);

Hide Details

Hide Details

Hide Details

runCmd: thread backtrace output: * thread #1, queue = 'com.apple.main-thread', stop reason = breakpoint 3.1 * frame #0: 0x00000001000015e0 a.out`-[MyString description](self=0x0000604000001cd0, _cmd="description") at main.m:43:7 frame #1: 0x0000000100001949 a.out`Test_MyString(program="/Users/buildslave/jenkins/workspace/lldb-cmake-sanitized/lldb-build/lldb-test-build.noindex/lang/objc/foundation/TestObjCMethods.test_break_gmodules/a.out") at main.m:98:37 frame #2: 0x0000000100001b54 a.out`main(argc=1, argv=0x00007ffeefbff498) at main.m:133:5 frame #3: 0x00007fff793be085 libdyld.dylib`start + 1 frame #4: 0x00007fff793be085 libdyld.dylib`start + 1

Hide Details

Hide Details

Expecting sub string: a.out`-[MyString description] Matched

Hide Details

runCmd: process continue output: Process 53754 resuming Process 53754 stopped * thread #1, queue = 'com.apple.main-thread', stop reason = breakpoint 4.1 frame #0: 0x00007fff4e5f0cee Foundation`-[NSAutoreleasePool release] Foundation`-[NSAutoreleasePool release]: -> 0x7fff4e5f0cee <+0>: pushq %rbp 0x7fff4e5f0cef <+1>: movq %rsp, %rbp 0x7fff4e5f0cf2 <+4>: pushq %r15 0x7fff4e5f0cf4 <+6>: pushq %r14

Hide Details

Hide Details

Hide Details

runCmd: thread backtrace output: * thread #1, queue = 'com.apple.main-thread', stop reason = breakpoint 4.1 * frame #0: 0x00007fff4e5f0cee Foundation`-[NSAutoreleasePool release] frame #1: 0x0000000100001ba3 a.out`main(argc=1, argv=0x00007ffeefbff498) at main.m:139:5 frame #2: 0x00007fff793be085 libdyld.dylib`start + 1 frame #3: 0x00007fff793be085 libdyld.dylib`start + 1

Hide Details

Hide Details

Expecting sub string: Foundation`-[NSAutoreleasePool release] Matched

Hide Details

<bound method SBProcess.Kill of <lldb.SBProcess; proxy of <Swig Object of type 'lldb::SBProcess *' at 0x10a370c60> >>: success

Hide Details

PASS: LLDB (/Users/buildslave/jenkins/workspace/lldb-cmake-sanitized/lldb-build/bin/clang-11-x86_64) :: test_break_gmodules (TestObjCMethods.FoundationTestCase) runCmd: settings clear -all output:

Hide Details

runCmd: settings set symbols.enable-external-lookup false output:

Hide Details

runCmd: settings set target.auto-apply-fixits false output:

Hide Details

runCmd: settings set plugin.process.gdb-remote.packet-timeout 60 output:

Hide Details

runCmd: settings set symbols.clang-modules-cache-path "/Users/buildslave/jenkins/workspace/lldb-cmake-sanitized/lldb-build/lldb-test-build.noindex/module-cache-lldb/lldb-api" output:

Hide Details

runCmd: settings set use-color false output:

Hide Details

runCmd: setting set target.prefer-dynamic-value no-dynamic-values output:

Hide Details

runCmd: settings set target.env-vars ASAN_OPTIONS=detect_stack_use_after_return=1 DYLD_INSERT_LIBRARIES=/Users/buildslave/jenkins/workspace/lldb-cmake-sanitized/host-compiler/lib/clang/11.0.0/lib/darwin/libclang_rt.asan_osx_dynamic.dylib output:

Hide Details

runCmd: file /Users/buildslave/jenkins/workspace/lldb-cmake-sanitized/lldb-build/lldb-test-build.noindex/lang/objc/foundation/TestObjCMethods.test_data_type_and_expr_dsym/a.out output: Current executable set to '/Users/buildslave/jenkins/workspace/lldb-cmake-sanitized/lldb-build/lldb-test-build.noindex/lang/objc/foundation/TestObjCMethods.test_data_type_and_expr_dsym/a.out' (x86_64).

Hide Details

Hide Details

runCmd: breakpoint set -n "-[MyString description]" output: Breakpoint 1: where = a.out`-[MyString description] + 16 at main.m:43:7, address = 0x00000001000015e0

Hide Details

Hide Details

Expecting pattern: ^Breakpoint (?P<bpno>[0-9]+): (?P<num_locations>[0-9]+) locations\.$ Not matched

Hide Details

Expecting pattern: ^Breakpoint (?P<bpno>[0-9]+): (?P<num_locations>no) locations \(pending\)\. Not matched

Hide Details

Expecting pattern: ^Breakpoint (?P<bpno>[0-9]+): where = (?P<module>.*)`(?P<symbol>[+\-]{0,1}[^+]+)( \+ (?P<offset>[0-9]+)){0,1}( \[inlined\] (?P<inline_symbol>.*)){0,1} at (?P<file>[^:]+):(?P<line_no>[0-9]+)(?P<column>(:[0-9]+)?), address = (?P<address>0x[0-9a-fA-F]+)$ Matched

Hide Details

runCmd: run output: Process 54357 stopped * thread #1, queue = 'com.apple.main-thread', stop reason = breakpoint 1.1 frame #0: 0x00000001000015e0 a.out`-[MyString description](self=0x0000604000001cd0, _cmd="description") at main.m:43:7 40 { 41 // Set a breakpoint on '-[MyString description]' and test expressions: 42 // expression (char *)sel_getName(_cmd) -> 43 if (self.descriptionPauses) // Break here for description test ^ 44 { 45 printf ("\nAbout to sleep.\n"); 46 usleep(100000);

Hide Details

Process 54357 launched: '/Users/buildslave/jenkins/workspace/lldb-cmake-sanitized/lldb-build/lldb-test-build.noindex/lang/objc/foundation/TestObjCMethods.test_data_type_and_expr_dsym/a.out' (x86_64)

Hide Details

Hide Details

runCmd: thread backtrace output: * thread #1, queue = 'com.apple.main-thread', stop reason = breakpoint 1.1 * frame #0: 0x00000001000015e0 a.out`-[MyString description](self=0x0000604000001cd0, _cmd="description") at main.m:43:7 frame #1: 0x0000000100001908 a.out`Test_MyString(program="/Users/buildslave/jenkins/workspace/lldb-cmake-sanitized/lldb-build/lldb-test-build.noindex/lang/objc/foundation/TestObjCMethods.test_data_type_and_expr_dsym/a.out") at main.m:96:37 frame #2: 0x0000000100001b54 a.out`main(argc=1, argv=0x00007ffeefbff488) at main.m:133:5 frame #3: 0x00007fff793be085 libdyld.dylib`start + 1 frame #4: 0x00007fff793be085 libdyld.dylib`start + 1

Hide Details

Hide Details

Expecting sub string: a.out`-[MyString description] Matched

Hide Details

runCmd: image lookup -t NSString output: Best match found in /Users/buildslave/jenkins/workspace/lldb-cmake-sanitized/lldb-build/lldb-test-build.noindex/lang/objc/foundation/TestObjCMethods.test_data_type_and_expr_dsym/a.out: id = {0x7fffffff0000004d}, name = "NSString", byte-size = 8, decl = NSString.h:99, compiler_type = "@interface NSString : NSObject @property(readonly, getter = length, setter = <null selector>) NSUInteger length; @end"

Hide Details

Hide Details

Hide Details

Expecting sub string: name = "NSString" Matched

Hide Details

Expecting sub string: compiler_type = "@interface NSString Matched

Hide Details

runCmd: image lookup -t MyString output: Best match found in /Users/buildslave/jenkins/workspace/lldb-cmake-sanitized/lldb-build/lldb-test-build.noindex/lang/objc/foundation/TestObjCMethods.test_data_type_and_expr_dsym/a.out: id = {0x7fffffff000000a9}, name = "MyString", byte-size = 32, decl = main.m:5, compiler_type = "@interface MyString : MyBase{ NSString * str; NSDate * date; BOOL _desc_pauses; } @property(retain, readwrite, getter = str_property, setter = setStr_property:) NSString *str_property; @property(assign, readwrite, getter = descriptionPauses, setter = setDescriptionPauses:) BOOL descriptionPauses; @end"

Hide Details

Hide Details

Hide Details

Expecting sub string: name = "MyString" Matched

Hide Details

Expecting sub string: compiler_type = "@interface MyString Matched

Hide Details

Expecting sub string: NSString * str; Matched

Hide Details

Expecting sub string: NSDate * date; Matched

Hide Details

runCmd: frame variable --show-types --scope output: ARG: (MyString *) self = 0x0000604000001cd0 ARG: (SEL) _cmd = "description"

Hide Details

Hide Details

Expecting sub string: ARG: (MyString *) self Matched

Hide Details

Expecting pattern: ARG: \(.*\) _cmd Matched

Hide Details

Expecting pattern: (objc_selector *)|(SEL) Matched

Hide Details

runCmd: frame variable *_cmd output: (SEL) *_cmd = ""

Hide Details

Hide Details

runCmd: frame variable --show-types self->str output: (NSString *) self->str = 0x0000611000002980 @"Hello from '/Users/buildslave/jenkins/workspace/lldb-cmake-sanitized/lldb-build/lldb-test-build.noindex/lang/objc/foundation/TestObjCMethods.test_data_type_and_expr_dsym/a.out'"

Hide Details

Hide Details

Expecting start string: (NSString *) self->str Matched

Hide Details

runCmd: frame variable --show-types self->date output: (NSDate *) self->date = 0x00006020000024d0 2020-05-31 12:27:32 UTC

Hide Details

Hide Details

Expecting start string: (NSDate *) self->date Matched

Hide Details

runCmd: frame variable --show-types *self output: (MyString) *self = { (MyBase) MyBase = { (NSObject) NSObject = { (Class) isa = MyString } (int) propertyMovesThings = 0 } (NSString *) str = 0x0000611000002980 @"Hello from '/Users/buildslave/jenkins/workspace/lldb-cmake-sanitized/lldb-build/lldb-test-build.noindex/lang/objc/foundation/TestObjCMethods.test_data_type_and_expr_dsym/a.out'" (NSDate *) date = 0x00006020000024d0 2020-05-31 12:27:32 UTC (BOOL) _desc_pauses = NO }

Hide Details

Hide Details

Expecting sub string: (MyString) *self Matched

Hide Details

Expecting sub string: (NSString *) str Matched

Hide Details

Expecting sub string: (NSDate *) date Matched

Hide Details

runCmd: expression self->isa output: (Class) $0 = MyString

Hide Details

Hide Details

Expecting sub string: Class) Matched

Hide Details

runCmd: expression self->non_existent_member check of return status not required runCmd failed! error: <user expression 1>:1:7: 'MyString' does not have a member named 'non_existent_member' self->non_existent_member ~~~~ ^

Hide Details

Hide Details

Expecting sub string: error: Matched

Hide Details

Expecting sub string: 'MyString' does not have a member named 'non_existent_member' Matched

Hide Details

runCmd: expression self->str output: (NSString *) $1 = 0x0000611000002980 @"Hello from '/Users/buildslave/jenkins/workspace/lldb-cmake-sanitized/lldb-build/lldb-test-build.noindex/lang/objc/foundation/TestObjCMethods.test_data_type_and_expr_dsym/a.out'"

Hide Details

Hide Details

runCmd: expression self->date output: (NSDate *) $2 = 0x00006020000024d0 2020-05-31 12:27:32 UTC

Hide Details

Hide Details

runCmd: breakpoint delete 1 output: 1 breakpoints deleted; 0 breakpoint locations disabled.

Hide Details

Hide Details

runCmd: breakpoint set -f "main.m" -l 97 output: Breakpoint 2: where = a.out`Test_MyString + 156 at main.m:97:5, address = 0x000000010000191c

Hide Details

Hide Details

Expecting pattern: ^Breakpoint (?P<bpno>[0-9]+): (?P<num_locations>[0-9]+) locations\.$ Not matched

Hide Details

Expecting pattern: ^Breakpoint (?P<bpno>[0-9]+): (?P<num_locations>no) locations \(pending\)\. Not matched

Hide Details

Expecting pattern: ^Breakpoint (?P<bpno>[0-9]+): where = (?P<module>.*)`(?P<symbol>[+\-]{0,1}[^+]+)( \+ (?P<offset>[0-9]+)){0,1}( \[inlined\] (?P<inline_symbol>.*)){0,1} at (?P<file>[^:]+):(?P<line_no>[0-9]+)(?P<column>(:[0-9]+)?), address = (?P<address>0x[0-9a-fA-F]+)$ Matched

Hide Details

runCmd: process continue output: Process 54357 resuming Process 54357 stopped * thread #1, queue = 'com.apple.main-thread', stop reason = breakpoint 2.1 frame #0: 0x000000010000191c a.out`Test_MyString(program="/Users/buildslave/jenkins/workspace/lldb-cmake-sanitized/lldb-build/lldb-test-build.noindex/lang/objc/foundation/TestObjCMethods.test_data_type_and_expr_dsym/a.out") at main.m:97:5 94 NSString *str = [NSString stringWithFormat:@"Hello from '%s'", program]; 95 MyString *my = [[MyString alloc] initWithNSString:str]; 96 NSLog(@"MyString instance: %@", [my description]); -> 97 my.descriptionPauses = YES; // Set break point at this line. Test 'expression -o -- my'. ^ 98 NSLog(@"MyString instance: %@", [my description]); 99 } 100

Hide Details

Hide Details

Hide Details

runCmd: expression --object-description -- my output: Hello from '/Users/buildslave/jenkins/workspace/lldb-cmake-sanitized/lldb-build/lldb-test-build.noindex/lang/objc/foundation/TestObjCMethods.test_data_type_and_expr_dsym/a.out' with timestamp: 2020-05-31 12:27:32 +0000

Hide Details

Hide Details

Hide Details

Expecting pattern: Hello from.*a.out.*with timestamp: Matched

Hide Details

<bound method SBProcess.Kill of <lldb.SBProcess; proxy of <Swig Object of type 'lldb::SBProcess *' at 0x10a3831b0> >>: success

Hide Details

PASS: LLDB (/Users/buildslave/jenkins/workspace/lldb-cmake-sanitized/lldb-build/bin/clang-11-x86_64) :: test_data_type_and_expr_dsym (TestObjCMethods.FoundationTestCase) runCmd: settings clear -all output:

Hide Details

runCmd: settings set symbols.enable-external-lookup false output:

Hide Details

runCmd: settings set target.auto-apply-fixits false output:

Hide Details

runCmd: settings set plugin.process.gdb-remote.packet-timeout 60 output:

Hide Details

runCmd: settings set symbols.clang-modules-cache-path "/Users/buildslave/jenkins/workspace/lldb-cmake-sanitized/lldb-build/lldb-test-build.noindex/module-cache-lldb/lldb-api" output:

Hide Details

runCmd: settings set use-color false output:

Hide Details

runCmd: setting set target.prefer-dynamic-value no-dynamic-values output:

Hide Details

runCmd: settings set target.env-vars ASAN_OPTIONS=detect_stack_use_after_return=1 DYLD_INSERT_LIBRARIES=/Users/buildslave/jenkins/workspace/lldb-cmake-sanitized/host-compiler/lib/clang/11.0.0/lib/darwin/libclang_rt.asan_osx_dynamic.dylib output:

Hide Details

runCmd: file /Users/buildslave/jenkins/workspace/lldb-cmake-sanitized/lldb-build/lldb-test-build.noindex/lang/objc/foundation/TestObjCMethods.test_data_type_and_expr_dwarf/a.out output: Current executable set to '/Users/buildslave/jenkins/workspace/lldb-cmake-sanitized/lldb-build/lldb-test-build.noindex/lang/objc/foundation/TestObjCMethods.test_data_type_and_expr_dwarf/a.out' (x86_64).

Hide Details

Hide Details

runCmd: breakpoint set -n "-[MyString description]" output: Breakpoint 1: where = a.out`-[MyString description] + 16 at main.m:43:7, address = 0x00000001000015e0

Hide Details

Hide Details

Expecting pattern: ^Breakpoint (?P<bpno>[0-9]+): (?P<num_locations>[0-9]+) locations\.$ Not matched

Hide Details

Expecting pattern: ^Breakpoint (?P<bpno>[0-9]+): (?P<num_locations>no) locations \(pending\)\. Not matched

Hide Details

Expecting pattern: ^Breakpoint (?P<bpno>[0-9]+): where = (?P<module>.*)`(?P<symbol>[+\-]{0,1}[^+]+)( \+ (?P<offset>[0-9]+)){0,1}( \[inlined\] (?P<inline_symbol>.*)){0,1} at (?P<file>[^:]+):(?P<line_no>[0-9]+)(?P<column>(:[0-9]+)?), address = (?P<address>0x[0-9a-fA-F]+)$ Matched

Hide Details

runCmd: run output: Process 55082 stopped * thread #1, queue = 'com.apple.main-thread', stop reason = breakpoint 1.1 frame #0: 0x00000001000015e0 a.out`-[MyString description](self=0x0000604000001cd0, _cmd="description") at main.m:43:7 40 { 41 // Set a breakpoint on '-[MyString description]' and test expressions: 42 // expression (char *)sel_getName(_cmd) -> 43 if (self.descriptionPauses) // Break here for description test ^ 44 { 45 printf ("\nAbout to sleep.\n"); 46 usleep(100000);

Hide Details

Process 55082 launched: '/Users/buildslave/jenkins/workspace/lldb-cmake-sanitized/lldb-build/lldb-test-build.noindex/lang/objc/foundation/TestObjCMethods.test_data_type_and_expr_dwarf/a.out' (x86_64)

Hide Details

Hide Details

runCmd: thread backtrace output: * thread #1, queue = 'com.apple.main-thread', stop reason = breakpoint 1.1 * frame #0: 0x00000001000015e0 a.out`-[MyString description](self=0x0000604000001cd0, _cmd="description") at main.m:43:7 frame #1: 0x0000000100001908 a.out`Test_MyString(program="/Users/buildslave/jenkins/workspace/lldb-cmake-sanitized/lldb-build/lldb-test-build.noindex/lang/objc/foundation/TestObjCMethods.test_data_type_and_expr_dwarf/a.out") at main.m:96:37 frame #2: 0x0000000100001b54 a.out`main(argc=1, argv=0x00007ffeefbff480) at main.m:133:5 frame #3: 0x00007fff793be085 libdyld.dylib`start + 1

Hide Details

Hide Details

Expecting sub string: a.out`-[MyString description] Matched

Hide Details

runCmd: image lookup -t NSString output: Best match found in /Users/buildslave/jenkins/workspace/lldb-cmake-sanitized/lldb-build/lldb-test-build.noindex/lang/objc/foundation/TestObjCMethods.test_data_type_and_expr_dwarf/a.out: id = {0x10000004d}, name = "NSString", byte-size = 8, decl = NSString.h:99, compiler_type = "@interface NSString : NSObject @property(readonly, getter = length, setter = <null selector>) NSUInteger length; @end"

Hide Details

Hide Details

Assertion failed: (tokenKind == tok::kw___bridge_retain), function ParseParenExpression, file /Users/buildslave/jenkins/workspace/lldb-cmake-sanitized/llvm-project/clang/lib/Parse/ParseExpr.cpp, line 2804.

Hide Details

--

Hide Details

******************** PASS: lldb-api :: commands/expression/regression-access-function-template-in-record/TestRegressionAccessFunctionTemplateInRecord.py (1895 of 2028) PASS: lldb-unit :: Expression/./ExpressionTests/DiagnosticManagerTest.PutString (1896 of 2028) PASS: lldb-api :: types/TestFloatTypesExpr.py (1897 of 2028) UNSUPPORTED: lldb-api :: commands/register/register/intel_xtended_registers/TestMPXRegisters.py (1898 of 2028) PASS: lldb-unit :: Utility/./UtilityTests/RegularExpression.Valid (1899 of 2028) FAIL: lldb-api :: lang/objc/rdar-11355592/TestRdar11355592.py (1900 of 2028) ******************** TEST 'lldb-api :: lang/objc/rdar-11355592/TestRdar11355592.py' FAILED ******************** Script: -- /Users/buildslave/jenkins/workspace/lldb-cmake-sanitized/lldb-build/lldb-test-build.noindex/copied-system-python /Users/buildslave/jenkins/workspace/lldb-cmake-sanitized/llvm-project/lldb/test/API/dotest.py --arch x86_64 -s /Users/buildslave/jenkins/workspace/lldb-cmake-sanitized/lldb-build/lldb-test-traces -S nm -u CXXFLAGS -u CFLAGS --codesign-identity lldb_codesign --server /Users/buildslave/jenkins/workspace/lldb-cmake-sanitized/lldb-build/./bin/debugserver --arch x86_64 --build-dir /Users/buildslave/jenkins/workspace/lldb-cmake-sanitized/lldb-build/lldb-test-build.noindex -s=/Users/buildslave/jenkins/workspace/lldb-cmake-sanitized/test/logs -t --env TERM=vt100 --env LLVM_LIBS_DIR=/Users/buildslave/jenkins/workspace/lldb-cmake-sanitized/lldb-build/./lib --inferior-env ASAN_OPTIONS=detect_stack_use_after_return=1 --inferior-env DYLD_INSERT_LIBRARIES=/Users/buildslave/jenkins/workspace/lldb-cmake-sanitized/host-compiler/lib/clang/11.0.0/lib/darwin/libclang_rt.asan_osx_dynamic.dylib --build-dir /Users/buildslave/jenkins/workspace/lldb-cmake-sanitized/lldb-build/lldb-test-build.noindex --lldb-module-cache-dir /Users/buildslave/jenkins/workspace/lldb-cmake-sanitized/lldb-build/lldb-test-build.noindex/module-cache-lldb/lldb-api --clang-module-cache-dir /Users/buildslave/jenkins/workspace/lldb-cmake-sanitized/lldb-build/lldb-test-build.noindex/module-cache-clang/lldb-api --executable /Users/buildslave/jenkins/workspace/lldb-cmake-sanitized/lldb-build/./bin/lldb --compiler /Users/buildslave/jenkins/workspace/lldb-cmake-sanitized/lldb-build/./bin/clang --dsymutil /Users/buildslave/jenkins/workspace/lldb-cmake-sanitized/lldb-build/./bin/dsymutil --filecheck /Users/buildslave/jenkins/workspace/lldb-cmake-sanitized/lldb-build/./bin/FileCheck --lldb-libs-dir /Users/buildslave/jenkins/workspace/lldb-cmake-sanitized/lldb-build/./lib /Users/buildslave/jenkins/workspace/lldb-cmake-sanitized/llvm-project/lldb/test/API/lang/objc/rdar-11355592 -p TestRdar11355592.py -- Exit Code: -6

Hide Details

Command Output (stdout): -- lldb version 11.0.99 clang revision ec25a71eb7fc72440149784951d62453301cc960 llvm revision ec25a71eb7fc72440149784951d62453301cc960

Hide Details

-- Command Output (stderr): --

Hide Details

Session logs for test failures/errors/unexpected successes will go into directory '/Users/buildslave/jenkins/workspace/lldb-cmake-sanitized/test/logs' Command invoked: /Users/buildslave/jenkins/workspace/lldb-cmake-sanitized/llvm-project/lldb/test/API/dotest.py --arch x86_64 -s /Users/buildslave/jenkins/workspace/lldb-cmake-sanitized/lldb-build/lldb-test-traces -S nm -u CXXFLAGS -u CFLAGS --codesign-identity lldb_codesign --server /Users/buildslave/jenkins/workspace/lldb-cmake-sanitized/lldb-build/./bin/debugserver --arch x86_64 --build-dir /Users/buildslave/jenkins/workspace/lldb-cmake-sanitized/lldb-build/lldb-test-build.noindex -s=/Users/buildslave/jenkins/workspace/lldb-cmake-sanitized/test/logs -t --env TERM=vt100 --env LLVM_LIBS_DIR=/Users/buildslave/jenkins/workspace/lldb-cmake-sanitized/lldb-build/./lib --inferior-env ASAN_OPTIONS=detect_stack_use_after_return=1 --inferior-env DYLD_INSERT_LIBRARIES=/Users/buildslave/jenkins/workspace/lldb-cmake-sanitized/host-compiler/lib/clang/11.0.0/lib/darwin/libclang_rt.asan_osx_dynamic.dylib --build-dir /Users/buildslave/jenkins/workspace/lldb-cmake-sanitized/lldb-build/lldb-test-build.noindex --lldb-module-cache-dir /Users/buildslave/jenkins/workspace/lldb-cmake-sanitized/lldb-build/lldb-test-build.noindex/module-cache-lldb/lldb-api --clang-module-cache-dir /Users/buildslave/jenkins/workspace/lldb-cmake-sanitized/lldb-build/lldb-test-build.noindex/module-cache-clang/lldb-api --executable /Users/buildslave/jenkins/workspace/lldb-cmake-sanitized/lldb-build/./bin/lldb --compiler /Users/buildslave/jenkins/workspace/lldb-cmake-sanitized/lldb-build/./bin/clang --dsymutil /Users/buildslave/jenkins/workspace/lldb-cmake-sanitized/lldb-build/./bin/dsymutil --filecheck /Users/buildslave/jenkins/workspace/lldb-cmake-sanitized/lldb-build/./bin/FileCheck --lldb-libs-dir /Users/buildslave/jenkins/workspace/lldb-cmake-sanitized/lldb-build/./lib /Users/buildslave/jenkins/workspace/lldb-cmake-sanitized/llvm-project/lldb/test/API/lang/objc/rdar-11355592 -p TestRdar11355592.py Change dir to: /Users/buildslave/jenkins/workspace/lldb-cmake-sanitized/llvm-project/lldb/test/API/lang/objc/rdar-11355592 runCmd: settings clear -all output:

Hide Details

runCmd: settings set symbols.enable-external-lookup false output:

Hide Details

runCmd: settings set target.auto-apply-fixits false output:

Hide Details

runCmd: settings set plugin.process.gdb-remote.packet-timeout 60 output:

Hide Details

runCmd: settings set symbols.clang-modules-cache-path "/Users/buildslave/jenkins/workspace/lldb-cmake-sanitized/lldb-build/lldb-test-build.noindex/module-cache-lldb/lldb-api" output:

Hide Details

runCmd: settings set use-color false output:

Hide Details

runCmd: setting set target.prefer-dynamic-value no-dynamic-values output:

Hide Details

runCmd: settings set target.env-vars ASAN_OPTIONS=detect_stack_use_after_return=1 DYLD_INSERT_LIBRARIES=/Users/buildslave/jenkins/workspace/lldb-cmake-sanitized/host-compiler/lib/clang/11.0.0/lib/darwin/libclang_rt.asan_osx_dynamic.dylib output:

Hide Details

runCmd: file /Users/buildslave/jenkins/workspace/lldb-cmake-sanitized/lldb-build/lldb-test-build.noindex/lang/objc/rdar-11355592/TestRdar11355592.test_charstar_dyntype_dsym/test_charstar_dyntype_dsym output: Current executable set to '/Users/buildslave/jenkins/workspace/lldb-cmake-sanitized/lldb-build/lldb-test-build.noindex/lang/objc/rdar-11355592/TestRdar11355592.test_charstar_dyntype_dsym/test_charstar_dyntype_dsym' (x86_64).

Hide Details

Hide Details

runCmd: breakpoint set -f "main.m" -l 33 output: Breakpoint 1: where = test_charstar_dyntype_dsym`main + 110 at main.m:33:15, address = 0x0000000100000ebe

Hide Details

Hide Details

Expecting pattern: ^Breakpoint (?P<bpno>[0-9]+): (?P<num_locations>[0-9]+) locations\.$ Not matched

Hide Details

Expecting pattern: ^Breakpoint (?P<bpno>[0-9]+): (?P<num_locations>no) locations \(pending\)\. Not matched

Hide Details

Expecting pattern: ^Breakpoint (?P<bpno>[0-9]+): where = (?P<module>.*)`(?P<symbol>[+\-]{0,1}[^+]+)( \+ (?P<offset>[0-9]+)){0,1}( \[inlined\] (?P<inline_symbol>.*)){0,1} at (?P<file>[^:]+):(?P<line_no>[0-9]+)(?P<column>(:[0-9]+)?), address = (?P<address>0x[0-9a-fA-F]+)$ Matched

Hide Details

runCmd: run output: Process 55718 stopped * thread #1, queue = 'com.apple.main-thread', stop reason = breakpoint 1.1 frame #0: 0x0000000100000ebe test_charstar_dyntype_dsym`main(argc=1, argv=0x00007ffeefbff458) at main.m:33:15 30 FoolMeOnce *my_foolie = [[FoolMeOnce alloc] initWithFirst: 20 andSecond: 55]; 31 const char *my_string = (char *) my_foolie; 32 -> 33 my_string = "Now this is a REAL string..."; // Set breakpoint here. ^ 34 35 [pool release]; 36 return 0;

Hide Details

Process 55718 launched: '/Users/buildslave/jenkins/workspace/lldb-cmake-sanitized/lldb-build/lldb-test-build.noindex/lang/objc/rdar-11355592/TestRdar11355592.test_charstar_dyntype_dsym/test_charstar_dyntype_dsym' (x86_64)

Hide Details

Hide Details

runCmd: frame variable -raw-output my_string output: (const char *) my_string = 0x00006020000022b0

Hide Details

Hide Details

Expecting sub string: const char * Matched

Hide Details

runCmd: frame variable my_string --raw-output --dynamic-type run-target output: (const char *) my_string = 0x00006020000022b0

Hide Details

Hide Details

Expecting sub string: const char * Matched

Hide Details

runCmd: e -R -- my_string output: (const char *) $0 = 0x00006020000022b0

Hide Details

Hide Details

Expecting sub string: const char * Matched

Hide Details

runCmd: expr -R -d run -- my_string output: (const char *) $1 = 0x00006020000022b0

Hide Details

Hide Details

Expecting sub string: const char * Matched

Hide Details

runCmd: frame variable my_foolie output: (FoolMeOnce *) my_foolie = 0x00006020000022b0

Hide Details

Hide Details

Expecting sub string: FoolMeOnce * Matched

Hide Details

runCmd: frame variable my_foolie --dynamic-type run-target output: (FoolMeOnce *) my_foolie = 0x00006020000022b0

Hide Details

Hide Details

Expecting sub string: FoolMeOnce * Matched

Hide Details

runCmd: expr my_foolie output: (FoolMeOnce *) $2 = 0x00006020000022b0

Hide Details

Hide Details

Expecting sub string: FoolMeOnce * Matched

Hide Details

runCmd: expr -d run -- my_foolie output: (FoolMeOnce *) $3 = 0x00006020000022b0

Hide Details

Hide Details

Expecting sub string: FoolMeOnce * Matched

Hide Details

runCmd: next output: Process 55718 stopped * thread #1, queue = 'com.apple.main-thread', stop reason = step over frame #0: 0x0000000100000ec9 test_charstar_dyntype_dsym`main(argc=1, argv=0x00007ffeefbff458) at main.m:35:6 32 33 my_string = "Now this is a REAL string..."; // Set breakpoint here. 34 -> 35 [pool release]; ^ 36 return 0; 37 }

Hide Details

Hide Details

Hide Details

runCmd: frame variable my_string output: (const char *) my_string = 0x0000000100000f96 "Now this is a REAL string..."

Hide Details

Hide Details

Expecting sub string: const char * Matched

Hide Details

runCmd: frame variable my_string --dynamic-type run-target output: (const char *) my_string = 0x0000000100000f96 "Now this is a REAL string..."

Hide Details

Hide Details

Expecting sub string: const char * Matched

Hide Details

runCmd: expr my_string output: (const char *) $4 = 0x0000000100000f96 "Now this is a REAL string..."

Hide Details

Hide Details

Expecting sub string: const char * Matched

Hide Details

runCmd: expr -d run -- my_string output: (const char *) $5 = 0x0000000100000f96 "Now this is a REAL string..."

Hide Details

Hide Details

Expecting sub string: const char * Matched

Hide Details

runCmd: frame variable my_foolie output: (FoolMeOnce *) my_foolie = 0x00006020000022b0

Hide Details

Hide Details

Expecting sub string: FoolMeOnce * Matched

Hide Details

runCmd: frame variable my_foolie --dynamic-type run-target output: (FoolMeOnce *) my_foolie = 0x00006020000022b0

Hide Details

Hide Details

Expecting sub string: FoolMeOnce * Matched

Hide Details

runCmd: expr my_foolie output: (FoolMeOnce *) $6 = 0x00006020000022b0

Hide Details

Hide Details

Expecting sub string: FoolMeOnce * Matched

Hide Details

runCmd: expr -d run -- my_foolie output: (FoolMeOnce *) $7 = 0x00006020000022b0

Hide Details

Hide Details

Expecting sub string: FoolMeOnce * Matched

Hide Details

<bound method SBProcess.Kill of <lldb.SBProcess; proxy of <Swig Object of type 'lldb::SBProcess *' at 0x111f56990> >>: success

Hide Details

PASS: LLDB (/Users/buildslave/jenkins/workspace/lldb-cmake-sanitized/lldb-build/bin/clang-11-x86_64) :: test_charstar_dyntype_dsym (TestRdar11355592.Rdar10967107TestCase) runCmd: settings clear -all output:

Hide Details

runCmd: settings set symbols.enable-external-lookup false output:

Hide Details

runCmd: settings set target.auto-apply-fixits false output:

Hide Details

runCmd: settings set plugin.process.gdb-remote.packet-timeout 60 output:

Hide Details

runCmd: settings set symbols.clang-modules-cache-path "/Users/buildslave/jenkins/workspace/lldb-cmake-sanitized/lldb-build/lldb-test-build.noindex/module-cache-lldb/lldb-api" output: Assertion failed: (tokenKind == tok::kw___bridge_retain), function ParseParenExpression, file /Users/buildslave/jenkins/workspace/lldb-cmake-sanitized/llvm-project/clang/lib/Parse/ParseExpr.cpp, line 2804.

Hide Details

--

Hide Details

******************** PASS: lldb-unit :: SymbolFile/NativePDB/./SymbolFileNativePDBTests/PDBFPOProgramToDWARFExpressionTests.SingleAssignmentRegisterRef (1901 of 2028) PASS: lldb-api :: functionalities/data-formatter/data-formatter-objc/cmtime/TestDataFormatterCMTime.py (1902 of 2028) FAIL: lldb-api :: python_api/exprpath_synthetic/TestExprPathSynthetic.py (1903 of 2028) ******************** TEST 'lldb-api :: python_api/exprpath_synthetic/TestExprPathSynthetic.py' FAILED ******************** Script: -- /Users/buildslave/jenkins/workspace/lldb-cmake-sanitized/lldb-build/lldb-test-build.noindex/copied-system-python /Users/buildslave/jenkins/workspace/lldb-cmake-sanitized/llvm-project/lldb/test/API/dotest.py --arch x86_64 -s /Users/buildslave/jenkins/workspace/lldb-cmake-sanitized/lldb-build/lldb-test-traces -S nm -u CXXFLAGS -u CFLAGS --codesign-identity lldb_codesign --server /Users/buildslave/jenkins/workspace/lldb-cmake-sanitized/lldb-build/./bin/debugserver --arch x86_64 --build-dir /Users/buildslave/jenkins/workspace/lldb-cmake-sanitized/lldb-build/lldb-test-build.noindex -s=/Users/buildslave/jenkins/workspace/lldb-cmake-sanitized/test/logs -t --env TERM=vt100 --env LLVM_LIBS_DIR=/Users/buildslave/jenkins/workspace/lldb-cmake-sanitized/lldb-build/./lib --inferior-env ASAN_OPTIONS=detect_stack_use_after_return=1 --inferior-env DYLD_INSERT_LIBRARIES=/Users/buildslave/jenkins/workspace/lldb-cmake-sanitized/host-compiler/lib/clang/11.0.0/lib/darwin/libclang_rt.asan_osx_dynamic.dylib --build-dir /Users/buildslave/jenkins/workspace/lldb-cmake-sanitized/lldb-build/lldb-test-build.noindex --lldb-module-cache-dir /Users/buildslave/jenkins/workspace/lldb-cmake-sanitized/lldb-build/lldb-test-build.noindex/module-cache-lldb/lldb-api --clang-module-cache-dir /Users/buildslave/jenkins/workspace/lldb-cmake-sanitized/lldb-build/lldb-test-build.noindex/module-cache-clang/lldb-api --executable /Users/buildslave/jenkins/workspace/lldb-cmake-sanitized/lldb-build/./bin/lldb --compiler /Users/buildslave/jenkins/workspace/lldb-cmake-sanitized/lldb-build/./bin/clang --dsymutil /Users/buildslave/jenkins/workspace/lldb-cmake-sanitized/lldb-build/./bin/dsymutil --filecheck /Users/buildslave/jenkins/workspace/lldb-cmake-sanitized/lldb-build/./bin/FileCheck --lldb-libs-dir /Users/buildslave/jenkins/workspace/lldb-cmake-sanitized/lldb-build/./lib /Users/buildslave/jenkins/workspace/lldb-cmake-sanitized/llvm-project/lldb/test/API/python_api/exprpath_synthetic -p TestExprPathSynthetic.py -- Exit Code: -6

Hide Details

Command Output (stdout): -- lldb version 11.0.99 clang revision ec25a71eb7fc72440149784951d62453301cc960 llvm revision ec25a71eb7fc72440149784951d62453301cc960

Hide Details

-- Command Output (stderr): -- Assertion failed: (tokenKind == tok::kw___bridge_retain), function ParseParenExpression, file /Users/buildslave/jenkins/workspace/lldb-cmake-sanitized/llvm-project/clang/lib/Parse/ParseExpr.cpp, line 2804.

Hide Details

--

Hide Details

******************** PASS: lldb-api :: commands/expression/import-std-module/weak_ptr/TestWeakPtrFromStdModule.py (1904 of 2028) PASS: lldb-api :: lang/cpp/char8_t/TestCxxChar8_t.py (1905 of 2028) PASS: lldb-unit :: Utility/./UtilityTests/AnsiTerminal.Empty (1906 of 2028) PASS: lldb-shell :: ObjectFile/ELF/PT_LOAD.yaml (1907 of 2028) PASS: lldb-api :: types/TestShortTypeExpr.py (1908 of 2028) PASS: lldb-api :: commands/expression/top-level/TestTopLevelExprs.py (1909 of 2028) PASS: lldb-api :: functionalities/data-formatter/data-formatter-disabling/TestDataFormatterDisabling.py (1910 of 2028) UNSUPPORTED: lldb-shell :: SymbolFile/PDB/variables-locations.test (1911 of 2028) PASS: lldb-unit :: Utility/./UtilityTests/StringListTest.GetMaxStringLengthMixed (1912 of 2028) PASS: lldb-api :: functionalities/unwind/zeroth_frame/TestZerothFrame.py (1913 of 2028) PASS: lldb-unit :: ScriptInterpreter/Python/./ScriptInterpreterPythonTests/PythonDataObjectsTest.TestPythonIntegerToStructuredInteger (1914 of 2028) PASS: lldb-unit :: Utility/./UtilityTests/CompletionRequest.TryCompleteCurrentArgGood (1915 of 2028) PASS: lldb-unit :: ScriptInterpreter/Python/./ScriptInterpreterPythonTests/PythonDataObjectsTest.TestPythonDictionaryToStructuredDictionary (1916 of 2028) PASS: lldb-unit :: Utility/./UtilityTests/DataExtractorTest.GetMaxS64 (1917 of 2028) PASS: lldb-api :: functionalities/data-formatter/var-in-aggregate-misuse/TestVarInAggregateMisuse.py (1918 of 2028) PASS: lldb-api :: functionalities/thread/thread_specific_break/TestThreadSpecificBreakpoint.py (1919 of 2028) PASS: lldb-unit :: ScriptInterpreter/Python/./ScriptInterpreterPythonTests/PythonDataObjectsTest.TestPythonListManipulation (1920 of 2028) PASS: lldb-unit :: Utility/./UtilityTests/PassiveReplayTest.InstrumentedFooInvalid (1921 of 2028) PASS: lldb-unit :: Utility/./UtilityTests/RangeTest.SetRangeBase (1922 of 2028) PASS: lldb-unit :: Utility/./UtilityTests/OptionsWithRawTest.WhitespaceSuffix (1923 of 2028) PASS: lldb-shell :: SymbolFile/NativePDB/source-list.cpp (1924 of 2028) PASS: lldb-unit :: Process/gdb-remote/./ProcessGdbRemoteTests/GDBRemoteClientBaseTest.SendContinueAndInterrupt (1925 of 2028) PASS: lldb-unit :: Utility/./UtilityTests/BinaryStreamTest.PutSLEB128Zero (1926 of 2028) PASS: lldb-api :: functionalities/pointer_num_children/TestPointerNumChildren.py (1927 of 2028) PASS: lldb-unit :: Symbol/./SymbolTests/TestTypeSystemClang.TestDisplayNameEmpty (1928 of 2028) PASS: lldb-shell :: SymbolFile/DWARF/forward-declarations.s (1929 of 2028) PASS: lldb-shell :: SymbolFile/Breakpad/line-table-missing-file.test (1930 of 2028) PASS: lldb-unit :: API/./APITests/SBCommandInterpreterTest.SingleWordCommand (1931 of 2028) PASS: lldb-api :: lang/cpp/namespace_definitions/TestNamespaceDefinitions.py (1932 of 2028) UNSUPPORTED: lldb-api :: commands/watchpoints/hello_watchlocation/TestWatchLocation.py (1933 of 2028) PASS: lldb-unit :: Utility/./UtilityTests/StreamTeeTest.Flush (1934 of 2028) PASS: lldb-unit :: debugserver/./debugserverTests/RNBSocket.LoopBackListenIPv4 (1935 of 2028) PASS: lldb-unit :: Utility/./UtilityTests/BinaryStreamTest.PutULEB128TwoBytes (1936 of 2028) PASS: lldb-shell :: SymbolFile/DWARF/DW_TAG_basic_type_DW_ATE_UTF_nonC.ll (1937 of 2028) PASS: lldb-unit :: Host/./HostTests/FileSystemTest.GetPermissions (1938 of 2028) UNSUPPORTED: lldb-shell :: Breakpoint/case-insensitive.test (1939 of 2028) PASS: lldb-unit :: Utility/./UtilityTests/StringExtractorTest.GetHexBytes_FullString (1940 of 2028) PASS: lldb-shell :: Reproducer/Functionalities/TestDataFormatter.test (1941 of 2028) PASS: lldb-api :: functionalities/gdb_remote_client/TestThreadSelectionBug.py (1942 of 2028) PASS: lldb-api :: functionalities/gdb_remote_client/TestRestartBug.py (1943 of 2028) PASS: lldb-api :: commands/expression/import-std-module/vector-bool/TestVectorBoolFromStdModule.py (1944 of 2028) PASS: lldb-shell :: Breakpoint/debug_rnglist_basic.test (1945 of 2028) PASS: lldb-unit :: ObjectFile/Breakpad/./ObjectFileBreakpadTests/FileRecord.parse (1946 of 2028) PASS: lldb-api :: lang/cpp/extern_c/TestExternCSymbols.py (1947 of 2028) PASS: lldb-api :: commands/expression/deleting-implicit-copy-constructor/TestDeletingImplicitCopyConstructor.py (1948 of 2028) PASS: lldb-unit :: Utility/./UtilityTests/StringExtractorTest.GetNameColonValueContainsColon (1949 of 2028) FAIL: lldb-api :: lang/objc/unicode-string/TestUnicodeString.py (1950 of 2028) ******************** TEST 'lldb-api :: lang/objc/unicode-string/TestUnicodeString.py' FAILED ******************** Script: -- /Users/buildslave/jenkins/workspace/lldb-cmake-sanitized/lldb-build/lldb-test-build.noindex/copied-system-python /Users/buildslave/jenkins/workspace/lldb-cmake-sanitized/llvm-project/lldb/test/API/dotest.py --arch x86_64 -s /Users/buildslave/jenkins/workspace/lldb-cmake-sanitized/lldb-build/lldb-test-traces -S nm -u CXXFLAGS -u CFLAGS --codesign-identity lldb_codesign --server /Users/buildslave/jenkins/workspace/lldb-cmake-sanitized/lldb-build/./bin/debugserver --arch x86_64 --build-dir /Users/buildslave/jenkins/workspace/lldb-cmake-sanitized/lldb-build/lldb-test-build.noindex -s=/Users/buildslave/jenkins/workspace/lldb-cmake-sanitized/test/logs -t --env TERM=vt100 --env LLVM_LIBS_DIR=/Users/buildslave/jenkins/workspace/lldb-cmake-sanitized/lldb-build/./lib --inferior-env ASAN_OPTIONS=detect_stack_use_after_return=1 --inferior-env DYLD_INSERT_LIBRARIES=/Users/buildslave/jenkins/workspace/lldb-cmake-sanitized/host-compiler/lib/clang/11.0.0/lib/darwin/libclang_rt.asan_osx_dynamic.dylib --build-dir /Users/buildslave/jenkins/workspace/lldb-cmake-sanitized/lldb-build/lldb-test-build.noindex --lldb-module-cache-dir /Users/buildslave/jenkins/workspace/lldb-cmake-sanitized/lldb-build/lldb-test-build.noindex/module-cache-lldb/lldb-api --clang-module-cache-dir /Users/buildslave/jenkins/workspace/lldb-cmake-sanitized/lldb-build/lldb-test-build.noindex/module-cache-clang/lldb-api --executable /Users/buildslave/jenkins/workspace/lldb-cmake-sanitized/lldb-build/./bin/lldb --compiler /Users/buildslave/jenkins/workspace/lldb-cmake-sanitized/lldb-build/./bin/clang --dsymutil /Users/buildslave/jenkins/workspace/lldb-cmake-sanitized/lldb-build/./bin/dsymutil --filecheck /Users/buildslave/jenkins/workspace/lldb-cmake-sanitized/lldb-build/./bin/FileCheck --lldb-libs-dir /Users/buildslave/jenkins/workspace/lldb-cmake-sanitized/lldb-build/./lib /Users/buildslave/jenkins/workspace/lldb-cmake-sanitized/llvm-project/lldb/test/API/lang/objc/unicode-string -p TestUnicodeString.py -- Exit Code: -6

Hide Details

Command Output (stdout): -- lldb version 11.0.99 clang revision ec25a71eb7fc72440149784951d62453301cc960 llvm revision ec25a71eb7fc72440149784951d62453301cc960

Hide Details

-- Command Output (stderr): -- Assertion failed: (tokenKind == tok::kw___bridge_retain), function ParseParenExpression, file /Users/buildslave/jenkins/workspace/lldb-cmake-sanitized/llvm-project/clang/lib/Parse/ParseExpr.cpp, line 2804.

Hide Details

--

Hide Details

******************** PASS: lldb-api :: functionalities/tail_call_frames/cross_dso/TestCrossDSOTailCalls.py (1951 of 2028) FAIL: lldb-api :: lang/objc/objc-new-syntax/TestObjCNewSyntaxDictionary.py (1952 of 2028) ******************** TEST 'lldb-api :: lang/objc/objc-new-syntax/TestObjCNewSyntaxDictionary.py' FAILED ******************** Script: -- /Users/buildslave/jenkins/workspace/lldb-cmake-sanitized/lldb-build/lldb-test-build.noindex/copied-system-python /Users/buildslave/jenkins/workspace/lldb-cmake-sanitized/llvm-project/lldb/test/API/dotest.py --arch x86_64 -s /Users/buildslave/jenkins/workspace/lldb-cmake-sanitized/lldb-build/lldb-test-traces -S nm -u CXXFLAGS -u CFLAGS --codesign-identity lldb_codesign --server /Users/buildslave/jenkins/workspace/lldb-cmake-sanitized/lldb-build/./bin/debugserver --arch x86_64 --build-dir /Users/buildslave/jenkins/workspace/lldb-cmake-sanitized/lldb-build/lldb-test-build.noindex -s=/Users/buildslave/jenkins/workspace/lldb-cmake-sanitized/test/logs -t --env TERM=vt100 --env LLVM_LIBS_DIR=/Users/buildslave/jenkins/workspace/lldb-cmake-sanitized/lldb-build/./lib --inferior-env ASAN_OPTIONS=detect_stack_use_after_return=1 --inferior-env DYLD_INSERT_LIBRARIES=/Users/buildslave/jenkins/workspace/lldb-cmake-sanitized/host-compiler/lib/clang/11.0.0/lib/darwin/libclang_rt.asan_osx_dynamic.dylib --build-dir /Users/buildslave/jenkins/workspace/lldb-cmake-sanitized/lldb-build/lldb-test-build.noindex --lldb-module-cache-dir /Users/buildslave/jenkins/workspace/lldb-cmake-sanitized/lldb-build/lldb-test-build.noindex/module-cache-lldb/lldb-api --clang-module-cache-dir /Users/buildslave/jenkins/workspace/lldb-cmake-sanitized/lldb-build/lldb-test-build.noindex/module-cache-clang/lldb-api --executable /Users/buildslave/jenkins/workspace/lldb-cmake-sanitized/lldb-build/./bin/lldb --compiler /Users/buildslave/jenkins/workspace/lldb-cmake-sanitized/lldb-build/./bin/clang --dsymutil /Users/buildslave/jenkins/workspace/lldb-cmake-sanitized/lldb-build/./bin/dsymutil --filecheck /Users/buildslave/jenkins/workspace/lldb-cmake-sanitized/lldb-build/./bin/FileCheck --lldb-libs-dir /Users/buildslave/jenkins/workspace/lldb-cmake-sanitized/lldb-build/./lib /Users/buildslave/jenkins/workspace/lldb-cmake-sanitized/llvm-project/lldb/test/API/lang/objc/objc-new-syntax -p TestObjCNewSyntaxDictionary.py -- Exit Code: -6

Hide Details

Command Output (stdout): -- lldb version 11.0.99 clang revision ec25a71eb7fc72440149784951d62453301cc960 llvm revision ec25a71eb7fc72440149784951d62453301cc960

Hide Details

-- Command Output (stderr): -- Assertion failed: (tokenKind == tok::kw___bridge_retain), function ParseParenExpression, file /Users/buildslave/jenkins/workspace/lldb-cmake-sanitized/llvm-project/clang/lib/Parse/ParseExpr.cpp, line 2804.

Hide Details

--

Hide Details

******************** PASS: lldb-unit :: Process/gdb-remote/./ProcessGdbRemoteTests/GDBRemoteCommunicationClientTest.SyncThreadState (1953 of 2028) PASS: lldb-api :: functionalities/thread/thread_exit/TestThreadExit.py (1954 of 2028) PASS: lldb-unit :: Utility/./UtilityTests/ScalarTest.CastOperations (1955 of 2028) PASS: lldb-shell :: Breakpoint/debug_addrx.test (1956 of 2028) PASS: lldb-unit :: Utility/./UtilityTests/TimerTest.CategoryTimes2 (1957 of 2028) PASS: lldb-shell :: SymbolFile/DWARF/debug-types-dwarf5.s (1958 of 2028) PASS: lldb-unit :: Utility/./UtilityTests/FileSpecTest.GetPath (1959 of 2028) PASS: lldb-unit :: Core/./LLDBCoreTests/SourceFileCache.FindSourceFileFound (1960 of 2028) PASS: lldb-shell :: Driver/TestConvenienceVariables.test (1961 of 2028) PASS: lldb-unit :: tools/lldb-server/tests/./LLDBServerTests/TestBase.LaunchModePreservesEnvironment (1962 of 2028) PASS: lldb-unit :: Utility/./UtilityTests/StringExtractorTest.GetU64BigEndian (1963 of 2028) PASS: lldb-api :: functionalities/thread/concurrent_events/TestConcurrentBreakpointsDelayedBreakpointOneWatchpoint.py (1964 of 2028) PASS: lldb-unit :: Utility/./UtilityTests/NameMatchesTest.EndsWith (1965 of 2028) UNSUPPORTED: lldb-shell :: Register/x86-ymm-write.test (1966 of 2028) PASS: lldb-unit :: ObjectFile/ELF/./ObjectFileELFTests/ObjectFileELFTest.GetModuleSpecifications_EarlySectionHeaders (1967 of 2028) PASS: lldb-unit :: Utility/./UtilityTests/StreamTest.QuotedCString (1968 of 2028) PASS: lldb-unit :: Utility/./UtilityTests/StreamTeeTest.SetStreamAtIndexOverwrite (1969 of 2028) PASS: lldb-unit :: Utility/./UtilityTests/StringLexerTest.Next (1970 of 2028) PASS: lldb-api :: lang/cpp/multiple-inheritance/TestCppMultipleInheritance.py (1971 of 2028) PASS: lldb-api :: tools/lldb-server/commandline/TestStubSetSID.py (1972 of 2028) PASS: lldb-api :: functionalities/tail_call_frames/ambiguous_tail_call_seq1/TestAmbiguousTailCallSeq1.py (1973 of 2028) UNSUPPORTED: lldb-api :: tools/lldb-server/TestGdbRemoteModuleInfo.py (1974 of 2028) PASS: lldb-api :: commands/expression/radar_9673664/TestExprHelpExamples.py (1975 of 2028) PASS: lldb-api :: functionalities/breakpoint/scripted_bkpt/TestScriptedResolver.py (1976 of 2028) PASS: lldb-shell :: Expr/TestMultilineExpr.test (1977 of 2028) PASS: lldb-unit :: Utility/./UtilityTests/ScalarTest.Promotion (1978 of 2028) PASS: lldb-api :: commands/frame/diagnose/dereference-this/TestDiagnoseDereferenceThis.py (1979 of 2028) PASS: lldb-unit :: Breakpoint/./LLDBBreakpointTests/BreakpointIDTest.StringIsBreakpointName (1980 of 2028) FAIL: lldb-api :: lang/objc/objc-property/TestObjCProperty.py (1981 of 2028) ******************** TEST 'lldb-api :: lang/objc/objc-property/TestObjCProperty.py' FAILED ******************** Script: -- /Users/buildslave/jenkins/workspace/lldb-cmake-sanitized/lldb-build/lldb-test-build.noindex/copied-system-python /Users/buildslave/jenkins/workspace/lldb-cmake-sanitized/llvm-project/lldb/test/API/dotest.py --arch x86_64 -s /Users/buildslave/jenkins/workspace/lldb-cmake-sanitized/lldb-build/lldb-test-traces -S nm -u CXXFLAGS -u CFLAGS --codesign-identity lldb_codesign --server /Users/buildslave/jenkins/workspace/lldb-cmake-sanitized/lldb-build/./bin/debugserver --arch x86_64 --build-dir /Users/buildslave/jenkins/workspace/lldb-cmake-sanitized/lldb-build/lldb-test-build.noindex -s=/Users/buildslave/jenkins/workspace/lldb-cmake-sanitized/test/logs -t --env TERM=vt100 --env LLVM_LIBS_DIR=/Users/buildslave/jenkins/workspace/lldb-cmake-sanitized/lldb-build/./lib --inferior-env ASAN_OPTIONS=detect_stack_use_after_return=1 --inferior-env DYLD_INSERT_LIBRARIES=/Users/buildslave/jenkins/workspace/lldb-cmake-sanitized/host-compiler/lib/clang/11.0.0/lib/darwin/libclang_rt.asan_osx_dynamic.dylib --build-dir /Users/buildslave/jenkins/workspace/lldb-cmake-sanitized/lldb-build/lldb-test-build.noindex --lldb-module-cache-dir /Users/buildslave/jenkins/workspace/lldb-cmake-sanitized/lldb-build/lldb-test-build.noindex/module-cache-lldb/lldb-api --clang-module-cache-dir /Users/buildslave/jenkins/workspace/lldb-cmake-sanitized/lldb-build/lldb-test-build.noindex/module-cache-clang/lldb-api --executable /Users/buildslave/jenkins/workspace/lldb-cmake-sanitized/lldb-build/./bin/lldb --compiler /Users/buildslave/jenkins/workspace/lldb-cmake-sanitized/lldb-build/./bin/clang --dsymutil /Users/buildslave/jenkins/workspace/lldb-cmake-sanitized/lldb-build/./bin/dsymutil --filecheck /Users/buildslave/jenkins/workspace/lldb-cmake-sanitized/lldb-build/./bin/FileCheck --lldb-libs-dir /Users/buildslave/jenkins/workspace/lldb-cmake-sanitized/lldb-build/./lib /Users/buildslave/jenkins/workspace/lldb-cmake-sanitized/llvm-project/lldb/test/API/lang/objc/objc-property -p TestObjCProperty.py -- Exit Code: -6

Hide Details

Command Output (stdout): -- lldb version 11.0.99 clang revision ec25a71eb7fc72440149784951d62453301cc960 llvm revision ec25a71eb7fc72440149784951d62453301cc960

Hide Details

-- Command Output (stderr): -- Assertion failed: (tokenKind == tok::kw___bridge_retain), function ParseParenExpression, file /Users/buildslave/jenkins/workspace/lldb-cmake-sanitized/llvm-project/clang/lib/Parse/ParseExpr.cpp, line 2804.

Hide Details

--

Hide Details

******************** PASS: lldb-unit :: Utility/./UtilityTests/UriParserTest.SchemeHostSeparator4 (1982 of 2028) UNSUPPORTED: lldb-api :: functionalities/data-formatter/data-formatter-stl/libstdcpp/list/TestDataFormatterStdList.py (1983 of 2028) PASS: lldb-unit :: Process/minidump/./LLDBMinidumpTests/MinidumpParserTest.MinidumpDuplicateModuleMinAddress (1984 of 2028) PASS: lldb-shell :: Quit/TestQuitExitCodeImplicit0.test (1985 of 2028) PASS: lldb-api :: functionalities/abbreviation/TestAbbreviations.py (1986 of 2028) PASS: lldb-unit :: Utility/./UtilityTests/OptionsWithRawTest.ArgsButNoLeadingDash (1987 of 2028) PASS: lldb-unit :: ObjectFile/ELF/./ObjectFileELFTests/ObjectFileELFTest.GetSymtab_NoSymEntryPointArmThumbAddressClass (1988 of 2028) PASS: lldb-shell :: SymbolFile/NativePDB/break-by-line.cpp (1989 of 2028) PASS: lldb-shell :: ObjectFile/ELF/section-addresses.yaml (1990 of 2028) PASS: lldb-api :: types/TestShortType.py (1991 of 2028) PASS: lldb-unit :: Utility/./UtilityTests/UUIDTest.StringConverion (1992 of 2028) PASS: lldb-unit :: SymbolFile/DWARF/./SymbolFileDWARFTests/SymbolFileDWARFTests.ParseArangesNonzeroSegmentSize (1993 of 2028) PASS: lldb-api :: functionalities/data-formatter/data-formatter-skip-summary/TestDataFormatterSkipSummary.py (1994 of 2028) PASS: lldb-unit :: Host/./HostTests/NativeProcessProtocolTest.ReadMemoryWithoutTrap (1995 of 2028) PASS: lldb-api :: commands/expression/import-std-module/sysroot/TestStdModuleSysroot.py (1996 of 2028) PASS: lldb-unit :: Utility/./UtilityTests/Predicate.WaitForValueEqualTo (1997 of 2028) PASS: lldb-api :: lang/objc/exceptions/TestObjCExceptions.py (1998 of 2028) PASS: lldb-unit :: Utility/./UtilityTests/StringListTest.SplitIntoLines (1999 of 2028) PASS: lldb-unit :: Utility/./UtilityTests/CompletionRequest.TryCompleteCurrentArgBad (2000 of 2028) PASS: lldb-unit :: Process/gdb-remote/./ProcessGdbRemoteTests/GDBRemoteCommunicationClientTest.SaveRestoreRegistersNoSuffix (2001 of 2028) PASS: lldb-unit :: ScriptInterpreter/Python/./ScriptInterpreterPythonTests/PythonDataObjectsTest.TestPythonTupleToStructuredList (2002 of 2028) PASS: lldb-unit :: Utility/./UtilityTests/DataExtractorTest.UncommonAddressSize (2003 of 2028) PASS: lldb-unit :: Language/Highlighting/./HighlighterTests/HighlighterTest.ClangBraces (2004 of 2028) PASS: lldb-api :: lang/cpp/diamond/TestDiamond.py (2005 of 2028) PASS: lldb-api :: commands/expression/rdar44436068/Test128BitsInteger.py (2006 of 2028) PASS: lldb-unit :: Utility/./UtilityTests/StringLexerTest.NextIfList (2007 of 2028) PASS: lldb-api :: commands/expression/inline-namespace/TestInlineNamespace.py (2008 of 2028) PASS: lldb-api :: lang/cpp/virtual-overload/TestVirtualOverload.py (2009 of 2028) PASS: lldb-api :: driver/batch_mode/TestBatchMode.py (2010 of 2028) PASS: lldb-unit :: Host/./HostTests/SocketTest.UDPConnect (2011 of 2028) PASS: lldb-unit :: Utility/./UtilityTests/StringListTest.ForRangeEmpty (2012 of 2028) PASS: lldb-shell :: ObjectFile/Breakpad/sections-trailing-func.test (2013 of 2028) PASS: lldb-api :: commands/expression/import-std-module/empty-module/TestEmptyStdModule.py (2014 of 2028) PASS: lldb-shell :: ObjectFile/ELF/PT_LOAD-overlap-section.yaml (2015 of 2028) PASS: lldb-api :: commands/command/nested_alias/TestNestedAlias.py (2016 of 2028) PASS: lldb-unit :: ScriptInterpreter/Python/./ScriptInterpreterPythonTests/PythonDataObjectsTest.TestGlobalNameResolutionWithDot (2017 of 2028) FAIL: lldb-api :: commands/expression/call-throws/TestCallThatThrows.py (2018 of 2028) ******************** TEST 'lldb-api :: commands/expression/call-throws/TestCallThatThrows.py' FAILED ******************** Script: -- /Users/buildslave/jenkins/workspace/lldb-cmake-sanitized/lldb-build/lldb-test-build.noindex/copied-system-python /Users/buildslave/jenkins/workspace/lldb-cmake-sanitized/llvm-project/lldb/test/API/dotest.py --arch x86_64 -s /Users/buildslave/jenkins/workspace/lldb-cmake-sanitized/lldb-build/lldb-test-traces -S nm -u CXXFLAGS -u CFLAGS --codesign-identity lldb_codesign --server /Users/buildslave/jenkins/workspace/lldb-cmake-sanitized/lldb-build/./bin/debugserver --arch x86_64 --build-dir /Users/buildslave/jenkins/workspace/lldb-cmake-sanitized/lldb-build/lldb-test-build.noindex -s=/Users/buildslave/jenkins/workspace/lldb-cmake-sanitized/test/logs -t --env TERM=vt100 --env LLVM_LIBS_DIR=/Users/buildslave/jenkins/workspace/lldb-cmake-sanitized/lldb-build/./lib --inferior-env ASAN_OPTIONS=detect_stack_use_after_return=1 --inferior-env DYLD_INSERT_LIBRARIES=/Users/buildslave/jenkins/workspace/lldb-cmake-sanitized/host-compiler/lib/clang/11.0.0/lib/darwin/libclang_rt.asan_osx_dynamic.dylib --build-dir /Users/buildslave/jenkins/workspace/lldb-cmake-sanitized/lldb-build/lldb-test-build.noindex --lldb-module-cache-dir /Users/buildslave/jenkins/workspace/lldb-cmake-sanitized/lldb-build/lldb-test-build.noindex/module-cache-lldb/lldb-api --clang-module-cache-dir /Users/buildslave/jenkins/workspace/lldb-cmake-sanitized/lldb-build/lldb-test-build.noindex/module-cache-clang/lldb-api --executable /Users/buildslave/jenkins/workspace/lldb-cmake-sanitized/lldb-build/./bin/lldb --compiler /Users/buildslave/jenkins/workspace/lldb-cmake-sanitized/lldb-build/./bin/clang --dsymutil /Users/buildslave/jenkins/workspace/lldb-cmake-sanitized/lldb-build/./bin/dsymutil --filecheck /Users/buildslave/jenkins/workspace/lldb-cmake-sanitized/lldb-build/./bin/FileCheck --lldb-libs-dir /Users/buildslave/jenkins/workspace/lldb-cmake-sanitized/lldb-build/./lib /Users/buildslave/jenkins/workspace/lldb-cmake-sanitized/llvm-project/lldb/test/API/commands/expression/call-throws -p TestCallThatThrows.py -- Exit Code: -6

Hide Details

Command Output (stdout): -- lldb version 11.0.99 clang revision ec25a71eb7fc72440149784951d62453301cc960 llvm revision ec25a71eb7fc72440149784951d62453301cc960

Hide Details

-- Command Output (stderr): -- Assertion failed: (tokenKind == tok::kw___bridge_retain), function ParseParenExpression, file /Users/buildslave/jenkins/workspace/lldb-cmake-sanitized/llvm-project/clang/lib/Parse/ParseExpr.cpp, line 2804.

Hide Details

--

Hide Details

******************** PASS: lldb-unit :: Utility/./UtilityTests/StringListTest.AppendListCStringArray (2019 of 2028) PASS: lldb-unit :: Signals/./SignalsTests/UnixSignalsTest.GetInfo (2020 of 2028) PASS: lldb-unit :: Language/Highlighting/./HighlighterTests/HighlighterTest.ClangIdentifiers (2021 of 2028) PASS: lldb-api :: functionalities/thread/concurrent_events/TestConcurrentTwoBreakpointThreads.py (2022 of 2028) PASS: lldb-unit :: Utility/./UtilityTests/StringListTest.ShiftStdString (2023 of 2028) PASS: lldb-shell :: SymbolFile/DWARF/debug-types-address-ranges.s (2024 of 2028) PASS: lldb-shell :: Quit/TestQuitExitCodeHex0.test (2025 of 2028) PASS: lldb-api :: functionalities/type_lookup/TestTypeLookup.py (2026 of 2028) FAIL: lldb-api :: functionalities/data-formatter/synthupdate/TestSyntheticFilterRecompute.py (2027 of 2028) ******************** TEST 'lldb-api :: functionalities/data-formatter/synthupdate/TestSyntheticFilterRecompute.py' FAILED ******************** Script: -- /Users/buildslave/jenkins/workspace/lldb-cmake-sanitized/lldb-build/lldb-test-build.noindex/copied-system-python /Users/buildslave/jenkins/workspace/lldb-cmake-sanitized/llvm-project/lldb/test/API/dotest.py --arch x86_64 -s /Users/buildslave/jenkins/workspace/lldb-cmake-sanitized/lldb-build/lldb-test-traces -S nm -u CXXFLAGS -u CFLAGS --codesign-identity lldb_codesign --server /Users/buildslave/jenkins/workspace/lldb-cmake-sanitized/lldb-build/./bin/debugserver --arch x86_64 --build-dir /Users/buildslave/jenkins/workspace/lldb-cmake-sanitized/lldb-build/lldb-test-build.noindex -s=/Users/buildslave/jenkins/workspace/lldb-cmake-sanitized/test/logs -t --env TERM=vt100 --env LLVM_LIBS_DIR=/Users/buildslave/jenkins/workspace/lldb-cmake-sanitized/lldb-build/./lib --inferior-env ASAN_OPTIONS=detect_stack_use_after_return=1 --inferior-env DYLD_INSERT_LIBRARIES=/Users/buildslave/jenkins/workspace/lldb-cmake-sanitized/host-compiler/lib/clang/11.0.0/lib/darwin/libclang_rt.asan_osx_dynamic.dylib --build-dir /Users/buildslave/jenkins/workspace/lldb-cmake-sanitized/lldb-build/lldb-test-build.noindex --lldb-module-cache-dir /Users/buildslave/jenkins/workspace/lldb-cmake-sanitized/lldb-build/lldb-test-build.noindex/module-cache-lldb/lldb-api --clang-module-cache-dir /Users/buildslave/jenkins/workspace/lldb-cmake-sanitized/lldb-build/lldb-test-build.noindex/module-cache-clang/lldb-api --executable /Users/buildslave/jenkins/workspace/lldb-cmake-sanitized/lldb-build/./bin/lldb --compiler /Users/buildslave/jenkins/workspace/lldb-cmake-sanitized/lldb-build/./bin/clang --dsymutil /Users/buildslave/jenkins/workspace/lldb-cmake-sanitized/lldb-build/./bin/dsymutil --filecheck /Users/buildslave/jenkins/workspace/lldb-cmake-sanitized/lldb-build/./bin/FileCheck --lldb-libs-dir /Users/buildslave/jenkins/workspace/lldb-cmake-sanitized/lldb-build/./lib /Users/buildslave/jenkins/workspace/lldb-cmake-sanitized/llvm-project/lldb/test/API/functionalities/data-formatter/synthupdate -p TestSyntheticFilterRecompute.py -- Exit Code: -6

Hide Details

Command Output (stdout): -- lldb version 11.0.99 clang revision ec25a71eb7fc72440149784951d62453301cc960 llvm revision ec25a71eb7fc72440149784951d62453301cc960

Hide Details

-- Command Output (stderr): --

Hide Details

Session logs for test failures/errors/unexpected successes will go into directory '/Users/buildslave/jenkins/workspace/lldb-cmake-sanitized/test/logs' Command invoked: /Users/buildslave/jenkins/workspace/lldb-cmake-sanitized/llvm-project/lldb/test/API/dotest.py --arch x86_64 -s /Users/buildslave/jenkins/workspace/lldb-cmake-sanitized/lldb-build/lldb-test-traces -S nm -u CXXFLAGS -u CFLAGS --codesign-identity lldb_codesign --server /Users/buildslave/jenkins/workspace/lldb-cmake-sanitized/lldb-build/./bin/debugserver --arch x86_64 --build-dir /Users/buildslave/jenkins/workspace/lldb-cmake-sanitized/lldb-build/lldb-test-build.noindex -s=/Users/buildslave/jenkins/workspace/lldb-cmake-sanitized/test/logs -t --env TERM=vt100 --env LLVM_LIBS_DIR=/Users/buildslave/jenkins/workspace/lldb-cmake-sanitized/lldb-build/./lib --inferior-env ASAN_OPTIONS=detect_stack_use_after_return=1 --inferior-env DYLD_INSERT_LIBRARIES=/Users/buildslave/jenkins/workspace/lldb-cmake-sanitized/host-compiler/lib/clang/11.0.0/lib/darwin/libclang_rt.asan_osx_dynamic.dylib --build-dir /Users/buildslave/jenkins/workspace/lldb-cmake-sanitized/lldb-build/lldb-test-build.noindex --lldb-module-cache-dir /Users/buildslave/jenkins/workspace/lldb-cmake-sanitized/lldb-build/lldb-test-build.noindex/module-cache-lldb/lldb-api --clang-module-cache-dir /Users/buildslave/jenkins/workspace/lldb-cmake-sanitized/lldb-build/lldb-test-build.noindex/module-cache-clang/lldb-api --executable /Users/buildslave/jenkins/workspace/lldb-cmake-sanitized/lldb-build/./bin/lldb --compiler /Users/buildslave/jenkins/workspace/lldb-cmake-sanitized/lldb-build/./bin/clang --dsymutil /Users/buildslave/jenkins/workspace/lldb-cmake-sanitized/lldb-build/./bin/dsymutil --filecheck /Users/buildslave/jenkins/workspace/lldb-cmake-sanitized/lldb-build/./bin/FileCheck --lldb-libs-dir /Users/buildslave/jenkins/workspace/lldb-cmake-sanitized/lldb-build/./lib /Users/buildslave/jenkins/workspace/lldb-cmake-sanitized/llvm-project/lldb/test/API/functionalities/data-formatter/synthupdate -p TestSyntheticFilterRecompute.py Change dir to: /Users/buildslave/jenkins/workspace/lldb-cmake-sanitized/llvm-project/lldb/test/API/functionalities/data-formatter/synthupdate runCmd: settings clear -all output:

Hide Details

runCmd: settings set symbols.enable-external-lookup false output:

Hide Details

runCmd: settings set target.auto-apply-fixits false output:

Hide Details

runCmd: settings set plugin.process.gdb-remote.packet-timeout 60 output:

Hide Details

runCmd: settings set symbols.clang-modules-cache-path "/Users/buildslave/jenkins/workspace/lldb-cmake-sanitized/lldb-build/lldb-test-build.noindex/module-cache-lldb/lldb-api" output:

Hide Details

runCmd: settings set use-color false output:

Hide Details

runCmd: setting set target.prefer-dynamic-value no-dynamic-values output:

Hide Details

runCmd: settings set target.env-vars ASAN_OPTIONS=detect_stack_use_after_return=1 DYLD_INSERT_LIBRARIES=/Users/buildslave/jenkins/workspace/lldb-cmake-sanitized/host-compiler/lib/clang/11.0.0/lib/darwin/libclang_rt.asan_osx_dynamic.dylib output:

Hide Details

runCmd: file /Users/buildslave/jenkins/workspace/lldb-cmake-sanitized/lldb-build/lldb-test-build.noindex/functionalities/data-formatter/synthupdate/TestSyntheticFilterRecompute.test_rdar12437442_with_run_command_dsym/a.out output: Current executable set to '/Users/buildslave/jenkins/workspace/lldb-cmake-sanitized/lldb-build/lldb-test-build.noindex/functionalities/data-formatter/synthupdate/TestSyntheticFilterRecompute.test_rdar12437442_with_run_command_dsym/a.out' (x86_64).

Hide Details

Hide Details

runCmd: breakpoint set -f "main.m" -l 11 output: Breakpoint 1: where = a.out`main + 722 at main.m:11:9, address = 0x0000000100000ec2

Hide Details

Hide Details

Expecting pattern: ^Breakpoint (?P<bpno>[0-9]+): (?P<num_locations>[0-9]+) locations\.$ Not matched

Hide Details

Expecting pattern: ^Breakpoint (?P<bpno>[0-9]+): (?P<num_locations>no) locations \(pending\)\. Not matched

Hide Details

Expecting pattern: ^Breakpoint (?P<bpno>[0-9]+): where = (?P<module>.*)`(?P<symbol>[+\-]{0,1}[^+]+)( \+ (?P<offset>[0-9]+)){0,1}( \[inlined\] (?P<inline_symbol>.*)){0,1} at (?P<file>[^:]+):(?P<line_no>[0-9]+)(?P<column>(:[0-9]+)?), address = (?P<address>0x[0-9a-fA-F]+)$ Matched

Hide Details

runCmd: run output: Process 64865 stopped * thread #1, queue = 'com.apple.main-thread', stop reason = breakpoint 1.1 frame #0: 0x0000000100000ec2 a.out`main(argc=1, argv=0x00007ffeefbff428) at main.m:11:9 8 NSArray* foo = [NSArray arrayWithObjects:@1,@2,@3,@4,@5, nil]; 9 NSDictionary *bar = @{@1 : @"one",@2 : @"two", @3 : @"three", @4 : @"four", @5 : @"five", @6 : @"six", @7 : @"seven"}; 10 id x = foo; -> 11 x = bar; // Set break point at this line. ^ 12 13 [pool drain]; 14 return 0;

Hide Details

Process 64865 launched: '/Users/buildslave/jenkins/workspace/lldb-cmake-sanitized/lldb-build/lldb-test-build.noindex/functionalities/data-formatter/synthupdate/TestSyntheticFilterRecompute.test_rdar12437442_with_run_command_dsym/a.out' (x86_64)

Hide Details

Hide Details

runCmd: thread list output: Process 64865 stopped * thread #1: tid = 0x6a6a63, 0x0000000100000ec2 a.out`main(argc=1, argv=0x00007ffeefbff428) at main.m:11:9, queue = 'com.apple.main-thread', stop reason = breakpoint 1.1

Hide Details

Hide Details

Expecting sub string: stopped Matched

Hide Details

Expecting sub string: stop reason = breakpoint Matched

Hide Details

Adding tearDown hook: def cleanup(): self.runCmd('type format clear', check=False) self.runCmd('type summary clear', check=False) self.runCmd('type synth clear', check=False)

Hide Details

Hide Details

runCmd: expr --dynamic-type run-target --ptr-depth 1 -- x output: (__NSArrayI *) $0 = 0x00006060000087e0 @"5 elements" { [0] = 0x8325cc462fa5a383 (int)1 [1] = 0x8325cc462fa5a083 (int)2 [2] = 0x8325cc462fa5a183 (int)3 [3] = 0x8325cc462fa5a683 (int)4 [4] = 0x8325cc462fa5a783 (int)5 }

Hide Details

Hide Details

runCmd: next output: Process 64865 stopped * thread #1, queue = 'com.apple.main-thread', stop reason = step over frame #0: 0x0000000100000ed0 a.out`main(argc=1, argv=0x00007ffeefbff428) at main.m:13:6 10 id x = foo; 11 x = bar; // Set break point at this line. 12 -> 13 [pool drain]; ^ 14 return 0; 15 } 16

Hide Details

Hide Details

Hide Details

runCmd: frame select 0 output: frame #0: 0x0000000100000ed0 a.out`main(argc=1, argv=0x00007ffeefbff428) at main.m:13:6 10 id x = foo; 11 x = bar; // Set break point at this line. 12 -> 13 [pool drain]; ^ 14 return 0; 15 } 16

Hide Details

Hide Details

runCmd: expr --dynamic-type run-target --ptr-depth 1 -- x output: (__NSDictionaryI *) $1 = 0x0000611000002980 7 key/value pairs { [0] = { key = 0x8325cc462fa5a783 (int)5 value = 0x00000001000010b0 @"five" } [1] = { key = 0x8325cc462fa5a383 (int)1 value = 0x0000000100001030 @"one" } [2] = { key = 0x8325cc462fa5a483 (int)6 value = 0x00000001000010d0 @"six" } [3] = { key = 0x8325cc462fa5a083 (int)2 value = 0x0000000100001050 @"two" } [4] = { key = 0x8325cc462fa5a583 (int)7 value = 0x00000001000010f0 @"seven" } [5] = { key = 0x8325cc462fa5a183 (int)3 value = 0x0000000100001070 @"three" } [6] = { key = 0x8325cc462fa5a683 (int)4 value = 0x0000000100001090 @"four" } }

Hide Details

Hide Details

<bound method SBProcess.Kill of <lldb.SBProcess; proxy of <Swig Object of type 'lldb::SBProcess *' at 0x125b5d990> >>: success

Hide Details

Executing tearDown hook: def cleanup(): self.runCmd('type format clear', check=False) self.runCmd('type summary clear', check=False) self.runCmd('type synth clear', check=False)

Hide Details

Hide Details

runCmd: type format clear check of return status not required output:

Hide Details

runCmd: type summary clear check of return status not required output:

Hide Details

runCmd: type synth clear check of return status not required output:

Hide Details

PASS: LLDB (/Users/buildslave/jenkins/workspace/lldb-cmake-sanitized/lldb-build/bin/clang-11-x86_64) :: test_rdar12437442_with_run_command_dsym (TestSyntheticFilterRecompute.SyntheticFilterRecomputingTestCase) runCmd: settings clear -all output:

Hide Details

runCmd: settings set symbols.enable-external-lookup false output:

Hide Details

runCmd: settings set target.auto-apply-fixits false output:

Hide Details

runCmd: settings set plugin.process.gdb-remote.packet-timeout 60 output: Assertion failed: (tokenKind == tok::kw___bridge_retain), function ParseParenExpression, file /Users/buildslave/jenkins/workspace/lldb-cmake-sanitized/llvm-project/clang/lib/Parse/ParseExpr.cpp, line 2804.

Hide Details

--

Hide Details

******************** PASS: lldb-api :: tools/lldb-server/TestGdbRemote_qThreadStopInfo.py (2028 of 2028) Slowest Tests: -------------------------------------------------------------------------- 352.44s: lldb-api :: tools/lldb-server/TestLldbGdbServer.py 262.47s: lldb-api :: lang/cpp/enum_types/TestCPP11EnumTypes.py 258.65s: lldb-api :: api/multithreaded/TestMultithreaded.py 246.34s: lldb-api :: tools/lldb-server/TestGdbRemoteThreadsInStopReply.py 156.91s: lldb-api :: lang/objc/exceptions/TestObjCExceptions.py 153.36s: lldb-api :: lang/cpp/namespace/TestNamespaceLookup.py 140.48s: lldb-api :: lang/objc/real-definition/TestRealDefinition.py 117.69s: lldb-api :: tools/lldb-server/TestGdbRemote_qThreadStopInfo.py 117.63s: lldb-api :: types/TestLongTypesExpr.py 110.10s: lldb-api :: lang/objc/foundation/TestObjCMethods.py 103.55s: lldb-api :: python_api/lldbutil/iter/TestLLDBIterator.py 102.28s: lldb-api :: lang/objcxx/class-name-clash/TestNameClash.py 91.85s: lldb-api :: functionalities/gdb_remote_client/TestWasm.py 88.62s: lldb-api :: types/TestLongTypes.py 88.58s: lldb-api :: commands/settings/TestSettings.py 86.72s: lldb-api :: functionalities/data-formatter/compactvectors/TestCompactVectors.py 79.84s: lldb-api :: api/check_public_api_headers/TestPublicAPIHeaders.py 79.35s: lldb-api :: lang/objc/forward-decl/TestForwardDecl.py 77.28s: lldb-api :: lang/objc/hidden-ivars/TestHiddenIvars.py 76.90s: lldb-api :: types/TestIntegerTypeExpr.py

Hide Details

Tests Times: -------------------------------------------------------------------------- [ Range ] :: [ Percentage ] :: [ Count ] -------------------------------------------------------------------------- [340s,360s) :: [ ] :: [ 1/2028] [320s,340s) :: [ ] :: [ 0/2028] [300s,320s) :: [ ] :: [ 0/2028] [280s,300s) :: [ ] :: [ 0/2028] [260s,280s) :: [ ] :: [ 2/2028] [240s,260s) :: [ ] :: [ 1/2028] [220s,240s) :: [ ] :: [ 0/2028] [200s,220s) :: [ ] :: [ 0/2028] [180s,200s) :: [ ] :: [ 0/2028] [160s,180s) :: [ ] :: [ 1/2028] [140s,160s) :: [ ] :: [ 2/2028] [120s,140s) :: [ ] :: [ 2/2028] [100s,120s) :: [ ] :: [ 3/2028] [ 80s,100s) :: [ ] :: [ 6/2028] [ 60s, 80s) :: [ ] :: [ 22/2028] [ 40s, 60s) :: [* ] :: [ 87/2028] [ 20s, 40s) :: [** ] :: [ 119/2028] [ 0s, 20s) :: [*********************************** ] :: [1782/2028] -------------------------------------------------------------------------- ******************** Failing Tests (53): lldb-api :: commands/expression/persist_objc_pointeetype/TestPersistObjCPointeeType.py lldb-api :: functionalities/data-formatter/data-formatter-objc/nsindexpath/TestDataFormatterNSIndexPath.py lldb-api :: functionalities/set-data/TestSetData.py lldb-api :: lang/objcxx/cxx-bridged-po/TestObjCXXBridgedPO.py lldb-api :: lang/objc/orderedset/TestOrderedSet.py lldb-api :: commands/expression/import_builtin_fileid/TestImportBuiltinFileID.py lldb-api :: functionalities/data-formatter/data-formatter-objc/TestDataFormatterObjCCF.py lldb-api :: lang/objc/objc-ivar-protocols/TestIvarProtocols.py lldb-api :: functionalities/data-formatter/data-formatter-objc/TestDataFormatterObjCNSContainer.py lldb-api :: lang/objc/foundation/TestObjCMethodsNSError.py lldb-api :: lang/objc/foundation/TestObjCMethodsNSArray.py lldb-api :: lang/objc/self/TestObjCSelf.py lldb-api :: lang/objc/objc++/TestObjCXX.py lldb-api :: commands/expression/context-object-objc/TestContextObjectObjc.py lldb-api :: lang/objc/objc-super/TestObjCSuper.py lldb-api :: commands/expression/namespace_local_var_same_name_obj_c/TestNamespaceLocalVarSameNameObjC.py lldb-api :: functionalities/data-formatter/poarray/TestPrintObjectArray.py lldb-api :: lang/objc/foundation/TestObjCMethodsString.py lldb-api :: lang/objc/blocks/TestObjCIvarsInBlocks.py lldb-api :: lang/objc/radar-9691614/TestObjCMethodReturningBOOL.py lldb-api :: functionalities/data-formatter/data-formatter-objc/TestDataFormatterObjCNSError.py lldb-api :: commands/expression/two-files/TestObjCTypeQueryFromOtherCompileUnit.py lldb-api :: lang/objc/objc-optimized/TestObjcOptimized.py lldb-api :: lang/objc/objc-struct-return/TestObjCStructReturn.py lldb-api :: lang/objc/objc-class-method/TestObjCClassMethod.py lldb-api :: lang/objc/hidden-ivars/TestHiddenIvars.py lldb-api :: commands/expression/po_verbosity/TestPoVerbosity.py lldb-api :: lang/objc/print-obj/TestPrintObj.py lldb-api :: lang/objc/bitfield_ivars/TestBitfieldIvars.py lldb-api :: lang/objc/foundation/TestConstStrings.py lldb-api :: lang/objc/conflicting-definition/TestConflictingDefinition.py lldb-api :: lang/objc/modules-non-objc-target/TestObjCModulesNonObjCTarget.py lldb-api :: lang/objc/modules/TestObjCModules.py lldb-api :: lang/objc/objc-new-syntax/TestObjCNewSyntaxArray.py lldb-api :: lang/objc/objc-new-syntax/TestObjCNewSyntaxLiteral.py lldb-api :: lang/objc/variadic_methods/TestVariadicMethods.py lldb-api :: lang/objc/objc_direct-methods/TestObjCDirectMethods.py lldb-api :: lang/objc/objc-static-method/TestObjCStaticMethod.py lldb-api :: lang/objc/objc-struct-argument/TestObjCStructArgument.py lldb-api :: lang/objc/forward-decl/TestForwardDecl.py lldb-api :: lang/objc/objc-runtime-ivars/TestRuntimeIvars.py lldb-api :: functionalities/data-formatter/data-formatter-objc/TestDataFormatterObjCExpr.py lldb-api :: lang/objcxx/objcxx-ivar-vector/TestIvarVector.py lldb-api :: commands/expression/diagnostics/TestExprDiagnostics.py lldb-api :: lang/objc/foundation/TestRuntimeTypes.py lldb-api :: lang/objc/foundation/TestObjCMethods.py lldb-api :: lang/objc/rdar-11355592/TestRdar11355592.py lldb-api :: python_api/exprpath_synthetic/TestExprPathSynthetic.py lldb-api :: lang/objc/unicode-string/TestUnicodeString.py lldb-api :: lang/objc/objc-new-syntax/TestObjCNewSyntaxDictionary.py lldb-api :: lang/objc/objc-property/TestObjCProperty.py lldb-api :: commands/expression/call-throws/TestCallThatThrows.py lldb-api :: functionalities/data-formatter/synthupdate/TestSyntheticFilterRecompute.py

Hide Details

Hide Details

Testing Time: 4221.08s Unsupported Tests : 170 Expected Passes : 1799 Expected Failures : 6 Unexpected Failures: 53 FAILED: tools/lldb/test/CMakeFiles/check-lldb-lit cd /Users/buildslave/jenkins/workspace/lldb-cmake-sanitized/lldb-build/tools/lldb/test && /usr/local/Frameworks/Python.framework/Versions/3.7/bin/python3.7 /Users/buildslave/jenkins/workspace/lldb-cmake-sanitized/lldb-build/./bin/llvm-lit -v --time-tests --shuffle --xunit-xml-output=/Users/buildslave/jenkins/workspace/lldb-cmake-sanitized/test/results.xml -v -j 4 --timeout 1200 /Users/buildslave/jenkins/workspace/lldb-cmake-sanitized/lldb-build/tools/lldb/test ninja: build stopped: subcommand failed. Command failed: Command '['/usr/bin/env', 'TERM=vt100', '/usr/local/bin/ninja', '-v', 'check-lldb']' returned non-zero exit status 1. Command: ['/usr/bin/env', 'TERM=vt100', '/usr/local/bin/ninja', '-v', 'check-lldb'] [Pipeline] } [Pipeline] // timeout [Pipeline] } [Pipeline] // stage [Pipeline] stage [Pipeline] { (Declarative: Post Actions) [Pipeline] scanForIssues [Clang (LLVM based)] Sleeping for 5 seconds due to JENKINS-32191... [Clang (LLVM based)] Parsing console log (workspace: '/Users/buildslave/jenkins/workspace/lldb-cmake-sanitized') [Clang (LLVM based)] Successfully parsed console log [Clang (LLVM based)] -> found 0 issues (skipped 0 duplicates) [Clang (LLVM based)] Skipping post processing [Clang (LLVM based)] No filter has been set, publishing all 0 issues [Pipeline] junit Recording test results [Pipeline] } [Pipeline] // stage [Pipeline] } [Pipeline] // withEnv [Pipeline] } [Pipeline] // node [Pipeline] End of Pipeline ERROR: script returned exit code 1 Finished: FAILURE