FailedConsole Output

Skipping 8,912 KB.. Full Log
0 @"1ST"
(const unichar [3]) myCharacters = {
  [0] = U+03c3 u'σ'
  [1] = U+0078 u'x'
  [2] = U+0078 u'x'
}
(NSString *) str7 = 0x0000603000003250 @"σxx"
(NSString *) str8 = 0x000061b000000780 @"hasVeryLongExtensionThisTimehasVeryLongExtensionThisTimehasVeryLongExtensionThisTimehasVeryLongExtensionThisTimehasVeryLongExtensionThisTimehasVeryLongExtensionThisTimehasVeryLongExtensionThisTimehasVeryLongExtensionThisTimehasVeryLongExtensionThisTimehasVeryLongExtensionThisTimehasVeryLongExtensionThisTimehasVeryLongExtensionThisTimehasVeryLongExtensionThisTimehasVeryLongExtensionThisTimehasVeryLongExtensionThisTimehasVeryLongExtensionThisTimehasVeryLongExtensionThisTimehasVeryLongExtensionThisTimehasVeryLongExtensionThisTimehasVeryLongExtensionThisTimehasVeryLongExtensionThisTimehasVeryLongExtensionThisTimehasVeryLongExtensionThisTimehasVeryLongExtensionThisTimehasVeryLongExtensionThisTimehasVeryLongExtensionThisTimehasVeryLongExtensionThisTimehasVeryLongExtensionThisTime"
(const unichar [54]) myOtherCharacters = {
  [0] = U+0061 u'a'
  [1] = U+0020 u' '
  [2] = U+0076 u'v'
  [3] = U+0065 u'e'
  [4] = U+0072 u'r'
  [5] = U+0079 u'y'
  [6] = U+0020 u' '
  [7] = U+006d u'm'
  [8] = U+0075 u'u'
  [9] = U+0063 u'c'
  [10] = U+0068 u'h'
  [11] = U+0020 u' '
  [12] = U+0062 u'b'
  [13] = U+006f u'o'
  [14] = U+0072 u'r'
  [15] = U+0069 u'i'
  [16] = U+006e u'n'
  [17] = U+0067 u'g'
  [18] = U+0020 u' '
  [19] = U+0074 u't'
  [20] = U+0061 u'a'
  [21] = U+0073 u's'
  [22] = U+006b u'k'
  [23] = U+0020 u' '
  [24] = U+0074 u't'
  [25] = U+006f u'o'
  [26] = U+0020 u' '
  [27] = U+0077 u'w'
  [28] = U+0072 u'r'
  [29] = U+0069 u'i'
  [30] = U+0074 u't'
  [31] = U+0065 u'e'
  [32] = U+0020 u' '
  [33] = U+0061 u'a'
  [34] = U+0020 u' '
  [35] = U+0073 u's'
  [36] = U+0074 u't'
  [37] = U+0072 u'r'
  [38] = U+0069 u'i'
  [39] = U+006e u'n'
  [40] = U+0067 u'g'
  [41] = U+0020 u' '
  [42] = U+0074 u't'
  [43] = U+0068 u'h'
  [44] = U+0069 u'i'
  [45] = U+0073 u's'
  [46] = U+0020 u' '
  [47] = U+0077 u'w'
  [48] = U+0061 u'a'
  [49] = U+0079 u'y'
  [50] = U+0021 u'!'
  [51] = U+0021 u'!'
  [52] = U+03c3 u'σ'
  [53] = U+0000 u'\0'
}
(NSString *) str9 = 0x000060d000001be0 @"a very much boring task to write a string this way!!σ\0"
(const unichar [2]) myNextCharacters = {
  [0] = U+03c3 u'σ'
  [1] = U+0000 u'\0'
}
(NSString *) str10 = 0x000060c000002200 @"This is a Unicode string σ number 4 right here"
(NSString *) str11 = 0x0000603000003280 @"__NSCFString"
(NSString *) label1 = 0x0000000100006210 @"Process Name: "
(NSString *) label2 = 0x0000000100006230 @"Process Id: "
(NSString *) processName = 0x00ef2f3f84ef0d97 @"a.out"
(NSString *) processID = 0x00ef687fddf65997 @"57653"
(NSString *) str12 = 0x0000606000008f00 @"Process Name:  a.out Process Id:  57653"
(NSString *) strA1 = 0x0000606000008f60 @"A rather short ASCII NSString object is here"
(NSString *) strA2 = 0x0000606000008fc0 @"A rather short UTF8 NSString object is here"
(NSString *) strA3 = 0x0000000100006170 @"A string made with the at sign is here"
(NSString *) strA4 = 0x0000606000009020 @"This is string number 4 right here"
(NSString *) strA5 = 0x00006040000019d0 @"{{1, 1}, {5, 5}}"
(NSString *) strA6 = 0x0000603000003310 @"1ST"
(NSString *) strA7 = 0x0000603000003340 @"σxx"
(NSString *) strA8 = 0x000061b000001580 @"hasVeryLongExtensionThisTimehasVeryLongExtensionThisTimehasVeryLongExtensionThisTimehasVeryLongExtensionThisTimehasVeryLongExtensionThisTimehasVeryLongExtensionThisTimehasVeryLongExtensionThisTimehasVeryLongExtensionThisTimehasVeryLongExtensionThisTimehasVeryLongExtensionThisTimehasVeryLongExtensionThisTimehasVeryLongExtensionThisTimehasVeryLongExtensionThisTimehasVeryLongExtensionThisTimehasVeryLongExtensionThisTimehasVeryLongExtensionThisTimehasVeryLongExtensionThisTimehasVeryLongExtensionThisTimehasVeryLongExtensionThisTimehasVeryLongExtensionThisTimehasVeryLongExtensionThisTimehasVeryLongExtensionThisTimehasVeryLongExtensionThisTimehasVeryLongExtensionThisTimehasVeryLongExtensionThisTimehasVeryLongExtensionThisTimehasVeryLongExtensionThisTimehasVeryLongExtensionThisTime"
(NSString *) strA9 = 0x000060d000001e50 @"a very much boring task to write a string this way!!σ\0"
(NSString *) strA10 = 0x000060c000002680 @"This is a Unicode string σ number 4 right here"
(NSString *) strA11 = 0x0000603000003370 @"__NSCFString"
(NSString *) strA12 = 0x0000606000009080 @"Process Name:  a.out Process Id:  57653"
(NSString *) strB1 = 0x00006060000090e0 @"A rather short ASCII NSString object is here"
(NSString *) strB2 = 0x0000606000009140 @"A rather short UTF8 NSString object is here"
(NSString *) strB3 = 0x0000000100006170 @"A string made with the at sign is here"
(NSString *) strB4 = 0x00006060000091a0 @"This is string number 4 right here"
(NSString *) strB5 = 0x0000604000001b10 @"{{1, 1}, {5, 5}}"
(NSString *) strB6 = 0x00006030000033a0 @"1ST"
(NSString *) strB7 = 0x00006030000033d0 @"σxx"
(NSString *) strB8 = 0x000061b000002380 @"hasVeryLongExtensionThisTimehasVeryLongExtensionThisTimehasVeryLongExtensionThisTimehasVeryLongExtensionThisTimehasVeryLongExtensionThisTimehasVeryLongExtensionThisTimehasVeryLongExtensionThisTimehasVeryLongExtensionThisTimehasVeryLongExtensionThisTimehasVeryLongExtensionThisTimehasVeryLongExtensionThisTimehasVeryLongExtensionThisTimehasVeryLongExtensionThisTimehasVeryLongExtensionThisTimehasVeryLongExtensionThisTimehasVeryLongExtensionThisTimehasVeryLongExtensionThisTimehasVeryLongExtensionThisTimehasVeryLongExtensionThisTimehasVeryLongExtensionThisTimehasVeryLongExtensionThisTimehasVeryLongExtensionThisTimehasVeryLongExtensionThisTimehasVeryLongExtensionThisTimehasVeryLongExtensionThisTimehasVeryLongExtensionThisTimehasVeryLongExtensionThisTimehasVeryLongExtensionThisTime"
(NSString *) strB9 = 0x000060d000001f20 @"a very much boring task to write a string this way!!σ\0"
(NSString *) strB10 = 0x000060c000002a40 @"This is a Unicode string σ number 4 right here"
(NSString *) strB11 = 0x0000603000003400 @"__NSCFString"
(NSString *) strB12 = 0x0000606000009200 @"Process Name:  a.out Process Id:  57653"
(NSString *) strC11 = 0x0000603000003430 @"__NSCFString"
(NSString *) strC12 = 0x0000606000009260 @"Process Name:  a.out Process Id:  57653"
(NSString *) strC1 = 0x00006060000092c0 @"A rather short ASCII NSString object is here"
(NSString *) strC2 = 0x0000606000009320 @"A rather short UTF8 NSString object is here"
(NSString *) strC3 = 0x0000000100006170 @"A string made with the at sign is here"
(NSString *) strC4 = 0x0000606000009380 @"This is string number 4 right here"
(NSString *) strC5 = 0x0000604000001c90 @"{{1, 1}, {5, 5}}"
(NSString *) strC6 = 0x0000603000003460 @"1ST"
(NSString *) strC7 = 0x0000603000003490 @"σxx"
(NSString *) strC8 = 0x000061b000003180 @"hasVeryLongExtensionThisTimehasVeryLongExtensionThisTimehasVeryLongExtensionThisTimehasVeryLongExtensionThisTimehasVeryLongExtensionThisTimehasVeryLongExtensionThisTimehasVeryLongExtensionThisTimehasVeryLongExtensionThisTimehasVeryLongExtensionThisTimehasVeryLongExtensionThisTimehasVeryLongExtensionThisTimehasVeryLongExtensionThisTimehasVeryLongExtensionThisTimehasVeryLongExtensionThisTimehasVeryLongExtensionThisTimehasVeryLongExtensionThisTimehasVeryLongExtensionThisTimehasVeryLongExtensionThisTimehasVeryLongExtensionThisTimehasVeryLongExtensionThisTimehasVeryLongExtensionThisTimehasVeryLongExtensionThisTimehasVeryLongExtensionThisTimehasVeryLongExtensionThisTimehasVeryLongExtensionThisTimehasVeryLongExtensionThisTimehasVeryLongExtensionThisTimehasVeryLongExtensionThisTime"
(NSString *) strC9 = 0x000060d000001ff0 @"a very much boring task to write a string this way!!σ\0"
(NSString *) strC10 = 0x000060c000002ec0 @"This is a Unicode string σ number 4 right here"
(NSString *) strD11 = 0x00006030000034c0 @"__NSCFString"
(NSString *) strD12 = 0x00006060000093e0 @"Process Name:  a.out Process Id:  57653"
(NSString *) eAcute = 0x0000603000003520 @"é"
(NSString *) randomHaziChar = 0x0000603000003580 @"鷅"
(NSString *) japanese = 0x00000001000062b0 @"色は匂へど散りぬるを"
(NSString *) italian = 0x00000001000062d0 @"L'Italia è una Repubblica democratica, fondata sul lavoro. La sovranità appartiene al popolo, che la esercita nelle forme e nei limiti della Costituzione."
(NSString *) french = 0x00000001000062f0 @"Que veut cette horde d'esclaves, De traîtres, de rois conjurés?"
(NSString *) german = 0x0000000100006310 @"Über-Ich und aus den Ansprüchen der sozialen Umwelt"
(void *[3]) data_set = ([0] = 0x0000606000008ba0, [1] = 0x0000606000008c00, [2] = 0x0000000100006170)
(NSString *) hebrew = 0x0000000100006330 @"לילה טוב"
(NSArray *) newArray = 0x0000604000001dd0 @"50 elements"
(NSDictionary *) newDictionary = 0x0000619000001980 12 key/value pairs
(NSDictionary *) newMutableDictionary = 0x0000603000003640 21 key/value pairs
(id [4]) cfKeys = {
  [0] = 0x0000000100006350
  [1] = 0x0000000100006610
  [2] = 0x0000000100006630
  [3] = 0x0000000100006650
}
(id [4]) cfValues = {
  [0] = 0x0000000100006350
  [1] = 0x0000000100006610
  [2] = 0x0000000100006630
  [3] = 0x0000000100006650
}
(NSDictionary *) nsDictionary = 0x00006060000095c0 2 key/value pairs
(NSDictionary *) nscfDictionary = 0x0000606000009620 4 key/value pairs
(CFDictionaryRef) cfDictionaryRef = 0x00006060000095c0 2 key/value pairs
(NSAttributedString *) attrString = 0x00006030000036d0 @"hello world from foo"
(NSAttributedString *) mutableAttrString = 0x0000603000003820 @"hello world from foo"
(NSString *) mutableString = 0x0000604000001f90 @"foo said this string needs to be very long so much longer than whatever other string has been seen ever before by anyone of the mankind that of course this is still not long enough given what foo our friend foo our lovely dearly friend foo desired of us so i am adding more stuff here for the sake of it and for the joy of our friend who is named guess what just foo. hence, dear friend foo, stay safe, your string is now  long enough to accommodate your testing need and I will make sure that if not we extend it with even more fuzzy random meaningless words pasted one after the other from a long tiresome friday evening spent working in my office. my office mate went home but I am still randomly typing just for the fun of seeing what happens of the length of a Mutable String in Cocoa if it goes beyond one byte.. so be it, dear foo"
(NSString *) mutableGetConst = 0x0000618000000080 @"foo said this string needs to be very long so much longer than whatever other string has been seen ever before by anyone of the mankind that of course this is still not long enough given what foo our friend foo our lovely dearly friend foo desired of us so i am adding more stuff here for the sake of it and for the joy of our friend who is named guess what just foo. hence, dear friend foo, stay safe, your string is now  long enough to accommodate your testing need and I will make sure that if not we extend it with even more fuzzy random meaningless words pasted one after the other from a long tiresome friday evening spent working in my office. my office mate went home but I am still randomly typing just for the fun of seeing what happens of the length of a Mutable String in Cocoa if it goes beyond one byte.. so be it, dear foo"
(NSData *) immutableData = 0x0000603000003880 5 bytes
(NSData *) mutableData = 0x0000604000002010 14 bytes
(unsigned int) concreteLength = 100000
(void *) zeroes1 = 0x0000633000000800
(NSData *) concreteData = 0x00006030000038b0 100000 bytes
(void *) zeroes2 = 0x000063300001c800
(NSMutableData *) concreteMutableData = 0x0000604000002050 100000 bytes
(NSSet *) nsset = 0x0000604000002090 3 elements
(NSSet *) nsmutableset = 0x0000603000003910 4 elements
(NSSet *) nscfSet = 0x00006040000020d0 2 elements
(CFSetRef) cfSetRef = 0x00006040000020d0 2 elements
(CFDataRef) data_ref = 0x0000607000003f20 @"5 bytes"
(CFMutableDataRef) mutable_data_ref = 0x0000607000003f90 @"5 bytes"
(CFMutableStringRef) mutable_string_ref = 0x0000604000002110 @"Wish ya knew"
(CFStringRef) cfstring_ref = 0x00000001000066d0 @"HELLO WORLD"
(CFArrayRef) cfarray_ref = 0x0000607000004000 @"3 elements"
(CFMutableArrayRef) mutable_array_ref = 0x0000604000002150 @"11 elements"
(CFBinaryHeapRef) binheap_ref = 0x000060c000003640 @"21 items"
(CFURLRef) cfurl_ref = 0x000060b000002350 @"http://www.foo.bar/"
(CFURLRef) cfchildurl_ref = 0x00006070000040e0 @"page.html -- http://www.foo.bar/"
(CFURLRef) cfgchildurl_ref = 0x0000607000004150 @"?whatever -- http://www.foo.bar/page.html"
(NSDictionary *) error_userInfo = 0x0000606000009e60 2 key/value pairs
(NSError *) nserror = 0x0000604000002290 domain: @"Foobar" - code: 12
(NSError **) nserrorptr = 0x00007ffeefbfee28 domain: @"Foobar" - code: 12
(NSBundle *) bundle_string = 0x0000607000004310 @"/System/Library/Frameworks/Accelerate.framework"
(NSBundle *) bundle_url = 0x0000607000004af0 @"/System/Library/Frameworks/Foundation.framework"
(NSBundle *) main_bundle = 0x0000607000004cb0 @"/Users/buildslave/jenkins/workspace/lldb-cmake-sanitized/lldb-build/lldb-test-build.noindex/functionalities/data-formatter/data-formatter-objc/TestDataFormatterObjCCF.test_coreframeworks_and_run_command_dsym"
(NSArray *) bundles = 0x0000604000002450 @"1 element"
(NSURL *) nsurl0 = 0x0000608000001320 @"file:///Users/buildslave/jenkins/workspace/lldb-cmake-sanitized/lldb-build/lldb-test-build.noindex/functionalities/data-formatter/data-formatter-objc/TestDataFormatterObjCCF.test_coreframeworks_and_run_command_dsym/"
(NSException *) except0 = 0x00006040000024d0 @"First"
(NSException *) except1 = 0x0000604000002510 @"Second"
(NSException *) except2 = 0x0000604000002550 @"Third"
(NSException *) except3 = 0x0000604000002590 @"Fourth"
(NSURL *) nsurl = 0x000060b0000028d0 @"http://www.foo.bar"
(NSURL *) nsurl2 = 0x0000607000004ee0 @"page.html -- http://www.foo.bar"
(NSURL *) nsurl3 = 0x0000607000004f50 @"?whatever -- http://www.foo.bar/page.html"
(NSDate *) date1 = 0xc152cfb68bc16ccf 1985-04-10 18:00:00 UTC
(NSDate *) date2 = 0x0000604000008e90 2011-01-01 08:00:00 UTC
(NSDate *) date3 = 0x0000602000003bb0 2020-06-01 12:40:55 UTC
(NSDate *) date4 = 0xc1227c716bc16ccf 1970-01-02 00:00:00 UTC
(NSDate *) date5 = 0x412d19dd80416ccf 2020-06-01 12:40:55 UTC
(CFAbsoluteTime) date1_abs = 1985-04-10 10:00:00 PST
(CFAbsoluteTime) date2_abs = 2011-01-01 00:00:00 PST
(CFAbsoluteTime) date3_abs = 2020-06-01 05:40:55 PDT
(CFAbsoluteTime) date4_abs = 1970-01-01 16:00:00 PST
(CFAbsoluteTime) date5_abs = 2020-06-01 05:40:55 PDT
(NSIndexSet *) iset1 = 0x0000603000009820 4 indexes
(NSIndexSet *) iset2 = 0x0000603000009850 512 indexes
(NSMutableIndexSet *) imset = 0x0000604000008f10 10 indexes
(CFTimeZoneRef) cupertino = 0x0000608000001a20 @"America/Los_Angeles"
(CFTimeZoneRef) home = 0x0000608000001ba0 @"Europe/Rome"
(CFTimeZoneRef) europe = 0x0000608000001d20 @"Europe/Paris"
(NSTimeZone *) cupertino_ns = 0x0000608000001a20 @"America/Los_Angeles"
(NSTimeZone *) home_ns = 0x0000608000001ba0 @"Europe/Rome"
(NSTimeZone *) europe_ns = 0x0000608000001d20 @"Europe/Paris"
(CFGregorianUnits) cf_greg_units = 1 years, 3 months, 5 days, 12 hours, 5 minutes 7 seconds
(CFGregorianDate) cf_greg_date = @"4/10/1985 18:0:0"
(CFRange) cf_range = location=4 length=4
(NSPoint) ns_point = (x = 4, y = 4)
(NSRange) ns_range = location=4, length=4
(NSRect) ns_rect = (origin = (x = 1, y = 1), size = (width = 5, height = 5))
(NSRect *) ns_rect_ptr = (origin = (x = 1, y = 1), size = (width = 5, height = 5))
(NSRectArray) ns_rect_arr = ((x = 1, y = 1), (width = 5, height = 5)), ...
(NSSize) ns_size = (width = 5, height = 7)
(NSSize *) ns_size_ptr = (width = 5, height = 7)
(CGSize) cg_size = (width = 1, height = 6)
(CGPoint) cg_point = (x = 2, y = 7)
(CGRect) cg_rect = (origin = (x = 1, y = 2), size = (width = 7, height = 7))
(RGBColor) rgb_color = red=3 green=56 blue=35
(RGBColor *) rgb_color_ptr = red=3 green=56 blue=35
(Rect) rect = (t=4, l=8, b=4, r=7)
(Rect *) rect_ptr = (t=4, l=8, b=4, r=7)
(Point) point = (v=7, h=12)
(Point *) point_ptr = (v=7, h=12)
(HIPoint) hi_point = (x=7, y=12)
(HIRect) hi_rect = origin=(x = 3, y = 5) size=(width = 4, height = 6)
(SEL) foo_selector = "foo_selector_impl"
(CFMutableBitVectorRef) mut_bv = 0x0000604000009490 1110 0110 1011 0000 1101 1010 1000 1111 0011 0101 1101 0001 00
(Molecule *) molecule = 0x0000602000003c50
(Class) myclass = NSValue
(Class) myclass2 = NSTaggedPointerString
(Class) myclass3 = Molecule
(Class) myclass4 = NSMutableArray
(Class) myclass5 = nil
(NSArray *) components = 0x00006040000094d0 @"3 elements"
(NSString *) path = 0x0000604000009510 @"usr/blah/stuff"

Hide Details

Hide Details

Expecting sub string: (CFGregorianUnits) cf_greg_units = 1 years, 3 months, 5 days, 12 hours, 5 minutes 7 seconds Matched

Hide Details

Expecting sub string: (CFGregorianDate) cf_greg_date = @"4/10/1985 18:0:0" Matched

Hide Details

Expecting sub string: (CFRange) cf_range = location=4 length=4 Matched

Hide Details

Expecting sub string: (NSPoint) ns_point = (x = 4, y = 4) Matched

Hide Details

Expecting sub string: (NSRange) ns_range = location=4, length=4 Matched

Hide Details

Expecting sub string: (NSRect) ns_rect = (origin = (x = 1, y = 1), size = (width = 5, height = 5)) Matched

Hide Details

Expecting sub string: (NSRectArray) ns_rect_arr = ((x = 1, y = 1), (width = 5, height = 5)), ... Matched

Hide Details

Expecting sub string: (NSSize) ns_size = (width = 5, height = 7) Matched

Hide Details

Expecting sub string: (CGSize) cg_size = (width = 1, height = 6) Matched

Hide Details

Expecting sub string: (CGPoint) cg_point = (x = 2, y = 7) Matched

Hide Details

Expecting sub string: (CGRect) cg_rect = (origin = (x = 1, y = 2), size = (width = 7, height = 7)) Matched

Hide Details

Expecting sub string: (Rect) rect = (t=4, l=8, b=4, r=7) Matched

Hide Details

Expecting sub string: (Rect *) rect_ptr = (t=4, l=8, b=4, r=7) Matched

Hide Details

Expecting sub string: (Point) point = (v=7, h=12) Matched

Hide Details

Expecting sub string: (Point *) point_ptr = (v=7, h=12) Matched

Hide Details

Expecting sub string: (SEL) foo_selector = "foo_selector_impl" Matched

Hide Details

runCmd: frame variable output: (int) argc = 1 (const char **) argv = 0x00007ffeefbff420 (NSAutoreleasePool *) pool = 0x00006040000016d0 (MyClass *) object = 0x0000603000002f20 (MyOtherClass *) object2 = 0x0000603000002f50 (NSNumber *) num1 = 0x00ef5b4aebc169e5 (int)5 (NSNumber *) num2 = 0x0000603000002fe0 (float)3.140000 (NSNumber *) num3 = 0x0000603000003010 (double)3.14 (NSNumber *) num4 = 0x0000603000003040 (int128_t)18446744073709551614 (NSNumber *) num5 = 0x00ef5b4aebc12dc5 (char)65 (NSNumber *) num6 = 0x00ef5b4aebc193f5 (long)255 (NSNumber *) num7 = 0x00ef5b4af545ecf5 (long)2000000 (NSNumber *) num8_Y = 0x00007fffa3c4dc30 YES (NSNumber *) num8_N = 0x00007fffa3c4dc40 NO (NSNumber *) num9 = 0xff10a4b51445ecd5 (short)-31616 (NSNumber *) num_at1 = 0x00ef5b4aebc160e5 (int)12 (NSNumber *) num_at2 = 0xff10a4b5143e98e5 (int)-12 (NSNumber *) num_at3 = 0x0000603000003070 (double)12.5 (NSNumber *) num_at4 = 0x00006030000030a0 (double)-12.5 (NSDecimalNumber *) decimal_number = 0x00006030000030d0 123456 x 10^-10 (NSDecimalNumber *) decimal_number_neg = 0x0000603000003100 -123456 x 10^10 (NSDecimalNumber *) decimal_one = 0x0000603000003130 1 x 10^0 (NSDecimalNumber *) decimal_zero = 0x0000602000002370 0 (NSDecimalNumber *) decimal_nan = 0x0000602000002390 NaN (NSString *) str0 = 0x00ef5b4adef45ef7 @"255" (NSString *) str1 = 0x0000606000008ba0 @"A rather short ASCII NSString object is here" (NSString *) str2 = 0x0000606000008c00 @"A rather short UTF8 NSString object is here" (NSString *) str3 = 0x0000000100006170 @"A string made with the at sign is here" (NSString *) str4 = 0x0000606000008c60 @"This is string number 4 right here" (NSRect) ns_rect_4str = (origin = (x = 1, y = 1), size = (width = 5, height = 5)) (NSString *) str5 = 0x0000604000001810 @"{{1, 1}, {5, 5}}" (NSString *) str6 = 0x0000603000003220 @"1ST" (const unichar [3]) myCharacters = { [0] = U+03c3 u'σ' [1] = U+0078 u'x' [2] = U+0078 u'x' } (NSString *) str7 = 0x0000603000003250 @"σxx" (NSString *) str8 = 0x000061b000000780 @"hasVeryLongExtensionThisTimehasVeryLongExtensionThisTimehasVeryLongExtensionThisTimehasVeryLongExtensionThisTimehasVeryLongExtensionThisTimehasVeryLongExtensionThisTimehasVeryLongExtensionThisTimehasVeryLongExtensionThisTimehasVeryLongExtensionThisTimehasVeryLongExtensionThisTimehasVeryLongExtensionThisTimehasVeryLongExtensionThisTimehasVeryLongExtensionThisTimehasVeryLongExtensionThisTimehasVeryLongExtensionThisTimehasVeryLongExtensionThisTimehasVeryLongExtensionThisTimehasVeryLongExtensionThisTimehasVeryLongExtensionThisTimehasVeryLongExtensionThisTimehasVeryLongExtensionThisTimehasVeryLongExtensionThisTimehasVeryLongExtensionThisTimehasVeryLongExtensionThisTimehasVeryLongExtensionThisTimehasVeryLongExtensionThisTimehasVeryLongExtensionThisTimehasVeryLongExtensionThisTime" (const unichar [54]) myOtherCharacters = { [0] = U+0061 u'a' [1] = U+0020 u' ' [2] = U+0076 u'v' [3] = U+0065 u'e' [4] = U+0072 u'r' [5] = U+0079 u'y' [6] = U+0020 u' ' [7] = U+006d u'm' [8] = U+0075 u'u' [9] = U+0063 u'c' [10] = U+0068 u'h' [11] = U+0020 u' ' [12] = U+0062 u'b' [13] = U+006f u'o' [14] = U+0072 u'r' [15] = U+0069 u'i' [16] = U+006e u'n' [17] = U+0067 u'g' [18] = U+0020 u' ' [19] = U+0074 u't' [20] = U+0061 u'a' [21] = U+0073 u's' [22] = U+006b u'k' [23] = U+0020 u' ' [24] = U+0074 u't' [25] = U+006f u'o' [26] = U+0020 u' ' [27] = U+0077 u'w' [28] = U+0072 u'r' [29] = U+0069 u'i' [30] = U+0074 u't' [31] = U+0065 u'e' [32] = U+0020 u' ' [33] = U+0061 u'a' [34] = U+0020 u' ' [35] = U+0073 u's' [36] = U+0074 u't' [37] = U+0072 u'r' [38] = U+0069 u'i' [39] = U+006e u'n' [40] = U+0067 u'g' [41] = U+0020 u' ' [42] = U+0074 u't' [43] = U+0068 u'h' [44] = U+0069 u'i' [45] = U+0073 u's' [46] = U+0020 u' ' [47] = U+0077 u'w' [48] = U+0061 u'a' [49] = U+0079 u'y' [50] = U+0021 u'!' [51] = U+0021 u'!' [52] = U+03c3 u'σ' [53] = U+0000 u'\0' } (NSString *) str9 = 0x000060d000001be0 @"a very much boring task to write a string this way!!σ\0" (const unichar [2]) myNextCharacters = { [0] = U+03c3 u'σ' [1] = U+0000 u'\0' } (NSString *) str10 = 0x000060c000002200 @"This is a Unicode string σ number 4 right here" (NSString *) str11 = 0x0000603000003280 @"__NSCFString" (NSString *) label1 = 0x0000000100006210 @"Process Name: " (NSString *) label2 = 0x0000000100006230 @"Process Id: " (NSString *) processName = 0x00ef2f3f84ef0d97 @"a.out" (NSString *) processID = 0x00ef687fddf65997 @"57653" (NSString *) str12 = 0x0000606000008f00 @"Process Name: a.out Process Id: 57653" (NSString *) strA1 = 0x0000606000008f60 @"A rather short ASCII NSString object is here" (NSString *) strA2 = 0x0000606000008fc0 @"A rather short UTF8 NSString object is here" (NSString *) strA3 = 0x0000000100006170 @"A string made with the at sign is here" (NSString *) strA4 = 0x0000606000009020 @"This is string number 4 right here" (NSString *) strA5 = 0x00006040000019d0 @"{{1, 1}, {5, 5}}" (NSString *) strA6 = 0x0000603000003310 @"1ST" (NSString *) strA7 = 0x0000603000003340 @"σxx" (NSString *) strA8 = 0x000061b000001580 @"hasVeryLongExtensionThisTimehasVeryLongExtensionThisTimehasVeryLongExtensionThisTimehasVeryLongExtensionThisTimehasVeryLongExtensionThisTimehasVeryLongExtensionThisTimehasVeryLongExtensionThisTimehasVeryLongExtensionThisTimehasVeryLongExtensionThisTimehasVeryLongExtensionThisTimehasVeryLongExtensionThisTimehasVeryLongExtensionThisTimehasVeryLongExtensionThisTimehasVeryLongExtensionThisTimehasVeryLongExtensionThisTimehasVeryLongExtensionThisTimehasVeryLongExtensionThisTimehasVeryLongExtensionThisTimehasVeryLongExtensionThisTimehasVeryLongExtensionThisTimehasVeryLongExtensionThisTimehasVeryLongExtensionThisTimehasVeryLongExtensionThisTimehasVeryLongExtensionThisTimehasVeryLongExtensionThisTimehasVeryLongExtensionThisTimehasVeryLongExtensionThisTimehasVeryLongExtensionThisTime" (NSString *) strA9 = 0x000060d000001e50 @"a very much boring task to write a string this way!!σ\0" (NSString *) strA10 = 0x000060c000002680 @"This is a Unicode string σ number 4 right here" (NSString *) strA11 = 0x0000603000003370 @"__NSCFString" (NSString *) strA12 = 0x0000606000009080 @"Process Name: a.out Process Id: 57653" (NSString *) strB1 = 0x00006060000090e0 @"A rather short ASCII NSString object is here" (NSString *) strB2 = 0x0000606000009140 @"A rather short UTF8 NSString object is here" (NSString *) strB3 = 0x0000000100006170 @"A string made with the at sign is here" (NSString *) strB4 = 0x00006060000091a0 @"This is string number 4 right here" (NSString *) strB5 = 0x0000604000001b10 @"{{1, 1}, {5, 5}}" (NSString *) strB6 = 0x00006030000033a0 @"1ST" (NSString *) strB7 = 0x00006030000033d0 @"σxx" (NSString *) strB8 = 0x000061b000002380 @"hasVeryLongExtensionThisTimehasVeryLongExtensionThisTimehasVeryLongExtensionThisTimehasVeryLongExtensionThisTimehasVeryLongExtensionThisTimehasVeryLongExtensionThisTimehasVeryLongExtensionThisTimehasVeryLongExtensionThisTimehasVeryLongExtensionThisTimehasVeryLongExtensionThisTimehasVeryLongExtensionThisTimehasVeryLongExtensionThisTimehasVeryLongExtensionThisTimehasVeryLongExtensionThisTimehasVeryLongExtensionThisTimehasVeryLongExtensionThisTimehasVeryLongExtensionThisTimehasVeryLongExtensionThisTimehasVeryLongExtensionThisTimehasVeryLongExtensionThisTimehasVeryLongExtensionThisTimehasVeryLongExtensionThisTimehasVeryLongExtensionThisTimehasVeryLongExtensionThisTimehasVeryLongExtensionThisTimehasVeryLongExtensionThisTimehasVeryLongExtensionThisTimehasVeryLongExtensionThisTime" (NSString *) strB9 = 0x000060d000001f20 @"a very much boring task to write a string this way!!σ\0" (NSString *) strB10 = 0x000060c000002a40 @"This is a Unicode string σ number 4 right here" (NSString *) strB11 = 0x0000603000003400 @"__NSCFString" (NSString *) strB12 = 0x0000606000009200 @"Process Name: a.out Process Id: 57653" (NSString *) strC11 = 0x0000603000003430 @"__NSCFString" (NSString *) strC12 = 0x0000606000009260 @"Process Name: a.out Process Id: 57653" (NSString *) strC1 = 0x00006060000092c0 @"A rather short ASCII NSString object is here" (NSString *) strC2 = 0x0000606000009320 @"A rather short UTF8 NSString object is here" (NSString *) strC3 = 0x0000000100006170 @"A string made with the at sign is here" (NSString *) strC4 = 0x0000606000009380 @"This is string number 4 right here" (NSString *) strC5 = 0x0000604000001c90 @"{{1, 1}, {5, 5}}" (NSString *) strC6 = 0x0000603000003460 @"1ST" (NSString *) strC7 = 0x0000603000003490 @"σxx" (NSString *) strC8 = 0x000061b000003180 @"hasVeryLongExtensionThisTimehasVeryLongExtensionThisTimehasVeryLongExtensionThisTimehasVeryLongExtensionThisTimehasVeryLongExtensionThisTimehasVeryLongExtensionThisTimehasVeryLongExtensionThisTimehasVeryLongExtensionThisTimehasVeryLongExtensionThisTimehasVeryLongExtensionThisTimehasVeryLongExtensionThisTimehasVeryLongExtensionThisTimehasVeryLongExtensionThisTimehasVeryLongExtensionThisTimehasVeryLongExtensionThisTimehasVeryLongExtensionThisTimehasVeryLongExtensionThisTimehasVeryLongExtensionThisTimehasVeryLongExtensionThisTimehasVeryLongExtensionThisTimehasVeryLongExtensionThisTimehasVeryLongExtensionThisTimehasVeryLongExtensionThisTimehasVeryLongExtensionThisTimehasVeryLongExtensionThisTimehasVeryLongExtensionThisTimehasVeryLongExtensionThisTimehasVeryLongExtensionThisTime" (NSString *) strC9 = 0x000060d000001ff0 @"a very much boring task to write a string this way!!σ\0" (NSString *) strC10 = 0x000060c000002ec0 @"This is a Unicode string σ number 4 right here" (NSString *) strD11 = 0x00006030000034c0 @"__NSCFString" (NSString *) strD12 = 0x00006060000093e0 @"Process Name: a.out Process Id: 57653" (NSString *) eAcute = 0x0000603000003520 @"é" (NSString *) randomHaziChar = 0x0000603000003580 @"鷅" (NSString *) japanese = 0x00000001000062b0 @"色は匂へど散りぬるを" (NSString *) italian = 0x00000001000062d0 @"L'Italia è una Repubblica democratica, fondata sul lavoro. La sovranità appartiene al popolo, che la esercita nelle forme e nei limiti della Costituzione." (NSString *) french = 0x00000001000062f0 @"Que veut cette horde d'esclaves, De traîtres, de rois conjurés?" (NSString *) german = 0x0000000100006310 @"Über-Ich und aus den Ansprüchen der sozialen Umwelt" (void *[3]) data_set = ([0] = 0x0000606000008ba0, [1] = 0x0000606000008c00, [2] = 0x0000000100006170) (NSString *) hebrew = 0x0000000100006330 @"לילה טוב" (NSArray *) newArray = 0x0000604000001dd0 @"50 elements" (NSDictionary *) newDictionary = 0x0000619000001980 12 key/value pairs (NSDictionary *) newMutableDictionary = 0x0000603000003640 21 key/value pairs (id [4]) cfKeys = { [0] = 0x0000000100006350 [1] = 0x0000000100006610 [2] = 0x0000000100006630 [3] = 0x0000000100006650 } (id [4]) cfValues = { [0] = 0x0000000100006350 [1] = 0x0000000100006610 [2] = 0x0000000100006630 [3] = 0x0000000100006650 } (NSDictionary *) nsDictionary = 0x00006060000095c0 2 key/value pairs (NSDictionary *) nscfDictionary = 0x0000606000009620 4 key/value pairs (CFDictionaryRef) cfDictionaryRef = 0x00006060000095c0 2 key/value pairs (NSAttributedString *) attrString = 0x00006030000036d0 @"hello world from foo" (NSAttributedString *) mutableAttrString = 0x0000603000003820 @"hello world from foo" (NSString *) mutableString = 0x0000604000001f90 @"foo said this string needs to be very long so much longer than whatever other string has been seen ever before by anyone of the mankind that of course this is still not long enough given what foo our friend foo our lovely dearly friend foo desired of us so i am adding more stuff here for the sake of it and for the joy of our friend who is named guess what just foo. hence, dear friend foo, stay safe, your string is now long enough to accommodate your testing need and I will make sure that if not we extend it with even more fuzzy random meaningless words pasted one after the other from a long tiresome friday evening spent working in my office. my office mate went home but I am still randomly typing just for the fun of seeing what happens of the length of a Mutable String in Cocoa if it goes beyond one byte.. so be it, dear foo" (NSString *) mutableGetConst = 0x0000618000000080 @"foo said this string needs to be very long so much longer than whatever other string has been seen ever before by anyone of the mankind that of course this is still not long enough given what foo our friend foo our lovely dearly friend foo desired of us so i am adding more stuff here for the sake of it and for the joy of our friend who is named guess what just foo. hence, dear friend foo, stay safe, your string is now long enough to accommodate your testing need and I will make sure that if not we extend it with even more fuzzy random meaningless words pasted one after the other from a long tiresome friday evening spent working in my office. my office mate went home but I am still randomly typing just for the fun of seeing what happens of the length of a Mutable String in Cocoa if it goes beyond one byte.. so be it, dear foo" (NSData *) immutableData = 0x0000603000003880 5 bytes (NSData *) mutableData = 0x0000604000002010 14 bytes (unsigned int) concreteLength = 100000 (void *) zeroes1 = 0x0000633000000800 (NSData *) concreteData = 0x00006030000038b0 100000 bytes (void *) zeroes2 = 0x000063300001c800 (NSMutableData *) concreteMutableData = 0x0000604000002050 100000 bytes (NSSet *) nsset = 0x0000604000002090 3 elements (NSSet *) nsmutableset = 0x0000603000003910 4 elements (NSSet *) nscfSet = 0x00006040000020d0 2 elements (CFSetRef) cfSetRef = 0x00006040000020d0 2 elements (CFDataRef) data_ref = 0x0000607000003f20 @"5 bytes" (CFMutableDataRef) mutable_data_ref = 0x0000607000003f90 @"5 bytes" (CFMutableStringRef) mutable_string_ref = 0x0000604000002110 @"Wish ya knew" (CFStringRef) cfstring_ref = 0x00000001000066d0 @"HELLO WORLD" (CFArrayRef) cfarray_ref = 0x0000607000004000 @"3 elements" (CFMutableArrayRef) mutable_array_ref = 0x0000604000002150 @"11 elements" (CFBinaryHeapRef) binheap_ref = 0x000060c000003640 @"21 items" (CFURLRef) cfurl_ref = 0x000060b000002350 @"http://www.foo.bar/" (CFURLRef) cfchildurl_ref = 0x00006070000040e0 @"page.html -- http://www.foo.bar/" (CFURLRef) cfgchildurl_ref = 0x0000607000004150 @"?whatever -- http://www.foo.bar/page.html" (NSDictionary *) error_userInfo = 0x0000606000009e60 2 key/value pairs (NSError *) nserror = 0x0000604000002290 domain: @"Foobar" - code: 12 (NSError **) nserrorptr = 0x00007ffeefbfee28 domain: @"Foobar" - code: 12 (NSBundle *) bundle_string = 0x0000607000004310 @"/System/Library/Frameworks/Accelerate.framework" (NSBundle *) bundle_url = 0x0000607000004af0 @"/System/Library/Frameworks/Foundation.framework" (NSBundle *) main_bundle = 0x0000607000004cb0 @"/Users/buildslave/jenkins/workspace/lldb-cmake-sanitized/lldb-build/lldb-test-build.noindex/functionalities/data-formatter/data-formatter-objc/TestDataFormatterObjCCF.test_coreframeworks_and_run_command_dsym" (NSArray *) bundles = 0x0000604000002450 @"1 element" (NSURL *) nsurl0 = 0x0000608000001320 @"file:///Users/buildslave/jenkins/workspace/lldb-cmake-sanitized/lldb-build/lldb-test-build.noindex/functionalities/data-formatter/data-formatter-objc/TestDataFormatterObjCCF.test_coreframeworks_and_run_command_dsym/" (NSException *) except0 = 0x00006040000024d0 @"First" (NSException *) except1 = 0x0000604000002510 @"Second" (NSException *) except2 = 0x0000604000002550 @"Third" (NSException *) except3 = 0x0000604000002590 @"Fourth" (NSURL *) nsurl = 0x000060b0000028d0 @"http://www.foo.bar" (NSURL *) nsurl2 = 0x0000607000004ee0 @"page.html -- http://www.foo.bar" (NSURL *) nsurl3 = 0x0000607000004f50 @"?whatever -- http://www.foo.bar/page.html" (NSDate *) date1 = 0xc152cfb68bc16ccf 1985-04-10 18:00:00 UTC (NSDate *) date2 = 0x0000604000008e90 2011-01-01 08:00:00 UTC (NSDate *) date3 = 0x0000602000003bb0 2020-06-01 12:40:55 UTC (NSDate *) date4 = 0xc1227c716bc16ccf 1970-01-02 00:00:00 UTC (NSDate *) date5 = 0x412d19dd80416ccf 2020-06-01 12:40:55 UTC (CFAbsoluteTime) date1_abs = 1985-04-10 10:00:00 PST (CFAbsoluteTime) date2_abs = 2011-01-01 00:00:00 PST (CFAbsoluteTime) date3_abs = 2020-06-01 05:40:55 PDT (CFAbsoluteTime) date4_abs = 1970-01-01 16:00:00 PST (CFAbsoluteTime) date5_abs = 2020-06-01 05:40:55 PDT (NSIndexSet *) iset1 = 0x0000603000009820 4 indexes (NSIndexSet *) iset2 = 0x0000603000009850 512 indexes (NSMutableIndexSet *) imset = 0x0000604000008f10 10 indexes (CFTimeZoneRef) cupertino = 0x0000608000001a20 @"America/Los_Angeles" (CFTimeZoneRef) home = 0x0000608000001ba0 @"Europe/Rome" (CFTimeZoneRef) europe = 0x0000608000001d20 @"Europe/Paris" (NSTimeZone *) cupertino_ns = 0x0000608000001a20 @"America/Los_Angeles" (NSTimeZone *) home_ns = 0x0000608000001ba0 @"Europe/Rome" (NSTimeZone *) europe_ns = 0x0000608000001d20 @"Europe/Paris" (CFGregorianUnits) cf_greg_units = 1 years, 3 months, 5 days, 12 hours, 5 minutes 7 seconds (CFGregorianDate) cf_greg_date = @"4/10/1985 18:0:0" (CFRange) cf_range = location=4 length=4 (NSPoint) ns_point = (x = 4, y = 4) (NSRange) ns_range = location=4, length=4 (NSRect) ns_rect = (origin = (x = 1, y = 1), size = (width = 5, height = 5)) (NSRect *) ns_rect_ptr = (origin = (x = 1, y = 1), size = (width = 5, height = 5)) (NSRectArray) ns_rect_arr = ((x = 1, y = 1), (width = 5, height = 5)), ... (NSSize) ns_size = (width = 5, height = 7) (NSSize *) ns_size_ptr = (width = 5, height = 7) (CGSize) cg_size = (width = 1, height = 6) (CGPoint) cg_point = (x = 2, y = 7) (CGRect) cg_rect = (origin = (x = 1, y = 2), size = (width = 7, height = 7)) (RGBColor) rgb_color = red=3 green=56 blue=35 (RGBColor *) rgb_color_ptr = red=3 green=56 blue=35 (Rect) rect = (t=4, l=8, b=4, r=7) (Rect *) rect_ptr = (t=4, l=8, b=4, r=7) (Point) point = (v=7, h=12) (Point *) point_ptr = (v=7, h=12) (HIPoint) hi_point = (x=7, y=12) (HIRect) hi_rect = origin=(x = 3, y = 5) size=(width = 4, height = 6) (SEL) foo_selector = "foo_selector_impl" (CFMutableBitVectorRef) mut_bv = 0x0000604000009490 1110 0110 1011 0000 1101 1010 1000 1111 0011 0101 1101 0001 00 (Molecule *) molecule = 0x0000602000003c50 (Class) myclass = NSValue (Class) myclass2 = NSTaggedPointerString (Class) myclass3 = Molecule (Class) myclass4 = NSMutableArray (Class) myclass5 = nil (NSArray *) components = 0x00006040000094d0 @"3 elements" (NSString *) path = 0x0000604000009510 @"usr/blah/stuff"

Hide Details

Hide Details

Expecting sub string: (RGBColor) rgb_color = red=3 green=56 blue=35 Matched

Hide Details

Expecting sub string: (RGBColor *) rgb_color_ptr = red=3 green=56 blue=35 Matched

Hide Details

Expecting sub string: (HIPoint) hi_point = (x=7, y=12) Matched

Hide Details

Expecting sub string: (HIRect) hi_rect = origin=(x = 3, y = 5) size=(width = 4, height = 6) Matched

Hide Details

<bound method SBProcess.Kill of <lldb.SBProcess; proxy of <Swig Object of type 'lldb::SBProcess *' at 0x10a8f1390> >>: success

Hide Details

PASS: LLDB (/Users/buildslave/jenkins/workspace/lldb-cmake-sanitized/lldb-build/bin/clang-11-x86_64) :: test_coreframeworks_and_run_command_dsym (TestDataFormatterObjCCF.ObjCDataFormatterCF) runCmd: settings clear -all output:

Hide Details

runCmd: settings set symbols.enable-external-lookup false output:

Hide Details

runCmd: settings set target.auto-apply-fixits false output:

Hide Details

runCmd: settings set plugin.process.gdb-remote.packet-timeout 60 output:

Hide Details

runCmd: settings set symbols.clang-modules-cache-path "/Users/buildslave/jenkins/workspace/lldb-cmake-sanitized/lldb-build/lldb-test-build.noindex/module-cache-lldb/lldb-api" output:

Hide Details

runCmd: settings set use-color false output:

Hide Details

runCmd: setting set target.prefer-dynamic-value no-dynamic-values output:

Hide Details

runCmd: settings set target.env-vars ASAN_OPTIONS=detect_stack_use_after_return=1 DYLD_INSERT_LIBRARIES=/Users/buildslave/jenkins/workspace/lldb-cmake-sanitized/host-compiler/lib/clang/11.0.0/lib/darwin/libclang_rt.asan_osx_dynamic.dylib output:

Hide Details

runCmd: settings set target.env-vars ASAN_OPTIONS=detect_stack_use_after_return=1 DYLD_INSERT_LIBRARIES=/Users/buildslave/jenkins/workspace/lldb-cmake-sanitized/host-compiler/lib/clang/11.0.0/lib/darwin/libclang_rt.asan_osx_dynamic.dylib output:

Hide Details

runCmd: thread list output: Process 57968 stopped * thread #1: tid = 0xaf2a42, 0x000000010000489b a.out`main(argc=1, argv=0x00007ffeefbff420) at main.m:770:4, queue = 'com.apple.main-thread', stop reason = breakpoint 1.1 thread #2: tid = 0xaf2a75, 0x00007fff794f85be libsystem_kernel.dylib`__workq_kernreturn + 10 thread #3: tid = 0xaf2a76, 0x00007fff794f85be libsystem_kernel.dylib`__workq_kernreturn + 10

Hide Details

Hide Details

Expecting sub string: stopped Matched

Hide Details

Expecting sub string: stop reason = breakpoint Matched

Hide Details

runCmd: frame variable output: (int) argc = 1 (const char **) argv = 0x00007ffeefbff420 (NSAutoreleasePool *) pool = 0x00006040000016d0 (MyClass *) object = 0x0000603000002f20 (MyOtherClass *) object2 = 0x0000603000002f50 (NSNumber *) num1 = 0x9469a1897fc49c2f (int)5 (NSNumber *) num2 = 0x0000603000002fe0 (float)3.140000 (NSNumber *) num3 = 0x0000603000003010 (double)3.14 (NSNumber *) num4 = 0x0000603000003040 (int128_t)18446744073709551614 (NSNumber *) num5 = 0x9469a1897fc4d80f (char)65 (NSNumber *) num6 = 0x9469a1897fc4663f (long)255 (NSNumber *) num7 = 0x9469a1896140193f (long)2000000 (NSNumber *) num8_Y = 0x00007fffa3c4dc30 YES (NSNumber *) num8_N = 0x00007fffa3c4dc40 NO (NSNumber *) num9 = 0x6b965e768040191f (short)-31616 (NSNumber *) num_at1 = 0x9469a1897fc4952f (int)12 (NSNumber *) num_at2 = 0x6b965e76803b6d2f (int)-12 (NSNumber *) num_at3 = 0x0000603000003070 (double)12.5 (NSNumber *) num_at4 = 0x00006030000030a0 (double)-12.5 (NSDecimalNumber *) decimal_number = 0x00006030000030d0 123456 x 10^-10 (NSDecimalNumber *) decimal_number_neg = 0x0000603000003100 -123456 x 10^10 (NSDecimalNumber *) decimal_one = 0x0000603000003130 1 x 10^0 (NSDecimalNumber *) decimal_zero = 0x0000602000002370 0 (NSDecimalNumber *) decimal_nan = 0x0000602000002390 NaN (NSString *) str0 = 0x9469a1894af1ab3d @"255" (NSString *) str1 = 0x0000606000008ba0 @"A rather short ASCII NSString object is here" (NSString *) str2 = 0x0000606000008c00 @"A rather short UTF8 NSString object is here" (NSString *) str3 = 0x0000000100006170 @"A string made with the at sign is here" (NSString *) str4 = 0x0000606000008c60 @"This is string number 4 right here" (NSRect) ns_rect_4str = (origin = (x = 1, y = 1), size = (width = 5, height = 5)) (NSString *) str5 = 0x0000604000001810 @"{{1, 1}, {5, 5}}" (NSString *) str6 = 0x0000603000003220 @"1ST" (const unichar [3]) myCharacters = { [0] = U+03c3 u'σ' [1] = U+0078 u'x' [2] = U+0078 u'x' } (NSString *) str7 = 0x0000603000003250 @"σxx" (NSString *) str8 = 0x000061b000000780 @"hasVeryLongExtensionThisTimehasVeryLongExtensionThisTimehasVeryLongExtensionThisTimehasVeryLongExtensionThisTimehasVeryLongExtensionThisTimehasVeryLongExtensionThisTimehasVeryLongExtensionThisTimehasVeryLongExtensionThisTimehasVeryLongExtensionThisTimehasVeryLongExtensionThisTimehasVeryLongExtensionThisTimehasVeryLongExtensionThisTimehasVeryLongExtensionThisTimehasVeryLongExtensionThisTimehasVeryLongExtensionThisTimehasVeryLongExtensionThisTimehasVeryLongExtensionThisTimehasVeryLongExtensionThisTimehasVeryLongExtensionThisTimehasVeryLongExtensionThisTimehasVeryLongExtensionThisTimehasVeryLongExtensionThisTimehasVeryLongExtensionThisTimehasVeryLongExtensionThisTimehasVeryLongExtensionThisTimehasVeryLongExtensionThisTimehasVeryLongExtensionThisTimehasVeryLongExtensionThisTime" (const unichar [54]) myOtherCharacters = { [0] = U+0061 u'a' [1] = U+0020 u' ' [2] = U+0076 u'v' [3] = U+0065 u'e' [4] = U+0072 u'r' [5] = U+0079 u'y' [6] = U+0020 u' ' [7] = U+006d u'm' [8] = U+0075 u'u' [9] = U+0063 u'c' [10] = U+0068 u'h' [11] = U+0020 u' ' [12] = U+0062 u'b' [13] = U+006f u'o' [14] = U+0072 u'r' [15] = U+0069 u'i' [16] = U+006e u'n' [17] = U+0067 u'g' [18] = U+0020 u' ' [19] = U+0074 u't' [20] = U+0061 u'a' [21] = U+0073 u's' [22] = U+006b u'k' [23] = U+0020 u' ' [24] = U+0074 u't' [25] = U+006f u'o' [26] = U+0020 u' ' [27] = U+0077 u'w' [28] = U+0072 u'r' [29] = U+0069 u'i' [30] = U+0074 u't' [31] = U+0065 u'e' [32] = U+0020 u' ' [33] = U+0061 u'a' [34] = U+0020 u' ' [35] = U+0073 u's' [36] = U+0074 u't' [37] = U+0072 u'r' [38] = U+0069 u'i' [39] = U+006e u'n' [40] = U+0067 u'g' [41] = U+0020 u' ' [42] = U+0074 u't' [43] = U+0068 u'h' [44] = U+0069 u'i' [45] = U+0073 u's' [46] = U+0020 u' ' [47] = U+0077 u'w' [48] = U+0061 u'a' [49] = U+0079 u'y' [50] = U+0021 u'!' [51] = U+0021 u'!' [52] = U+03c3 u'σ' [53] = U+0000 u'\0' } (NSString *) str9 = 0x000060d000001be0 @"a very much boring task to write a string this way!!σ\0" (const unichar [2]) myNextCharacters = { [0] = U+03c3 u'σ' [1] = U+0000 u'\0' } (NSString *) str10 = 0x000060c000002200 @"This is a Unicode string σ number 4 right here" (NSString *) str11 = 0x0000603000003280 @"__NSCFString" (NSString *) label1 = 0x0000000100006210 @"Process Name: " (NSString *) label2 = 0x0000000100006230 @"Process Id: " (NSString *) processName = 0x9469d5fc10eaf85d @"a.out" (NSString *) processID = 0x946999bf46f3ac5d @"57968" (NSString *) str12 = 0x0000606000008f00 @"Process Name: a.out Process Id: 57968" (NSString *) strA1 = 0x0000606000008f60 @"A rather short ASCII NSString object is here" (NSString *) strA2 = 0x0000606000008fc0 @"A rather short UTF8 NSString object is here" (NSString *) strA3 = 0x0000000100006170 @"A string made with the at sign is here" (NSString *) strA4 = 0x0000606000009020 @"This is string number 4 right here" (NSString *) strA5 = 0x00006040000019d0 @"{{1, 1}, {5, 5}}" (NSString *) strA6 = 0x0000603000003310 @"1ST" (NSString *) strA7 = 0x0000603000003340 @"σxx" (NSString *) strA8 = 0x000061b000001580 @"hasVeryLongExtensionThisTimehasVeryLongExtensionThisTimehasVeryLongExtensionThisTimehasVeryLongExtensionThisTimehasVeryLongExtensionThisTimehasVeryLongExtensionThisTimehasVeryLongExtensionThisTimehasVeryLongExtensionThisTimehasVeryLongExtensionThisTimehasVeryLongExtensionThisTimehasVeryLongExtensionThisTimehasVeryLongExtensionThisTimehasVeryLongExtensionThisTimehasVeryLongExtensionThisTimehasVeryLongExtensionThisTimehasVeryLongExtensionThisTimehasVeryLongExtensionThisTimehasVeryLongExtensionThisTimehasVeryLongExtensionThisTimehasVeryLongExtensionThisTimehasVeryLongExtensionThisTimehasVeryLongExtensionThisTimehasVeryLongExtensionThisTimehasVeryLongExtensionThisTimehasVeryLongExtensionThisTimehasVeryLongExtensionThisTimehasVeryLongExtensionThisTimehasVeryLongExtensionThisTime" (NSString *) strA9 = 0x000060d000001e50 @"a very much boring task to write a string this way!!σ\0" (NSString *) strA10 = 0x000060c000002680 @"This is a Unicode string σ number 4 right here" (NSString *) strA11 = 0x0000603000003370 @"__NSCFString" (NSString *) strA12 = 0x0000606000009080 @"Process Name: a.out Process Id: 57968" (NSString *) strB1 = 0x00006060000090e0 @"A rather short ASCII NSString object is here" (NSString *) strB2 = 0x0000606000009140 @"A rather short UTF8 NSString object is here" (NSString *) strB3 = 0x0000000100006170 @"A string made with the at sign is here" (NSString *) strB4 = 0x00006060000091a0 @"This is string number 4 right here" (NSString *) strB5 = 0x0000604000001b10 @"{{1, 1}, {5, 5}}" (NSString *) strB6 = 0x00006030000033a0 @"1ST" (NSString *) strB7 = 0x00006030000033d0 @"σxx" (NSString *) strB8 = 0x000061b000002380 @"hasVeryLongExtensionThisTimehasVeryLongExtensionThisTimehasVeryLongExtensionThisTimehasVeryLongExtensionThisTimehasVeryLongExtensionThisTimehasVeryLongExtensionThisTimehasVeryLongExtensionThisTimehasVeryLongExtensionThisTimehasVeryLongExtensionThisTimehasVeryLongExtensionThisTimehasVeryLongExtensionThisTimehasVeryLongExtensionThisTimehasVeryLongExtensionThisTimehasVeryLongExtensionThisTimehasVeryLongExtensionThisTimehasVeryLongExtensionThisTimehasVeryLongExtensionThisTimehasVeryLongExtensionThisTimehasVeryLongExtensionThisTimehasVeryLongExtensionThisTimehasVeryLongExtensionThisTimehasVeryLongExtensionThisTimehasVeryLongExtensionThisTimehasVeryLongExtensionThisTimehasVeryLongExtensionThisTimehasVeryLongExtensionThisTimehasVeryLongExtensionThisTimehasVeryLongExtensionThisTime" (NSString *) strB9 = 0x000060d000001f20 @"a very much boring task to write a string this way!!σ\0" (NSString *) strB10 = 0x000060c000002a40 @"This is a Unicode string σ number 4 right here" (NSString *) strB11 = 0x0000603000003400 @"__NSCFString" (NSString *) strB12 = 0x0000606000009200 @"Process Name: a.out Process Id: 57968" (NSString *) strC11 = 0x0000603000003430 @"__NSCFString" (NSString *) strC12 = 0x0000606000009260 @"Process Name: a.out Process Id: 57968" (NSString *) strC1 = 0x00006060000092c0 @"A rather short ASCII NSString object is here" (NSString *) strC2 = 0x0000606000009320 @"A rather short UTF8 NSString object is here" (NSString *) strC3 = 0x0000000100006170 @"A string made with the at sign is here" (NSString *) strC4 = 0x0000606000009380 @"This is string number 4 right here" (NSString *) strC5 = 0x0000604000001c90 @"{{1, 1}, {5, 5}}" (NSString *) strC6 = 0x0000603000003460 @"1ST" (NSString *) strC7 = 0x0000603000003490 @"σxx" (NSString *) strC8 = 0x000061b000003180 @"hasVeryLongExtensionThisTimehasVeryLongExtensionThisTimehasVeryLongExtensionThisTimehasVeryLongExtensionThisTimehasVeryLongExtensionThisTimehasVeryLongExtensionThisTimehasVeryLongExtensionThisTimehasVeryLongExtensionThisTimehasVeryLongExtensionThisTimehasVeryLongExtensionThisTimehasVeryLongExtensionThisTimehasVeryLongExtensionThisTimehasVeryLongExtensionThisTimehasVeryLongExtensionThisTimehasVeryLongExtensionThisTimehasVeryLongExtensionThisTimehasVeryLongExtensionThisTimehasVeryLongExtensionThisTimehasVeryLongExtensionThisTimehasVeryLongExtensionThisTimehasVeryLongExtensionThisTimehasVeryLongExtensionThisTimehasVeryLongExtensionThisTimehasVeryLongExtensionThisTimehasVeryLongExtensionThisTimehasVeryLongExtensionThisTimehasVeryLongExtensionThisTimehasVeryLongExtensionThisTime" (NSString *) strC9 = 0x000060d000001ff0 @"a very much boring task to write a string this way!!σ\0" (NSString *) strC10 = 0x000060c000002ec0 @"This is a Unicode string σ number 4 right here" (NSString *) strD11 = 0x00006030000034c0 @"__NSCFString" (NSString *) strD12 = 0x00006060000093e0 @"Process Name: a.out Process Id: 57968" (NSString *) eAcute = 0x0000603000003520 @"é" (NSString *) randomHaziChar = 0x0000603000003580 @"鷅" (NSString *) japanese = 0x00000001000062b0 @"色は匂へど散りぬるを" (NSString *) italian = 0x00000001000062d0 @"L'Italia è una Repubblica democratica, fondata sul lavoro. La sovranità appartiene al popolo, che la esercita nelle forme e nei limiti della Costituzione." (NSString *) french = 0x00000001000062f0 @"Que veut cette horde d'esclaves, De traîtres, de rois conjurés?" (NSString *) german = 0x0000000100006310 @"Über-Ich und aus den Ansprüchen der sozialen Umwelt" (void *[3]) data_set = ([0] = 0x0000606000008ba0, [1] = 0x0000606000008c00, [2] = 0x0000000100006170) (NSString *) hebrew = 0x0000000100006330 @"לילה טוב" (NSArray *) newArray = 0x0000604000001dd0 @"50 elements" (NSDictionary *) newDictionary = 0x0000619000001980 12 key/value pairs (NSDictionary *) newMutableDictionary = 0x0000603000003640 21 key/value pairs (id [4]) cfKeys = { [0] = 0x0000000100006350 [1] = 0x0000000100006610 [2] = 0x0000000100006630 [3] = 0x0000000100006650 } (id [4]) cfValues = { [0] = 0x0000000100006350 [1] = 0x0000000100006610 [2] = 0x0000000100006630 [3] = 0x0000000100006650 } (NSDictionary *) nsDictionary = 0x00006060000095c0 2 key/value pairs (NSDictionary *) nscfDictionary = 0x0000606000009620 4 key/value pairs (CFDictionaryRef) cfDictionaryRef = 0x00006060000095c0 2 key/value pairs (NSAttributedString *) attrString = 0x00006030000036d0 @"hello world from foo" (NSAttributedString *) mutableAttrString = 0x00006030000037c0 @"hello world from foo" (NSString *) mutableString = 0x0000604000001f90 @"foo said this string needs to be very long so much longer than whatever other string has been seen ever before by anyone of the mankind that of course this is still not long enough given what foo our friend foo our lovely dearly friend foo desired of us so i am adding more stuff here for the sake of it and for the joy of our friend who is named guess what just foo. hence, dear friend foo, stay safe, your string is now long enough to accommodate your testing need and I will make sure that if not we extend it with even more fuzzy random meaningless words pasted one after the other from a long tiresome friday evening spent working in my office. my office mate went home but I am still randomly typing just for the fun of seeing what happens of the length of a Mutable String in Cocoa if it goes beyond one byte.. so be it, dear foo" (NSString *) mutableGetConst = 0x0000618000000080 @"foo said this string needs to be very long so much longer than whatever other string has been seen ever before by anyone of the mankind that of course this is still not long enough given what foo our friend foo our lovely dearly friend foo desired of us so i am adding more stuff here for the sake of it and for the joy of our friend who is named guess what just foo. hence, dear friend foo, stay safe, your string is now long enough to accommodate your testing need and I will make sure that if not we extend it with even more fuzzy random meaningless words pasted one after the other from a long tiresome friday evening spent working in my office. my office mate went home but I am still randomly typing just for the fun of seeing what happens of the length of a Mutable String in Cocoa if it goes beyond one byte.. so be it, dear foo" (NSData *) immutableData = 0x0000603000003820 5 bytes (NSData *) mutableData = 0x0000604000002010 14 bytes (unsigned int) concreteLength = 100000 (void *) zeroes1 = 0x0000633000000800 (NSData *) concreteData = 0x0000603000003850 100000 bytes (void *) zeroes2 = 0x000063300001c800 (NSMutableData *) concreteMutableData = 0x0000604000002050 100000 bytes (NSSet *) nsset = 0x0000604000002090 3 elements (NSSet *) nsmutableset = 0x00006030000038b0 4 elements (NSSet *) nscfSet = 0x00006040000020d0 2 elements (CFSetRef) cfSetRef = 0x00006040000020d0 2 elements (CFDataRef) data_ref = 0x0000607000003f20 @"5 bytes" (CFMutableDataRef) mutable_data_ref = 0x0000607000003f90 @"5 bytes" (CFMutableStringRef) mutable_string_ref = 0x0000604000002110 @"Wish ya knew" (CFStringRef) cfstring_ref = 0x00000001000066d0 @"HELLO WORLD" (CFArrayRef) cfarray_ref = 0x0000607000004000 @"3 elements" (CFMutableArrayRef) mutable_array_ref = 0x0000604000002150 @"11 elements" (CFBinaryHeapRef) binheap_ref = 0x000060c000003640 @"21 items" (CFURLRef) cfurl_ref = 0x000060b000002350 @"http://www.foo.bar/" (CFURLRef) cfchildurl_ref = 0x00006070000040e0 @"page.html -- http://www.foo.bar/" (CFURLRef) cfgchildurl_ref = 0x0000607000004150 @"?whatever -- http://www.foo.bar/page.html" (NSDictionary *) error_userInfo = 0x0000606000009e60 2 key/value pairs (NSError *) nserror = 0x0000604000002290 domain: @"Foobar" - code: 12 (NSError **) nserrorptr = 0x00007ffeefbfee28 domain: @"Foobar" - code: 12 (NSBundle *) bundle_string = 0x0000607000004310 @"/System/Library/Frameworks/Accelerate.framework" (NSBundle *) bundle_url = 0x0000607000004af0 @"/System/Library/Frameworks/Foundation.framework" (NSBundle *) main_bundle = 0x0000607000004cb0 @"/Users/buildslave/jenkins/workspace/lldb-cmake-sanitized/lldb-build/lldb-test-build.noindex/functionalities/data-formatter/data-formatter-objc/TestDataFormatterObjCCF.test_coreframeworks_and_run_command_dwarf" (NSArray *) bundles = 0x0000604000002450 @"1 element" (NSURL *) nsurl0 = 0x0000608000001320 @"file:///Users/buildslave/jenkins/workspace/lldb-cmake-sanitized/lldb-build/lldb-test-build.noindex/functionalities/data-formatter/data-formatter-objc/TestDataFormatterObjCCF.test_coreframeworks_and_run_command_dwarf/" (NSException *) except0 = 0x00006040000024d0 @"First" (NSException *) except1 = 0x0000604000002510 @"Second" (NSException *) except2 = 0x0000604000002550 @"Third" (NSException *) except3 = 0x0000604000002590 @"Fourth" (NSURL *) nsurl = 0x000060b0000028d0 @"http://www.foo.bar" (NSURL *) nsurl2 = 0x0000607000004ee0 @"page.html -- http://www.foo.bar" (NSURL *) nsurl3 = 0x0000607000004f50 @"?whatever -- http://www.foo.bar/page.html" (NSDate *) date1 = 0x55d435751fc49905 1985-04-10 18:00:00 UTC (NSDate *) date2 = 0x0000604000008e90 2011-01-01 08:00:00 UTC (NSDate *) date3 = 0x0000602000003bb0 2020-06-01 12:41:11 UTC (NSDate *) date4 = 0x55a486b2ffc49905 1970-01-02 00:00:00 UTC (NSDate *) date5 = 0xd5abe31e0c449905 2020-06-01 12:41:11 UTC (CFAbsoluteTime) date1_abs = 1985-04-10 10:00:00 PST (CFAbsoluteTime) date2_abs = 2011-01-01 00:00:00 PST (CFAbsoluteTime) date3_abs = 2020-06-01 05:41:11 PDT (CFAbsoluteTime) date4_abs = 1970-01-01 16:00:00 PST (CFAbsoluteTime) date5_abs = 2020-06-01 05:41:11 PDT (NSIndexSet *) iset1 = 0x0000603000009790 4 indexes (NSIndexSet *) iset2 = 0x00006030000097c0 512 indexes (NSMutableIndexSet *) imset = 0x0000604000008f10 10 indexes (CFTimeZoneRef) cupertino = 0x0000608000001a20 @"America/Los_Angeles" (CFTimeZoneRef) home = 0x0000608000001ba0 @"Europe/Rome" (CFTimeZoneRef) europe = 0x0000608000001d20 @"Europe/Paris" (NSTimeZone *) cupertino_ns = 0x0000608000001a20 @"America/Los_Angeles" (NSTimeZone *) home_ns = 0x0000608000001ba0 @"Europe/Rome" (NSTimeZone *) europe_ns = 0x0000608000001d20 @"Europe/Paris" (CFGregorianUnits) cf_greg_units = 1 years, 3 months, 5 days, 12 hours, 5 minutes 7 seconds (CFGregorianDate) cf_greg_date = @"4/10/1985 18:0:0" (CFRange) cf_range = location=4 length=4 (NSPoint) ns_point = (x = 4, y = 4) (NSRange) ns_range = location=4, length=4 (NSRect) ns_rect = (origin = (x = 1, y = 1), size = (width = 5, height = 5)) (NSRect *) ns_rect_ptr = (origin = (x = 1, y = 1), size = (width = 5, height = 5)) (NSRectArray) ns_rect_arr = ((x = 1, y = 1), (width = 5, height = 5)), ... (NSSize) ns_size = (width = 5, height = 7) (NSSize *) ns_size_ptr = (width = 5, height = 7) (CGSize) cg_size = (width = 1, height = 6) (CGPoint) cg_point = (x = 2, y = 7) (CGRect) cg_rect = (origin = (x = 1, y = 2), size = (width = 7, height = 7)) (RGBColor) rgb_color = red=3 green=56 blue=35 (RGBColor *) rgb_color_ptr = red=3 green=56 blue=35 (Rect) rect = (t=4, l=8, b=4, r=7) (Rect *) rect_ptr = (t=4, l=8, b=4, r=7) (Point) point = (v=7, h=12) (Point *) point_ptr = (v=7, h=12) (HIPoint) hi_point = (x=7, y=12) (HIRect) hi_rect = origin=(x = 3, y = 5) size=(width = 4, height = 6) (SEL) foo_selector = "foo_selector_impl" (CFMutableBitVectorRef) mut_bv = 0x0000604000009490 1110 0110 1011 0000 1101 1010 1000 1111 0011 0101 1101 0001 00 (Molecule *) molecule = 0x0000602000003c50 (Class) myclass = NSValue (Class) myclass2 = NSTaggedPointerString (Class) myclass3 = Molecule (Class) myclass4 = NSMutableArray (Class) myclass5 = nil (NSArray *) components = 0x00006040000094d0 @"3 elements" (NSString *) path = 0x0000604000009510 @"usr/blah/stuff"

Hide Details

Hide Details

Expecting sub string: (CFGregorianUnits) cf_greg_units = 1 years, 3 months, 5 days, 12 hours, 5 minutes 7 seconds Matched

Hide Details

Expecting sub string: (CFGregorianDate) cf_greg_date = @"4/10/1985 18:0:0" Matched

Hide Details

Expecting sub string: (CFRange) cf_range = location=4 length=4 Matched

Hide Details

Expecting sub string: (NSPoint) ns_point = (x = 4, y = 4) Matched

Hide Details

Expecting sub string: (NSRange) ns_range = location=4, length=4 Matched

Hide Details

Expecting sub string: (NSRect) ns_rect = (origin = (x = 1, y = 1), size = (width = 5, height = 5)) Matched

Hide Details

Expecting sub string: (NSRectArray) ns_rect_arr = ((x = 1, y = 1), (width = 5, height = 5)), ... Matched

Hide Details

Expecting sub string: (NSSize) ns_size = (width = 5, height = 7) Matched

Hide Details

Expecting sub string: (CGSize) cg_size = (width = 1, height = 6) Matched

Hide Details

Expecting sub string: (CGPoint) cg_point = (x = 2, y = 7) Matched

Hide Details

Expecting sub string: (CGRect) cg_rect = (origin = (x = 1, y = 2), size = (width = 7, height = 7)) Matched

Hide Details

Expecting sub string: (Rect) rect = (t=4, l=8, b=4, r=7) Matched

Hide Details

Expecting sub string: (Rect *) rect_ptr = (t=4, l=8, b=4, r=7) Matched

Hide Details

Expecting sub string: (Point) point = (v=7, h=12) Matched

Hide Details

Expecting sub string: (Point *) point_ptr = (v=7, h=12) Matched

Hide Details

Expecting sub string: (SEL) foo_selector = "foo_selector_impl" Matched

Hide Details

runCmd: frame variable output: (int) argc = 1 (const char **) argv = 0x00007ffeefbff420 (NSAutoreleasePool *) pool = 0x00006040000016d0 (MyClass *) object = 0x0000603000002f20 (MyOtherClass *) object2 = 0x0000603000002f50 (NSNumber *) num1 = 0x9469a1897fc49c2f (int)5 (NSNumber *) num2 = 0x0000603000002fe0 (float)3.140000 (NSNumber *) num3 = 0x0000603000003010 (double)3.14 (NSNumber *) num4 = 0x0000603000003040 (int128_t)18446744073709551614 (NSNumber *) num5 = 0x9469a1897fc4d80f (char)65 (NSNumber *) num6 = 0x9469a1897fc4663f (long)255 (NSNumber *) num7 = 0x9469a1896140193f (long)2000000 (NSNumber *) num8_Y = 0x00007fffa3c4dc30 YES (NSNumber *) num8_N = 0x00007fffa3c4dc40 NO (NSNumber *) num9 = 0x6b965e768040191f (short)-31616 (NSNumber *) num_at1 = 0x9469a1897fc4952f (int)12 (NSNumber *) num_at2 = 0x6b965e76803b6d2f (int)-12 (NSNumber *) num_at3 = 0x0000603000003070 (double)12.5 (NSNumber *) num_at4 = 0x00006030000030a0 (double)-12.5 (NSDecimalNumber *) decimal_number = 0x00006030000030d0 123456 x 10^-10 (NSDecimalNumber *) decimal_number_neg = 0x0000603000003100 -123456 x 10^10 (NSDecimalNumber *) decimal_one = 0x0000603000003130 1 x 10^0 (NSDecimalNumber *) decimal_zero = 0x0000602000002370 0 (NSDecimalNumber *) decimal_nan = 0x0000602000002390 NaN (NSString *) str0 = 0x9469a1894af1ab3d @"255" (NSString *) str1 = 0x0000606000008ba0 @"A rather short ASCII NSString object is here" (NSString *) str2 = 0x0000606000008c00 @"A rather short UTF8 NSString object is here" (NSString *) str3 = 0x0000000100006170 @"A string made with the at sign is here" (NSString *) str4 = 0x0000606000008c60 @"This is string number 4 right here" (NSRect) ns_rect_4str = (origin = (x = 1, y = 1), size = (width = 5, height = 5)) (NSString *) str5 = 0x0000604000001810 @"{{1, 1}, {5, 5}}" (NSString *) str6 = 0x0000603000003220 @"1ST" (const unichar [3]) myCharacters = { [0] = U+03c3 u'σ' [1] = U+0078 u'x' [2] = U+0078 u'x' } (NSString *) str7 = 0x0000603000003250 @"σxx" (NSString *) str8 = 0x000061b000000780 @"hasVeryLongExtensionThisTimehasVeryLongExtensionThisTimehasVeryLongExtensionThisTimehasVeryLongExtensionThisTimehasVeryLongExtensionThisTimehasVeryLongExtensionThisTimehasVeryLongExtensionThisTimehasVeryLongExtensionThisTimehasVeryLongExtensionThisTimehasVeryLongExtensionThisTimehasVeryLongExtensionThisTimehasVeryLongExtensionThisTimehasVeryLongExtensionThisTimehasVeryLongExtensionThisTimehasVeryLongExtensionThisTimehasVeryLongExtensionThisTimehasVeryLongExtensionThisTimehasVeryLongExtensionThisTimehasVeryLongExtensionThisTimehasVeryLongExtensionThisTimehasVeryLongExtensionThisTimehasVeryLongExtensionThisTimehasVeryLongExtensionThisTimehasVeryLongExtensionThisTimehasVeryLongExtensionThisTimehasVeryLongExtensionThisTimehasVeryLongExtensionThisTimehasVeryLongExtensionThisTime" (const unichar [54]) myOtherCharacters = { [0] = U+0061 u'a' [1] = U+0020 u' ' [2] = U+0076 u'v' [3] = U+0065 u'e' [4] = U+0072 u'r' [5] = U+0079 u'y' [6] = U+0020 u' ' [7] = U+006d u'm' [8] = U+0075 u'u' [9] = U+0063 u'c' [10] = U+0068 u'h' [11] = U+0020 u' ' [12] = U+0062 u'b' [13] = U+006f u'o' [14] = U+0072 u'r' [15] = U+0069 u'i' [16] = U+006e u'n' [17] = U+0067 u'g' [18] = U+0020 u' ' [19] = U+0074 u't' [20] = U+0061 u'a' [21] = U+0073 u's' [22] = U+006b u'k' [23] = U+0020 u' ' [24] = U+0074 u't' [25] = U+006f u'o' [26] = U+0020 u' ' [27] = U+0077 u'w' [28] = U+0072 u'r' [29] = U+0069 u'i' [30] = U+0074 u't' [31] = U+0065 u'e' [32] = U+0020 u' ' [33] = U+0061 u'a' [34] = U+0020 u' ' [35] = U+0073 u's' [36] = U+0074 u't' [37] = U+0072 u'r' [38] = U+0069 u'i' [39] = U+006e u'n' [40] = U+0067 u'g' [41] = U+0020 u' ' [42] = U+0074 u't' [43] = U+0068 u'h' [44] = U+0069 u'i' [45] = U+0073 u's' [46] = U+0020 u' ' [47] = U+0077 u'w' [48] = U+0061 u'a' [49] = U+0079 u'y' [50] = U+0021 u'!' [51] = U+0021 u'!' [52] = U+03c3 u'σ' [53] = U+0000 u'\0' } (NSString *) str9 = 0x000060d000001be0 @"a very much boring task to write a string this way!!σ\0" (const unichar [2]) myNextCharacters = { [0] = U+03c3 u'σ' [1] = U+0000 u'\0' } (NSString *) str10 = 0x000060c000002200 @"This is a Unicode string σ number 4 right here" (NSString *) str11 = 0x0000603000003280 @"__NSCFString" (NSString *) label1 = 0x0000000100006210 @"Process Name: " (NSString *) label2 = 0x0000000100006230 @"Process Id: " (NSString *) processName = 0x9469d5fc10eaf85d @"a.out" (NSString *) processID = 0x946999bf46f3ac5d @"57968" (NSString *) str12 = 0x0000606000008f00 @"Process Name: a.out Process Id: 57968" (NSString *) strA1 = 0x0000606000008f60 @"A rather short ASCII NSString object is here" (NSString *) strA2 = 0x0000606000008fc0 @"A rather short UTF8 NSString object is here" (NSString *) strA3 = 0x0000000100006170 @"A string made with the at sign is here" (NSString *) strA4 = 0x0000606000009020 @"This is string number 4 right here" (NSString *) strA5 = 0x00006040000019d0 @"{{1, 1}, {5, 5}}" (NSString *) strA6 = 0x0000603000003310 @"1ST" (NSString *) strA7 = 0x0000603000003340 @"σxx" (NSString *) strA8 = 0x000061b000001580 @"hasVeryLongExtensionThisTimehasVeryLongExtensionThisTimehasVeryLongExtensionThisTimehasVeryLongExtensionThisTimehasVeryLongExtensionThisTimehasVeryLongExtensionThisTimehasVeryLongExtensionThisTimehasVeryLongExtensionThisTimehasVeryLongExtensionThisTimehasVeryLongExtensionThisTimehasVeryLongExtensionThisTimehasVeryLongExtensionThisTimehasVeryLongExtensionThisTimehasVeryLongExtensionThisTimehasVeryLongExtensionThisTimehasVeryLongExtensionThisTimehasVeryLongExtensionThisTimehasVeryLongExtensionThisTimehasVeryLongExtensionThisTimehasVeryLongExtensionThisTimehasVeryLongExtensionThisTimehasVeryLongExtensionThisTimehasVeryLongExtensionThisTimehasVeryLongExtensionThisTimehasVeryLongExtensionThisTimehasVeryLongExtensionThisTimehasVeryLongExtensionThisTimehasVeryLongExtensionThisTime" (NSString *) strA9 = 0x000060d000001e50 @"a very much boring task to write a string this way!!σ\0" (NSString *) strA10 = 0x000060c000002680 @"This is a Unicode string σ number 4 right here" (NSString *) strA11 = 0x0000603000003370 @"__NSCFString" (NSString *) strA12 = 0x0000606000009080 @"Process Name: a.out Process Id: 57968" (NSString *) strB1 = 0x00006060000090e0 @"A rather short ASCII NSString object is here" (NSString *) strB2 = 0x0000606000009140 @"A rather short UTF8 NSString object is here" (NSString *) strB3 = 0x0000000100006170 @"A string made with the at sign is here" (NSString *) strB4 = 0x00006060000091a0 @"This is string number 4 right here" (NSString *) strB5 = 0x0000604000001b10 @"{{1, 1}, {5, 5}}" (NSString *) strB6 = 0x00006030000033a0 @"1ST" (NSString *) strB7 = 0x00006030000033d0 @"σxx" (NSString *) strB8 = 0x000061b000002380 @"hasVeryLongExtensionThisTimehasVeryLongExtensionThisTimehasVeryLongExtensionThisTimehasVeryLongExtensionThisTimehasVeryLongExtensionThisTimehasVeryLongExtensionThisTimehasVeryLongExtensionThisTimehasVeryLongExtensionThisTimehasVeryLongExtensionThisTimehasVeryLongExtensionThisTimehasVeryLongExtensionThisTimehasVeryLongExtensionThisTimehasVeryLongExtensionThisTimehasVeryLongExtensionThisTimehasVeryLongExtensionThisTimehasVeryLongExtensionThisTimehasVeryLongExtensionThisTimehasVeryLongExtensionThisTimehasVeryLongExtensionThisTimehasVeryLongExtensionThisTimehasVeryLongExtensionThisTimehasVeryLongExtensionThisTimehasVeryLongExtensionThisTimehasVeryLongExtensionThisTimehasVeryLongExtensionThisTimehasVeryLongExtensionThisTimehasVeryLongExtensionThisTimehasVeryLongExtensionThisTime" (NSString *) strB9 = 0x000060d000001f20 @"a very much boring task to write a string this way!!σ\0" (NSString *) strB10 = 0x000060c000002a40 @"This is a Unicode string σ number 4 right here" (NSString *) strB11 = 0x0000603000003400 @"__NSCFString" (NSString *) strB12 = 0x0000606000009200 @"Process Name: a.out Process Id: 57968" (NSString *) strC11 = 0x0000603000003430 @"__NSCFString" (NSString *) strC12 = 0x0000606000009260 @"Process Name: a.out Process Id: 57968" (NSString *) strC1 = 0x00006060000092c0 @"A rather short ASCII NSString object is here" (NSString *) strC2 = 0x0000606000009320 @"A rather short UTF8 NSString object is here" (NSString *) strC3 = 0x0000000100006170 @"A string made with the at sign is here" (NSString *) strC4 = 0x0000606000009380 @"This is string number 4 right here" (NSString *) strC5 = 0x0000604000001c90 @"{{1, 1}, {5, 5}}" (NSString *) strC6 = 0x0000603000003460 @"1ST" (NSString *) strC7 = 0x0000603000003490 @"σxx" (NSString *) strC8 = 0x000061b000003180 @"hasVeryLongExtensionThisTimehasVeryLongExtensionThisTimehasVeryLongExtensionThisTimehasVeryLongExtensionThisTimehasVeryLongExtensionThisTimehasVeryLongExtensionThisTimehasVeryLongExtensionThisTimehasVeryLongExtensionThisTimehasVeryLongExtensionThisTimehasVeryLongExtensionThisTimehasVeryLongExtensionThisTimehasVeryLongExtensionThisTimehasVeryLongExtensionThisTimehasVeryLongExtensionThisTimehasVeryLongExtensionThisTimehasVeryLongExtensionThisTimehasVeryLongExtensionThisTimehasVeryLongExtensionThisTimehasVeryLongExtensionThisTimehasVeryLongExtensionThisTimehasVeryLongExtensionThisTimehasVeryLongExtensionThisTimehasVeryLongExtensionThisTimehasVeryLongExtensionThisTimehasVeryLongExtensionThisTimehasVeryLongExtensionThisTimehasVeryLongExtensionThisTimehasVeryLongExtensionThisTime" (NSString *) strC9 = 0x000060d000001ff0 @"a very much boring task to write a string this way!!σ\0" (NSString *) strC10 = 0x000060c000002ec0 @"This is a Unicode string σ number 4 right here" (NSString *) strD11 = 0x00006030000034c0 @"__NSCFString" (NSString *) strD12 = 0x00006060000093e0 @"Process Name: a.out Process Id: 57968" (NSString *) eAcute = 0x0000603000003520 @"é" (NSString *) randomHaziChar = 0x0000603000003580 @"鷅" (NSString *) japanese = 0x00000001000062b0 @"色は匂へど散りぬるを" (NSString *) italian = 0x00000001000062d0 @"L'Italia è una Repubblica democratica, fondata sul lavoro. La sovranità appartiene al popolo, che la esercita nelle forme e nei limiti della Costituzione." (NSString *) french = 0x00000001000062f0 @"Que veut cette horde d'esclaves, De traîtres, de rois conjurés?" (NSString *) german = 0x0000000100006310 @"Über-Ich und aus den Ansprüchen der sozialen Umwelt" (void *[3]) data_set = ([0] = 0x0000606000008ba0, [1] = 0x0000606000008c00, [2] = 0x0000000100006170) (NSString *) hebrew = 0x0000000100006330 @"לילה טוב" (NSArray *) newArray = 0x0000604000001dd0 @"50 elements" (NSDictionary *) newDictionary = 0x0000619000001980 12 key/value pairs (NSDictionary *) newMutableDictionary = 0x0000603000003640 21 key/value pairs (id [4]) cfKeys = { [0] = 0x0000000100006350 [1] = 0x0000000100006610 [2] = 0x0000000100006630 [3] = 0x0000000100006650 } (id [4]) cfValues = { [0] = 0x0000000100006350 [1] = 0x0000000100006610 [2] = 0x0000000100006630 [3] = 0x0000000100006650 } (NSDictionary *) nsDictionary = 0x00006060000095c0 2 key/value pairs (NSDictionary *) nscfDictionary = 0x0000606000009620 4 key/value pairs (CFDictionaryRef) cfDictionaryRef = 0x00006060000095c0 2 key/value pairs (NSAttributedString *) attrString = 0x00006030000036d0 @"hello world from foo" (NSAttributedString *) mutableAttrString = 0x00006030000037c0 @"hello world from foo" (NSString *) mutableString = 0x0000604000001f90 @"foo said this string needs to be very long so much longer than whatever other string has been seen ever before by anyone of the mankind that of course this is still not long enough given what foo our friend foo our lovely dearly friend foo desired of us so i am adding more stuff here for the sake of it and for the joy of our friend who is named guess what just foo. hence, dear friend foo, stay safe, your string is now long enough to accommodate your testing need and I will make sure that if not we extend it with even more fuzzy random meaningless words pasted one after the other from a long tiresome friday evening spent working in my office. my office mate went home but I am still randomly typing just for the fun of seeing what happens of the length of a Mutable String in Cocoa if it goes beyond one byte.. so be it, dear foo" (NSString *) mutableGetConst = 0x0000618000000080 @"foo said this string needs to be very long so much longer than whatever other string has been seen ever before by anyone of the mankind that of course this is still not long enough given what foo our friend foo our lovely dearly friend foo desired of us so i am adding more stuff here for the sake of it and for the joy of our friend who is named guess what just foo. hence, dear friend foo, stay safe, your string is now long enough to accommodate your testing need and I will make sure that if not we extend it with even more fuzzy random meaningless words pasted one after the other from a long tiresome friday evening spent working in my office. my office mate went home but I am still randomly typing just for the fun of seeing what happens of the length of a Mutable String in Cocoa if it goes beyond one byte.. so be it, dear foo" (NSData *) immutableData = 0x0000603000003820 5 bytes (NSData *) mutableData = 0x0000604000002010 14 bytes (unsigned int) concreteLength = 100000 (void *) zeroes1 = 0x0000633000000800 (NSData *) concreteData = 0x0000603000003850 100000 bytes (void *) zeroes2 = 0x000063300001c800 (NSMutableData *) concreteMutableData = 0x0000604000002050 100000 bytes (NSSet *) nsset = 0x0000604000002090 3 elements (NSSet *) nsmutableset = 0x00006030000038b0 4 elements (NSSet *) nscfSet = 0x00006040000020d0 2 elements (CFSetRef) cfSetRef = 0x00006040000020d0 2 elements (CFDataRef) data_ref = 0x0000607000003f20 @"5 bytes" (CFMutableDataRef) mutable_data_ref = 0x0000607000003f90 @"5 bytes" (CFMutableStringRef) mutable_string_ref = 0x0000604000002110 @"Wish ya knew" (CFStringRef) cfstring_ref = 0x00000001000066d0 @"HELLO WORLD" (CFArrayRef) cfarray_ref = 0x0000607000004000 @"3 elements" (CFMutableArrayRef) mutable_array_ref = 0x0000604000002150 @"11 elements" (CFBinaryHeapRef) binheap_ref = 0x000060c000003640 @"21 items" (CFURLRef) cfurl_ref = 0x000060b000002350 @"http://www.foo.bar/" (CFURLRef) cfchildurl_ref = 0x00006070000040e0 @"page.html -- http://www.foo.bar/" (CFURLRef) cfgchildurl_ref = 0x0000607000004150 @"?whatever -- http://www.foo.bar/page.html" (NSDictionary *) error_userInfo = 0x0000606000009e60 2 key/value pairs (NSError *) nserror = 0x0000604000002290 domain: @"Foobar" - code: 12 (NSError **) nserrorptr = 0x00007ffeefbfee28 domain: @"Foobar" - code: 12 (NSBundle *) bundle_string = 0x0000607000004310 @"/System/Library/Frameworks/Accelerate.framework" (NSBundle *) bundle_url = 0x0000607000004af0 @"/System/Library/Frameworks/Foundation.framework" (NSBundle *) main_bundle = 0x0000607000004cb0 @"/Users/buildslave/jenkins/workspace/lldb-cmake-sanitized/lldb-build/lldb-test-build.noindex/functionalities/data-formatter/data-formatter-objc/TestDataFormatterObjCCF.test_coreframeworks_and_run_command_dwarf" (NSArray *) bundles = 0x0000604000002450 @"1 element" (NSURL *) nsurl0 = 0x0000608000001320 @"file:///Users/buildslave/jenkins/workspace/lldb-cmake-sanitized/lldb-build/lldb-test-build.noindex/functionalities/data-formatter/data-formatter-objc/TestDataFormatterObjCCF.test_coreframeworks_and_run_command_dwarf/" (NSException *) except0 = 0x00006040000024d0 @"First" (NSException *) except1 = 0x0000604000002510 @"Second" (NSException *) except2 = 0x0000604000002550 @"Third" (NSException *) except3 = 0x0000604000002590 @"Fourth" (NSURL *) nsurl = 0x000060b0000028d0 @"http://www.foo.bar" (NSURL *) nsurl2 = 0x0000607000004ee0 @"page.html -- http://www.foo.bar" (NSURL *) nsurl3 = 0x0000607000004f50 @"?whatever -- http://www.foo.bar/page.html" (NSDate *) date1 = 0x55d435751fc49905 1985-04-10 18:00:00 UTC (NSDate *) date2 = 0x0000604000008e90 2011-01-01 08:00:00 UTC (NSDate *) date3 = 0x0000602000003bb0 2020-06-01 12:41:11 UTC (NSDate *) date4 = 0x55a486b2ffc49905 1970-01-02 00:00:00 UTC (NSDate *) date5 = 0xd5abe31e0c449905 2020-06-01 12:41:11 UTC (CFAbsoluteTime) date1_abs = 1985-04-10 10:00:00 PST (CFAbsoluteTime) date2_abs = 2011-01-01 00:00:00 PST (CFAbsoluteTime) date3_abs = 2020-06-01 05:41:11 PDT (CFAbsoluteTime) date4_abs = 1970-01-01 16:00:00 PST (CFAbsoluteTime) date5_abs = 2020-06-01 05:41:11 PDT (NSIndexSet *) iset1 = 0x0000603000009790 4 indexes (NSIndexSet *) iset2 = 0x00006030000097c0 512 indexes (NSMutableIndexSet *) imset = 0x0000604000008f10 10 indexes (CFTimeZoneRef) cupertino = 0x0000608000001a20 @"America/Los_Angeles" (CFTimeZoneRef) home = 0x0000608000001ba0 @"Europe/Rome" (CFTimeZoneRef) europe = 0x0000608000001d20 @"Europe/Paris" (NSTimeZone *) cupertino_ns = 0x0000608000001a20 @"America/Los_Angeles" (NSTimeZone *) home_ns = 0x0000608000001ba0 @"Europe/Rome" (NSTimeZone *) europe_ns = 0x0000608000001d20 @"Europe/Paris" (CFGregorianUnits) cf_greg_units = 1 years, 3 months, 5 days, 12 hours, 5 minutes 7 seconds (CFGregorianDate) cf_greg_date = @"4/10/1985 18:0:0" (CFRange) cf_range = location=4 length=4 (NSPoint) ns_point = (x = 4, y = 4) (NSRange) ns_range = location=4, length=4 (NSRect) ns_rect = (origin = (x = 1, y = 1), size = (width = 5, height = 5)) (NSRect *) ns_rect_ptr = (origin = (x = 1, y = 1), size = (width = 5, height = 5)) (NSRectArray) ns_rect_arr = ((x = 1, y = 1), (width = 5, height = 5)), ... (NSSize) ns_size = (width = 5, height = 7) (NSSize *) ns_size_ptr = (width = 5, height = 7) (CGSize) cg_size = (width = 1, height = 6) (CGPoint) cg_point = (x = 2, y = 7) (CGRect) cg_rect = (origin = (x = 1, y = 2), size = (width = 7, height = 7)) (RGBColor) rgb_color = red=3 green=56 blue=35 (RGBColor *) rgb_color_ptr = red=3 green=56 blue=35 (Rect) rect = (t=4, l=8, b=4, r=7) (Rect *) rect_ptr = (t=4, l=8, b=4, r=7) (Point) point = (v=7, h=12) (Point *) point_ptr = (v=7, h=12) (HIPoint) hi_point = (x=7, y=12) (HIRect) hi_rect = origin=(x = 3, y = 5) size=(width = 4, height = 6) (SEL) foo_selector = "foo_selector_impl" (CFMutableBitVectorRef) mut_bv = 0x0000604000009490 1110 0110 1011 0000 1101 1010 1000 1111 0011 0101 1101 0001 00 (Molecule *) molecule = 0x0000602000003c50 (Class) myclass = NSValue (Class) myclass2 = NSTaggedPointerString (Class) myclass3 = Molecule (Class) myclass4 = NSMutableArray (Class) myclass5 = nil (NSArray *) components = 0x00006040000094d0 @"3 elements" (NSString *) path = 0x0000604000009510 @"usr/blah/stuff"

Hide Details

Assertion failed: (tokenKind == tok::kw___bridge_retain), function ParseParenExpression, file /Users/buildslave/jenkins/workspace/lldb-cmake-sanitized/llvm-project/clang/lib/Parse/ParseExpr.cpp, line 2804.

Hide Details

--

Hide Details

******************** PASS: lldb-api :: arm/emulation/TestEmulations.py (1695 of 2028) PASS: lldb-shell :: Reproducer/TestCaptureEnvOverride.test (1696 of 2028) PASS: lldb-api :: python_api/watchpoint/TestWatchpointIgnoreCount.py (1697 of 2028) FAIL: lldb-api :: lang/objc/objc-new-syntax/TestObjCNewSyntaxDictionary.py (1698 of 2028) ******************** TEST 'lldb-api :: lang/objc/objc-new-syntax/TestObjCNewSyntaxDictionary.py' FAILED ******************** Script: -- /Users/buildslave/jenkins/workspace/lldb-cmake-sanitized/lldb-build/lldb-test-build.noindex/copied-system-python /Users/buildslave/jenkins/workspace/lldb-cmake-sanitized/llvm-project/lldb/test/API/dotest.py --arch x86_64 -s /Users/buildslave/jenkins/workspace/lldb-cmake-sanitized/lldb-build/lldb-test-traces -S nm -u CXXFLAGS -u CFLAGS --codesign-identity lldb_codesign --server /Users/buildslave/jenkins/workspace/lldb-cmake-sanitized/lldb-build/./bin/debugserver --arch x86_64 --build-dir /Users/buildslave/jenkins/workspace/lldb-cmake-sanitized/lldb-build/lldb-test-build.noindex -s=/Users/buildslave/jenkins/workspace/lldb-cmake-sanitized/test/logs -t --env TERM=vt100 --env LLVM_LIBS_DIR=/Users/buildslave/jenkins/workspace/lldb-cmake-sanitized/lldb-build/./lib --inferior-env ASAN_OPTIONS=detect_stack_use_after_return=1 --inferior-env DYLD_INSERT_LIBRARIES=/Users/buildslave/jenkins/workspace/lldb-cmake-sanitized/host-compiler/lib/clang/11.0.0/lib/darwin/libclang_rt.asan_osx_dynamic.dylib --build-dir /Users/buildslave/jenkins/workspace/lldb-cmake-sanitized/lldb-build/lldb-test-build.noindex --lldb-module-cache-dir /Users/buildslave/jenkins/workspace/lldb-cmake-sanitized/lldb-build/lldb-test-build.noindex/module-cache-lldb/lldb-api --clang-module-cache-dir /Users/buildslave/jenkins/workspace/lldb-cmake-sanitized/lldb-build/lldb-test-build.noindex/module-cache-clang/lldb-api --executable /Users/buildslave/jenkins/workspace/lldb-cmake-sanitized/lldb-build/./bin/lldb --compiler /Users/buildslave/jenkins/workspace/lldb-cmake-sanitized/lldb-build/./bin/clang --dsymutil /Users/buildslave/jenkins/workspace/lldb-cmake-sanitized/lldb-build/./bin/dsymutil --filecheck /Users/buildslave/jenkins/workspace/lldb-cmake-sanitized/lldb-build/./bin/FileCheck --lldb-libs-dir /Users/buildslave/jenkins/workspace/lldb-cmake-sanitized/lldb-build/./lib /Users/buildslave/jenkins/workspace/lldb-cmake-sanitized/llvm-project/lldb/test/API/lang/objc/objc-new-syntax -p TestObjCNewSyntaxDictionary.py -- Exit Code: -6

Hide Details

Command Output (stdout): -- lldb version 11.0.99 clang revision cbec419b3ebba3fe5551540cfd3e484dfa253a3a llvm revision cbec419b3ebba3fe5551540cfd3e484dfa253a3a

Hide Details

-- Command Output (stderr): -- Assertion failed: (tokenKind == tok::kw___bridge_retain), function ParseParenExpression, file /Users/buildslave/jenkins/workspace/lldb-cmake-sanitized/llvm-project/clang/lib/Parse/ParseExpr.cpp, line 2804.

Hide Details

--

Hide Details

******************** PASS: lldb-unit :: Target/./TargetTests/ModuleCacheTest.GetAndPutStrangeHostname (1699 of 2028) PASS: lldb-api :: functionalities/thread/concurrent_events/TestConcurrentDelaySignalBreak.py (1700 of 2028) UNSUPPORTED: lldb-shell :: ObjectFile/ELF/minidebuginfo-no-lzma.yaml (1701 of 2028) PASS: lldb-api :: functionalities/tail_call_frames/thread_step_out_message/TestArtificialFrameStepOutMessage.py (1702 of 2028) PASS: lldb-unit :: ObjectFile/Breakpad/./ObjectFileBreakpadTests/FuncRecord.parse (1703 of 2028) PASS: lldb-unit :: Host/./HostTests/SocketTest.TCPGetConnectURI (1704 of 2028) XFAIL: lldb-shell :: Register/x86-64-write.test (1705 of 2028) PASS: lldb-unit :: Process/minidump/./LLDBMinidumpTests/MinidumpParserTest.GetMemoryRegionInfoFromMemoryList (1706 of 2028) UNSUPPORTED: lldb-api :: functionalities/ubsan/user-expression/TestUbsanUserExpression.py (1707 of 2028) PASS: lldb-api :: commands/frame/diagnose/dereference-this/TestDiagnoseDereferenceThis.py (1708 of 2028) PASS: lldb-api :: functionalities/thread/step_out/TestThreadStepOut.py (1709 of 2028) PASS: lldb-unit :: Process/gdb-remote/./ProcessGdbRemoteTests/GDBRemoteClientBaseTest.SendContinueAndInterrupt2PacketBug (1710 of 2028) PASS: lldb-unit :: Utility/./UtilityTests/LogChannelTest.Disable (1711 of 2028) UNSUPPORTED: lldb-api :: functionalities/darwin_log/filter/regex/subsystem/TestDarwinLogFilterRegexSubsystem.py (1712 of 2028) PASS: lldb-unit :: Utility/./UtilityTests/RangeTest.NotEqual (1713 of 2028) PASS: lldb-shell :: ScriptInterpreter/Python/sb_address_exception.test (1714 of 2028) PASS: lldb-unit :: Utility/./UtilityTests/StringListTest.ShiftMove (1715 of 2028) UNSUPPORTED: lldb-api :: commands/gui/basic/TestGuiBasic.py (1716 of 2028) PASS: lldb-api :: commands/expression/anonymous-struct/TestCallUserAnonTypedef.py (1717 of 2028) PASS: lldb-shell :: SymbolFile/DWARF/dir-separator-no-comp-dir.s (1718 of 2028) PASS: lldb-shell :: SymbolFile/DWARF/debug_loc-aslr.s (1719 of 2028) PASS: lldb-api :: macosx/function-starts/TestFunctionStarts.py (1720 of 2028) PASS: lldb-unit :: Utility/./UtilityTests/StringListTest.InsertStringAtIndexStdString (1721 of 2028) PASS: lldb-api :: functionalities/process_crash_info/TestProcessCrashInfo.py (1722 of 2028) PASS: lldb-unit :: Utility/./UtilityTests/StringListTest.LongestCommonPrefixSingleElement (1723 of 2028) PASS: lldb-shell :: Quit/TestQuitExitCode0.test (1724 of 2028) PASS: lldb-unit :: Expression/./ExpressionTests/DiagnosticManagerTest.AppendMessageNoDiag (1725 of 2028) PASS: lldb-api :: commands/process/attach-resume/TestAttachResume.py (1726 of 2028) PASS: lldb-unit :: ScriptInterpreter/Python/./ScriptInterpreterPythonTests/PythonDataObjectsTest.TestPythonStringToStr (1727 of 2028) PASS: lldb-shell :: Breakpoint/jitbp_elf.test (1728 of 2028) PASS: lldb-api :: commands/expression/import-std-module/deque-dbg-info-content/TestDbgInfoContentDequeFromStdModule.py (1729 of 2028) PASS: lldb-api :: commands/expression/entry-bp/TestExprEntryBP.py (1730 of 2028) PASS: lldb-api :: lang/cpp/lambdas/TestLambdas.py (1731 of 2028) PASS: lldb-api :: lang/cpp/nsimport/TestCppNsImport.py (1732 of 2028) PASS: lldb-unit :: Core/./LLDBCoreTests/RichManglingContextTest.Basic (1733 of 2028) PASS: lldb-api :: commands/expression/codegen-crash-typedefdecl-not-in_declcontext/TestCodegenCrashTypedefDeclNotInDeclContext.py (1734 of 2028) PASS: lldb-unit :: Utility/./UtilityTests/ScalarTest.CastOperations (1735 of 2028) UNSUPPORTED: lldb-api :: functionalities/thread/thread_specific_break_plus_condition/TestThreadSpecificBpPlusCondition.py (1736 of 2028) UNSUPPORTED: lldb-shell :: Register/x86-gp-write.test (1737 of 2028) PASS: lldb-api :: python_api/lldbutil/iter/TestRegistersIterator.py (1738 of 2028) PASS: lldb-unit :: Utility/./UtilityTests/ConstStringTest.MangledCounterpart (1739 of 2028) PASS: lldb-unit :: Process/minidump/./LLDBMinidumpTests/MinidumpParserTest.GetMiscInfoWindows (1740 of 2028) PASS: lldb-unit :: UnwindAssembly/x86/./UnwindAssemblyx86Tests/Testx86AssemblyInspectionEngine.TestSpArithx86_64Augmented (1741 of 2028) PASS: lldb-api :: lang/c/stepping/TestStepAndBreakpoints.py (1742 of 2028) PASS: lldb-shell :: SymbolFile/NativePDB/break-by-line.cpp (1743 of 2028) PASS: lldb-api :: functionalities/data-formatter/hexcaps/TestDataFormatterHexCaps.py (1744 of 2028) PASS: lldb-unit :: Interpreter/./InterpreterTests/OptionArgParserTest.toScriptLanguage (1745 of 2028) PASS: lldb-api :: functionalities/thread/concurrent_events/TestConcurrentTwoBreakpointsOneWatchpoint.py (1746 of 2028) PASS: lldb-unit :: Host/./HostTests/SocketTest.DecodeHostAndPort (1747 of 2028) PASS: lldb-api :: commands/expression/import-std-module/list-dbg-info-content/TestDbgInfoContentListFromStdModule.py (1748 of 2028) PASS: lldb-api :: python_api/target/TestTargetAPI.py (1749 of 2028) PASS: lldb-api :: functionalities/tail_call_frames/sbapi_support/TestTailCallFrameSBAPI.py (1750 of 2028) PASS: lldb-unit :: Utility/./UtilityTests/TimeoutTest.Construction (1751 of 2028) PASS: lldb-api :: functionalities/thread/concurrent_events/TestConcurrentTwoWatchpointThreads.py (1752 of 2028) UNSUPPORTED: lldb-api :: lang/objc/foundation/TestFoundationDisassembly.py (1753 of 2028) PASS: lldb-api :: functionalities/thread/concurrent_events/TestConcurrentBreakpointsDelayedBreakpointOneWatchpoint.py (1754 of 2028) PASS: lldb-unit :: Utility/./UtilityTests/PassiveReplayTest.InstrumentedBarPtr (1755 of 2028) PASS: lldb-unit :: ScriptInterpreter/Python/./ScriptInterpreterPythonTests/PythonDataObjectsTest.TestPythonIntegerToStr (1756 of 2028) PASS: lldb-unit :: Host/./HostTests/SocketTest.TCPListen0ConnectAccept (1757 of 2028) PASS: lldb-api :: lang/cpp/namespace_conflicts/TestNamespaceConflicts.py (1758 of 2028) PASS: lldb-unit :: Utility/./UtilityTests/StringListTest.ShiftStdString (1759 of 2028) PASS: lldb-unit :: Host/./HostTests/HostInfoTest.GetAugmentedArchSpec (1760 of 2028) PASS: lldb-api :: lang/cpp/auto/TestCPPAuto.py (1761 of 2028) PASS: lldb-api :: lang/cpp/class_types/TestClassTypes.py (1762 of 2028) PASS: lldb-unit :: Utility/./UtilityTests/StreamTest.QuotedCString (1763 of 2028) PASS: lldb-shell :: Commands/command-source.test (1764 of 2028) PASS: lldb-unit :: UnwindAssembly/x86/./UnwindAssemblyx86Tests/Testx86AssemblyInspectionEngine.TestSpillRegToStackViaMOVx86_64 (1765 of 2028) PASS: lldb-unit :: Utility/./UtilityTests/StringListTest.AppendStringStdString (1766 of 2028) UNSUPPORTED: lldb-shell :: Expr/TestIRMemoryMapWindows.test (1767 of 2028) PASS: lldb-unit :: Utility/./UtilityTests/SerializationRountripTest.SerializeDeserializeCStringArray (1768 of 2028) UNSUPPORTED: lldb-api :: functionalities/data-formatter/data-formatter-stl/libstdcpp/smart_ptr/TestDataFormatterStdSmartPtr.py (1769 of 2028) PASS: lldb-unit :: Utility/./UtilityTests/VMRange.Ordering (1770 of 2028) PASS: lldb-api :: python_api/value_var_update/TestValueVarUpdate.py (1771 of 2028) PASS: lldb-unit :: Utility/./UtilityTests/XcodeSDKTest.SDKSupportsModules (1772 of 2028) PASS: lldb-shell :: SymbolFile/DWARF/dwo-type-in-main-file.s (1773 of 2028) UNSUPPORTED: lldb-api :: functionalities/data-formatter/data-formatter-stl/libstdcpp/tuple/TestDataFormatterStdTuple.py (1774 of 2028) PASS: lldb-api :: commands/expression/scoped_enums/TestScopedEnumType.py (1775 of 2028) PASS: lldb-unit :: Process/gdb-remote/./ProcessGdbRemoteTests/GDBRemoteClientBaseTest.SendPacketAndReceiveResponseWithOutputSupport (1776 of 2028) PASS: lldb-unit :: Process/minidump/./LLDBMinidumpTests/MinidumpParserTest.GetPidWindows (1777 of 2028) UNSUPPORTED: lldb-api :: tools/lldb-server/TestGdbRemote_vContThreads.py (1778 of 2028) PASS: lldb-api :: functionalities/thread/concurrent_events/TestConcurrentTwoWatchpointsOneDelayBreakpoint.py (1779 of 2028) PASS: lldb-unit :: Utility/./UtilityTests/StringListTest.AppendListCStringArray (1780 of 2028) PASS: lldb-api :: lang/objcxx/hide-runtime-values/TestObjCXXHideRuntimeValues.py (1781 of 2028) PASS: lldb-api :: commands/expression/radar_8638051/Test8638051.py (1782 of 2028) PASS: lldb-unit :: Utility/./UtilityTests/ArgsTest.TestSingleArgWithQuotedSpace (1783 of 2028) PASS: lldb-unit :: Utility/./UtilityTests/StreamTeeTest.GetStreamAtIndexOutOfBounds (1784 of 2028) PASS: lldb-api :: functionalities/data-formatter/setvaluefromcstring/TestSetValueFromCString.py (1785 of 2028) UNSUPPORTED: lldb-shell :: Register/arm-gp-read.test (1786 of 2028) PASS: lldb-api :: functionalities/data-formatter/data-formatter-objc/TestDataFormatterObjCNSBundle.py (1787 of 2028) PASS: lldb-unit :: Utility/./UtilityTests/StringExtractorTest.GetHexU8_Underflow2 (1788 of 2028) PASS: lldb-unit :: Utility/./UtilityTests/ProcessInstanceInfo.Yaml (1789 of 2028) PASS: lldb-unit :: Host/./HostTests/FileActionTest.Open (1790 of 2028) PASS: lldb-api :: functionalities/thread/concurrent_events/TestConcurrentTwoWatchpointsOneSignal.py (1791 of 2028) PASS: lldb-shell :: ObjectFile/PECOFF/uuid.yaml (1792 of 2028) PASS: lldb-unit :: Utility/./UtilityTests/UUIDTest.Validity (1793 of 2028) PASS: lldb-unit :: Utility/./UtilityTests/BinaryStreamTest.PutSLEB128TwoBytes (1794 of 2028) PASS: lldb-unit :: ScriptInterpreter/Python/./ScriptInterpreterPythonTests/PythonDataObjectsTest.TestGlobalNameResolutionWithDot (1795 of 2028) PASS: lldb-shell :: Reproducer/TestDSYM.test (1796 of 2028) UNSUPPORTED: lldb-shell :: SymbolFile/PDB/variables-locations.test (1797 of 2028) UNSUPPORTED: lldb-api :: lang/objc/rdar-12408181/TestRdar12408181.py (1798 of 2028) PASS: lldb-unit :: Utility/./UtilityTests/CompletionRequest.TryCompleteCurrentArgMode (1799 of 2028) PASS: lldb-unit :: Utility/./UtilityTests/GeneratorTest.GetOrCreate (1800 of 2028) PASS: lldb-unit :: SymbolFile/DWARF/./SymbolFileDWARFTests/DWARFASTParserClangTests.EnsureAllDIEsInDeclContextHaveBeenParsedParsesOnlyMatchingEntries (1801 of 2028) PASS: lldb-unit :: Utility/./UtilityTests/ArgsTest.EscapeLLDBCommandArgument (1802 of 2028) PASS: lldb-shell :: BuildScript/toolchain-clang.test (1803 of 2028) FAIL: lldb-api :: functionalities/data-formatter/poarray/TestPrintObjectArray.py (1804 of 2028) ******************** TEST 'lldb-api :: functionalities/data-formatter/poarray/TestPrintObjectArray.py' FAILED ******************** Script: -- /Users/buildslave/jenkins/workspace/lldb-cmake-sanitized/lldb-build/lldb-test-build.noindex/copied-system-python /Users/buildslave/jenkins/workspace/lldb-cmake-sanitized/llvm-project/lldb/test/API/dotest.py --arch x86_64 -s /Users/buildslave/jenkins/workspace/lldb-cmake-sanitized/lldb-build/lldb-test-traces -S nm -u CXXFLAGS -u CFLAGS --codesign-identity lldb_codesign --server /Users/buildslave/jenkins/workspace/lldb-cmake-sanitized/lldb-build/./bin/debugserver --arch x86_64 --build-dir /Users/buildslave/jenkins/workspace/lldb-cmake-sanitized/lldb-build/lldb-test-build.noindex -s=/Users/buildslave/jenkins/workspace/lldb-cmake-sanitized/test/logs -t --env TERM=vt100 --env LLVM_LIBS_DIR=/Users/buildslave/jenkins/workspace/lldb-cmake-sanitized/lldb-build/./lib --inferior-env ASAN_OPTIONS=detect_stack_use_after_return=1 --inferior-env DYLD_INSERT_LIBRARIES=/Users/buildslave/jenkins/workspace/lldb-cmake-sanitized/host-compiler/lib/clang/11.0.0/lib/darwin/libclang_rt.asan_osx_dynamic.dylib --build-dir /Users/buildslave/jenkins/workspace/lldb-cmake-sanitized/lldb-build/lldb-test-build.noindex --lldb-module-cache-dir /Users/buildslave/jenkins/workspace/lldb-cmake-sanitized/lldb-build/lldb-test-build.noindex/module-cache-lldb/lldb-api --clang-module-cache-dir /Users/buildslave/jenkins/workspace/lldb-cmake-sanitized/lldb-build/lldb-test-build.noindex/module-cache-clang/lldb-api --executable /Users/buildslave/jenkins/workspace/lldb-cmake-sanitized/lldb-build/./bin/lldb --compiler /Users/buildslave/jenkins/workspace/lldb-cmake-sanitized/lldb-build/./bin/clang --dsymutil /Users/buildslave/jenkins/workspace/lldb-cmake-sanitized/lldb-build/./bin/dsymutil --filecheck /Users/buildslave/jenkins/workspace/lldb-cmake-sanitized/lldb-build/./bin/FileCheck --lldb-libs-dir /Users/buildslave/jenkins/workspace/lldb-cmake-sanitized/lldb-build/./lib /Users/buildslave/jenkins/workspace/lldb-cmake-sanitized/llvm-project/lldb/test/API/functionalities/data-formatter/poarray -p TestPrintObjectArray.py -- Exit Code: -6

Hide Details

Command Output (stdout): -- lldb version 11.0.99 clang revision cbec419b3ebba3fe5551540cfd3e484dfa253a3a llvm revision cbec419b3ebba3fe5551540cfd3e484dfa253a3a

Hide Details

-- Command Output (stderr): --

Hide Details

Session logs for test failures/errors/unexpected successes will go into directory '/Users/buildslave/jenkins/workspace/lldb-cmake-sanitized/test/logs' Command invoked: /Users/buildslave/jenkins/workspace/lldb-cmake-sanitized/llvm-project/lldb/test/API/dotest.py --arch x86_64 -s /Users/buildslave/jenkins/workspace/lldb-cmake-sanitized/lldb-build/lldb-test-traces -S nm -u CXXFLAGS -u CFLAGS --codesign-identity lldb_codesign --server /Users/buildslave/jenkins/workspace/lldb-cmake-sanitized/lldb-build/./bin/debugserver --arch x86_64 --build-dir /Users/buildslave/jenkins/workspace/lldb-cmake-sanitized/lldb-build/lldb-test-build.noindex -s=/Users/buildslave/jenkins/workspace/lldb-cmake-sanitized/test/logs -t --env TERM=vt100 --env LLVM_LIBS_DIR=/Users/buildslave/jenkins/workspace/lldb-cmake-sanitized/lldb-build/./lib --inferior-env ASAN_OPTIONS=detect_stack_use_after_return=1 --inferior-env DYLD_INSERT_LIBRARIES=/Users/buildslave/jenkins/workspace/lldb-cmake-sanitized/host-compiler/lib/clang/11.0.0/lib/darwin/libclang_rt.asan_osx_dynamic.dylib --build-dir /Users/buildslave/jenkins/workspace/lldb-cmake-sanitized/lldb-build/lldb-test-build.noindex --lldb-module-cache-dir /Users/buildslave/jenkins/workspace/lldb-cmake-sanitized/lldb-build/lldb-test-build.noindex/module-cache-lldb/lldb-api --clang-module-cache-dir /Users/buildslave/jenkins/workspace/lldb-cmake-sanitized/lldb-build/lldb-test-build.noindex/module-cache-clang/lldb-api --executable /Users/buildslave/jenkins/workspace/lldb-cmake-sanitized/lldb-build/./bin/lldb --compiler /Users/buildslave/jenkins/workspace/lldb-cmake-sanitized/lldb-build/./bin/clang --dsymutil /Users/buildslave/jenkins/workspace/lldb-cmake-sanitized/lldb-build/./bin/dsymutil --filecheck /Users/buildslave/jenkins/workspace/lldb-cmake-sanitized/lldb-build/./bin/FileCheck --lldb-libs-dir /Users/buildslave/jenkins/workspace/lldb-cmake-sanitized/lldb-build/./lib /Users/buildslave/jenkins/workspace/lldb-cmake-sanitized/llvm-project/lldb/test/API/functionalities/data-formatter/poarray -p TestPrintObjectArray.py Change dir to: /Users/buildslave/jenkins/workspace/lldb-cmake-sanitized/llvm-project/lldb/test/API/functionalities/data-formatter/poarray runCmd: settings clear -all output:

Hide Details

runCmd: settings set symbols.enable-external-lookup false output:

Hide Details

runCmd: settings set target.auto-apply-fixits false output:

Hide Details

runCmd: settings set plugin.process.gdb-remote.packet-timeout 60 output:

Hide Details

runCmd: settings set symbols.clang-modules-cache-path "/Users/buildslave/jenkins/workspace/lldb-cmake-sanitized/lldb-build/lldb-test-build.noindex/module-cache-lldb/lldb-api" output:

Hide Details

runCmd: settings set use-color false output:

Hide Details

runCmd: setting set target.prefer-dynamic-value no-dynamic-values output:

Hide Details

runCmd: settings set target.env-vars ASAN_OPTIONS=detect_stack_use_after_return=1 DYLD_INSERT_LIBRARIES=/Users/buildslave/jenkins/workspace/lldb-cmake-sanitized/host-compiler/lib/clang/11.0.0/lib/darwin/libclang_rt.asan_osx_dynamic.dylib output:

Hide Details

runCmd: file /Users/buildslave/jenkins/workspace/lldb-cmake-sanitized/lldb-build/lldb-test-build.noindex/functionalities/data-formatter/poarray/TestPrintObjectArray.test_print_array_dsym/a.out output: Current executable set to '/Users/buildslave/jenkins/workspace/lldb-cmake-sanitized/lldb-build/lldb-test-build.noindex/functionalities/data-formatter/poarray/TestPrintObjectArray.test_print_array_dsym/a.out' (x86_64).

Hide Details

Hide Details

runCmd: breakpoint set -f "main.mm" -l 20 output: Breakpoint 1: where = a.out`main + 459 at main.mm:20:3, address = 0x0000000100000efb

Hide Details

Hide Details

Expecting pattern: ^Breakpoint (?P<bpno>[0-9]+): (?P<num_locations>[0-9]+) locations\.$ Not matched

Hide Details

Expecting pattern: ^Breakpoint (?P<bpno>[0-9]+): (?P<num_locations>no) locations \(pending\)\. Not matched

Hide Details

Expecting pattern: ^Breakpoint (?P<bpno>[0-9]+): where = (?P<module>.*)`(?P<symbol>[+\-]{0,1}[^+]+)( \+ (?P<offset>[0-9]+)){0,1}( \[inlined\] (?P<inline_symbol>.*)){0,1} at (?P<file>[^:]+):(?P<line_no>[0-9]+)(?P<column>(:[0-9]+)?), address = (?P<address>0x[0-9a-fA-F]+)$ Matched

Hide Details

runCmd: run output: Process 65621 stopped * thread #1, queue = 'com.apple.main-thread', stop reason = breakpoint 1.1 frame #0: 0x0000000100000efb a.out`main at main.mm:20:3 17 tobjects->two = array2; 18 tobjects->three = dictionary; 19 id* objects = (id*)tobjects; -> 20 return 0; // break here ^ 21 }

Hide Details

Process 65621 launched: '/Users/buildslave/jenkins/workspace/lldb-cmake-sanitized/lldb-build/lldb-test-build.noindex/functionalities/data-formatter/poarray/TestPrintObjectArray.test_print_array_dsym/a.out' (x86_64)

Hide Details

Hide Details

runCmd: thread list output: Process 65621 stopped * thread #1: tid = 0xaf61ac, 0x0000000100000efb a.out`main at main.mm:20:3, queue = 'com.apple.main-thread', stop reason = breakpoint 1.1

Hide Details

Hide Details

Expecting sub string: stopped Matched

Hide Details

Expecting sub string: stop reason = breakpoint Matched

Hide Details

Adding tearDown hook: def cleanup(): self.runCmd('type format clear', check=False) self.runCmd('type summary clear', check=False) self.runCmd('type synth clear', check=False)

Hide Details

Hide Details

runCmd: expr --element-count 3 --object-description -- objects output: { <__NSArrayI 0x604000001710>( 3735928559, 4276993775, 3203398366 )

Hide Details

<__NSArrayI 0x603000002f20>( Hello, World )

Hide Details

{ Two = ( Hello, World ); 1 = ( Hello, World ); }

Hide Details

}

Hide Details

Hide Details

Expecting sub string: 3735928559 Matched

Hide Details

Expecting sub string: 4276993775 Matched

Hide Details

Expecting sub string: 3203398366 Matched

Hide Details

Expecting sub string: Hello Matched

Hide Details

Expecting sub string: World Matched

Hide Details

Expecting sub string: Two = Matched

Hide Details

Expecting sub string: 1 = Matched

Hide Details

runCmd: poarray 3 objects output: { <__NSArrayI 0x604000001710>( 3735928559, 4276993775, 3203398366 )

Hide Details

<__NSArrayI 0x603000002f20>( Hello, World )

Hide Details

{ Two = ( Hello, World ); 1 = ( Hello, World ); }

Hide Details

}

Hide Details

Hide Details

Expecting sub string: 3735928559 Matched

Hide Details

Expecting sub string: 4276993775 Matched

Hide Details

Expecting sub string: 3203398366 Matched

Hide Details

Expecting sub string: Hello Matched

Hide Details

Expecting sub string: World Matched

Hide Details

Expecting sub string: Two = Matched

Hide Details

Expecting sub string: 1 = Matched

Hide Details

runCmd: expr --element-count 3 --object-description --description-verbosity=full -- objects output: (id *) $2 = 0x0000603000002fb0 { (id) [0] = 0x0000604000001710 <__NSArrayI 0x604000001710>( 3735928559, 4276993775, 3203398366 )

Hide Details

(id) [1] = 0x0000603000002f20 <__NSArrayI 0x603000002f20>( Hello, World )

Hide Details

(id) [2] = 0x0000606000008a20 { Two = ( Hello, World ); 1 = ( Hello, World ); }

Hide Details

}

Hide Details

Hide Details

Expecting sub string: [0] = Matched

Hide Details

Expecting sub string: 3735928559 Matched

Hide Details

Expecting sub string: 4276993775 Matched

Hide Details

Expecting sub string: 3203398366 Matched

Hide Details

Expecting sub string: [1] = Matched

Hide Details

Expecting sub string: Hello Matched

Hide Details

Expecting sub string: World Matched

Hide Details

Expecting sub string: [2] = Matched

Hide Details

Expecting sub string: Two = Matched

Hide Details

Expecting sub string: 1 = Matched

Hide Details

runCmd: parray 3 objects output: (id *) $3 = 0x0000603000002fb0 { (id) [0] = 0x0000604000001710 (id) [1] = 0x0000603000002f20 (id) [2] = 0x0000606000008a20 }

Hide Details

Hide Details

Expecting sub string: [0] = 0x Matched

Hide Details

Expecting sub string: [1] = 0x Matched

Hide Details

Expecting sub string: [2] = 0x Matched

Hide Details

runCmd: expr --element-count 3 -d run -- objects output: (id *) $4 = 0x0000603000002fb0 { (__NSArrayI *) [0] = 0x0000604000001710 3 elements (__NSArrayI *) [1] = 0x0000603000002f20 2 elements (__NSDictionaryI *) [2] = 0x0000606000008a20 2 key/value pairs }

Hide Details

Hide Details

Expecting sub string: 3 elements Matched

Hide Details

Expecting sub string: 2 elements Matched

Hide Details

Expecting sub string: 2 key/value pairs Matched

Hide Details

runCmd: expr --element-count 3 -d run --ptr-depth=1 -- objects output: (id *) $5 = 0x0000603000002fb0 { (__NSArrayI *) [0] = 0x0000604000001710 3 elements { [0] = 0x6a906fdff67ddf47 3735928559 [1] = 0x6a906fffb67ddf47 4276993775 [2] = 0x6a906fbfb439ee47 3203398366 } (__NSArrayI *) [1] = 0x0000603000002f20 2 elements { [0] = 0x0000000100001038 "Hello" [1] = 0x0000000100001058 "World" } (__NSDictionaryI *) [2] = 0x0000606000008a20 2 key/value pairs { [0] = { key = 0x0000000100001078 "Two" value = 0x0000603000002f20 2 elements } [1] = { key = 0x6a906f015bc33157 1 value = 0x0000603000002f20 2 elements } } }

Hide Details

Assertion failed: (tokenKind == tok::kw___bridge_retain), function ParseParenExpression, file /Users/buildslave/jenkins/workspace/lldb-cmake-sanitized/llvm-project/clang/lib/Parse/ParseExpr.cpp, line 2804.

Hide Details

--

Hide Details

******************** PASS: lldb-unit :: Utility/./UtilityTests/LogTest.Unregister (1805 of 2028) PASS: lldb-unit :: Host/./HostTests/NativeProcessProtocolTest.SetBreakpointFailWrite (1806 of 2028) PASS: lldb-unit :: Utility/./UtilityTests/Predicate.WaitForValueNotEqualTo (1807 of 2028) PASS: lldb-api :: python_api/watchpoint/TestWatchpointIter.py (1808 of 2028) PASS: lldb-api :: tools/lldb-server/commandline/TestStubReverseConnect.py (1809 of 2028) PASS: lldb-unit :: Utility/./UtilityTests/TimerTest.CategoryTimes2 (1810 of 2028) PASS: lldb-api :: functionalities/breakpoint/inlined_breakpoints/TestInlinedBreakpoints.py (1811 of 2028) PASS: lldb-unit :: ScriptInterpreter/Python/./ScriptInterpreterPythonTests/PythonDataObjectsTest.TestPythonBoolean (1812 of 2028) PASS: lldb-api :: commands/statistics/basic/TestStats.py (1813 of 2028) PASS: lldb-unit :: Host/./HostTests/SocketAddressTest.GetAddressInfo (1814 of 2028) PASS: lldb-unit :: ScriptInterpreter/Python/./ScriptInterpreterPythonTests/PythonDataObjectsTest.TestExtractingUInt64ThroughStructuredData (1815 of 2028) PASS: lldb-unit :: Symbol/./SymbolTests/PostfixExpression.ToDWARF (1816 of 2028) PASS: lldb-api :: functionalities/tail_call_frames/inlining_and_tail_calls/TestInliningAndTailCalls.py (1817 of 2028) FAIL: lldb-api :: lang/objc/foundation/TestObjCMethodsString.py (1818 of 2028) ******************** TEST 'lldb-api :: lang/objc/foundation/TestObjCMethodsString.py' FAILED ******************** Script: -- /Users/buildslave/jenkins/workspace/lldb-cmake-sanitized/lldb-build/lldb-test-build.noindex/copied-system-python /Users/buildslave/jenkins/workspace/lldb-cmake-sanitized/llvm-project/lldb/test/API/dotest.py --arch x86_64 -s /Users/buildslave/jenkins/workspace/lldb-cmake-sanitized/lldb-build/lldb-test-traces -S nm -u CXXFLAGS -u CFLAGS --codesign-identity lldb_codesign --server /Users/buildslave/jenkins/workspace/lldb-cmake-sanitized/lldb-build/./bin/debugserver --arch x86_64 --build-dir /Users/buildslave/jenkins/workspace/lldb-cmake-sanitized/lldb-build/lldb-test-build.noindex -s=/Users/buildslave/jenkins/workspace/lldb-cmake-sanitized/test/logs -t --env TERM=vt100 --env LLVM_LIBS_DIR=/Users/buildslave/jenkins/workspace/lldb-cmake-sanitized/lldb-build/./lib --inferior-env ASAN_OPTIONS=detect_stack_use_after_return=1 --inferior-env DYLD_INSERT_LIBRARIES=/Users/buildslave/jenkins/workspace/lldb-cmake-sanitized/host-compiler/lib/clang/11.0.0/lib/darwin/libclang_rt.asan_osx_dynamic.dylib --build-dir /Users/buildslave/jenkins/workspace/lldb-cmake-sanitized/lldb-build/lldb-test-build.noindex --lldb-module-cache-dir /Users/buildslave/jenkins/workspace/lldb-cmake-sanitized/lldb-build/lldb-test-build.noindex/module-cache-lldb/lldb-api --clang-module-cache-dir /Users/buildslave/jenkins/workspace/lldb-cmake-sanitized/lldb-build/lldb-test-build.noindex/module-cache-clang/lldb-api --executable /Users/buildslave/jenkins/workspace/lldb-cmake-sanitized/lldb-build/./bin/lldb --compiler /Users/buildslave/jenkins/workspace/lldb-cmake-sanitized/lldb-build/./bin/clang --dsymutil /Users/buildslave/jenkins/workspace/lldb-cmake-sanitized/lldb-build/./bin/dsymutil --filecheck /Users/buildslave/jenkins/workspace/lldb-cmake-sanitized/lldb-build/./bin/FileCheck --lldb-libs-dir /Users/buildslave/jenkins/workspace/lldb-cmake-sanitized/lldb-build/./lib /Users/buildslave/jenkins/workspace/lldb-cmake-sanitized/llvm-project/lldb/test/API/lang/objc/foundation -p TestObjCMethodsString.py -- Exit Code: -6

Hide Details

Command Output (stdout): -- lldb version 11.0.99 clang revision cbec419b3ebba3fe5551540cfd3e484dfa253a3a llvm revision cbec419b3ebba3fe5551540cfd3e484dfa253a3a

Hide Details

-- Command Output (stderr): -- Assertion failed: (tokenKind == tok::kw___bridge_retain), function ParseParenExpression, file /Users/buildslave/jenkins/workspace/lldb-cmake-sanitized/llvm-project/clang/lib/Parse/ParseExpr.cpp, line 2804.

Hide Details

--

Hide Details

******************** PASS: lldb-unit :: Target/./TargetTests/ModuleCacheTest.GetAndPutUuidExists (1819 of 2028) PASS: lldb-unit :: Host/./HostTests/FileSystemTest.FileAndDirectoryComponents (1820 of 2028) PASS: lldb-api :: functionalities/breakpoint/breakpoint_ignore_count/TestBreakpointIgnoreCount.py (1821 of 2028) PASS: lldb-unit :: SymbolFile/NativePDB/./SymbolFileNativePDBTests/PDBFPOProgramToDWARFExpressionTests.UnsupportedRASearch (1822 of 2028) PASS: lldb-api :: commands/expression/import-std-module/forward_list/TestForwardListFromStdModule.py (1823 of 2028) PASS: lldb-unit :: Utility/./UtilityTests/Predicate.WaitForValueEqualTo (1824 of 2028) PASS: lldb-shell :: ObjectFile/ELF/duplicate-section.yaml (1825 of 2028) PASS: lldb-api :: commands/expression/result_numbering/TestResultNumbering.py (1826 of 2028) FAIL: lldb-api :: lang/objc/hidden-ivars/TestHiddenIvars.py (1827 of 2028) ******************** TEST 'lldb-api :: lang/objc/hidden-ivars/TestHiddenIvars.py' FAILED ******************** Script: -- /Users/buildslave/jenkins/workspace/lldb-cmake-sanitized/lldb-build/lldb-test-build.noindex/copied-system-python /Users/buildslave/jenkins/workspace/lldb-cmake-sanitized/llvm-project/lldb/test/API/dotest.py --arch x86_64 -s /Users/buildslave/jenkins/workspace/lldb-cmake-sanitized/lldb-build/lldb-test-traces -S nm -u CXXFLAGS -u CFLAGS --codesign-identity lldb_codesign --server /Users/buildslave/jenkins/workspace/lldb-cmake-sanitized/lldb-build/./bin/debugserver --arch x86_64 --build-dir /Users/buildslave/jenkins/workspace/lldb-cmake-sanitized/lldb-build/lldb-test-build.noindex -s=/Users/buildslave/jenkins/workspace/lldb-cmake-sanitized/test/logs -t --env TERM=vt100 --env LLVM_LIBS_DIR=/Users/buildslave/jenkins/workspace/lldb-cmake-sanitized/lldb-build/./lib --inferior-env ASAN_OPTIONS=detect_stack_use_after_return=1 --inferior-env DYLD_INSERT_LIBRARIES=/Users/buildslave/jenkins/workspace/lldb-cmake-sanitized/host-compiler/lib/clang/11.0.0/lib/darwin/libclang_rt.asan_osx_dynamic.dylib --build-dir /Users/buildslave/jenkins/workspace/lldb-cmake-sanitized/lldb-build/lldb-test-build.noindex --lldb-module-cache-dir /Users/buildslave/jenkins/workspace/lldb-cmake-sanitized/lldb-build/lldb-test-build.noindex/module-cache-lldb/lldb-api --clang-module-cache-dir /Users/buildslave/jenkins/workspace/lldb-cmake-sanitized/lldb-build/lldb-test-build.noindex/module-cache-clang/lldb-api --executable /Users/buildslave/jenkins/workspace/lldb-cmake-sanitized/lldb-build/./bin/lldb --compiler /Users/buildslave/jenkins/workspace/lldb-cmake-sanitized/lldb-build/./bin/clang --dsymutil /Users/buildslave/jenkins/workspace/lldb-cmake-sanitized/lldb-build/./bin/dsymutil --filecheck /Users/buildslave/jenkins/workspace/lldb-cmake-sanitized/lldb-build/./bin/FileCheck --lldb-libs-dir /Users/buildslave/jenkins/workspace/lldb-cmake-sanitized/lldb-build/./lib /Users/buildslave/jenkins/workspace/lldb-cmake-sanitized/llvm-project/lldb/test/API/lang/objc/hidden-ivars -p TestHiddenIvars.py -- Exit Code: -6

Hide Details

Command Output (stdout): -- lldb version 11.0.99 clang revision cbec419b3ebba3fe5551540cfd3e484dfa253a3a llvm revision cbec419b3ebba3fe5551540cfd3e484dfa253a3a

Hide Details

-- Command Output (stderr): -- Assertion failed: (tokenKind == tok::kw___bridge_retain), function ParseParenExpression, file /Users/buildslave/jenkins/workspace/lldb-cmake-sanitized/llvm-project/clang/lib/Parse/ParseExpr.cpp, line 2804.

Hide Details

--

Hide Details

******************** PASS: lldb-shell :: Breakpoint/case-sensitive.test (1828 of 2028) PASS: lldb-api :: lang/cpp/signed_types/TestSignedTypes.py (1829 of 2028) FAIL: lldb-api :: lang/objc/objc-struct-return/TestObjCStructReturn.py (1830 of 2028) ******************** TEST 'lldb-api :: lang/objc/objc-struct-return/TestObjCStructReturn.py' FAILED ******************** Script: -- /Users/buildslave/jenkins/workspace/lldb-cmake-sanitized/lldb-build/lldb-test-build.noindex/copied-system-python /Users/buildslave/jenkins/workspace/lldb-cmake-sanitized/llvm-project/lldb/test/API/dotest.py --arch x86_64 -s /Users/buildslave/jenkins/workspace/lldb-cmake-sanitized/lldb-build/lldb-test-traces -S nm -u CXXFLAGS -u CFLAGS --codesign-identity lldb_codesign --server /Users/buildslave/jenkins/workspace/lldb-cmake-sanitized/lldb-build/./bin/debugserver --arch x86_64 --build-dir /Users/buildslave/jenkins/workspace/lldb-cmake-sanitized/lldb-build/lldb-test-build.noindex -s=/Users/buildslave/jenkins/workspace/lldb-cmake-sanitized/test/logs -t --env TERM=vt100 --env LLVM_LIBS_DIR=/Users/buildslave/jenkins/workspace/lldb-cmake-sanitized/lldb-build/./lib --inferior-env ASAN_OPTIONS=detect_stack_use_after_return=1 --inferior-env DYLD_INSERT_LIBRARIES=/Users/buildslave/jenkins/workspace/lldb-cmake-sanitized/host-compiler/lib/clang/11.0.0/lib/darwin/libclang_rt.asan_osx_dynamic.dylib --build-dir /Users/buildslave/jenkins/workspace/lldb-cmake-sanitized/lldb-build/lldb-test-build.noindex --lldb-module-cache-dir /Users/buildslave/jenkins/workspace/lldb-cmake-sanitized/lldb-build/lldb-test-build.noindex/module-cache-lldb/lldb-api --clang-module-cache-dir /Users/buildslave/jenkins/workspace/lldb-cmake-sanitized/lldb-build/lldb-test-build.noindex/module-cache-clang/lldb-api --executable /Users/buildslave/jenkins/workspace/lldb-cmake-sanitized/lldb-build/./bin/lldb --compiler /Users/buildslave/jenkins/workspace/lldb-cmake-sanitized/lldb-build/./bin/clang --dsymutil /Users/buildslave/jenkins/workspace/lldb-cmake-sanitized/lldb-build/./bin/dsymutil --filecheck /Users/buildslave/jenkins/workspace/lldb-cmake-sanitized/lldb-build/./bin/FileCheck --lldb-libs-dir /Users/buildslave/jenkins/workspace/lldb-cmake-sanitized/lldb-build/./lib /Users/buildslave/jenkins/workspace/lldb-cmake-sanitized/llvm-project/lldb/test/API/lang/objc/objc-struct-return -p TestObjCStructReturn.py -- Exit Code: -6

Hide Details

Command Output (stdout): -- lldb version 11.0.99 clang revision cbec419b3ebba3fe5551540cfd3e484dfa253a3a llvm revision cbec419b3ebba3fe5551540cfd3e484dfa253a3a

Hide Details

-- Command Output (stderr): -- Assertion failed: (tokenKind == tok::kw___bridge_retain), function ParseParenExpression, file /Users/buildslave/jenkins/workspace/lldb-cmake-sanitized/llvm-project/clang/lib/Parse/ParseExpr.cpp, line 2804.

Hide Details

--

Hide Details

******************** PASS: lldb-unit :: Utility/./UtilityTests/ScalarTest.ExtractBitfield (1831 of 2028) PASS: lldb-unit :: Utility/./UtilityTests/NameMatchesTest.Ignore (1832 of 2028) PASS: lldb-api :: functionalities/reproducers/attach/TestReproducerAttach.py (1833 of 2028) PASS: lldb-unit :: Expression/./ExpressionTests/DWARFExpression.DW_OP_piece (1834 of 2028) PASS: lldb-unit :: Language/Highlighting/./HighlighterTests/HighlighterTest.ClangScalarLiterals (1835 of 2028) PASS: lldb-api :: functionalities/postmortem/netbsd-core/TestNetBSDCore.py (1836 of 2028) PASS: lldb-api :: functionalities/data-formatter/data-formatter-stl/libcxx/vector/TestDataFormatterLibcxxVector.py (1837 of 2028) PASS: lldb-unit :: Target/./TargetTests/PathMappingListTest.RemapRoot (1838 of 2028) PASS: lldb-api :: lang/cpp/constructors/TestCppConstructors.py (1839 of 2028) PASS: lldb-unit :: Utility/./UtilityTests/StringExtractorTest.GetU64LittleEndian (1840 of 2028) PASS: lldb-unit :: Platform/./LLDBPlatformTests/PlatformDarwinTest.TestParseVersionBuildDir (1841 of 2028) UNSUPPORTED: lldb-shell :: ScriptInterpreter/Lua/bindings.test (1842 of 2028) PASS: lldb-shell :: SymbolFile/DWARF/debug_loc_and_loclists.s (1843 of 2028) PASS: lldb-api :: tools/lldb-vscode/attach/TestVSCode_attach.py (1844 of 2028) PASS: lldb-api :: functionalities/data-formatter/boolreference/TestFormattersBoolRefPtr.py (1845 of 2028) PASS: lldb-unit :: UnwindAssembly/x86/./UnwindAssemblyx86Tests/Testx86AssemblyInspectionEngine.TestPopRBPWithREX (1846 of 2028) PASS: lldb-api :: sample_test/TestSampleInlineTest.py (1847 of 2028) PASS: lldb-shell :: ObjectFile/ELF/PT_LOAD-empty.yaml (1848 of 2028) UNSUPPORTED: lldb-api :: arm/breakpoint-it/TestBreakpointIt.py (1849 of 2028) PASS: lldb-unit :: Utility/./UtilityTests/DataExtractorTest.GetMaxU64_unchecked (1850 of 2028) UNSUPPORTED: lldb-shell :: Reproducer/TestLuaImport.test (1851 of 2028) PASS: lldb-shell :: ScriptInterpreter/Python/crashlog.test (1852 of 2028) PASS: lldb-unit :: Language/Highlighting/./HighlighterTests/HighlighterTest.HighlighterSelectionPath (1853 of 2028) PASS: lldb-api :: lang/cpp/member-and-local-vars-with-same-name/TestMembersAndLocalsWithSameName.py (1854 of 2028) PASS: lldb-unit :: Utility/./UtilityTests/RecordReplayTest.InstrumentedBar (1855 of 2028) PASS: lldb-api :: functionalities/signal/TestSendSignal.py (1856 of 2028) PASS: lldb-api :: commands/expression/import-std-module/shared_ptr/TestSharedPtrFromStdModule.py (1857 of 2028) PASS: lldb-api :: commands/expression/import-std-module/forward_list-dbg-info-content/TestDbgInfoContentForwardListFromStdModule.py (1858 of 2028) UNSUPPORTED: lldb-api :: functionalities/ptr_refs/TestPtrRefs.py (1859 of 2028) PASS: lldb-api :: functionalities/abbreviation/TestCommonShortSpellings.py (1860 of 2028) PASS: lldb-api :: lang/c/local_types/TestUseClosestType.py (1861 of 2028) PASS: lldb-unit :: Utility/./UtilityTests/BinaryStreamTest.PutSLEB128EightBytes (1862 of 2028) UNSUPPORTED: lldb-api :: benchmarks/expression/TestExpressionCmd.py (1863 of 2028) PASS: lldb-api :: functionalities/lazy-loading/TestLazyLoading.py (1864 of 2028) PASS: lldb-api :: commands/watchpoints/watchpoint_disable/TestWatchpointDisable.py (1865 of 2028) PASS: lldb-shell :: SymbolFile/NativePDB/ast-methods.cpp (1866 of 2028) PASS: lldb-unit :: ScriptInterpreter/Python/./ScriptInterpreterPythonTests/PythonDataObjectsTest.TestPythonListToStructuredList (1867 of 2028) PASS: lldb-unit :: ObjectFile/Breakpad/./ObjectFileBreakpadTests/FileRecord.parse (1868 of 2028) PASS: lldb-api :: commands/expression/char/TestExprsChar.py (1869 of 2028) PASS: lldb-unit :: Utility/./UtilityTests/GeneratorTest.Get (1870 of 2028) PASS: lldb-shell :: Unwind/trap_frame_sym_ctx.test (1871 of 2028) PASS: lldb-unit :: Utility/./UtilityTests/StringLexerTest.GetUnlexed (1872 of 2028) PASS: lldb-unit :: Utility/./UtilityTests/SerializationRountripTest.SerializeDeserializePodReferences (1873 of 2028) UNSUPPORTED: lldb-api :: functionalities/thread/break_after_join/TestBreakAfterJoin.py (1874 of 2028) PASS: lldb-api :: functionalities/data-formatter/data-formatter-caching/TestDataFormatterCaching.py (1875 of 2028) PASS: lldb-unit :: Utility/./UtilityTests/RangeTest.ContainsRangeStartingFromZero (1876 of 2028) PASS: lldb-shell :: SymbolFile/NativePDB/break-by-function.cpp (1877 of 2028) PASS: lldb-api :: types/TestLongTypesExpr.py (1878 of 2028) UNSUPPORTED: lldb-shell :: SymbolFile/PDB/function-level-linking.test (1879 of 2028) PASS: lldb-unit :: UnwindAssembly/x86/./UnwindAssemblyx86Tests/Testx86AssemblyInspectionEngine.TestCALLNextInsn (1880 of 2028) PASS: lldb-api :: python_api/watchpoint/TestSetWatchpoint.py (1881 of 2028) PASS: lldb-api :: lang/mixed/TestMixedLanguages.py (1882 of 2028) UNSUPPORTED: lldb-api :: functionalities/darwin_log/source/info/TestDarwinLogSourceInfo.py (1883 of 2028) PASS: lldb-api :: lang/cpp/symbols/TestSymbols.py (1884 of 2028) PASS: lldb-unit :: Symbol/./SymbolTests/TestTypeSystemClang.TestGetEnumIntegerTypeBasicTypes (1885 of 2028) PASS: lldb-unit :: Utility/./UtilityTests/FileSpecTest.EqualSeparator (1886 of 2028) PASS: lldb-unit :: UnwindAssembly/x86/./UnwindAssemblyx86Tests/Testx86AssemblyInspectionEngine.TestPopRBX (1887 of 2028) PASS: lldb-api :: lang/cpp/chained-calls/TestCppChainedCalls.py (1888 of 2028) PASS: lldb-unit :: Utility/./UtilityTests/StreamTeeTest.Constructor2Streams (1889 of 2028) PASS: lldb-unit :: Symbol/./SymbolTests/LineEntryTest.GetSameLineContiguousAddressRangeNestedInline (1890 of 2028) PASS: lldb-unit :: Symbol/./SymbolTests/TestClangASTImporter.CopyDeclTagDecl (1891 of 2028) PASS: lldb-api :: python_api/sbvalue_persist/TestSBValuePersist.py (1892 of 2028) XFAIL: lldb-shell :: Register/x86-64-ymm-write.test (1893 of 2028) PASS: lldb-api :: types/TestFloatTypesExpr.py (1894 of 2028) PASS: lldb-unit :: Process/minidump/./LLDBMinidumpTests/MinidumpParserTest.GetMemoryRegionInfoFromMemory64List (1895 of 2028) PASS: lldb-unit :: Symbol/./SymbolTests/TestClangASTImporter.RecordLayout (1896 of 2028) PASS: lldb-unit :: Host/./HostTests/SocketTest.TCPGetAddress (1897 of 2028) PASS: lldb-shell :: Reproducer/TestDiscard.test (1898 of 2028) PASS: lldb-unit :: SymbolFile/NativePDB/./SymbolFileNativePDBTests/PDBFPOProgramToDWARFExpressionTests.UnknownOp (1899 of 2028) PASS: lldb-unit :: Utility/./UtilityTests/StreamTeeTest.DefaultConstructor (1900 of 2028) PASS: lldb-unit :: Utility/./UtilityTests/UriParserTest.SchemeHostSeparator (1901 of 2028) UNSUPPORTED: lldb-api :: macosx/macabi/TestMacABImacOSFramework.py (1902 of 2028) PASS: lldb-unit :: Symbol/./SymbolTests/TestClangASTImporter.MetadataPropagationAfterCopying (1903 of 2028) PASS: lldb-shell :: Register/x86-64-read.test (1904 of 2028) PASS: lldb-unit :: Utility/./UtilityTests/OptionsWithRawTest.ArgsButNoLeadingDash (1905 of 2028) PASS: lldb-unit :: ScriptInterpreter/Python/./ScriptInterpreterPythonTests/PythonDataObjectsTest.TestResetting (1906 of 2028) PASS: lldb-unit :: Expression/./ExpressionTests/CppModuleConfigurationTest.UnrelatedLibrary (1907 of 2028) PASS: lldb-unit :: Utility/./UtilityTests/StatusTest.ErrorConversion (1908 of 2028) PASS: lldb-api :: functionalities/data-formatter/data-formatter-skip-summary/TestDataFormatterSkipSummary.py (1909 of 2028) PASS: lldb-api :: lang/cpp/breakpoint_in_member_func_w_non_primitive_params/TestBreakpointInMemberFuncWNonPrimitiveParams.py (1910 of 2028) PASS: lldb-unit :: Core/./LLDBCoreTests/RichManglingContextTest.SwitchProvider (1911 of 2028) PASS: lldb-api :: tools/lldb-vscode/console/TestVSCode_console.py (1912 of 2028) PASS: lldb-unit :: UnwindAssembly/x86/./UnwindAssemblyx86Tests/Testx86AssemblyInspectionEngine.TestPushR15 (1913 of 2028) PASS: lldb-api :: functionalities/data-formatter/data-formatter-smart-array/TestDataFormatterSmartArray.py (1914 of 2028) PASS: lldb-shell :: ScriptInterpreter/None/import_module.test (1915 of 2028) PASS: lldb-api :: commands/expression/weak_symbols/TestWeakSymbols.py (1916 of 2028) PASS: lldb-unit :: Utility/./UtilityTests/StringExtractorTest.GetHexU8_Extra (1917 of 2028) UNSUPPORTED: lldb-shell :: Breakpoint/ppc64-localentry.test (1918 of 2028) PASS: lldb-shell :: ObjectFile/ELF/PT_LOAD-overlap-section.yaml (1919 of 2028) PASS: lldb-shell :: Minidump/memory-region.yaml (1920 of 2028) PASS: lldb-unit :: Utility/./UtilityTests/SerializationRountripTest.SerializeDeserializeCStringArrayNullptr (1921 of 2028) UNSUPPORTED: lldb-shell :: Register/x86-64-ymm16-read.test (1922 of 2028) PASS: lldb-api :: lang/objc/modules-cache/TestClangModulesCache.py (1923 of 2028) PASS: lldb-unit :: Utility/./UtilityTests/StreamTest.AddressPrefix (1924 of 2028) PASS: lldb-api :: python_api/sbtype_typeclass/TestSBTypeTypeClass.py (1925 of 2028) PASS: lldb-api :: functionalities/thread/concurrent_events/TestConcurrentWatchpointDelayWatchpointOneBreakpoint.py (1926 of 2028) PASS: lldb-unit :: Utility/./UtilityTests/BinaryStreamTest.PutSLEB128OneByte (1927 of 2028) PASS: lldb-shell :: SymbolFile/DWARF/debug_ranges.s (1928 of 2028) UNSUPPORTED: lldb-api :: functionalities/breakpoint/breakpoint_callback_command_source/TestBreakpointCallbackCommandSource.py (1929 of 2028) PASS: lldb-unit :: Process/gdb-remote/./ProcessGdbRemoteTests/GDBRemoteCommunicationServerTest.SendErrorResponse_StringError (1930 of 2028) PASS: lldb-unit :: Expression/./ExpressionTests/DiagnosticManagerTest.AppendMessageSubsequentDiags (1931 of 2028) PASS: lldb-api :: commands/help/TestHelp.py (1932 of 2028) PASS: lldb-unit :: Utility/./UtilityTests/BinaryStreamTest.PutULEB128FourBytes (1933 of 2028) PASS: lldb-api :: functionalities/archives/TestBSDArchives.py (1934 of 2028) PASS: lldb-shell :: Reproducer/Functionalities/TestStepping.test (1935 of 2028) PASS: lldb-api :: functionalities/data-formatter/data-formatter-synth/TestDataFormatterSynth.py (1936 of 2028) PASS: lldb-api :: tools/lldb-server/TestGdbRemoteKill.py (1937 of 2028) PASS: lldb-unit :: Utility/./UtilityTests/Flags.AnyClear (1938 of 2028) UNSUPPORTED: lldb-shell :: Watchpoint/netbsd-nouserdbregs.test (1939 of 2028) PASS: lldb-api :: commands/command/script_alias/TestCommandScriptAlias.py (1940 of 2028) PASS: lldb-api :: commands/version/TestVersion.py (1941 of 2028) PASS: lldb-api :: types/TestDoubleTypesExpr.py (1942 of 2028) PASS: lldb-shell :: Minidump/Windows/Sigsegv/sigsegv.test (1943 of 2028) PASS: lldb-unit :: Utility/./UtilityTests/UriParserTest.LongPath (1944 of 2028) UNSUPPORTED: lldb-api :: functionalities/tsan/multiple/TestTsanMultiple.py (1945 of 2028) PASS: lldb-api :: functionalities/postmortem/elf-core/gcore/TestGCore.py (1946 of 2028) PASS: lldb-shell :: SymbolFile/DWARF/find-basic-function.cpp (1947 of 2028) PASS: lldb-unit :: Utility/./UtilityTests/ArgsTest.StringListConstructor (1948 of 2028) PASS: lldb-api :: commands/expression/regression-access-function-template-in-record/TestRegressionAccessFunctionTemplateInRecord.py (1949 of 2028) PASS: lldb-api :: commands/target/create-no-such-arch/TestNoSuchArch.py (1950 of 2028) PASS: lldb-api :: functionalities/inferior-crashing/TestInferiorCrashing.py (1951 of 2028) PASS: lldb-unit :: Utility/./UtilityTests/NameMatchesTest.Equals (1952 of 2028) UNSUPPORTED: lldb-api :: functionalities/darwin_log/filter/exact_match/subsystem/TestDarwinLogFilterMatchSubsystem.py (1953 of 2028) PASS: lldb-unit :: Host/./HostTests/MainLoopTest.TerminatesImmediately (1954 of 2028) PASS: lldb-unit :: DataFormatter/./LLDBFormatterTests/FormatManagerTests.CompatibleLangs (1955 of 2028) PASS: lldb-shell :: SymbolFile/DWARF/find-method.cpp (1956 of 2028) UNSUPPORTED: lldb-shell :: SymbolFile/PDB/expressions.test (1957 of 2028) UNSUPPORTED: lldb-shell :: Register/x86-64-zmm-read.test (1958 of 2028) PASS: lldb-unit :: Symbol/./SymbolTests/TestClangASTImporter.DeportTypeTagDecl (1959 of 2028) PASS: lldb-shell :: SymbolFile/DWARF/DW_OP_piece-struct.s (1960 of 2028) PASS: lldb-api :: commands/apropos/with-process/TestAproposWithProcess.py (1961 of 2028) PASS: lldb-unit :: Utility/./UtilityTests/NameMatchesTest.EndsWith (1962 of 2028) FAIL: lldb-api :: lang/objc/objc-struct-argument/TestObjCStructArgument.py (1963 of 2028) ******************** TEST 'lldb-api :: lang/objc/objc-struct-argument/TestObjCStructArgument.py' FAILED ******************** Script: -- /Users/buildslave/jenkins/workspace/lldb-cmake-sanitized/lldb-build/lldb-test-build.noindex/copied-system-python /Users/buildslave/jenkins/workspace/lldb-cmake-sanitized/llvm-project/lldb/test/API/dotest.py --arch x86_64 -s /Users/buildslave/jenkins/workspace/lldb-cmake-sanitized/lldb-build/lldb-test-traces -S nm -u CXXFLAGS -u CFLAGS --codesign-identity lldb_codesign --server /Users/buildslave/jenkins/workspace/lldb-cmake-sanitized/lldb-build/./bin/debugserver --arch x86_64 --build-dir /Users/buildslave/jenkins/workspace/lldb-cmake-sanitized/lldb-build/lldb-test-build.noindex -s=/Users/buildslave/jenkins/workspace/lldb-cmake-sanitized/test/logs -t --env TERM=vt100 --env LLVM_LIBS_DIR=/Users/buildslave/jenkins/workspace/lldb-cmake-sanitized/lldb-build/./lib --inferior-env ASAN_OPTIONS=detect_stack_use_after_return=1 --inferior-env DYLD_INSERT_LIBRARIES=/Users/buildslave/jenkins/workspace/lldb-cmake-sanitized/host-compiler/lib/clang/11.0.0/lib/darwin/libclang_rt.asan_osx_dynamic.dylib --build-dir /Users/buildslave/jenkins/workspace/lldb-cmake-sanitized/lldb-build/lldb-test-build.noindex --lldb-module-cache-dir /Users/buildslave/jenkins/workspace/lldb-cmake-sanitized/lldb-build/lldb-test-build.noindex/module-cache-lldb/lldb-api --clang-module-cache-dir /Users/buildslave/jenkins/workspace/lldb-cmake-sanitized/lldb-build/lldb-test-build.noindex/module-cache-clang/lldb-api --executable /Users/buildslave/jenkins/workspace/lldb-cmake-sanitized/lldb-build/./bin/lldb --compiler /Users/buildslave/jenkins/workspace/lldb-cmake-sanitized/lldb-build/./bin/clang --dsymutil /Users/buildslave/jenkins/workspace/lldb-cmake-sanitized/lldb-build/./bin/dsymutil --filecheck /Users/buildslave/jenkins/workspace/lldb-cmake-sanitized/lldb-build/./bin/FileCheck --lldb-libs-dir /Users/buildslave/jenkins/workspace/lldb-cmake-sanitized/lldb-build/./lib /Users/buildslave/jenkins/workspace/lldb-cmake-sanitized/llvm-project/lldb/test/API/lang/objc/objc-struct-argument -p TestObjCStructArgument.py -- Exit Code: -6

Hide Details

Command Output (stdout): -- lldb version 11.0.99 clang revision cbec419b3ebba3fe5551540cfd3e484dfa253a3a llvm revision cbec419b3ebba3fe5551540cfd3e484dfa253a3a

Hide Details

-- Command Output (stderr): -- Assertion failed: (tokenKind == tok::kw___bridge_retain), function ParseParenExpression, file /Users/buildslave/jenkins/workspace/lldb-cmake-sanitized/llvm-project/clang/lib/Parse/ParseExpr.cpp, line 2804.

Hide Details

--

Hide Details

******************** PASS: lldb-shell :: Reproducer/TestVersionCheck.test (1964 of 2028) PASS: lldb-unit :: UnwindAssembly/x86/./UnwindAssemblyx86Tests/Testx86AssemblyInspectionEngine.Testi386IgnoredRegisters (1965 of 2028) UNSUPPORTED: lldb-api :: functionalities/data-formatter/data-formatter-stl/libstdcpp/map/TestDataFormatterStdMap.py (1966 of 2028) PASS: lldb-api :: functionalities/unwind/sigtramp/TestSigtrampUnwind.py (1967 of 2028) PASS: lldb-api :: lang/cpp/llvm-style/TestLLVMStyle.py (1968 of 2028) PASS: lldb-unit :: Utility/./UtilityTests/StringListTest.GetSize (1969 of 2028) PASS: lldb-unit :: Language/Highlighting/./HighlighterTests/HighlighterTest.ClangCursorPosBeforeOtherToken (1970 of 2028) UNSUPPORTED: lldb-api :: commands/target/auto-install-main-executable/TestAutoInstallMainExecutable.py (1971 of 2028) PASS: lldb-unit :: Utility/./UtilityTests/OptionsWithRawTest.EmptyInput (1972 of 2028) PASS: lldb-unit :: Utility/./UtilityTests/RecordReplayTest.InstrumentedFooSameThis (1973 of 2028) UNSUPPORTED: lldb-api :: commands/expression/completion-crash-invalid-iterator/TestInvalidIteratorCompletionCrash.py (1974 of 2028) PASS: lldb-unit :: Expression/./ExpressionTests/CppModuleConfigurationTest.UnknownLibCppFile (1975 of 2028) PASS: lldb-unit :: Utility/./UtilityTests/SubsystemRAIITest.NormalSubsystem (1976 of 2028) PASS: lldb-api :: functionalities/data-formatter/data-formatter-categories/TestDataFormatterCategories.py (1977 of 2028) PASS: lldb-api :: functionalities/data-formatter/data-formatter-stl/libcxx/queue/TestDataFormatterLibcxxQueue.py (1978 of 2028) PASS: lldb-unit :: Utility/./UtilityTests/UriParserTest.MinimalPath (1979 of 2028) PASS: lldb-unit :: Expression/./ExpressionTests/ClangExpressionDeclMapTest.TestUnknownIdentifierLookup (1980 of 2028) PASS: lldb-shell :: ObjectFile/ELF/minidebuginfo-corrupt-xz.yaml (1981 of 2028) PASS: lldb-unit :: Utility/./UtilityTests/ArgsTest.TestQuotedUnknownEscape (1982 of 2028) UNSUPPORTED: lldb-api :: tools/lldb-server/thread-name/TestGdbRemoteThreadName.py (1983 of 2028) PASS: lldb-unit :: Language/Highlighting/./HighlighterTests/HighlighterTest.FallbackHighlighter (1984 of 2028) PASS: lldb-shell :: SymbolFile/DWARF/find-basic-type.cpp (1985 of 2028) PASS: lldb-api :: lang/c/bitfields/TestBitfields.py (1986 of 2028) PASS: lldb-api :: commands/watchpoints/multiple_threads/TestWatchpointMultipleThreads.py (1987 of 2028) PASS: lldb-unit :: Utility/./UtilityTests/StreamTeeTest.SetStreamAtIndexOutOfBounds (1988 of 2028) PASS: lldb-unit :: Utility/./UtilityTests/DataExtractorTest.GetBitfield (1989 of 2028) PASS: lldb-shell :: ObjectFile/wasm/unified-debug-sections.yaml (1990 of 2028) PASS: lldb-api :: lang/cpp/breakpoint-commands/TestCPPBreakpointCommands.py (1991 of 2028) PASS: lldb-unit :: Utility/./UtilityTests/RangeTest.NotEqualInvalid (1992 of 2028) PASS: lldb-api :: functionalities/thread/concurrent_events/TestConcurrentCrashWithBreak.py (1993 of 2028) PASS: lldb-api :: functionalities/type_lookup/TestTypeLookup.py (1994 of 2028) FAIL: lldb-api :: lang/objc/objc++/TestObjCXX.py (1995 of 2028) ******************** TEST 'lldb-api :: lang/objc/objc++/TestObjCXX.py' FAILED ******************** Script: -- /Users/buildslave/jenkins/workspace/lldb-cmake-sanitized/lldb-build/lldb-test-build.noindex/copied-system-python /Users/buildslave/jenkins/workspace/lldb-cmake-sanitized/llvm-project/lldb/test/API/dotest.py --arch x86_64 -s /Users/buildslave/jenkins/workspace/lldb-cmake-sanitized/lldb-build/lldb-test-traces -S nm -u CXXFLAGS -u CFLAGS --codesign-identity lldb_codesign --server /Users/buildslave/jenkins/workspace/lldb-cmake-sanitized/lldb-build/./bin/debugserver --arch x86_64 --build-dir /Users/buildslave/jenkins/workspace/lldb-cmake-sanitized/lldb-build/lldb-test-build.noindex -s=/Users/buildslave/jenkins/workspace/lldb-cmake-sanitized/test/logs -t --env TERM=vt100 --env LLVM_LIBS_DIR=/Users/buildslave/jenkins/workspace/lldb-cmake-sanitized/lldb-build/./lib --inferior-env ASAN_OPTIONS=detect_stack_use_after_return=1 --inferior-env DYLD_INSERT_LIBRARIES=/Users/buildslave/jenkins/workspace/lldb-cmake-sanitized/host-compiler/lib/clang/11.0.0/lib/darwin/libclang_rt.asan_osx_dynamic.dylib --build-dir /Users/buildslave/jenkins/workspace/lldb-cmake-sanitized/lldb-build/lldb-test-build.noindex --lldb-module-cache-dir /Users/buildslave/jenkins/workspace/lldb-cmake-sanitized/lldb-build/lldb-test-build.noindex/module-cache-lldb/lldb-api --clang-module-cache-dir /Users/buildslave/jenkins/workspace/lldb-cmake-sanitized/lldb-build/lldb-test-build.noindex/module-cache-clang/lldb-api --executable /Users/buildslave/jenkins/workspace/lldb-cmake-sanitized/lldb-build/./bin/lldb --compiler /Users/buildslave/jenkins/workspace/lldb-cmake-sanitized/lldb-build/./bin/clang --dsymutil /Users/buildslave/jenkins/workspace/lldb-cmake-sanitized/lldb-build/./bin/dsymutil --filecheck /Users/buildslave/jenkins/workspace/lldb-cmake-sanitized/lldb-build/./bin/FileCheck --lldb-libs-dir /Users/buildslave/jenkins/workspace/lldb-cmake-sanitized/lldb-build/./lib /Users/buildslave/jenkins/workspace/lldb-cmake-sanitized/llvm-project/lldb/test/API/lang/objc/objc++ -p TestObjCXX.py -- Exit Code: -6

Hide Details

Command Output (stdout): -- lldb version 11.0.99 clang revision cbec419b3ebba3fe5551540cfd3e484dfa253a3a llvm revision cbec419b3ebba3fe5551540cfd3e484dfa253a3a

Hide Details

-- Command Output (stderr): -- Assertion failed: (tokenKind == tok::kw___bridge_retain), function ParseParenExpression, file /Users/buildslave/jenkins/workspace/lldb-cmake-sanitized/llvm-project/clang/lib/Parse/ParseExpr.cpp, line 2804.

Hide Details

--

Hide Details

******************** PASS: lldb-shell :: Settings/TestFrameFormatNoColor.test (1996 of 2028) FAIL: lldb-api :: lang/objc/forward-decl/TestForwardDecl.py (1997 of 2028) ******************** TEST 'lldb-api :: lang/objc/forward-decl/TestForwardDecl.py' FAILED ******************** Script: -- /Users/buildslave/jenkins/workspace/lldb-cmake-sanitized/lldb-build/lldb-test-build.noindex/copied-system-python /Users/buildslave/jenkins/workspace/lldb-cmake-sanitized/llvm-project/lldb/test/API/dotest.py --arch x86_64 -s /Users/buildslave/jenkins/workspace/lldb-cmake-sanitized/lldb-build/lldb-test-traces -S nm -u CXXFLAGS -u CFLAGS --codesign-identity lldb_codesign --server /Users/buildslave/jenkins/workspace/lldb-cmake-sanitized/lldb-build/./bin/debugserver --arch x86_64 --build-dir /Users/buildslave/jenkins/workspace/lldb-cmake-sanitized/lldb-build/lldb-test-build.noindex -s=/Users/buildslave/jenkins/workspace/lldb-cmake-sanitized/test/logs -t --env TERM=vt100 --env LLVM_LIBS_DIR=/Users/buildslave/jenkins/workspace/lldb-cmake-sanitized/lldb-build/./lib --inferior-env ASAN_OPTIONS=detect_stack_use_after_return=1 --inferior-env DYLD_INSERT_LIBRARIES=/Users/buildslave/jenkins/workspace/lldb-cmake-sanitized/host-compiler/lib/clang/11.0.0/lib/darwin/libclang_rt.asan_osx_dynamic.dylib --build-dir /Users/buildslave/jenkins/workspace/lldb-cmake-sanitized/lldb-build/lldb-test-build.noindex --lldb-module-cache-dir /Users/buildslave/jenkins/workspace/lldb-cmake-sanitized/lldb-build/lldb-test-build.noindex/module-cache-lldb/lldb-api --clang-module-cache-dir /Users/buildslave/jenkins/workspace/lldb-cmake-sanitized/lldb-build/lldb-test-build.noindex/module-cache-clang/lldb-api --executable /Users/buildslave/jenkins/workspace/lldb-cmake-sanitized/lldb-build/./bin/lldb --compiler /Users/buildslave/jenkins/workspace/lldb-cmake-sanitized/lldb-build/./bin/clang --dsymutil /Users/buildslave/jenkins/workspace/lldb-cmake-sanitized/lldb-build/./bin/dsymutil --filecheck /Users/buildslave/jenkins/workspace/lldb-cmake-sanitized/lldb-build/./bin/FileCheck --lldb-libs-dir /Users/buildslave/jenkins/workspace/lldb-cmake-sanitized/lldb-build/./lib /Users/buildslave/jenkins/workspace/lldb-cmake-sanitized/llvm-project/lldb/test/API/lang/objc/forward-decl -p TestForwardDecl.py -- Exit Code: -6

Hide Details

Command Output (stdout): -- lldb version 11.0.99 clang revision cbec419b3ebba3fe5551540cfd3e484dfa253a3a llvm revision cbec419b3ebba3fe5551540cfd3e484dfa253a3a

Hide Details

-- Command Output (stderr): -- Assertion failed: (tokenKind == tok::kw___bridge_retain), function ParseParenExpression, file /Users/buildslave/jenkins/workspace/lldb-cmake-sanitized/llvm-project/clang/lib/Parse/ParseExpr.cpp, line 2804.

Hide Details

--

Hide Details

******************** PASS: lldb-api :: tools/lldb-server/TestGdbRemoteThreadsInStopReply.py (1998 of 2028) PASS: lldb-unit :: ObjectFile/Breakpad/./ObjectFileBreakpadTests/Record.classify (1999 of 2028) PASS: lldb-api :: functionalities/thread/concurrent_events/TestConcurrentManyCrash.py (2000 of 2028) PASS: lldb-unit :: UnwindAssembly/x86/./UnwindAssemblyx86Tests/Testx86AssemblyInspectionEngine.TestPushESI (2001 of 2028) PASS: lldb-shell :: Driver/TestCore.test (2002 of 2028) PASS: lldb-shell :: Commands/CommandScriptImmediateOutput/CommandScriptImmediateOutputConsole.test (2003 of 2028) PASS: lldb-unit :: Utility/./UtilityTests/BinaryStreamTest.PutULEB128One (2004 of 2028) PASS: lldb-api :: functionalities/gdb_remote_client/TestArmRegisterDefinition.py (2005 of 2028) PASS: lldb-unit :: Language/Highlighting/./HighlighterTests/HighlighterTest.ClangTrailingBackslashMissingNewLine (2006 of 2028) PASS: lldb-unit :: ScriptInterpreter/Python/./ScriptInterpreterPythonTests/PythonDataObjectsTest.TestPythonTupleValues (2007 of 2028) PASS: lldb-unit :: Language/Highlighting/./HighlighterTests/HighlighterTest.ClangBraces (2008 of 2028) PASS: lldb-api :: commands/settings/use_source_cache/TestUseSourceCache.py (2009 of 2028) UNSUPPORTED: lldb-api :: tools/lldb-vscode/completions/TestVSCode_completions.py (2010 of 2028) PASS: lldb-shell :: ObjectFile/MachO/lc_build_version.yaml (2011 of 2028) PASS: lldb-unit :: Utility/./UtilityTests/StringListTest.SplitIntoLinesSingleTrailingCR (2012 of 2028) PASS: lldb-api :: python_api/value/change_values/TestChangeValueAPI.py (2013 of 2028) PASS: lldb-api :: functionalities/postmortem/minidump/TestMiniDump.py (2014 of 2028) UNSUPPORTED: lldb-api :: iohandler/completion/TestIOHandlerCompletion.py (2015 of 2028) PASS: lldb-unit :: Utility/./UtilityTests/Flags.GetBitSize (2016 of 2028) UNSUPPORTED: lldb-api :: lang/cpp/printf/TestPrintf.py (2017 of 2028) PASS: lldb-unit :: Utility/./UtilityTests/EnvironmentTest.EnvpConversion (2018 of 2028) PASS: lldb-api :: lang/objc/foundation/TestSymbolTable.py (2019 of 2028) PASS: lldb-unit :: Utility/./UtilityTests/StringExtractorTest.DecodeHexU8_InvalidHex2 (2020 of 2028) PASS: lldb-unit :: Expression/./ExpressionTests/ClangExpressionDeclMapTest.TestPersistentDeclLookup (2021 of 2028) PASS: lldb-api :: lang/c/enum_types/TestEnumTypes.py (2022 of 2028) PASS: lldb-shell :: SymbolFile/DWARF/debug-types-dwo-cross-reference.cpp (2023 of 2028) PASS: lldb-unit :: Target/./TargetTests/ExecutionContextTest.GetByteOrderProcess (2024 of 2028) PASS: lldb-shell :: ObjectFile/ELF/compressed-sections.yaml (2025 of 2028) UNSUPPORTED: lldb-api :: functionalities/thread/create_during_step/TestCreateDuringStep.py (2026 of 2028) FAIL: lldb-api :: functionalities/data-formatter/data-formatter-objc/TestDataFormatterObjCNSError.py (2027 of 2028) ******************** TEST 'lldb-api :: functionalities/data-formatter/data-formatter-objc/TestDataFormatterObjCNSError.py' FAILED ******************** Script: -- /Users/buildslave/jenkins/workspace/lldb-cmake-sanitized/lldb-build/lldb-test-build.noindex/copied-system-python /Users/buildslave/jenkins/workspace/lldb-cmake-sanitized/llvm-project/lldb/test/API/dotest.py --arch x86_64 -s /Users/buildslave/jenkins/workspace/lldb-cmake-sanitized/lldb-build/lldb-test-traces -S nm -u CXXFLAGS -u CFLAGS --codesign-identity lldb_codesign --server /Users/buildslave/jenkins/workspace/lldb-cmake-sanitized/lldb-build/./bin/debugserver --arch x86_64 --build-dir /Users/buildslave/jenkins/workspace/lldb-cmake-sanitized/lldb-build/lldb-test-build.noindex -s=/Users/buildslave/jenkins/workspace/lldb-cmake-sanitized/test/logs -t --env TERM=vt100 --env LLVM_LIBS_DIR=/Users/buildslave/jenkins/workspace/lldb-cmake-sanitized/lldb-build/./lib --inferior-env ASAN_OPTIONS=detect_stack_use_after_return=1 --inferior-env DYLD_INSERT_LIBRARIES=/Users/buildslave/jenkins/workspace/lldb-cmake-sanitized/host-compiler/lib/clang/11.0.0/lib/darwin/libclang_rt.asan_osx_dynamic.dylib --build-dir /Users/buildslave/jenkins/workspace/lldb-cmake-sanitized/lldb-build/lldb-test-build.noindex --lldb-module-cache-dir /Users/buildslave/jenkins/workspace/lldb-cmake-sanitized/lldb-build/lldb-test-build.noindex/module-cache-lldb/lldb-api --clang-module-cache-dir /Users/buildslave/jenkins/workspace/lldb-cmake-sanitized/lldb-build/lldb-test-build.noindex/module-cache-clang/lldb-api --executable /Users/buildslave/jenkins/workspace/lldb-cmake-sanitized/lldb-build/./bin/lldb --compiler /Users/buildslave/jenkins/workspace/lldb-cmake-sanitized/lldb-build/./bin/clang --dsymutil /Users/buildslave/jenkins/workspace/lldb-cmake-sanitized/lldb-build/./bin/dsymutil --filecheck /Users/buildslave/jenkins/workspace/lldb-cmake-sanitized/lldb-build/./bin/FileCheck --lldb-libs-dir /Users/buildslave/jenkins/workspace/lldb-cmake-sanitized/lldb-build/./lib /Users/buildslave/jenkins/workspace/lldb-cmake-sanitized/llvm-project/lldb/test/API/functionalities/data-formatter/data-formatter-objc -p TestDataFormatterObjCNSError.py -- Exit Code: -6

Hide Details

Command Output (stdout): -- lldb version 11.0.99 clang revision cbec419b3ebba3fe5551540cfd3e484dfa253a3a llvm revision cbec419b3ebba3fe5551540cfd3e484dfa253a3a

Hide Details

-- Command Output (stderr): -- Assertion failed: (tokenKind == tok::kw___bridge_retain), function ParseParenExpression, file /Users/buildslave/jenkins/workspace/lldb-cmake-sanitized/llvm-project/clang/lib/Parse/ParseExpr.cpp, line 2804.

Hide Details

--

Hide Details

******************** PASS: lldb-api :: commands/register/register/register_command/TestRegisters.py (2028 of 2028) Slowest Tests: -------------------------------------------------------------------------- 350.48s: lldb-api :: tools/lldb-server/TestLldbGdbServer.py 267.35s: lldb-api :: lang/cpp/enum_types/TestCPP11EnumTypes.py 258.10s: lldb-api :: api/multithreaded/TestMultithreaded.py 244.90s: lldb-api :: tools/lldb-server/TestGdbRemoteThreadsInStopReply.py 156.09s: lldb-api :: lang/objc/exceptions/TestObjCExceptions.py 154.39s: lldb-api :: lang/cpp/namespace/TestNamespaceLookup.py 140.77s: lldb-api :: lang/objc/real-definition/TestRealDefinition.py 124.11s: lldb-api :: types/TestLongTypesExpr.py 119.23s: lldb-api :: tools/lldb-server/TestGdbRemote_qThreadStopInfo.py 110.76s: lldb-api :: lang/objc/foundation/TestObjCMethods.py 104.84s: lldb-api :: python_api/lldbutil/iter/TestLLDBIterator.py 98.08s: lldb-api :: python_api/exprpath_synthetic/TestExprPathSynthetic.py 91.70s: lldb-api :: functionalities/gdb_remote_client/TestWasm.py 88.87s: lldb-api :: lang/objc/conflicting-definition/TestConflictingDefinition.py 87.12s: lldb-api :: types/TestLongTypes.py 86.72s: lldb-api :: commands/settings/TestSettings.py 85.98s: lldb-api :: functionalities/data-formatter/compactvectors/TestCompactVectors.py 78.38s: lldb-api :: api/check_public_api_headers/TestPublicAPIHeaders.py 77.64s: lldb-api :: lang/objc/foundation/TestObjCMethodsNSArray.py 76.73s: lldb-api :: commands/expression/import-std-module/stack/TestStackFromStdModule.py

Hide Details

Tests Times: -------------------------------------------------------------------------- [ Range ] :: [ Percentage ] :: [ Count ] -------------------------------------------------------------------------- [340s,360s) :: [ ] :: [ 1/2028] [320s,340s) :: [ ] :: [ 0/2028] [300s,320s) :: [ ] :: [ 0/2028] [280s,300s) :: [ ] :: [ 0/2028] [260s,280s) :: [ ] :: [ 2/2028] [240s,260s) :: [ ] :: [ 1/2028] [220s,240s) :: [ ] :: [ 0/2028] [200s,220s) :: [ ] :: [ 0/2028] [180s,200s) :: [ ] :: [ 0/2028] [160s,180s) :: [ ] :: [ 1/2028] [140s,160s) :: [ ] :: [ 2/2028] [120s,140s) :: [ ] :: [ 2/2028] [100s,120s) :: [ ] :: [ 3/2028] [ 80s,100s) :: [ ] :: [ 6/2028] [ 60s, 80s) :: [ ] :: [ 21/2028] [ 40s, 60s) :: [* ] :: [ 88/2028] [ 20s, 40s) :: [** ] :: [ 120/2028] [ 0s, 20s) :: [*********************************** ] :: [1781/2028] -------------------------------------------------------------------------- ******************** Failing Tests (53): lldb-api :: lang/objc/foundation/TestObjCMethodsNSArray.py lldb-api :: commands/expression/two-files/TestObjCTypeQueryFromOtherCompileUnit.py lldb-api :: functionalities/data-formatter/data-formatter-objc/TestDataFormatterObjCNSContainer.py lldb-api :: commands/expression/import_builtin_fileid/TestImportBuiltinFileID.py lldb-api :: python_api/exprpath_synthetic/TestExprPathSynthetic.py lldb-api :: lang/objc/objc-class-method/TestObjCClassMethod.py lldb-api :: lang/objc/variadic_methods/TestVariadicMethods.py lldb-api :: functionalities/data-formatter/data-formatter-objc/nsindexpath/TestDataFormatterNSIndexPath.py lldb-api :: commands/expression/call-throws/TestCallThatThrows.py lldb-api :: commands/expression/diagnostics/TestExprDiagnostics.py lldb-api :: lang/objc/foundation/TestConstStrings.py lldb-api :: lang/objcxx/cxx-bridged-po/TestObjCXXBridgedPO.py lldb-api :: lang/objc/print-obj/TestPrintObj.py lldb-api :: lang/objc/objc-static-method/TestObjCStaticMethod.py lldb-api :: functionalities/data-formatter/synthupdate/TestSyntheticFilterRecompute.py lldb-api :: commands/expression/namespace_local_var_same_name_obj_c/TestNamespaceLocalVarSameNameObjC.py lldb-api :: commands/expression/persist_objc_pointeetype/TestPersistObjCPointeeType.py lldb-api :: lang/objcxx/objcxx-ivar-vector/TestIvarVector.py lldb-api :: lang/objc/objc-runtime-ivars/TestRuntimeIvars.py lldb-api :: lang/objc/radar-9691614/TestObjCMethodReturningBOOL.py lldb-api :: functionalities/set-data/TestSetData.py lldb-api :: lang/objc/rdar-11355592/TestRdar11355592.py lldb-api :: lang/objc/conflicting-definition/TestConflictingDefinition.py lldb-api :: commands/expression/po_verbosity/TestPoVerbosity.py lldb-api :: commands/expression/context-object-objc/TestContextObjectObjc.py lldb-api :: lang/objc/objc-new-syntax/TestObjCNewSyntaxArray.py lldb-api :: lang/objc/blocks/TestObjCIvarsInBlocks.py lldb-api :: lang/objc/objc-optimized/TestObjcOptimized.py lldb-api :: lang/objc/objc-super/TestObjCSuper.py lldb-api :: lang/objc/foundation/TestObjCMethodsNSError.py lldb-api :: functionalities/data-formatter/data-formatter-objc/TestDataFormatterObjCExpr.py lldb-api :: lang/objc/self/TestObjCSelf.py lldb-api :: lang/objc/modules-non-objc-target/TestObjCModulesNonObjCTarget.py lldb-api :: lang/objc/objc-property/TestObjCProperty.py lldb-api :: lang/objc/foundation/TestObjCMethods.py lldb-api :: lang/objc/modules/TestObjCModules.py lldb-api :: lang/objc/unicode-string/TestUnicodeString.py lldb-api :: lang/objc/objc_direct-methods/TestObjCDirectMethods.py lldb-api :: lang/objc/objc-ivar-protocols/TestIvarProtocols.py lldb-api :: lang/objc/orderedset/TestOrderedSet.py lldb-api :: lang/objc/objc-new-syntax/TestObjCNewSyntaxLiteral.py lldb-api :: lang/objc/bitfield_ivars/TestBitfieldIvars.py lldb-api :: lang/objc/foundation/TestRuntimeTypes.py lldb-api :: functionalities/data-formatter/data-formatter-objc/TestDataFormatterObjCCF.py lldb-api :: lang/objc/objc-new-syntax/TestObjCNewSyntaxDictionary.py lldb-api :: functionalities/data-formatter/poarray/TestPrintObjectArray.py lldb-api :: lang/objc/foundation/TestObjCMethodsString.py lldb-api :: lang/objc/hidden-ivars/TestHiddenIvars.py lldb-api :: lang/objc/objc-struct-return/TestObjCStructReturn.py lldb-api :: lang/objc/objc-struct-argument/TestObjCStructArgument.py lldb-api :: lang/objc/forward-decl/TestForwardDecl.py lldb-api :: lang/objc/objc++/TestObjCXX.py lldb-api :: functionalities/data-formatter/data-formatter-objc/TestDataFormatterObjCNSError.py

Hide Details

Hide Details

Testing Time: 4166.15s Unsupported Tests : 170 Expected Passes : 1799 Expected Failures : 6 Unexpected Failures: 53 FAILED: tools/lldb/test/CMakeFiles/check-lldb-lit cd /Users/buildslave/jenkins/workspace/lldb-cmake-sanitized/lldb-build/tools/lldb/test && /usr/local/Frameworks/Python.framework/Versions/3.7/bin/python3.7 /Users/buildslave/jenkins/workspace/lldb-cmake-sanitized/lldb-build/./bin/llvm-lit -v --time-tests --shuffle --xunit-xml-output=/Users/buildslave/jenkins/workspace/lldb-cmake-sanitized/test/results.xml -v -j 4 --timeout 1200 /Users/buildslave/jenkins/workspace/lldb-cmake-sanitized/lldb-build/tools/lldb/test ninja: build stopped: subcommand failed. Command failed: Command '['/usr/bin/env', 'TERM=vt100', '/usr/local/bin/ninja', '-v', 'check-lldb']' returned non-zero exit status 1. Command: ['/usr/bin/env', 'TERM=vt100', '/usr/local/bin/ninja', '-v', 'check-lldb'] [Pipeline] } [Pipeline] // timeout [Pipeline] } [Pipeline] // stage [Pipeline] stage [Pipeline] { (Declarative: Post Actions) [Pipeline] scanForIssues [Clang (LLVM based)] Sleeping for 5 seconds due to JENKINS-32191... [Clang (LLVM based)] Parsing console log (workspace: '/Users/buildslave/jenkins/workspace/lldb-cmake-sanitized') [Clang (LLVM based)] Successfully parsed console log [Clang (LLVM based)] -> found 2 issues (skipped 0 duplicates) [Clang (LLVM based)] Post processing issues on 'green-dragon-23' with source code encoding 'UTF-8' [Clang (LLVM based)] Creating SCM blamer to obtain author and commit information for affected files [Clang (LLVM based)] Creating SCM miner to obtain statistics for affected repository files [Clang (LLVM based)] Resolving file names for all issues in source directory '/Users/buildslave/jenkins/workspace/lldb-cmake-sanitized' [Clang (LLVM based)] -> resolved paths in source directory (1 found, 0 not found) [Clang (LLVM based)] Resolving module names from module definitions (build.xml, pom.xml, or Manifest.mf files) [Clang (LLVM based)] -> resolved module names for 2 issues [Clang (LLVM based)] Resolving package names (or namespaces) by parsing the affected files [Clang (LLVM based)] -> resolved package names of 1 affected files [Clang (LLVM based)] No filter has been set, publishing all 2 issues [Clang (LLVM based)] Creating fingerprints for all affected code blocks to track issues over different builds [Clang (LLVM based)] -> created fingerprints for 2 issues (skipped 0 issues) [Clang (LLVM based)] Copying affected files to Jenkins' build folder '/Users/Shared/Jenkins/Home/jobs/lldb-cmake-sanitized/builds/1497/files-with-issues' [Clang (LLVM based)] -> 1 copied, 0 not in workspace, 0 not-found, 0 with I/O error [Pipeline] junit Recording test results [Pipeline] } [Pipeline] // stage [Pipeline] } [Pipeline] // withEnv [Pipeline] } [Pipeline] // node [Pipeline] End of Pipeline ERROR: script returned exit code 1 Finished: FAILURE