FailedConsole Output

Skipping 9,082 KB.. Full Log
1221 of 2028)
PASS: lldb-shell :: Driver/TestProcessAttach.test (1222 of 2028)
PASS: lldb-unit :: Utility/./UtilityTests/UriParserTest.BracketedHostnameWithPortIPv6 (1223 of 2028)
UNSUPPORTED: lldb-shell :: SymbolFile/NativePDB/local-variables.cpp (1224 of 2028)
PASS: lldb-shell :: BuildScript/toolchain-clang.test (1225 of 2028)
PASS: lldb-shell :: Register/x86-64-ymm-read.test (1226 of 2028)
PASS: lldb-unit :: Expression/./ExpressionTests/CppModuleConfigurationTest.IgnoreLibStdCpp (1227 of 2028)
PASS: lldb-unit :: ScriptInterpreter/Python/./ScriptInterpreterPythonTests/PythonDataObjectsTest.TestPythonBytes (1228 of 2028)
PASS: lldb-unit :: ScriptInterpreter/Python/./ScriptInterpreterPythonTests/PythonDataObjectsTest.TestResetting (1229 of 2028)
PASS: lldb-unit :: Utility/./UtilityTests/StringExtractorTest.GetHexBytes (1230 of 2028)
PASS: lldb-unit :: Utility/./UtilityTests/ConstStringTest.YAML (1231 of 2028)
PASS: lldb-shell :: SymbolFile/DWARF/dir-separator-no-comp-dir-relative-name.s (1232 of 2028)
PASS: lldb-unit :: Symbol/./SymbolTests/TestClangASTImporter.CanImportInvalidType (1233 of 2028)
UNSUPPORTED: lldb-api :: linux/mix-dwo-and-regular-objects/TestMixedDwarfBinary.py (1234 of 2028)
PASS: lldb-api :: commands/expression/calculator_mode/TestCalculatorMode.py (1235 of 2028)
PASS: lldb-api :: types/TestCharType.py (1236 of 2028)
PASS: lldb-shell :: SymbolFile/DWARF/dir-separator-windows.s (1237 of 2028)
PASS: lldb-unit :: ScriptInterpreter/Python/./ScriptInterpreterPythonTests/PythonDataObjectsTest.TestPythonString (1238 of 2028)
UNSUPPORTED: lldb-shell :: SymbolFile/PDB/function-nested-block.test (1239 of 2028)
PASS: lldb-api :: functionalities/unwind/zeroth_frame/TestZerothFrame.py (1240 of 2028)
PASS: lldb-api :: functionalities/thread/backtrace_all/TestBacktraceAll.py (1241 of 2028)
PASS: lldb-api :: functionalities/breakpoint/debugbreak/TestDebugBreak.py (1242 of 2028)
PASS: lldb-api :: python_api/lldbutil/iter/TestLLDBIterator.py (1243 of 2028)
PASS: lldb-shell :: ObjectFile/ELF/build-id-case.yaml (1244 of 2028)
PASS: lldb-unit :: Utility/./UtilityTests/UUIDTest.SetFromStringRef (1245 of 2028)
XFAIL: lldb-shell :: SymbolFile/DWARF/find-type-in-function.cpp (1246 of 2028)
PASS: lldb-unit :: Utility/./UtilityTests/RangeTest.Slide (1247 of 2028)
PASS: lldb-unit :: Utility/./UtilityTests/StringExtractorTest.GetHexBytesAvail_OddPair (1248 of 2028)
PASS: lldb-api :: functionalities/pointer_num_children/TestPointerNumChildren.py (1249 of 2028)
PASS: lldb-unit :: UnwindAssembly/x86/./UnwindAssemblyx86Tests/Testx86AssemblyInspectionEngine.TestSimple64bitFrameFunction (1250 of 2028)
PASS: lldb-api :: commands/frame/var/TestFrameVar.py (1251 of 2028)
UNSUPPORTED: lldb-shell :: SymbolFile/PDB/compilands.test (1252 of 2028)
PASS: lldb-unit :: Utility/./UtilityTests/StringExtractorTest.GetHexBytesAvail (1253 of 2028)
PASS: lldb-unit :: Utility/./UtilityTests/VMRange.ContainsAddr (1254 of 2028)
PASS: lldb-shell :: ScriptInterpreter/None/none.test (1255 of 2028)
PASS: lldb-unit :: Utility/./UtilityTests/PassiveReplayTest.InstrumentedFooInvalid (1256 of 2028)
PASS: lldb-api :: functionalities/data-formatter/nssetsynth/TestNSSetSynthetic.py (1257 of 2028)
PASS: lldb-unit :: Utility/./UtilityTests/CompletionRequest.Constructor (1258 of 2028)
UNSUPPORTED: lldb-api :: commands/watchpoints/hello_watchlocation/TestWatchLocation.py (1259 of 2028)
PASS: lldb-unit :: Utility/./UtilityTests/RangeTest.SetRangeBase (1260 of 2028)
PASS: lldb-shell :: SymbolFile/NativePDB/nested-types.cpp (1261 of 2028)
PASS: lldb-unit :: Utility/./UtilityTests/LogChannelTest.Enable (1262 of 2028)
PASS: lldb-unit :: Utility/./UtilityTests/OptionsWithRawTest.QuotedSuffix (1263 of 2028)
PASS: lldb-shell :: ObjectFile/ELF/PT_LOAD-overlap.yaml (1264 of 2028)
PASS: lldb-api :: macosx/safe-to-func-call/TestSafeFuncCalls.py (1265 of 2028)
PASS: lldb-api :: python_api/lldbutil/iter/TestRegistersIterator.py (1266 of 2028)
PASS: lldb-api :: commands/expression/argument_passing_restrictions/TestArgumentPassingRestrictions.py (1267 of 2028)
PASS: lldb-unit :: Utility/./UtilityTests/RangeTest.SizeTypes (1268 of 2028)
PASS: lldb-api :: python_api/module_section/TestModuleAndSection.py (1269 of 2028)
PASS: lldb-shell :: Minidump/Windows/Sigsegv/sigsegv.test (1270 of 2028)
PASS: lldb-unit :: ObjectFile/PECOFF/./ObjectFilePECOFFTests/PECallFrameInfoTest.Chained_eh (1271 of 2028)
PASS: lldb-unit :: Utility/./UtilityTests/TimerTest.CategoryTimesStats (1272 of 2028)
PASS: lldb-unit :: Utility/./UtilityTests/FileSpecTest.EqualDotsPosix (1273 of 2028)
PASS: lldb-api :: python_api/lldbutil/TestSwigVersion.py (1274 of 2028)
UNSUPPORTED: lldb-shell :: Register/arm-fp-read.test (1275 of 2028)
PASS: lldb-unit :: UnwindAssembly/x86/./UnwindAssemblyx86Tests/Testx86AssemblyInspectionEngine.TestPushImm (1276 of 2028)
PASS: lldb-api :: functionalities/breakpoint/breakpoint_ids/TestBreakpointIDs.py (1277 of 2028)
PASS: lldb-api :: commands/target/stop-hooks/TestStopHooks.py (1278 of 2028)
UNSUPPORTED: lldb-api :: functionalities/gdb_remote_client/TestWasm.py (1279 of 2028)
PASS: lldb-api :: lang/cpp/overloaded-functions/TestOverloadedFunctions.py (1280 of 2028)
PASS: lldb-shell :: Breakpoint/split-dwarf-5-addrbase.test (1281 of 2028)
PASS: lldb-unit :: Utility/./UtilityTests/StringExtractorTest.GetHexBytes_OddPair (1282 of 2028)
PASS: lldb-unit :: Utility/./UtilityTests/StreamTeeTest.AppendStream (1283 of 2028)
PASS: lldb-unit :: Utility/./UtilityTests/ArchSpecTest.MergeFromMachOUnknown (1284 of 2028)
PASS: lldb-shell :: Driver/TestPositionalArgs.test (1285 of 2028)
PASS: lldb-api :: functionalities/gdb_remote_client/TestRestartBug.py (1286 of 2028)
PASS: lldb-shell :: ObjectFile/PECOFF/invalid-export-table.yaml (1287 of 2028)
PASS: lldb-api :: functionalities/data-formatter/data-formatter-stl/libcxx/queue/TestDataFormatterLibcxxQueue.py (1288 of 2028)
PASS: lldb-api :: functionalities/data-formatter/data-formatter-python-synth/TestDataFormatterPythonSynth.py (1289 of 2028)
UNSUPPORTED: lldb-api :: functionalities/asan/TestReportData.py (1290 of 2028)
UNSUPPORTED: lldb-shell :: SymbolFile/PDB/expressions.test (1291 of 2028)
PASS: lldb-unit :: Language/Highlighting/./HighlighterTests/HighlighterTest.ClangComments (1292 of 2028)
PASS: lldb-unit :: Utility/./UtilityTests/SerializationRountripTest.SerializeDeserializeObjectReference (1293 of 2028)
PASS: lldb-unit :: Core/./LLDBCoreTests/MangledTest.ResultForValidName (1294 of 2028)
PASS: lldb-unit :: Utility/./UtilityTests/StringListTest.Clear (1295 of 2028)
PASS: lldb-unit :: Utility/./UtilityTests/RangeTest.DoesAdjoinOrIntersect (1296 of 2028)
PASS: lldb-shell :: ObjectFile/ELF/avr-basic-info.yaml (1297 of 2028)
PASS: lldb-unit :: UnwindAssembly/x86/./UnwindAssemblyx86Tests/Testx86AssemblyInspectionEngine.TestPushESI (1298 of 2028)
PASS: lldb-api :: functionalities/thread/crash_during_step/TestCrashDuringStep.py (1299 of 2028)
PASS: lldb-api :: commands/expression/import-std-module/weak_ptr-dbg-info-content/TestDbgInfoContentWeakPtrFromStdModule.py (1300 of 2028)
PASS: lldb-shell :: Quit/TestQuitExitCode0.test (1301 of 2028)
PASS: lldb-shell :: Commands/CommandScriptImmediateOutput/CommandScriptImmediateOutputFile.test (1302 of 2028)
PASS: lldb-api :: lang/cpp/breakpoint_in_member_func_w_non_primitive_params/TestBreakpointInMemberFuncWNonPrimitiveParams.py (1303 of 2028)
PASS: lldb-api :: functionalities/data-formatter/nsarraysynth/TestNSArraySynthetic.py (1304 of 2028)
PASS: lldb-unit :: Language/Highlighting/./HighlighterTests/HighlighterTest.ClangBraces (1305 of 2028)
PASS: lldb-unit :: Utility/./UtilityTests/StringListTest.InsertStringAtIndexMove (1306 of 2028)
PASS: lldb-shell :: SymbolFile/DWARF/gnu-style-compression.cpp (1307 of 2028)
PASS: lldb-unit :: Host/./HostTests/FileSystemTest.Readable (1308 of 2028)
UNSUPPORTED: lldb-shell :: ObjectFile/ELF/minidebuginfo-no-lzma.yaml (1309 of 2028)
PASS: lldb-unit :: Process/minidump/./LLDBMinidumpTests/MinidumpParserTest.GetMiscInfo_no_stream (1310 of 2028)
PASS: lldb-unit :: Process/minidump/./LLDBMinidumpTests/MinidumpParserTest.GetPid (1311 of 2028)
PASS: lldb-unit :: Utility/./UtilityTests/StreamTeeTest.Write (1312 of 2028)
PASS: lldb-api :: lang/cpp/modules-import/TestCXXModulesImport.py (1313 of 2028)
PASS: lldb-unit :: Utility/./UtilityTests/StringExtractorTest.GetHexU8_Extra (1314 of 2028)
PASS: lldb-shell :: SymbolFile/NativePDB/break-by-line.cpp (1315 of 2028)
PASS: lldb-unit :: Host/./HostTests/FileSystemTest.Resolve (1316 of 2028)
PASS: lldb-unit :: Language/Highlighting/./HighlighterTests/HighlighterTest.ClangSquareBrackets (1317 of 2028)
PASS: lldb-api :: lang/mixed/TestMixedLanguages.py (1318 of 2028)
PASS: lldb-api :: functionalities/paths/TestPaths.py (1319 of 2028)
PASS: lldb-shell :: Quit/TestQuitExitCodeNonInt.test (1320 of 2028)
PASS: lldb-unit :: Utility/./UtilityTests/RangeTest.LessThanInvalid (1321 of 2028)
PASS: lldb-api :: python_api/class_members/TestSBTypeClassMembers.py (1322 of 2028)
PASS: lldb-api :: tools/lldb-vscode/attach/TestVSCode_attach.py (1323 of 2028)
PASS: lldb-unit :: Utility/./UtilityTests/RegisterValueTest.GetSet8 (1324 of 2028)
PASS: lldb-unit :: SymbolFile/NativePDB/./SymbolFileNativePDBTests/PDBFPOProgramToDWARFExpressionTests.UnresolvedRegisterAssignmentReference (1325 of 2028)
PASS: lldb-shell :: Quit/TestQuitExitCodeImplicit0.test (1326 of 2028)
UNSUPPORTED: lldb-shell :: ScriptInterpreter/Lua/breakpoint_callback.test (1327 of 2028)
PASS: lldb-unit :: Utility/./UtilityTests/ArgsTest.TestUnknownEscape (1328 of 2028)
PASS: lldb-unit :: Utility/./UtilityTests/StringListTest.LongestCommonPrefixNoPrefix (1329 of 2028)
PASS: lldb-api :: commands/quit/TestQuit.py (1330 of 2028)
PASS: lldb-api :: functionalities/data-formatter/data-formatter-synthval/TestDataFormatterSynthVal.py (1331 of 2028)
UNSUPPORTED: lldb-api :: functionalities/ptr_refs/TestPtrRefs.py (1332 of 2028)
PASS: lldb-unit :: Process/gdb-remote/./ProcessGdbRemoteTests/GDBRemoteClientBaseTest.SendContinueAndLateInterrupt (1333 of 2028)
PASS: lldb-api :: python_api/type/TestTypeList.py (1334 of 2028)
PASS: lldb-unit :: Utility/./UtilityTests/StringExtractorTest.InitEmpty (1335 of 2028)
PASS: lldb-api :: tools/lldb-server/TestGdbRemote_vCont.py (1336 of 2028)
PASS: lldb-shell :: SymbolFile/DWARF/debug-types-dwo-cross-reference.cpp (1337 of 2028)
PASS: lldb-api :: functionalities/thread/exit_during_expression/TestExitDuringExpression.py (1338 of 2028)
FAIL: lldb-api :: lang/objcxx/cxx-bridged-po/TestObjCXXBridgedPO.py (1339 of 2028)
******************** TEST 'lldb-api :: lang/objcxx/cxx-bridged-po/TestObjCXXBridgedPO.py' FAILED ********************
Script:
--
/Users/buildslave/jenkins/workspace/lldb-cmake-sanitized/lldb-build/lldb-test-build.noindex/copied-system-python /Users/buildslave/jenkins/workspace/lldb-cmake-sanitized/llvm-project/lldb/test/API/dotest.py --arch x86_64 -s /Users/buildslave/jenkins/workspace/lldb-cmake-sanitized/lldb-build/lldb-test-traces -S nm -u CXXFLAGS -u CFLAGS --codesign-identity lldb_codesign --server /Users/buildslave/jenkins/workspace/lldb-cmake-sanitized/lldb-build/./bin/debugserver --arch x86_64 --build-dir /Users/buildslave/jenkins/workspace/lldb-cmake-sanitized/lldb-build/lldb-test-build.noindex -s=/Users/buildslave/jenkins/workspace/lldb-cmake-sanitized/test/logs -t --env TERM=vt100 --env LLVM_LIBS_DIR=/Users/buildslave/jenkins/workspace/lldb-cmake-sanitized/lldb-build/./lib --inferior-env ASAN_OPTIONS=detect_stack_use_after_return=1 --inferior-env DYLD_INSERT_LIBRARIES=/Users/buildslave/jenkins/workspace/lldb-cmake-sanitized/host-compiler/lib/clang/11.0.0/lib/darwin/libclang_rt.asan_osx_dynamic.dylib --build-dir /Users/buildslave/jenkins/workspace/lldb-cmake-sanitized/lldb-build/lldb-test-build.noindex --lldb-module-cache-dir /Users/buildslave/jenkins/workspace/lldb-cmake-sanitized/lldb-build/lldb-test-build.noindex/module-cache-lldb/lldb-api --clang-module-cache-dir /Users/buildslave/jenkins/workspace/lldb-cmake-sanitized/lldb-build/lldb-test-build.noindex/module-cache-clang/lldb-api --executable /Users/buildslave/jenkins/workspace/lldb-cmake-sanitized/lldb-build/./bin/lldb --compiler /Users/buildslave/jenkins/workspace/lldb-cmake-sanitized/lldb-build/./bin/clang --dsymutil /Users/buildslave/jenkins/workspace/lldb-cmake-sanitized/lldb-build/./bin/dsymutil --filecheck /Users/buildslave/jenkins/workspace/lldb-cmake-sanitized/lldb-build/./bin/FileCheck --lldb-libs-dir /Users/buildslave/jenkins/workspace/lldb-cmake-sanitized/lldb-build/./lib /Users/buildslave/jenkins/workspace/lldb-cmake-sanitized/llvm-project/lldb/test/API/lang/objcxx/cxx-bridged-po -p TestObjCXXBridgedPO.py
--
Exit Code: -6

Hide Details

Command Output (stdout): -- lldb version 11.0.99 clang revision 7ad36491cadee1ed91e18215c30328a3d5c104f9 llvm revision 7ad36491cadee1ed91e18215c30328a3d5c104f9

Hide Details

-- Command Output (stderr): -- Assertion failed: (tokenKind == tok::kw___bridge_retain), function ParseParenExpression, file /Users/buildslave/jenkins/workspace/lldb-cmake-sanitized/llvm-project/clang/lib/Parse/ParseExpr.cpp, line 2804.

Hide Details

--

Hide Details

******************** PASS: lldb-unit :: UnwindAssembly/x86/./UnwindAssemblyx86Tests/Testx86AssemblyInspectionEngine.Test64bitFramelessSmallStackFrame (1340 of 2028) PASS: lldb-api :: lang/c/shared_lib/TestSharedLib.py (1341 of 2028) PASS: lldb-unit :: Expression/./ExpressionTests/CppModuleConfigurationTest.LibCppV2 (1342 of 2028) PASS: lldb-shell :: ObjectFile/wasm/basic.yaml (1343 of 2028) PASS: lldb-api :: functionalities/data-formatter/stringprinter/TestStringPrinter.py (1344 of 2028) PASS: lldb-api :: python_api/formatters/TestFormattersSBAPI.py (1345 of 2028) PASS: lldb-unit :: Utility/./UtilityTests/StringListTest.ShiftMove (1346 of 2028) PASS: lldb-unit :: Utility/./UtilityTests/StringExtractorTest.GetNameColonValueSuccess (1347 of 2028) PASS: lldb-shell :: SymbolFile/DWARF/find-basic-variable.cpp (1348 of 2028) UNSUPPORTED: lldb-api :: benchmarks/stepping/TestSteppingSpeed.py (1349 of 2028) PASS: lldb-api :: commands/platform/basic/TestPlatformPython.py (1350 of 2028) PASS: lldb-unit :: Utility/./UtilityTests/StringExtractorTest.GetHexU8_Underflow2_NoEof (1351 of 2028) PASS: lldb-shell :: ObjectFile/ELF/section-types-edgecases.yaml (1352 of 2028) PASS: lldb-api :: lang/cpp/wchar_t/TestCxxWCharT.py (1353 of 2028) PASS: lldb-unit :: Expression/./ExpressionTests/DiagnosticManagerTest.GetStringSeverityLabels (1354 of 2028) PASS: lldb-unit :: ScriptInterpreter/Python/./ScriptInterpreterPythonTests/PythonDataObjectsTest.TestCallable (1355 of 2028) PASS: lldb-api :: functionalities/data-formatter/data-formatter-stl/libcxx/optional/TestDataFormatterLibcxxOptional.py (1356 of 2028) PASS: lldb-shell :: SymbolFile/DWARF/inline-function-address.ll (1357 of 2028) PASS: lldb-shell :: Process/Optimization.test (1358 of 2028) PASS: lldb-api :: functionalities/optimized_code/TestNoASanExceptionAfterEvalOP_piece.py (1359 of 2028) PASS: lldb-unit :: ScriptInterpreter/Python/./ScriptInterpreterPythonTests/PythonDataObjectsTest.TestPythonTupleInitializerList2 (1360 of 2028) PASS: lldb-shell :: SymbolFile/Breakpad/unwind-via-stack-win.test (1361 of 2028) PASS: lldb-unit :: Utility/./UtilityTests/RangeDataVector.FindEntryIndexesThatContain (1362 of 2028) UNSUPPORTED: lldb-api :: functionalities/darwin_log/source/debug/TestDarwinLogSourceDebug.py (1363 of 2028) PASS: lldb-unit :: Symbol/./SymbolTests/TestClangASTImporter.ImportInvalidType (1364 of 2028) PASS: lldb-shell :: Watchpoint/SetErrorCases.test (1365 of 2028) PASS: lldb-unit :: Utility/./UtilityTests/StreamTest.AddressRangeInvalidRange (1366 of 2028) PASS: lldb-unit :: Interpreter/./InterpreterTests/CompletionTest.DirCompletionUsername (1367 of 2028) PASS: lldb-api :: lang/cpp/nsimport/TestCppNsImport.py (1368 of 2028) UNSUPPORTED: lldb-shell :: ObjectFile/ELF/minidebuginfo-set-and-hit-breakpoint.test (1369 of 2028) UNSUPPORTED: lldb-shell :: SymbolFile/DWARF/debug-types-expressions.test (1370 of 2028) UNSUPPORTED: lldb-api :: functionalities/thread/create_during_step/TestCreateDuringStep.py (1371 of 2028) PASS: lldb-api :: functionalities/process_crash_info/TestProcessCrashInfo.py (1372 of 2028) PASS: lldb-shell :: SymbolFile/DWARF/DW_OP_piece-struct.s (1373 of 2028) UNSUPPORTED: lldb-api :: commands/register/register/intel_xtended_registers/mpx_offset_intersection/TestMPXOffsetIntersection.py (1374 of 2028) PASS: lldb-unit :: Expression/./ExpressionTests/DiagnosticManagerTest.FixedExpression (1375 of 2028) PASS: lldb-shell :: SymbolFile/Breakpad/line-table-missing-file.test (1376 of 2028) PASS: lldb-unit :: UnwindAssembly/x86/./UnwindAssemblyx86Tests/Testx86AssemblyInspectionEngine.TestMovRSPtoRBP (1377 of 2028) PASS: lldb-unit :: Utility/./UtilityTests/StringLexerTest.PutBack (1378 of 2028) PASS: lldb-shell :: Reproducer/TestProcessList.test (1379 of 2028) PASS: lldb-unit :: debugserver/./debugserverTests/RNBSocket.LoopBackListenIPv4 (1380 of 2028) PASS: lldb-api :: tools/lldb-server/TestGdbRemoteAttach.py (1381 of 2028) PASS: lldb-unit :: Utility/./UtilityTests/OptionsWithRawTest.ArgsButNoLeadingDash (1382 of 2028) PASS: lldb-unit :: SymbolFile/DWARF/./SymbolFileDWARFTests/SymbolFileDWARFTests.TestAbbrevNullAttrValidForm (1383 of 2028) PASS: lldb-unit :: Core/./LLDBCoreTests/MangledTest.NameIndexes_FindFunctionSymbols (1384 of 2028) PASS: lldb-api :: python_api/default-constructor/TestDefaultConstructorForAPIObjects.py (1385 of 2028) PASS: lldb-unit :: Interpreter/./InterpreterTests/CompletionTest.FileCompletionAbsolute (1386 of 2028) UNSUPPORTED: lldb-api :: benchmarks/turnaround/TestCompileRunToBreakpointTurnaround.py (1387 of 2028) PASS: lldb-unit :: Target/./TargetTests/RemoteAwarePlatformTest.TestResolveExecutabelOnClientByPlatform (1388 of 2028) PASS: lldb-api :: functionalities/data-formatter/hexcaps/TestDataFormatterHexCaps.py (1389 of 2028) PASS: lldb-unit :: Utility/./UtilityTests/StringLexerTest.Peek (1390 of 2028) UNSUPPORTED: lldb-api :: commands/expression/completion-crash-invalid-iterator/TestInvalidIteratorCompletionCrash.py (1391 of 2028) PASS: lldb-unit :: Utility/./UtilityTests/StringListTest.JoinEmpty (1392 of 2028) UNSUPPORTED: lldb-api :: tools/lldb-server/TestGdbRemoteModuleInfo.py (1393 of 2028) PASS: lldb-unit :: ScriptInterpreter/Python/./ScriptInterpreterPythonTests/PythonDataObjectsTest.TestRun (1394 of 2028) PASS: lldb-api :: functionalities/breakpoint/cpp_exception/TestCPPExceptionBreakpoint.py (1395 of 2028) PASS: lldb-api :: commands/watchpoints/watchpoint_on_vectors/TestValueOfVectorVariable.py (1396 of 2028) PASS: lldb-unit :: debugserver/./debugserverTests/RNBSocket.LoopBackConnectIPv4 (1397 of 2028) PASS: lldb-api :: sanity/TestModuleCacheSanity.py (1398 of 2028) PASS: lldb-unit :: Host/./HostTests/NativeProcessProtocolTest.ReadCStringFromMemory_CrossPageBoundary (1399 of 2028) PASS: lldb-api :: functionalities/breakpoint/breakpoint_options/TestBreakpointOptions.py (1400 of 2028) PASS: lldb-unit :: Utility/./UtilityTests/OptionsWithRawTest.SingleWordSuffix (1401 of 2028) PASS: lldb-unit :: Utility/./UtilityTests/SerializationRountripTest.SerializeDeserializePodReferences (1402 of 2028) PASS: lldb-shell :: Reproducer/TestDiscard.test (1403 of 2028) UNSUPPORTED: lldb-api :: functionalities/breakpoint/breakpoint_callback_command_source/TestBreakpointCallbackCommandSource.py (1404 of 2028) PASS: lldb-unit :: Utility/./UtilityTests/CompletionRequest.DuplicateFilteringWithComments (1405 of 2028) UNSUPPORTED: lldb-api :: tools/lldb-server/TestGdbRemoteAuxvSupport.py (1406 of 2028) PASS: lldb-api :: lang/cpp/this/TestCPPThis.py (1407 of 2028) PASS: lldb-unit :: Expression/./ExpressionTests/ClangHostTest.ComputeClangResourceDirectory (1408 of 2028) PASS: lldb-shell :: SymbolFile/DWARF/debug-names-compressed.cpp (1409 of 2028) PASS: lldb-unit :: ObjectFile/Breakpad/./ObjectFileBreakpadTests/FileRecord.parse (1410 of 2028) PASS: lldb-api :: python_api/process/TestProcessAPI.py (1411 of 2028) PASS: lldb-unit :: Utility/./UtilityTests/ArgsTest.StringListConstructor (1412 of 2028) PASS: lldb-shell :: ObjectFile/MachO/symtab.yaml (1413 of 2028) PASS: lldb-unit :: Host/./HostTests/NativeProcessProtocolTest.ReadMemoryWithoutTrap (1414 of 2028) FAIL: lldb-api :: python_api/exprpath_synthetic/TestExprPathSynthetic.py (1415 of 2028) ******************** TEST 'lldb-api :: python_api/exprpath_synthetic/TestExprPathSynthetic.py' FAILED ******************** Script: -- /Users/buildslave/jenkins/workspace/lldb-cmake-sanitized/lldb-build/lldb-test-build.noindex/copied-system-python /Users/buildslave/jenkins/workspace/lldb-cmake-sanitized/llvm-project/lldb/test/API/dotest.py --arch x86_64 -s /Users/buildslave/jenkins/workspace/lldb-cmake-sanitized/lldb-build/lldb-test-traces -S nm -u CXXFLAGS -u CFLAGS --codesign-identity lldb_codesign --server /Users/buildslave/jenkins/workspace/lldb-cmake-sanitized/lldb-build/./bin/debugserver --arch x86_64 --build-dir /Users/buildslave/jenkins/workspace/lldb-cmake-sanitized/lldb-build/lldb-test-build.noindex -s=/Users/buildslave/jenkins/workspace/lldb-cmake-sanitized/test/logs -t --env TERM=vt100 --env LLVM_LIBS_DIR=/Users/buildslave/jenkins/workspace/lldb-cmake-sanitized/lldb-build/./lib --inferior-env ASAN_OPTIONS=detect_stack_use_after_return=1 --inferior-env DYLD_INSERT_LIBRARIES=/Users/buildslave/jenkins/workspace/lldb-cmake-sanitized/host-compiler/lib/clang/11.0.0/lib/darwin/libclang_rt.asan_osx_dynamic.dylib --build-dir /Users/buildslave/jenkins/workspace/lldb-cmake-sanitized/lldb-build/lldb-test-build.noindex --lldb-module-cache-dir /Users/buildslave/jenkins/workspace/lldb-cmake-sanitized/lldb-build/lldb-test-build.noindex/module-cache-lldb/lldb-api --clang-module-cache-dir /Users/buildslave/jenkins/workspace/lldb-cmake-sanitized/lldb-build/lldb-test-build.noindex/module-cache-clang/lldb-api --executable /Users/buildslave/jenkins/workspace/lldb-cmake-sanitized/lldb-build/./bin/lldb --compiler /Users/buildslave/jenkins/workspace/lldb-cmake-sanitized/lldb-build/./bin/clang --dsymutil /Users/buildslave/jenkins/workspace/lldb-cmake-sanitized/lldb-build/./bin/dsymutil --filecheck /Users/buildslave/jenkins/workspace/lldb-cmake-sanitized/lldb-build/./bin/FileCheck --lldb-libs-dir /Users/buildslave/jenkins/workspace/lldb-cmake-sanitized/lldb-build/./lib /Users/buildslave/jenkins/workspace/lldb-cmake-sanitized/llvm-project/lldb/test/API/python_api/exprpath_synthetic -p TestExprPathSynthetic.py -- Exit Code: -6

Hide Details

Command Output (stdout): -- lldb version 11.0.99 clang revision 7ad36491cadee1ed91e18215c30328a3d5c104f9 llvm revision 7ad36491cadee1ed91e18215c30328a3d5c104f9

Hide Details

-- Command Output (stderr): -- Assertion failed: (tokenKind == tok::kw___bridge_retain), function ParseParenExpression, file /Users/buildslave/jenkins/workspace/lldb-cmake-sanitized/llvm-project/clang/lib/Parse/ParseExpr.cpp, line 2804.

Hide Details

--

Hide Details

******************** PASS: lldb-shell :: Reproducer/Functionalities/TestStepping.test (1416 of 2028) PASS: lldb-unit :: tools/lldb-server/tests/./LLDBServerTests/TestBase.DebugserverEnv (1417 of 2028) PASS: lldb-unit :: Utility/./UtilityTests/SerializationRountripTest.SerializeDeserializeCStringArrayNullptrElem (1418 of 2028) PASS: lldb-unit :: DataFormatter/./LLDBFormatterTests/StringPrinterTests.CxxASCII (1419 of 2028) UNSUPPORTED: lldb-api :: lang/objc/rdar-12408181/TestRdar12408181.py (1420 of 2028) PASS: lldb-api :: types/TestShortTypeExpr.py (1421 of 2028) PASS: lldb-api :: functionalities/archives/TestBSDArchives.py (1422 of 2028) PASS: lldb-api :: lang/cpp/class_types/TestClassTypesDisassembly.py (1423 of 2028) PASS: lldb-unit :: Utility/./UtilityTests/ScalarTest.CastOperations (1424 of 2028) PASS: lldb-api :: functionalities/data-formatter/summary-string-onfail/Test-rdar-9974002.py (1425 of 2028) FAIL: lldb-api :: lang/objc/objc-ivar-protocols/TestIvarProtocols.py (1426 of 2028) ******************** TEST 'lldb-api :: lang/objc/objc-ivar-protocols/TestIvarProtocols.py' FAILED ******************** Script: -- /Users/buildslave/jenkins/workspace/lldb-cmake-sanitized/lldb-build/lldb-test-build.noindex/copied-system-python /Users/buildslave/jenkins/workspace/lldb-cmake-sanitized/llvm-project/lldb/test/API/dotest.py --arch x86_64 -s /Users/buildslave/jenkins/workspace/lldb-cmake-sanitized/lldb-build/lldb-test-traces -S nm -u CXXFLAGS -u CFLAGS --codesign-identity lldb_codesign --server /Users/buildslave/jenkins/workspace/lldb-cmake-sanitized/lldb-build/./bin/debugserver --arch x86_64 --build-dir /Users/buildslave/jenkins/workspace/lldb-cmake-sanitized/lldb-build/lldb-test-build.noindex -s=/Users/buildslave/jenkins/workspace/lldb-cmake-sanitized/test/logs -t --env TERM=vt100 --env LLVM_LIBS_DIR=/Users/buildslave/jenkins/workspace/lldb-cmake-sanitized/lldb-build/./lib --inferior-env ASAN_OPTIONS=detect_stack_use_after_return=1 --inferior-env DYLD_INSERT_LIBRARIES=/Users/buildslave/jenkins/workspace/lldb-cmake-sanitized/host-compiler/lib/clang/11.0.0/lib/darwin/libclang_rt.asan_osx_dynamic.dylib --build-dir /Users/buildslave/jenkins/workspace/lldb-cmake-sanitized/lldb-build/lldb-test-build.noindex --lldb-module-cache-dir /Users/buildslave/jenkins/workspace/lldb-cmake-sanitized/lldb-build/lldb-test-build.noindex/module-cache-lldb/lldb-api --clang-module-cache-dir /Users/buildslave/jenkins/workspace/lldb-cmake-sanitized/lldb-build/lldb-test-build.noindex/module-cache-clang/lldb-api --executable /Users/buildslave/jenkins/workspace/lldb-cmake-sanitized/lldb-build/./bin/lldb --compiler /Users/buildslave/jenkins/workspace/lldb-cmake-sanitized/lldb-build/./bin/clang --dsymutil /Users/buildslave/jenkins/workspace/lldb-cmake-sanitized/lldb-build/./bin/dsymutil --filecheck /Users/buildslave/jenkins/workspace/lldb-cmake-sanitized/lldb-build/./bin/FileCheck --lldb-libs-dir /Users/buildslave/jenkins/workspace/lldb-cmake-sanitized/lldb-build/./lib /Users/buildslave/jenkins/workspace/lldb-cmake-sanitized/llvm-project/lldb/test/API/lang/objc/objc-ivar-protocols -p TestIvarProtocols.py -- Exit Code: -6

Hide Details

Command Output (stdout): -- lldb version 11.0.99 clang revision 7ad36491cadee1ed91e18215c30328a3d5c104f9 llvm revision 7ad36491cadee1ed91e18215c30328a3d5c104f9

Hide Details

-- Command Output (stderr): -- Assertion failed: (tokenKind == tok::kw___bridge_retain), function ParseParenExpression, file /Users/buildslave/jenkins/workspace/lldb-cmake-sanitized/llvm-project/clang/lib/Parse/ParseExpr.cpp, line 2804.

Hide Details

--

Hide Details

******************** FAIL: lldb-api :: lang/objc/objc-static-method/TestObjCStaticMethod.py (1427 of 2028) ******************** TEST 'lldb-api :: lang/objc/objc-static-method/TestObjCStaticMethod.py' FAILED ******************** Script: -- /Users/buildslave/jenkins/workspace/lldb-cmake-sanitized/lldb-build/lldb-test-build.noindex/copied-system-python /Users/buildslave/jenkins/workspace/lldb-cmake-sanitized/llvm-project/lldb/test/API/dotest.py --arch x86_64 -s /Users/buildslave/jenkins/workspace/lldb-cmake-sanitized/lldb-build/lldb-test-traces -S nm -u CXXFLAGS -u CFLAGS --codesign-identity lldb_codesign --server /Users/buildslave/jenkins/workspace/lldb-cmake-sanitized/lldb-build/./bin/debugserver --arch x86_64 --build-dir /Users/buildslave/jenkins/workspace/lldb-cmake-sanitized/lldb-build/lldb-test-build.noindex -s=/Users/buildslave/jenkins/workspace/lldb-cmake-sanitized/test/logs -t --env TERM=vt100 --env LLVM_LIBS_DIR=/Users/buildslave/jenkins/workspace/lldb-cmake-sanitized/lldb-build/./lib --inferior-env ASAN_OPTIONS=detect_stack_use_after_return=1 --inferior-env DYLD_INSERT_LIBRARIES=/Users/buildslave/jenkins/workspace/lldb-cmake-sanitized/host-compiler/lib/clang/11.0.0/lib/darwin/libclang_rt.asan_osx_dynamic.dylib --build-dir /Users/buildslave/jenkins/workspace/lldb-cmake-sanitized/lldb-build/lldb-test-build.noindex --lldb-module-cache-dir /Users/buildslave/jenkins/workspace/lldb-cmake-sanitized/lldb-build/lldb-test-build.noindex/module-cache-lldb/lldb-api --clang-module-cache-dir /Users/buildslave/jenkins/workspace/lldb-cmake-sanitized/lldb-build/lldb-test-build.noindex/module-cache-clang/lldb-api --executable /Users/buildslave/jenkins/workspace/lldb-cmake-sanitized/lldb-build/./bin/lldb --compiler /Users/buildslave/jenkins/workspace/lldb-cmake-sanitized/lldb-build/./bin/clang --dsymutil /Users/buildslave/jenkins/workspace/lldb-cmake-sanitized/lldb-build/./bin/dsymutil --filecheck /Users/buildslave/jenkins/workspace/lldb-cmake-sanitized/lldb-build/./bin/FileCheck --lldb-libs-dir /Users/buildslave/jenkins/workspace/lldb-cmake-sanitized/lldb-build/./lib /Users/buildslave/jenkins/workspace/lldb-cmake-sanitized/llvm-project/lldb/test/API/lang/objc/objc-static-method -p TestObjCStaticMethod.py -- Exit Code: -6

Hide Details

Command Output (stdout): -- lldb version 11.0.99 clang revision 7ad36491cadee1ed91e18215c30328a3d5c104f9 llvm revision 7ad36491cadee1ed91e18215c30328a3d5c104f9

Hide Details

-- Command Output (stderr): -- Assertion failed: (tokenKind == tok::kw___bridge_retain), function ParseParenExpression, file /Users/buildslave/jenkins/workspace/lldb-cmake-sanitized/llvm-project/clang/lib/Parse/ParseExpr.cpp, line 2804.

Hide Details

--

Hide Details

******************** PASS: lldb-shell :: Settings/TestLineMarkerColor.test (1428 of 2028) PASS: lldb-unit :: ScriptInterpreter/Python/./ScriptInterpreterPythonTests/PythonDataObjectsTest.TestExtractingUInt64ThroughStructuredData (1429 of 2028) PASS: lldb-unit :: Utility/./UtilityTests/NameMatchesTest.Contains (1430 of 2028) PASS: lldb-api :: functionalities/target_var/TestTargetVar.py (1431 of 2028) XFAIL: lldb-shell :: Register/x86-mm-xmm-read.test (1432 of 2028) PASS: lldb-api :: commands/expression/ir-interpreter/TestIRInterpreter.py (1433 of 2028) PASS: lldb-api :: lang/c/local_variables/TestLocalVariables.py (1434 of 2028) PASS: lldb-shell :: Host/TestCustomShell.test (1435 of 2028) PASS: lldb-api :: tools/lldb-vscode/step/TestVSCode_step.py (1436 of 2028) PASS: lldb-unit :: Core/./LLDBCoreTests/RichManglingContextTest.FromCxxMethodName (1437 of 2028) PASS: lldb-api :: commands/expression/weak_symbols/TestWeakSymbols.py (1438 of 2028) PASS: lldb-unit :: Utility/./UtilityTests/LogChannelTest.List (1439 of 2028) PASS: lldb-api :: lang/c/struct_types/TestStructTypes.py (1440 of 2028) PASS: lldb-unit :: Utility/./UtilityTests/UriParserTest.MinimalPath (1441 of 2028) PASS: lldb-shell :: Minidump/memory-region.yaml (1442 of 2028) PASS: lldb-shell :: Quit/TestQuitExitCode-30.test (1443 of 2028) PASS: lldb-api :: lang/c/inlines/TestRedefinitionsInInlines.py (1444 of 2028) PASS: lldb-api :: lang/cpp/auto/TestCPPAuto.py (1445 of 2028) PASS: lldb-unit :: Utility/./UtilityTests/BinaryStreamTest.PutULEB128MaxValue (1446 of 2028) PASS: lldb-api :: macosx/duplicate-archive-members/TestDuplicateMembers.py (1447 of 2028) PASS: lldb-api :: commands/version/TestVersion.py (1448 of 2028) PASS: lldb-shell :: SymbolFile/NativePDB/ast-functions.cpp (1449 of 2028) PASS: lldb-unit :: Utility/./UtilityTests/ArgsTest.GetArgumentArrayRef (1450 of 2028) PASS: lldb-api :: lang/cpp/virtual-overload/TestVirtualOverload.py (1451 of 2028) PASS: lldb-api :: tools/lldb-server/TestAppleSimulatorOSType.py (1452 of 2028) PASS: lldb-unit :: Utility/./UtilityTests/UriParserTest.BracketedHostname (1453 of 2028) PASS: lldb-api :: functionalities/gdb_remote_client/TestNoWatchpointSupportInfo.py (1454 of 2028) PASS: lldb-unit :: Utility/./UtilityTests/ArchSpecTest.Compatibility (1455 of 2028) PASS: lldb-unit :: Utility/./UtilityTests/StringListTest.JoinNonSpace (1456 of 2028) PASS: lldb-unit :: Utility/./UtilityTests/AnsiTerminal.Empty (1457 of 2028) PASS: lldb-unit :: Host/./HostTests/SocketTest.TCPListen0ConnectAccept (1458 of 2028) PASS: lldb-shell :: Quit/TestQuitExitCodeHexA.test (1459 of 2028) FAIL: lldb-api :: functionalities/set-data/TestSetData.py (1460 of 2028) ******************** TEST 'lldb-api :: functionalities/set-data/TestSetData.py' FAILED ******************** Script: -- /Users/buildslave/jenkins/workspace/lldb-cmake-sanitized/lldb-build/lldb-test-build.noindex/copied-system-python /Users/buildslave/jenkins/workspace/lldb-cmake-sanitized/llvm-project/lldb/test/API/dotest.py --arch x86_64 -s /Users/buildslave/jenkins/workspace/lldb-cmake-sanitized/lldb-build/lldb-test-traces -S nm -u CXXFLAGS -u CFLAGS --codesign-identity lldb_codesign --server /Users/buildslave/jenkins/workspace/lldb-cmake-sanitized/lldb-build/./bin/debugserver --arch x86_64 --build-dir /Users/buildslave/jenkins/workspace/lldb-cmake-sanitized/lldb-build/lldb-test-build.noindex -s=/Users/buildslave/jenkins/workspace/lldb-cmake-sanitized/test/logs -t --env TERM=vt100 --env LLVM_LIBS_DIR=/Users/buildslave/jenkins/workspace/lldb-cmake-sanitized/lldb-build/./lib --inferior-env ASAN_OPTIONS=detect_stack_use_after_return=1 --inferior-env DYLD_INSERT_LIBRARIES=/Users/buildslave/jenkins/workspace/lldb-cmake-sanitized/host-compiler/lib/clang/11.0.0/lib/darwin/libclang_rt.asan_osx_dynamic.dylib --build-dir /Users/buildslave/jenkins/workspace/lldb-cmake-sanitized/lldb-build/lldb-test-build.noindex --lldb-module-cache-dir /Users/buildslave/jenkins/workspace/lldb-cmake-sanitized/lldb-build/lldb-test-build.noindex/module-cache-lldb/lldb-api --clang-module-cache-dir /Users/buildslave/jenkins/workspace/lldb-cmake-sanitized/lldb-build/lldb-test-build.noindex/module-cache-clang/lldb-api --executable /Users/buildslave/jenkins/workspace/lldb-cmake-sanitized/lldb-build/./bin/lldb --compiler /Users/buildslave/jenkins/workspace/lldb-cmake-sanitized/lldb-build/./bin/clang --dsymutil /Users/buildslave/jenkins/workspace/lldb-cmake-sanitized/lldb-build/./bin/dsymutil --filecheck /Users/buildslave/jenkins/workspace/lldb-cmake-sanitized/lldb-build/./bin/FileCheck --lldb-libs-dir /Users/buildslave/jenkins/workspace/lldb-cmake-sanitized/lldb-build/./lib /Users/buildslave/jenkins/workspace/lldb-cmake-sanitized/llvm-project/lldb/test/API/functionalities/set-data -p TestSetData.py -- Exit Code: -6

Hide Details

Command Output (stdout): -- lldb version 11.0.99 clang revision 7ad36491cadee1ed91e18215c30328a3d5c104f9 llvm revision 7ad36491cadee1ed91e18215c30328a3d5c104f9

Hide Details

-- Command Output (stderr): -- Assertion failed: (tokenKind == tok::kw___bridge_retain), function ParseParenExpression, file /Users/buildslave/jenkins/workspace/lldb-cmake-sanitized/llvm-project/clang/lib/Parse/ParseExpr.cpp, line 2804.

Hide Details

--

Hide Details

******************** PASS: lldb-unit :: Utility/./UtilityTests/StringListTest.LongestCommonPrefixDuplicateElement (1461 of 2028) PASS: lldb-api :: functionalities/data-formatter/data-formatter-script/TestDataFormatterScript.py (1462 of 2028) PASS: lldb-unit :: Utility/./UtilityTests/RangeTest.LessThan (1463 of 2028) PASS: lldb-api :: functionalities/data-formatter/data-formatter-enum-format/TestDataFormatterEnumFormat.py (1464 of 2028) PASS: lldb-unit :: Utility/./UtilityTests/StringListTest.JoinThree (1465 of 2028) PASS: lldb-api :: commands/command/script/TestCommandScript.py (1466 of 2028) PASS: lldb-unit :: Target/./TargetTests/ExecutionContextTest.GetByteOrderTarget (1467 of 2028) PASS: lldb-api :: macosx/universal/TestUniversal.py (1468 of 2028) PASS: lldb-shell :: Reproducer/TestCaptureEnvOverride.test (1469 of 2028) UNSUPPORTED: lldb-api :: arm/breakpoint-thumb-codesection/TestBreakpointThumbCodesection.py (1470 of 2028) PASS: lldb-shell :: Settings/TestDisableColor.test (1471 of 2028) PASS: lldb-unit :: Language/Highlighting/./HighlighterTests/HighlighterTest.HighlighterSelectionType (1472 of 2028) PASS: lldb-api :: api/check_public_api_headers/TestPublicAPIHeaders.py (1473 of 2028) PASS: lldb-unit :: Process/gdb-remote/./ProcessGdbRemoteTests/GDBRemoteCommunicationClientTest.TestPacketSpeedJSON (1474 of 2028) PASS: lldb-unit :: Process/gdb-remote/./ProcessGdbRemoteTests/GDBRemoteClientBaseTest.InterruptNoResponse (1475 of 2028) PASS: lldb-api :: functionalities/thread/exit_during_break/TestExitDuringBreak.py (1476 of 2028) PASS: lldb-unit :: Utility/./UtilityTests/Flags.Clear (1477 of 2028) PASS: lldb-shell :: Commands/command-backtrace.test (1478 of 2028) PASS: lldb-unit :: Utility/./UtilityTests/RangeTest.SlideZero (1479 of 2028) PASS: lldb-unit :: Utility/./UtilityTests/Predicate.WaitForValueNotEqualTo (1480 of 2028) PASS: lldb-unit :: Utility/./UtilityTests/StringListTest.JoinMultiCharSeparator (1481 of 2028) PASS: lldb-api :: macosx/profile_vrs_detach/TestDetachVrsProfile.py (1482 of 2028) PASS: lldb-shell :: Process/TestEnvironment.test (1483 of 2028) PASS: lldb-unit :: Target/./TargetTests/PathMappingListTest.RemapRoot (1484 of 2028) PASS: lldb-api :: functionalities/type_lookup/TestTypeLookup.py (1485 of 2028) PASS: lldb-api :: lang/cpp/namespace_conflicts/TestNamespaceConflicts.py (1486 of 2028) PASS: lldb-api :: commands/settings/quoting/TestQuoting.py (1487 of 2028) PASS: lldb-api :: functionalities/data-formatter/format-propagation/TestFormatPropagation.py (1488 of 2028) PASS: lldb-api :: commands/frame/var-scope/TestFrameVariableScope.py (1489 of 2028) PASS: lldb-api :: lang/cpp/class_static/TestStaticVariables.py (1490 of 2028) PASS: lldb-unit :: UnwindAssembly/x86/./UnwindAssemblyx86Tests/Testx86AssemblyInspectionEngine.TestPopR15 (1491 of 2028) PASS: lldb-unit :: ScriptInterpreter/Python/./ScriptInterpreterPythonTests/PythonDataObjectsTest.TestPythonListValueEquality (1492 of 2028) PASS: lldb-shell :: ObjectFile/ELF/aarch64-relocations.yaml (1493 of 2028) PASS: lldb-unit :: Utility/./UtilityTests/StringListTest.ShiftCString (1494 of 2028) PASS: lldb-unit :: Utility/./UtilityTests/SerializationRountripTest.SerializeDeserializePodPointers (1495 of 2028) PASS: lldb-unit :: Language/Highlighting/./HighlighterTests/HighlighterTest.ClangOperators (1496 of 2028) PASS: lldb-unit :: Utility/./UtilityTests/RangeTest.Equal (1497 of 2028) PASS: lldb-unit :: Utility/./UtilityTests/SubsystemRAIITest.SubsystemWithErrorFailure (1498 of 2028) PASS: lldb-shell :: SymbolFile/DWARF/compilercontext.ll (1499 of 2028) PASS: lldb-unit :: Host/./HostTests/HostInfoTest.GetXcodeSDK (1500 of 2028) PASS: lldb-api :: functionalities/breakpoint/breakpoint_language/TestBreakpointLanguage.py (1501 of 2028) PASS: lldb-shell :: SymbolFile/DWARF/dwarf5-partial-index.cpp (1502 of 2028) PASS: lldb-unit :: Utility/./UtilityTests/RangeTest.Constructor (1503 of 2028) PASS: lldb-api :: commands/expression/persistent_ptr_update/TestPersistentPtrUpdate.py (1504 of 2028) PASS: lldb-unit :: Utility/./UtilityTests/RecordReplayTest.InstrumentedBar (1505 of 2028) PASS: lldb-unit :: Language/Highlighting/./HighlighterTests/HighlighterTest.ClangCursorPosEndOfLine (1506 of 2028) PASS: lldb-unit :: Utility/./UtilityTests/StringExtractorTest.GetHexBytes_Partial (1507 of 2028) PASS: lldb-unit :: Utility/./UtilityTests/ArgsTest.TestQuotedTrailingBackslash (1508 of 2028) UNSUPPORTED: lldb-api :: functionalities/data-formatter/data-formatter-stl/libstdcpp/list/TestDataFormatterStdList.py (1509 of 2028) PASS: lldb-unit :: Expression/./ExpressionTests/ClangHostTest.MacOSX (1510 of 2028) PASS: lldb-unit :: Utility/./UtilityTests/ArgsTest.ReplaceArgumentAtIndexLonger (1511 of 2028) PASS: lldb-api :: lang/cpp/call-function/TestCallCPPFunction.py (1512 of 2028) PASS: lldb-unit :: Utility/./UtilityTests/RecordReplayTest.InstrumentedFooSameThis (1513 of 2028) UNSUPPORTED: lldb-shell :: Register/x86-ymm-write.test (1514 of 2028) PASS: lldb-api :: lang/objc/objc-foundation-dictionary-empty/TestNSDictionary0.py (1515 of 2028) PASS: lldb-unit :: ScriptInterpreter/Python/./ScriptInterpreterPythonTests/PythonDataObjectsTest.TestPythonIntegerToStr (1516 of 2028) PASS: lldb-shell :: SymbolFile/DWARF/array-sizes.s (1517 of 2028) PASS: lldb-api :: commands/expression/import-std-module/list/TestListFromStdModule.py (1518 of 2028) PASS: lldb-unit :: Signals/./SignalsTests/UnixSignalsTest.Iteration (1519 of 2028) PASS: lldb-unit :: ScriptInterpreter/Python/./ScriptInterpreterPythonTests/PythonDataObjectsTest.TestExceptions (1520 of 2028) PASS: lldb-unit :: Utility/./UtilityTests/TimeoutTest.Format (1521 of 2028) PASS: lldb-shell :: ObjectFile/PECOFF/export-dllfunc.yaml (1522 of 2028) PASS: lldb-api :: functionalities/data-formatter/data-formatter-stl/libcxx/variant/TestDataFormatterLibcxxVariant.py (1523 of 2028) PASS: lldb-shell :: ObjectFile/PECOFF/sections.yaml (1524 of 2028) PASS: lldb-unit :: Utility/./UtilityTests/StreamTest.PutCharWhitespace (1525 of 2028) PASS: lldb-unit :: Utility/./UtilityTests/StructuredDataTest.ParseJSONFromFile (1526 of 2028) PASS: lldb-api :: python_api/sbvalue_const_addrof/TestSBValueConstAddrOf.py (1527 of 2028) PASS: lldb-shell :: SymbolFile/DWARF/debug_loclists-dwo.s (1528 of 2028) PASS: lldb-shell :: ObjectFile/MachO/lc_build_version.yaml (1529 of 2028) PASS: lldb-shell :: Reproducer/TestPythonImport.test (1530 of 2028) UNSUPPORTED: lldb-api :: functionalities/darwin_log/format/TestDarwinLogMessageFormat.py (1531 of 2028) PASS: lldb-api :: commands/expression/context-object/TestContextObject.py (1532 of 2028) PASS: lldb-api :: functionalities/tail_call_frames/thread_step_out_message/TestArtificialFrameStepOutMessage.py (1533 of 2028) PASS: lldb-api :: functionalities/plugins/command_plugin/TestPluginCommands.py (1534 of 2028) PASS: lldb-unit :: Target/./TargetTests/ModuleCacheTest.GetAndPutStrangeHostname (1535 of 2028) UNSUPPORTED: lldb-api :: commands/register/register/intel_xtended_registers/mpx_bound_violation/TestBoundViolation.py (1536 of 2028) PASS: lldb-unit :: Language/Highlighting/./HighlighterTests/HighlighterTest.Colons (1537 of 2028) XFAIL: lldb-shell :: Register/x86-64-ymm-write.test (1538 of 2028) PASS: lldb-shell :: ObjectFile/ELF/PT_LOAD-empty.yaml (1539 of 2028) PASS: lldb-unit :: Symbol/./SymbolTests/TestTypeSystemClang.TestBuiltinTypeForEncodingAndBitSize (1540 of 2028) PASS: lldb-api :: lang/cpp/incomplete-types/TestCppIncompleteTypes.py (1541 of 2028) PASS: lldb-unit :: Core/./LLDBCoreTests/MangledTest.EmptyForInvalidName (1542 of 2028) PASS: lldb-unit :: Expression/./ExpressionTests/CppModuleConfigurationTest.Linux (1543 of 2028) PASS: lldb-unit :: Utility/./UtilityTests/ConstStringTest.UpdateMangledCounterpart (1544 of 2028) PASS: lldb-shell :: Settings/TestFrameFormatMangling.test (1545 of 2028) PASS: lldb-unit :: Core/./LLDBCoreTests/SourceFileCache.FindSourceFileNotFound (1546 of 2028) UNSUPPORTED: lldb-api :: functionalities/darwin_log/filter/regex/message/TestDarwinLogFilterRegexMessage.py (1547 of 2028) PASS: lldb-api :: lang/objc/objc-baseclass-sbtype/TestObjCBaseClassSBType.py (1548 of 2028) PASS: lldb-unit :: Utility/./UtilityTests/StreamTest.AddressRangeEmptyRange (1549 of 2028) PASS: lldb-api :: commands/expression/import-std-module/deque-basic/TestDequeFromStdModule.py (1550 of 2028) PASS: lldb-unit :: Utility/./UtilityTests/ScalarTest.Comparison (1551 of 2028) PASS: lldb-api :: functionalities/data-formatter/data-formatter-stl/libcxx/multimap/TestDataFormatterLibccMultiMap.py (1552 of 2028) PASS: lldb-api :: macosx/save_crashlog/TestSaveCrashlog.py (1553 of 2028) UNSUPPORTED: lldb-api :: functionalities/data-formatter/data-formatter-stl/libstdcpp/tuple/TestDataFormatterStdTuple.py (1554 of 2028) PASS: lldb-api :: lang/c/unicode/TestUnicodeSymbols.py (1555 of 2028) PASS: lldb-unit :: Process/minidump/./LLDBMinidumpTests/MinidumpParserTest.GetPidWindows (1556 of 2028) PASS: lldb-unit :: Expression/./ExpressionTests/DiagnosticManagerTest.AddDiagnostic (1557 of 2028) FAIL: lldb-api :: lang/objc/foundation/TestConstStrings.py (1558 of 2028) ******************** TEST 'lldb-api :: lang/objc/foundation/TestConstStrings.py' FAILED ******************** Script: -- /Users/buildslave/jenkins/workspace/lldb-cmake-sanitized/lldb-build/lldb-test-build.noindex/copied-system-python /Users/buildslave/jenkins/workspace/lldb-cmake-sanitized/llvm-project/lldb/test/API/dotest.py --arch x86_64 -s /Users/buildslave/jenkins/workspace/lldb-cmake-sanitized/lldb-build/lldb-test-traces -S nm -u CXXFLAGS -u CFLAGS --codesign-identity lldb_codesign --server /Users/buildslave/jenkins/workspace/lldb-cmake-sanitized/lldb-build/./bin/debugserver --arch x86_64 --build-dir /Users/buildslave/jenkins/workspace/lldb-cmake-sanitized/lldb-build/lldb-test-build.noindex -s=/Users/buildslave/jenkins/workspace/lldb-cmake-sanitized/test/logs -t --env TERM=vt100 --env LLVM_LIBS_DIR=/Users/buildslave/jenkins/workspace/lldb-cmake-sanitized/lldb-build/./lib --inferior-env ASAN_OPTIONS=detect_stack_use_after_return=1 --inferior-env DYLD_INSERT_LIBRARIES=/Users/buildslave/jenkins/workspace/lldb-cmake-sanitized/host-compiler/lib/clang/11.0.0/lib/darwin/libclang_rt.asan_osx_dynamic.dylib --build-dir /Users/buildslave/jenkins/workspace/lldb-cmake-sanitized/lldb-build/lldb-test-build.noindex --lldb-module-cache-dir /Users/buildslave/jenkins/workspace/lldb-cmake-sanitized/lldb-build/lldb-test-build.noindex/module-cache-lldb/lldb-api --clang-module-cache-dir /Users/buildslave/jenkins/workspace/lldb-cmake-sanitized/lldb-build/lldb-test-build.noindex/module-cache-clang/lldb-api --executable /Users/buildslave/jenkins/workspace/lldb-cmake-sanitized/lldb-build/./bin/lldb --compiler /Users/buildslave/jenkins/workspace/lldb-cmake-sanitized/lldb-build/./bin/clang --dsymutil /Users/buildslave/jenkins/workspace/lldb-cmake-sanitized/lldb-build/./bin/dsymutil --filecheck /Users/buildslave/jenkins/workspace/lldb-cmake-sanitized/lldb-build/./bin/FileCheck --lldb-libs-dir /Users/buildslave/jenkins/workspace/lldb-cmake-sanitized/lldb-build/./lib /Users/buildslave/jenkins/workspace/lldb-cmake-sanitized/llvm-project/lldb/test/API/lang/objc/foundation -p TestConstStrings.py -- Exit Code: -6

Hide Details

Command Output (stdout): -- lldb version 11.0.99 clang revision 7ad36491cadee1ed91e18215c30328a3d5c104f9 llvm revision 7ad36491cadee1ed91e18215c30328a3d5c104f9

Hide Details

-- Command Output (stderr): -- Assertion failed: (tokenKind == tok::kw___bridge_retain), function ParseParenExpression, file /Users/buildslave/jenkins/workspace/lldb-cmake-sanitized/llvm-project/clang/lib/Parse/ParseExpr.cpp, line 2804.

Hide Details

--

Hide Details

******************** PASS: lldb-unit :: Process/minidump/./LLDBMinidumpTests/MinidumpParserTest.GetThreadContext_x86_64 (1559 of 2028) PASS: lldb-unit :: Utility/./UtilityTests/StreamTeeTest.GetStreamAtIndexOutOfBounds (1560 of 2028) PASS: lldb-shell :: SymbolFile/DWARF/DW_OP_piece-smaller-than-struct.s (1561 of 2028) PASS: lldb-api :: functionalities/breakpoint/auto_continue/TestBreakpointAutoContinue.py (1562 of 2028) PASS: lldb-api :: types/TestIntegerTypeExpr.py (1563 of 2028) UNSUPPORTED: lldb-api :: functionalities/data-formatter/data-formatter-stl/libstdcpp/smart_ptr/TestDataFormatterStdSmartPtr.py (1564 of 2028) PASS: lldb-unit :: ObjectFile/PECOFF/./ObjectFilePECOFFTests/PECallFrameInfoTest.Basic_eh (1565 of 2028) PASS: lldb-unit :: Utility/./UtilityTests/ArgsTest.ReplaceArgumentAtIndexShort (1566 of 2028) PASS: lldb-unit :: Utility/./UtilityTests/ArgsTest.TestSingleArg (1567 of 2028) PASS: lldb-unit :: Utility/./UtilityTests/StringListTest.LongestCommonPrefix (1568 of 2028) PASS: lldb-api :: lang/c/const_variables/TestConstVariables.py (1569 of 2028) UNSUPPORTED: lldb-shell :: Register/x86-ymm-read.test (1570 of 2028) PASS: lldb-api :: functionalities/breakpoint/move_nearest/TestMoveNearest.py (1571 of 2028) PASS: lldb-unit :: Host/./HostTests/FileSystemTest.GetPermissions (1572 of 2028) PASS: lldb-shell :: ObjectFile/PECOFF/basic-info.yaml (1573 of 2028) PASS: lldb-api :: functionalities/target-new-solib-notifications/TestModuleLoadedNotifys.py (1574 of 2028) PASS: lldb-unit :: Utility/./UtilityTests/UriParserTest.MinimalPortPath (1575 of 2028) PASS: lldb-api :: python_api/watchpoint/TestWatchpointIter.py (1576 of 2028) PASS: lldb-unit :: Host/./HostTests/File.GetWaitableHandleFileno (1577 of 2028) PASS: lldb-unit :: Utility/./UtilityTests/RangeTest.NotEqualInvalid (1578 of 2028) PASS: lldb-unit :: Utility/./UtilityTests/FileSpecTest.AppendPathComponent (1579 of 2028) PASS: lldb-api :: types/TestDoubleTypesExpr.py (1580 of 2028) PASS: lldb-api :: functionalities/gdb_remote_client/TestStopPCs.py (1581 of 2028) PASS: lldb-unit :: Utility/./UtilityTests/FileSpecTest.CopyByAppendingPathComponent (1582 of 2028) PASS: lldb-unit :: Utility/./UtilityTests/UriParserTest.SchemeHostSeparator3 (1583 of 2028) UNSUPPORTED: lldb-api :: commands/gui/basic/TestGuiBasic.py (1584 of 2028) PASS: lldb-api :: commands/expression/pr35310/TestExprsBug35310.py (1585 of 2028) PASS: lldb-api :: functionalities/breakpoint/source_regexp/TestSourceRegexBreakpoints.py (1586 of 2028) PASS: lldb-api :: functionalities/postmortem/minidump-new/TestMiniDumpUUID.py (1587 of 2028) UNSUPPORTED: lldb-api :: functionalities/data-formatter/data-formatter-stl/libstdcpp/map/TestDataFormatterStdMap.py (1588 of 2028) PASS: lldb-api :: functionalities/thread/exit_during_step/TestExitDuringStep.py (1589 of 2028) PASS: lldb-unit :: Utility/./UtilityTests/StringListTest.GetSize (1590 of 2028) PASS: lldb-unit :: Target/./TargetTests/ModuleCacheTest.GetAndPutUuidExists (1591 of 2028) PASS: lldb-api :: functionalities/dynamic_value_child_count/TestDynamicValueChildCount.py (1592 of 2028) PASS: lldb-unit :: Target/./TargetTests/ModuleCacheTest.GetAndPut (1593 of 2028) PASS: lldb-api :: lang/c/stepping/TestStepAndBreakpoints.py (1594 of 2028) PASS: lldb-api :: functionalities/thread/concurrent_events/TestConcurrentManyWatchpoints.py (1595 of 2028) PASS: lldb-api :: functionalities/thread/concurrent_events/TestConcurrentManyBreakpoints.py (1596 of 2028) PASS: lldb-unit :: Utility/./UtilityTests/StreamTest.PutSLEB128 (1597 of 2028) PASS: lldb-unit :: ScriptInterpreter/Python/./ScriptInterpreterPythonTests/PythonDataObjectsTest.TestDictionaryResolutionWithDot (1598 of 2028) PASS: lldb-unit :: Utility/./UtilityTests/StreamTest.AddressSize (1599 of 2028) PASS: lldb-api :: python_api/sblaunchinfo/TestSBLaunchInfo.py (1600 of 2028) UNSUPPORTED: lldb-shell :: SymbolFile/NativePDB/stack_unwinding01.cpp (1601 of 2028) PASS: lldb-unit :: Utility/./UtilityTests/StringListTest.AppendListCStringArray (1602 of 2028) PASS: lldb-api :: commands/expression/deleting-implicit-copy-constructor/TestDeletingImplicitCopyConstructor.py (1603 of 2028) PASS: lldb-unit :: Process/minidump/./LLDBMinidumpTests/MinidumpParserTest.GetMemoryRegionInfoLinuxMaps (1604 of 2028) PASS: lldb-unit :: Utility/./UtilityTests/ArgsTest.TestMultipleArgs (1605 of 2028) PASS: lldb-unit :: Utility/./UtilityTests/CompletionRequest.TryCompleteCurrentArgGood (1606 of 2028) PASS: lldb-api :: lang/objcxx/class-name-clash/TestNameClash.py (1607 of 2028) PASS: lldb-unit :: Utility/./UtilityTests/OptionsWithRawTest.EmptySuffix (1608 of 2028) PASS: lldb-shell :: Recognizer/assert.test (1609 of 2028) FAIL: lldb-api :: lang/objc/bitfield_ivars/TestBitfieldIvars.py (1610 of 2028) ******************** TEST 'lldb-api :: lang/objc/bitfield_ivars/TestBitfieldIvars.py' FAILED ******************** Script: -- /Users/buildslave/jenkins/workspace/lldb-cmake-sanitized/lldb-build/lldb-test-build.noindex/copied-system-python /Users/buildslave/jenkins/workspace/lldb-cmake-sanitized/llvm-project/lldb/test/API/dotest.py --arch x86_64 -s /Users/buildslave/jenkins/workspace/lldb-cmake-sanitized/lldb-build/lldb-test-traces -S nm -u CXXFLAGS -u CFLAGS --codesign-identity lldb_codesign --server /Users/buildslave/jenkins/workspace/lldb-cmake-sanitized/lldb-build/./bin/debugserver --arch x86_64 --build-dir /Users/buildslave/jenkins/workspace/lldb-cmake-sanitized/lldb-build/lldb-test-build.noindex -s=/Users/buildslave/jenkins/workspace/lldb-cmake-sanitized/test/logs -t --env TERM=vt100 --env LLVM_LIBS_DIR=/Users/buildslave/jenkins/workspace/lldb-cmake-sanitized/lldb-build/./lib --inferior-env ASAN_OPTIONS=detect_stack_use_after_return=1 --inferior-env DYLD_INSERT_LIBRARIES=/Users/buildslave/jenkins/workspace/lldb-cmake-sanitized/host-compiler/lib/clang/11.0.0/lib/darwin/libclang_rt.asan_osx_dynamic.dylib --build-dir /Users/buildslave/jenkins/workspace/lldb-cmake-sanitized/lldb-build/lldb-test-build.noindex --lldb-module-cache-dir /Users/buildslave/jenkins/workspace/lldb-cmake-sanitized/lldb-build/lldb-test-build.noindex/module-cache-lldb/lldb-api --clang-module-cache-dir /Users/buildslave/jenkins/workspace/lldb-cmake-sanitized/lldb-build/lldb-test-build.noindex/module-cache-clang/lldb-api --executable /Users/buildslave/jenkins/workspace/lldb-cmake-sanitized/lldb-build/./bin/lldb --compiler /Users/buildslave/jenkins/workspace/lldb-cmake-sanitized/lldb-build/./bin/clang --dsymutil /Users/buildslave/jenkins/workspace/lldb-cmake-sanitized/lldb-build/./bin/dsymutil --filecheck /Users/buildslave/jenkins/workspace/lldb-cmake-sanitized/lldb-build/./bin/FileCheck --lldb-libs-dir /Users/buildslave/jenkins/workspace/lldb-cmake-sanitized/lldb-build/./lib /Users/buildslave/jenkins/workspace/lldb-cmake-sanitized/llvm-project/lldb/test/API/lang/objc/bitfield_ivars -p TestBitfieldIvars.py -- Exit Code: -6

Hide Details

Command Output (stdout): -- lldb version 11.0.99 clang revision 7ad36491cadee1ed91e18215c30328a3d5c104f9 llvm revision 7ad36491cadee1ed91e18215c30328a3d5c104f9

Hide Details

-- Command Output (stderr): -- Assertion failed: (tokenKind == tok::kw___bridge_retain), function ParseParenExpression, file /Users/buildslave/jenkins/workspace/lldb-cmake-sanitized/llvm-project/clang/lib/Parse/ParseExpr.cpp, line 2804.

Hide Details

--

Hide Details

******************** UNSUPPORTED: lldb-api :: functionalities/tty/TestTerminal.py (1611 of 2028) PASS: lldb-shell :: SymbolFile/symbol-binding.test (1612 of 2028) PASS: lldb-unit :: Symbol/./SymbolTests/TestTypeSystemClang.TestGetEnumIntegerTypeInvalid (1613 of 2028) PASS: lldb-api :: functionalities/gdb_remote_client/TestArmRegisterDefinition.py (1614 of 2028) PASS: lldb-api :: commands/watchpoints/hello_watchpoint/TestMyFirstWatchpoint.py (1615 of 2028) PASS: lldb-unit :: Symbol/./SymbolTests/TestTypeSystemClang.TestGetTypeClassTypeOf (1616 of 2028) PASS: lldb-api :: commands/watchpoints/watchpoint_count/TestWatchpointCount.py (1617 of 2028) PASS: lldb-unit :: ScriptInterpreter/Python/./ScriptInterpreterPythonTests/PythonDataObjectsTest.TestPythonBoolean (1618 of 2028) PASS: lldb-unit :: Utility/./UtilityTests/StringExtractorTest.GetHexU8_InvalidHex_NoEof (1619 of 2028) PASS: lldb-api :: python_api/get-value-32bit-int/TestGetValue32BitInt.py (1620 of 2028) PASS: lldb-unit :: Utility/./UtilityTests/BinaryStreamTest.PutULEB128Zero (1621 of 2028) PASS: lldb-api :: functionalities/thread/concurrent_events/TestConcurrentSignalBreak.py (1622 of 2028) PASS: lldb-shell :: ObjectFile/ELF/section-types.yaml (1623 of 2028) PASS: lldb-unit :: Utility/./UtilityTests/ReproducerTest.SetReplay (1624 of 2028) PASS: lldb-api :: functionalities/breakpoint/address_breakpoints/TestAddressBreakpoints.py (1625 of 2028) PASS: lldb-unit :: DataFormatter/./LLDBFormatterTests/FormatManagerTests.CompatibleLangs (1626 of 2028) PASS: lldb-unit :: Utility/./UtilityTests/XcodeSDKTest.GetSDKTypeForTriple (1627 of 2028) PASS: lldb-api :: lang/cpp/symbols/TestSymbols.py (1628 of 2028) PASS: lldb-unit :: Utility/./UtilityTests/LogChannelEnabledTest.LLDB_LOG_ERROR (1629 of 2028) PASS: lldb-api :: lang/objc/modules-update/TestClangModulesUpdate.py (1630 of 2028) PASS: lldb-unit :: Utility/./UtilityTests/StringListTest.JoinSingle (1631 of 2028) FAIL: lldb-api :: functionalities/data-formatter/poarray/TestPrintObjectArray.py (1632 of 2028) ******************** TEST 'lldb-api :: functionalities/data-formatter/poarray/TestPrintObjectArray.py' FAILED ******************** Script: -- /Users/buildslave/jenkins/workspace/lldb-cmake-sanitized/lldb-build/lldb-test-build.noindex/copied-system-python /Users/buildslave/jenkins/workspace/lldb-cmake-sanitized/llvm-project/lldb/test/API/dotest.py --arch x86_64 -s /Users/buildslave/jenkins/workspace/lldb-cmake-sanitized/lldb-build/lldb-test-traces -S nm -u CXXFLAGS -u CFLAGS --codesign-identity lldb_codesign --server /Users/buildslave/jenkins/workspace/lldb-cmake-sanitized/lldb-build/./bin/debugserver --arch x86_64 --build-dir /Users/buildslave/jenkins/workspace/lldb-cmake-sanitized/lldb-build/lldb-test-build.noindex -s=/Users/buildslave/jenkins/workspace/lldb-cmake-sanitized/test/logs -t --env TERM=vt100 --env LLVM_LIBS_DIR=/Users/buildslave/jenkins/workspace/lldb-cmake-sanitized/lldb-build/./lib --inferior-env ASAN_OPTIONS=detect_stack_use_after_return=1 --inferior-env DYLD_INSERT_LIBRARIES=/Users/buildslave/jenkins/workspace/lldb-cmake-sanitized/host-compiler/lib/clang/11.0.0/lib/darwin/libclang_rt.asan_osx_dynamic.dylib --build-dir /Users/buildslave/jenkins/workspace/lldb-cmake-sanitized/lldb-build/lldb-test-build.noindex --lldb-module-cache-dir /Users/buildslave/jenkins/workspace/lldb-cmake-sanitized/lldb-build/lldb-test-build.noindex/module-cache-lldb/lldb-api --clang-module-cache-dir /Users/buildslave/jenkins/workspace/lldb-cmake-sanitized/lldb-build/lldb-test-build.noindex/module-cache-clang/lldb-api --executable /Users/buildslave/jenkins/workspace/lldb-cmake-sanitized/lldb-build/./bin/lldb --compiler /Users/buildslave/jenkins/workspace/lldb-cmake-sanitized/lldb-build/./bin/clang --dsymutil /Users/buildslave/jenkins/workspace/lldb-cmake-sanitized/lldb-build/./bin/dsymutil --filecheck /Users/buildslave/jenkins/workspace/lldb-cmake-sanitized/lldb-build/./bin/FileCheck --lldb-libs-dir /Users/buildslave/jenkins/workspace/lldb-cmake-sanitized/lldb-build/./lib /Users/buildslave/jenkins/workspace/lldb-cmake-sanitized/llvm-project/lldb/test/API/functionalities/data-formatter/poarray -p TestPrintObjectArray.py -- Exit Code: -6

Hide Details

Command Output (stdout): -- lldb version 11.0.99 clang revision 7ad36491cadee1ed91e18215c30328a3d5c104f9 llvm revision 7ad36491cadee1ed91e18215c30328a3d5c104f9

Hide Details

-- Command Output (stderr): --

Hide Details

Session logs for test failures/errors/unexpected successes will go into directory '/Users/buildslave/jenkins/workspace/lldb-cmake-sanitized/test/logs' Command invoked: /Users/buildslave/jenkins/workspace/lldb-cmake-sanitized/llvm-project/lldb/test/API/dotest.py --arch x86_64 -s /Users/buildslave/jenkins/workspace/lldb-cmake-sanitized/lldb-build/lldb-test-traces -S nm -u CXXFLAGS -u CFLAGS --codesign-identity lldb_codesign --server /Users/buildslave/jenkins/workspace/lldb-cmake-sanitized/lldb-build/./bin/debugserver --arch x86_64 --build-dir /Users/buildslave/jenkins/workspace/lldb-cmake-sanitized/lldb-build/lldb-test-build.noindex -s=/Users/buildslave/jenkins/workspace/lldb-cmake-sanitized/test/logs -t --env TERM=vt100 --env LLVM_LIBS_DIR=/Users/buildslave/jenkins/workspace/lldb-cmake-sanitized/lldb-build/./lib --inferior-env ASAN_OPTIONS=detect_stack_use_after_return=1 --inferior-env DYLD_INSERT_LIBRARIES=/Users/buildslave/jenkins/workspace/lldb-cmake-sanitized/host-compiler/lib/clang/11.0.0/lib/darwin/libclang_rt.asan_osx_dynamic.dylib --build-dir /Users/buildslave/jenkins/workspace/lldb-cmake-sanitized/lldb-build/lldb-test-build.noindex --lldb-module-cache-dir /Users/buildslave/jenkins/workspace/lldb-cmake-sanitized/lldb-build/lldb-test-build.noindex/module-cache-lldb/lldb-api --clang-module-cache-dir /Users/buildslave/jenkins/workspace/lldb-cmake-sanitized/lldb-build/lldb-test-build.noindex/module-cache-clang/lldb-api --executable /Users/buildslave/jenkins/workspace/lldb-cmake-sanitized/lldb-build/./bin/lldb --compiler /Users/buildslave/jenkins/workspace/lldb-cmake-sanitized/lldb-build/./bin/clang --dsymutil /Users/buildslave/jenkins/workspace/lldb-cmake-sanitized/lldb-build/./bin/dsymutil --filecheck /Users/buildslave/jenkins/workspace/lldb-cmake-sanitized/lldb-build/./bin/FileCheck --lldb-libs-dir /Users/buildslave/jenkins/workspace/lldb-cmake-sanitized/lldb-build/./lib /Users/buildslave/jenkins/workspace/lldb-cmake-sanitized/llvm-project/lldb/test/API/functionalities/data-formatter/poarray -p TestPrintObjectArray.py Change dir to: /Users/buildslave/jenkins/workspace/lldb-cmake-sanitized/llvm-project/lldb/test/API/functionalities/data-formatter/poarray runCmd: settings clear -all output:

Hide Details

runCmd: settings set symbols.enable-external-lookup false output:

Hide Details

runCmd: settings set target.auto-apply-fixits false output:

Hide Details

runCmd: settings set plugin.process.gdb-remote.packet-timeout 60 output:

Hide Details

runCmd: settings set symbols.clang-modules-cache-path "/Users/buildslave/jenkins/workspace/lldb-cmake-sanitized/lldb-build/lldb-test-build.noindex/module-cache-lldb/lldb-api" output:

Hide Details

runCmd: settings set use-color false output:

Hide Details

runCmd: setting set target.prefer-dynamic-value no-dynamic-values output:

Hide Details

runCmd: settings set target.env-vars ASAN_OPTIONS=detect_stack_use_after_return=1 DYLD_INSERT_LIBRARIES=/Users/buildslave/jenkins/workspace/lldb-cmake-sanitized/host-compiler/lib/clang/11.0.0/lib/darwin/libclang_rt.asan_osx_dynamic.dylib output:

Hide Details

runCmd: file /Users/buildslave/jenkins/workspace/lldb-cmake-sanitized/lldb-build/lldb-test-build.noindex/functionalities/data-formatter/poarray/TestPrintObjectArray.test_print_array_dsym/a.out output: Current executable set to '/Users/buildslave/jenkins/workspace/lldb-cmake-sanitized/lldb-build/lldb-test-build.noindex/functionalities/data-formatter/poarray/TestPrintObjectArray.test_print_array_dsym/a.out' (x86_64).

Hide Details

Hide Details

runCmd: breakpoint set -f "main.mm" -l 20 output: Breakpoint 1: where = a.out`main + 459 at main.mm:20:3, address = 0x0000000100000efb

Hide Details

Hide Details

Expecting pattern: ^Breakpoint (?P<bpno>[0-9]+): (?P<num_locations>[0-9]+) locations\.$ Not matched

Hide Details

Expecting pattern: ^Breakpoint (?P<bpno>[0-9]+): (?P<num_locations>no) locations \(pending\)\. Not matched

Hide Details

Expecting pattern: ^Breakpoint (?P<bpno>[0-9]+): where = (?P<module>.*)`(?P<symbol>[+\-]{0,1}[^+]+)( \+ (?P<offset>[0-9]+)){0,1}( \[inlined\] (?P<inline_symbol>.*)){0,1} at (?P<file>[^:]+):(?P<line_no>[0-9]+)(?P<column>(:[0-9]+)?), address = (?P<address>0x[0-9a-fA-F]+)$ Matched

Hide Details

runCmd: run output: Process 17686 stopped * thread #1, queue = 'com.apple.main-thread', stop reason = breakpoint 1.1 frame #0: 0x0000000100000efb a.out`main at main.mm:20:3 17 tobjects->two = array2; 18 tobjects->three = dictionary; 19 id* objects = (id*)tobjects; -> 20 return 0; // break here ^ 21 }

Hide Details

Process 17686 launched: '/Users/buildslave/jenkins/workspace/lldb-cmake-sanitized/lldb-build/lldb-test-build.noindex/functionalities/data-formatter/poarray/TestPrintObjectArray.test_print_array_dsym/a.out' (x86_64)

Hide Details

Hide Details

runCmd: thread list output: Process 17686 stopped * thread #1: tid = 0x184728, 0x0000000100000efb a.out`main at main.mm:20:3, queue = 'com.apple.main-thread', stop reason = breakpoint 1.1

Hide Details

Hide Details

Expecting sub string: stopped Matched

Hide Details

Expecting sub string: stop reason = breakpoint Matched

Hide Details

Adding tearDown hook: def cleanup(): self.runCmd('type format clear', check=False) self.runCmd('type summary clear', check=False) self.runCmd('type synth clear', check=False)

Hide Details

Hide Details

runCmd: expr --element-count 3 --object-description -- objects output: { <__NSArrayI 0x604000001710>( 3735928559, 4276993775, 3203398366 )

Hide Details

<__NSArrayI 0x603000002f20>( Hello, World )

Hide Details

{ Two = ( Hello, World ); 1 = ( Hello, World ); }

Hide Details

}

Hide Details

Hide Details

Expecting sub string: 3735928559 Matched

Hide Details

Expecting sub string: 4276993775 Matched

Hide Details

Expecting sub string: 3203398366 Matched

Hide Details

Expecting sub string: Hello Matched

Hide Details

Expecting sub string: World Matched

Hide Details

Expecting sub string: Two = Matched

Hide Details

Expecting sub string: 1 = Matched

Hide Details

runCmd: poarray 3 objects output: { <__NSArrayI 0x604000001710>( 3735928559, 4276993775, 3203398366 )

Hide Details

<__NSArrayI 0x603000002f20>( Hello, World )

Hide Details

{ Two = ( Hello, World ); 1 = ( Hello, World ); }

Hide Details

}

Hide Details

Hide Details

Expecting sub string: 3735928559 Matched

Hide Details

Expecting sub string: 4276993775 Matched

Hide Details

Expecting sub string: 3203398366 Matched

Hide Details

Expecting sub string: Hello Matched

Hide Details

Expecting sub string: World Matched

Hide Details

Expecting sub string: Two = Matched

Hide Details

Expecting sub string: 1 = Matched

Hide Details

runCmd: expr --element-count 3 --object-description --description-verbosity=full -- objects output: (id *) $2 = 0x0000603000002fb0 { (id) [0] = 0x0000604000001710 <__NSArrayI 0x604000001710>( 3735928559, 4276993775, 3203398366 )

Hide Details

(id) [1] = 0x0000603000002f20 <__NSArrayI 0x603000002f20>( Hello, World )

Hide Details

(id) [2] = 0x0000606000008a20 { Two = ( Hello, World ); 1 = ( Hello, World ); }

Hide Details

}

Hide Details

Hide Details

Expecting sub string: [0] = Matched

Hide Details

Expecting sub string: 3735928559 Matched

Hide Details

Expecting sub string: 4276993775 Matched

Hide Details

Expecting sub string: 3203398366 Matched

Hide Details

Expecting sub string: [1] = Matched

Hide Details

Expecting sub string: Hello Matched

Hide Details

Expecting sub string: World Matched

Hide Details

Expecting sub string: [2] = Matched

Hide Details

Expecting sub string: Two = Matched

Hide Details

Expecting sub string: 1 = Matched

Hide Details

runCmd: parray 3 objects output: (id *) $3 = 0x0000603000002fb0 { (id) [0] = 0x0000604000001710 (id) [1] = 0x0000603000002f20 (id) [2] = 0x0000606000008a20 }

Hide Details

Hide Details

Expecting sub string: [0] = 0x Matched

Hide Details

Expecting sub string: [1] = 0x Matched

Hide Details

Expecting sub string: [2] = 0x Matched

Hide Details

runCmd: expr --element-count 3 -d run -- objects output: (id *) $4 = 0x0000603000002fb0 { (__NSArrayI *) [0] = 0x0000604000001710 3 elements (__NSArrayI *) [1] = 0x0000603000002f20 2 elements (__NSDictionaryI *) [2] = 0x0000606000008a20 2 key/value pairs }

Hide Details

Hide Details

Expecting sub string: 3 elements Matched

Hide Details

Expecting sub string: 2 elements Matched

Hide Details

Expecting sub string: 2 key/value pairs Matched

Hide Details

runCmd: expr --element-count 3 -d run --ptr-depth=1 -- objects output: (id *) $5 = 0x0000603000002fb0 { (__NSArrayI *) [0] = 0x0000604000001710 3 elements { [0] = 0x1caf6c463d83e81d 3735928559 [1] = 0x1caf6c667d83e81d 4276993775 [2] = 0x1caf6c267fc7d91d 3203398366 } (__NSArrayI *) [1] = 0x0000603000002f20 2 elements { [0] = 0x0000000100001038 "Hello" [1] = 0x0000000100001058 "World" } (__NSDictionaryI *) [2] = 0x0000606000008a20 2 key/value pairs { [0] = { key = 0x0000000100001078 "Two" value = 0x0000603000002f20 2 elements } [1] = { key = 0x1caf6c98903d060d 1 value = 0x0000603000002f20 2 elements } } }

Hide Details

Assertion failed: (tokenKind == tok::kw___bridge_retain), function ParseParenExpression, file /Users/buildslave/jenkins/workspace/lldb-cmake-sanitized/llvm-project/clang/lib/Parse/ParseExpr.cpp, line 2804.

Hide Details

--

Hide Details

******************** PASS: lldb-api :: lang/objc/modules-incomplete/TestIncompleteModules.py (1633 of 2028) PASS: lldb-api :: commands/expression/import-std-module/conflicts/TestStdModuleWithConflicts.py (1634 of 2028) PASS: lldb-unit :: Process/minidump/./LLDBMinidumpTests/MinidumpParserTest.GetArchitecture (1635 of 2028) PASS: lldb-api :: functionalities/data-formatter/cstring-utf8-summary/TestCstringUnicode.py (1636 of 2028) PASS: lldb-shell :: ObjectFile/MachO/subsections.yaml (1637 of 2028) PASS: lldb-api :: python_api/process/io/TestProcessIO.py (1638 of 2028) PASS: lldb-shell :: ObjectFile/ELF/section-overlap.yaml (1639 of 2028) PASS: lldb-api :: commands/expression/import-std-module/vector-bool/TestVectorBoolFromStdModule.py (1640 of 2028) PASS: lldb-unit :: Utility/./UtilityTests/ProcessInstanceInfo.Yaml (1641 of 2028) PASS: lldb-unit :: Utility/./UtilityTests/ArgsTest.AppendArguments (1642 of 2028) PASS: lldb-unit :: SymbolFile/NativePDB/./SymbolFileNativePDBTests/PDBFPOProgramToDWARFExpressionTests.UnsupportedRASearch (1643 of 2028) PASS: lldb-unit :: Target/./TargetTests/ExecutionContextTest.GetByteOrderProcess (1644 of 2028) PASS: lldb-api :: python_api/watchpoint/watchlocation/TestTargetWatchAddress.py (1645 of 2028) PASS: lldb-unit :: Process/gdb-remote/./ProcessGdbRemoteTests/GDBRemoteCommunicationClientTest.GetMemoryRegionInfoInvalidResponse (1646 of 2028) PASS: lldb-unit :: Symbol/./SymbolTests/SymbolsTest.LocateExecutableSymbolFileForUnknownExecutableAndMissingSymbolFile (1647 of 2028) PASS: lldb-api :: functionalities/lazy-loading/TestLazyLoading.py (1648 of 2028) PASS: lldb-api :: commands/apropos/with-process/TestAproposWithProcess.py (1649 of 2028) PASS: lldb-shell :: SymbolFile/Breakpad/line-table-edgecases.test (1650 of 2028) PASS: lldb-unit :: Symbol/./SymbolTests/TestClangASTImporter.MetadataPropagation (1651 of 2028) PASS: lldb-api :: functionalities/thread/concurrent_events/TestConcurrentTwoBreakpointsOneDelaySignal.py (1652 of 2028) PASS: lldb-unit :: UnwindAssembly/x86/./UnwindAssemblyx86Tests/Testx86AssemblyInspectionEngine.TestStackRealign8BitDisp_i386 (1653 of 2028) PASS: lldb-unit :: Utility/./UtilityTests/RangeTest.Copy (1654 of 2028) PASS: lldb-unit :: Utility/./UtilityTests/FileSpecTest.EqualDotsWindows (1655 of 2028) PASS: lldb-api :: functionalities/show_location/TestShowLocationDwarf5.py (1656 of 2028) PASS: lldb-unit :: Symbol/./SymbolTests/TestClangASTImporter.RecordLayout (1657 of 2028) PASS: lldb-api :: python_api/value_var_update/TestValueVarUpdate.py (1658 of 2028) PASS: lldb-shell :: ObjectFile/MachO/lc_version_min.yaml (1659 of 2028) PASS: lldb-unit :: Utility/./UtilityTests/TimerTest.CategoryTimesNested (1660 of 2028) UNSUPPORTED: lldb-api :: tools/lldb-server/TestGdbRemote_vContThreads.py (1661 of 2028) PASS: lldb-api :: functionalities/memory/cache/TestMemoryCache.py (1662 of 2028) PASS: lldb-unit :: Utility/./UtilityTests/RangeTest.ContainsRange (1663 of 2028) PASS: lldb-api :: functionalities/gdb_remote_client/TestNoGPacketSupported.py (1664 of 2028) FAIL: lldb-api :: lang/objc/hidden-ivars/TestHiddenIvars.py (1665 of 2028) ******************** TEST 'lldb-api :: lang/objc/hidden-ivars/TestHiddenIvars.py' FAILED ******************** Script: -- /Users/buildslave/jenkins/workspace/lldb-cmake-sanitized/lldb-build/lldb-test-build.noindex/copied-system-python /Users/buildslave/jenkins/workspace/lldb-cmake-sanitized/llvm-project/lldb/test/API/dotest.py --arch x86_64 -s /Users/buildslave/jenkins/workspace/lldb-cmake-sanitized/lldb-build/lldb-test-traces -S nm -u CXXFLAGS -u CFLAGS --codesign-identity lldb_codesign --server /Users/buildslave/jenkins/workspace/lldb-cmake-sanitized/lldb-build/./bin/debugserver --arch x86_64 --build-dir /Users/buildslave/jenkins/workspace/lldb-cmake-sanitized/lldb-build/lldb-test-build.noindex -s=/Users/buildslave/jenkins/workspace/lldb-cmake-sanitized/test/logs -t --env TERM=vt100 --env LLVM_LIBS_DIR=/Users/buildslave/jenkins/workspace/lldb-cmake-sanitized/lldb-build/./lib --inferior-env ASAN_OPTIONS=detect_stack_use_after_return=1 --inferior-env DYLD_INSERT_LIBRARIES=/Users/buildslave/jenkins/workspace/lldb-cmake-sanitized/host-compiler/lib/clang/11.0.0/lib/darwin/libclang_rt.asan_osx_dynamic.dylib --build-dir /Users/buildslave/jenkins/workspace/lldb-cmake-sanitized/lldb-build/lldb-test-build.noindex --lldb-module-cache-dir /Users/buildslave/jenkins/workspace/lldb-cmake-sanitized/lldb-build/lldb-test-build.noindex/module-cache-lldb/lldb-api --clang-module-cache-dir /Users/buildslave/jenkins/workspace/lldb-cmake-sanitized/lldb-build/lldb-test-build.noindex/module-cache-clang/lldb-api --executable /Users/buildslave/jenkins/workspace/lldb-cmake-sanitized/lldb-build/./bin/lldb --compiler /Users/buildslave/jenkins/workspace/lldb-cmake-sanitized/lldb-build/./bin/clang --dsymutil /Users/buildslave/jenkins/workspace/lldb-cmake-sanitized/lldb-build/./bin/dsymutil --filecheck /Users/buildslave/jenkins/workspace/lldb-cmake-sanitized/lldb-build/./bin/FileCheck --lldb-libs-dir /Users/buildslave/jenkins/workspace/lldb-cmake-sanitized/lldb-build/./lib /Users/buildslave/jenkins/workspace/lldb-cmake-sanitized/llvm-project/lldb/test/API/lang/objc/hidden-ivars -p TestHiddenIvars.py -- Exit Code: -6

Hide Details

Command Output (stdout): -- lldb version 11.0.99 clang revision 7ad36491cadee1ed91e18215c30328a3d5c104f9 llvm revision 7ad36491cadee1ed91e18215c30328a3d5c104f9

Hide Details

-- Command Output (stderr): -- Assertion failed: (tokenKind == tok::kw___bridge_retain), function ParseParenExpression, file /Users/buildslave/jenkins/workspace/lldb-cmake-sanitized/llvm-project/clang/lib/Parse/ParseExpr.cpp, line 2804.

Hide Details

--

Hide Details

******************** PASS: lldb-unit :: Utility/./UtilityTests/StreamTest.PutHex32ByteOrderLittle (1666 of 2028) PASS: lldb-api :: commands/frame/diagnose/bad-reference/TestBadReference.py (1667 of 2028) PASS: lldb-unit :: UnwindAssembly/x86/./UnwindAssemblyx86Tests/Testx86AssemblyInspectionEngine.TestPopR14 (1668 of 2028) PASS: lldb-api :: functionalities/data-formatter/data-formatter-stl/libcxx/initializerlist/TestInitializerList.py (1669 of 2028) PASS: lldb-unit :: Utility/./UtilityTests/RangeDataVector.FindEntryIndexesThatContain_Overlap (1670 of 2028) PASS: lldb-unit :: Utility/./UtilityTests/StringLexerTest.HasAtLeast (1671 of 2028) PASS: lldb-unit :: Process/minidump/./LLDBMinidumpTests/MinidumpParserTest.InvalidMinidump (1672 of 2028) PASS: lldb-shell :: ObjectFile/ELF/netbsd-exec-8.99.30-amd64.yaml (1673 of 2028) PASS: lldb-api :: commands/settings/use_source_cache/TestUseSourceCache.py (1674 of 2028) PASS: lldb-unit :: Utility/./UtilityTests/StreamTest.PutCString (1675 of 2028) PASS: lldb-shell :: ObjectFile/PECOFF/basic-info-arm.yaml (1676 of 2028) PASS: lldb-unit :: Symbol/./SymbolTests/PostfixExpression.ParseOneExpression (1677 of 2028) PASS: lldb-api :: functionalities/data-formatter/data-formatter-objc/TestDataFormatterObjNSException.py (1678 of 2028) PASS: lldb-unit :: UnwindAssembly/x86/./UnwindAssemblyx86Tests/Testx86AssemblyInspectionEngine.TestStackRealign32BitDisp_x86_64 (1679 of 2028) UNSUPPORTED: lldb-api :: api/multiple-debuggers/TestMultipleDebuggers.py (1680 of 2028) PASS: lldb-unit :: UnwindAssembly/x86/./UnwindAssemblyx86Tests/Testx86AssemblyInspectionEngine.TestPopRBX (1681 of 2028) UNSUPPORTED: lldb-api :: functionalities/data-formatter/data-formatter-stl/libstdcpp/unique_ptr/TestDataFormatterStdUniquePtr.py (1682 of 2028) UNSUPPORTED: lldb-shell :: SymbolFile/PDB/ast-restore.test (1683 of 2028) PASS: lldb-unit :: Utility/./UtilityTests/RecordReplayTest.InstrumentedBarRef (1684 of 2028) PASS: lldb-unit :: Utility/./UtilityTests/ScalarTest.GetBytes (1685 of 2028) PASS: lldb-api :: api/multithreaded/TestMultithreaded.py (1686 of 2028) UNSUPPORTED: lldb-api :: commands/expression/macros/TestMacros.py (1687 of 2028) PASS: lldb-unit :: Process/minidump/./LLDBMinidumpTests/MinidumpParserTest.GetPidWow64 (1688 of 2028) PASS: lldb-unit :: Language/Highlighting/./HighlighterTests/HighlighterTest.Keywords (1689 of 2028) PASS: lldb-api :: functionalities/gdb_remote_client/TestqOffsets.py (1690 of 2028) UNSUPPORTED: lldb-api :: iohandler/completion/TestIOHandlerCompletion.py (1691 of 2028) UNSUPPORTED: lldb-api :: functionalities/tsan/global_location/TestTsanGlobalLocation.py (1692 of 2028) PASS: lldb-unit :: Utility/./UtilityTests/StringListTest.SplitIntoLinesEmpty (1693 of 2028) PASS: lldb-api :: python_api/lldbutil/frame/TestFrameUtils.py (1694 of 2028) PASS: lldb-shell :: Reproducer/Functionalities/TestExpressionEvaluation.test (1695 of 2028) PASS: lldb-unit :: Process/gdb-remote/./ProcessGdbRemoteTests/GDBRemoteCommunicationServerTest.SendErrorResponse_StringError (1696 of 2028) PASS: lldb-api :: functionalities/data-formatter/frameformat_smallstruct/TestFrameFormatSmallStruct.py (1697 of 2028) PASS: lldb-shell :: Expr/TestMultilineExpr.test (1698 of 2028) PASS: lldb-api :: lang/objc/direct-dispatch-step/TestObjCDirectDispatchStepping.py (1699 of 2028) PASS: lldb-shell :: SymbolFile/DWARF/dir-separator-posix.s (1700 of 2028) PASS: lldb-unit :: Utility/./UtilityTests/FileSpecTest.IsRelative (1701 of 2028) PASS: lldb-unit :: Host/./HostTests/ConnectionFileDescriptorTest.TCPGetURIv4 (1702 of 2028) PASS: lldb-unit :: Symbol/./SymbolTests/TestTypeSystemClang.TestNotDeletingUserCopyCstrDueToMoveCStr (1703 of 2028) PASS: lldb-api :: functionalities/inline-stepping/TestInlineStepping.py (1704 of 2028) UNSUPPORTED: lldb-api :: terminal/TestEditline.py (1705 of 2028) PASS: lldb-api :: tools/lldb-server/TestGdbRemote_qThreadStopInfo.py (1706 of 2028) PASS: lldb-shell :: Reproducer/TestDump.test (1707 of 2028) PASS: lldb-api :: commands/expression/import_base_class_when_class_has_derived_member/TestImportBaseClassWhenClassHasDerivedMember.py (1708 of 2028) PASS: lldb-api :: functionalities/data-formatter/data-formatter-proper-plurals/TestFormattersOneIsSingular.py (1709 of 2028) PASS: lldb-api :: lang/cpp/template-function/TestTemplateFunctions.py (1710 of 2028) UNSUPPORTED: lldb-api :: iohandler/resize/TestIOHandlerResize.py (1711 of 2028) FAIL: lldb-api :: lang/objcxx/objcxx-ivar-vector/TestIvarVector.py (1712 of 2028) ******************** TEST 'lldb-api :: lang/objcxx/objcxx-ivar-vector/TestIvarVector.py' FAILED ******************** Script: -- /Users/buildslave/jenkins/workspace/lldb-cmake-sanitized/lldb-build/lldb-test-build.noindex/copied-system-python /Users/buildslave/jenkins/workspace/lldb-cmake-sanitized/llvm-project/lldb/test/API/dotest.py --arch x86_64 -s /Users/buildslave/jenkins/workspace/lldb-cmake-sanitized/lldb-build/lldb-test-traces -S nm -u CXXFLAGS -u CFLAGS --codesign-identity lldb_codesign --server /Users/buildslave/jenkins/workspace/lldb-cmake-sanitized/lldb-build/./bin/debugserver --arch x86_64 --build-dir /Users/buildslave/jenkins/workspace/lldb-cmake-sanitized/lldb-build/lldb-test-build.noindex -s=/Users/buildslave/jenkins/workspace/lldb-cmake-sanitized/test/logs -t --env TERM=vt100 --env LLVM_LIBS_DIR=/Users/buildslave/jenkins/workspace/lldb-cmake-sanitized/lldb-build/./lib --inferior-env ASAN_OPTIONS=detect_stack_use_after_return=1 --inferior-env DYLD_INSERT_LIBRARIES=/Users/buildslave/jenkins/workspace/lldb-cmake-sanitized/host-compiler/lib/clang/11.0.0/lib/darwin/libclang_rt.asan_osx_dynamic.dylib --build-dir /Users/buildslave/jenkins/workspace/lldb-cmake-sanitized/lldb-build/lldb-test-build.noindex --lldb-module-cache-dir /Users/buildslave/jenkins/workspace/lldb-cmake-sanitized/lldb-build/lldb-test-build.noindex/module-cache-lldb/lldb-api --clang-module-cache-dir /Users/buildslave/jenkins/workspace/lldb-cmake-sanitized/lldb-build/lldb-test-build.noindex/module-cache-clang/lldb-api --executable /Users/buildslave/jenkins/workspace/lldb-cmake-sanitized/lldb-build/./bin/lldb --compiler /Users/buildslave/jenkins/workspace/lldb-cmake-sanitized/lldb-build/./bin/clang --dsymutil /Users/buildslave/jenkins/workspace/lldb-cmake-sanitized/lldb-build/./bin/dsymutil --filecheck /Users/buildslave/jenkins/workspace/lldb-cmake-sanitized/lldb-build/./bin/FileCheck --lldb-libs-dir /Users/buildslave/jenkins/workspace/lldb-cmake-sanitized/lldb-build/./lib /Users/buildslave/jenkins/workspace/lldb-cmake-sanitized/llvm-project/lldb/test/API/lang/objcxx/objcxx-ivar-vector -p TestIvarVector.py -- Exit Code: -6

Hide Details

Command Output (stdout): -- lldb version 11.0.99 clang revision 7ad36491cadee1ed91e18215c30328a3d5c104f9 llvm revision 7ad36491cadee1ed91e18215c30328a3d5c104f9

Hide Details

-- Command Output (stderr): -- Assertion failed: (tokenKind == tok::kw___bridge_retain), function ParseParenExpression, file /Users/buildslave/jenkins/workspace/lldb-cmake-sanitized/llvm-project/clang/lib/Parse/ParseExpr.cpp, line 2804.

Hide Details

--

Hide Details

******************** PASS: lldb-api :: tools/lldb-vscode/launch/TestVSCode_launch.py (1713 of 2028) PASS: lldb-unit :: Utility/./UtilityTests/RangeTest.ContainsEndInclusive (1714 of 2028) PASS: lldb-unit :: Process/minidump/./LLDBMinidumpTests/MinidumpParserTest.GetMemoryRegionInfoFromMemoryList (1715 of 2028) UNSUPPORTED: lldb-api :: functionalities/thread/multi_break/TestMultipleBreakpoints.py (1716 of 2028) PASS: lldb-api :: lang/c/unions/TestUnionMembers.py (1717 of 2028) PASS: lldb-api :: lang/objc/single-entry-dictionary/TestObjCSingleEntryDictionary.py (1718 of 2028) PASS: lldb-api :: lang/cpp/signed_types/TestSignedTypes.py (1719 of 2028) PASS: lldb-shell :: Driver/TestCore.test (1720 of 2028) PASS: lldb-api :: commands/platform/basic/TestPlatformCommand.py (1721 of 2028) PASS: lldb-shell :: Commands/command-source.test (1722 of 2028) PASS: lldb-unit :: Process/gdb-remote/./ProcessGdbRemoteTests/GDBRemoteClientBaseTest.SendContinueDelegateStructuredDataReceipt (1723 of 2028) PASS: lldb-api :: commands/expression/radar_9673664/TestExprHelpExamples.py (1724 of 2028) PASS: lldb-shell :: SymbolFile/NativePDB/tag-types.cpp (1725 of 2028) PASS: lldb-unit :: Utility/./UtilityTests/UriParserTest.BadPort (1726 of 2028) PASS: lldb-unit :: Utility/./UtilityTests/ProcessInstanceInfo.DumpTable (1727 of 2028) UNSUPPORTED: lldb-api :: functionalities/process_save_core/TestProcessSaveCore.py (1728 of 2028) PASS: lldb-api :: functionalities/inferior-assert/TestInferiorAssert.py (1729 of 2028) PASS: lldb-unit :: Utility/./UtilityTests/BinaryStreamTest.PutULEB128ThreeBytes (1730 of 2028) PASS: lldb-unit :: UnwindAssembly/x86/./UnwindAssemblyx86Tests/Testx86AssemblyInspectionEngine.TestPushEDI (1731 of 2028) PASS: lldb-shell :: Breakpoint/implicit_const_form_support.test (1732 of 2028) PASS: lldb-unit :: Utility/./UtilityTests/BinaryStreamTest.PutULEB128SixBytes (1733 of 2028) PASS: lldb-unit :: ObjectFile/Breakpad/./ObjectFileBreakpadTests/LineRecord.parse (1734 of 2028) PASS: lldb-shell :: Commands/command-regex-delete.test (1735 of 2028) PASS: lldb-unit :: Utility/./UtilityTests/AnsiTerminal.Basic (1736 of 2028) PASS: lldb-unit :: Utility/./UtilityTests/Flags.AnySet (1737 of 2028) PASS: lldb-unit :: UnwindAssembly/x86/./UnwindAssemblyx86Tests/Testx86AssemblyInspectionEngine.TestPushEAX (1738 of 2028) PASS: lldb-unit :: Expression/./ExpressionTests/DiagnosticManagerTest.PutStringMultiple (1739 of 2028) PASS: lldb-unit :: SymbolFile/NativePDB/./SymbolFileNativePDBTests/PDBFPOProgramToDWARFExpressionTests.UnresolvedRegisterReference (1740 of 2028) PASS: lldb-shell :: Breakpoint/debug_rnglistx_rlex.test (1741 of 2028) PASS: lldb-api :: commands/expression/no-deadlock/TestExprDoesntBlock.py (1742 of 2028) PASS: lldb-unit :: UnwindAssembly/x86/./UnwindAssemblyx86Tests/Testx86AssemblyInspectionEngine.TestAddRSP (1743 of 2028) FAIL: lldb-api :: lang/objc/objc-optimized/TestObjcOptimized.py (1744 of 2028) ******************** TEST 'lldb-api :: lang/objc/objc-optimized/TestObjcOptimized.py' FAILED ******************** Script: -- /Users/buildslave/jenkins/workspace/lldb-cmake-sanitized/lldb-build/lldb-test-build.noindex/copied-system-python /Users/buildslave/jenkins/workspace/lldb-cmake-sanitized/llvm-project/lldb/test/API/dotest.py --arch x86_64 -s /Users/buildslave/jenkins/workspace/lldb-cmake-sanitized/lldb-build/lldb-test-traces -S nm -u CXXFLAGS -u CFLAGS --codesign-identity lldb_codesign --server /Users/buildslave/jenkins/workspace/lldb-cmake-sanitized/lldb-build/./bin/debugserver --arch x86_64 --build-dir /Users/buildslave/jenkins/workspace/lldb-cmake-sanitized/lldb-build/lldb-test-build.noindex -s=/Users/buildslave/jenkins/workspace/lldb-cmake-sanitized/test/logs -t --env TERM=vt100 --env LLVM_LIBS_DIR=/Users/buildslave/jenkins/workspace/lldb-cmake-sanitized/lldb-build/./lib --inferior-env ASAN_OPTIONS=detect_stack_use_after_return=1 --inferior-env DYLD_INSERT_LIBRARIES=/Users/buildslave/jenkins/workspace/lldb-cmake-sanitized/host-compiler/lib/clang/11.0.0/lib/darwin/libclang_rt.asan_osx_dynamic.dylib --build-dir /Users/buildslave/jenkins/workspace/lldb-cmake-sanitized/lldb-build/lldb-test-build.noindex --lldb-module-cache-dir /Users/buildslave/jenkins/workspace/lldb-cmake-sanitized/lldb-build/lldb-test-build.noindex/module-cache-lldb/lldb-api --clang-module-cache-dir /Users/buildslave/jenkins/workspace/lldb-cmake-sanitized/lldb-build/lldb-test-build.noindex/module-cache-clang/lldb-api --executable /Users/buildslave/jenkins/workspace/lldb-cmake-sanitized/lldb-build/./bin/lldb --compiler /Users/buildslave/jenkins/workspace/lldb-cmake-sanitized/lldb-build/./bin/clang --dsymutil /Users/buildslave/jenkins/workspace/lldb-cmake-sanitized/lldb-build/./bin/dsymutil --filecheck /Users/buildslave/jenkins/workspace/lldb-cmake-sanitized/lldb-build/./bin/FileCheck --lldb-libs-dir /Users/buildslave/jenkins/workspace/lldb-cmake-sanitized/lldb-build/./lib /Users/buildslave/jenkins/workspace/lldb-cmake-sanitized/llvm-project/lldb/test/API/lang/objc/objc-optimized -p TestObjcOptimized.py -- Exit Code: -6

Hide Details

Command Output (stdout): -- lldb version 11.0.99 clang revision 7ad36491cadee1ed91e18215c30328a3d5c104f9 llvm revision 7ad36491cadee1ed91e18215c30328a3d5c104f9 a.out was compiled with optimization - stepping may behave oddly; variables may not be available. a.out was compiled with optimization - stepping may behave oddly; variables may not be available. a.out was compiled with optimization - stepping may behave oddly; variables may not be available.

Hide Details

-- Command Output (stderr): -- Assertion failed: (tokenKind == tok::kw___bridge_retain), function ParseParenExpression, file /Users/buildslave/jenkins/workspace/lldb-cmake-sanitized/llvm-project/clang/lib/Parse/ParseExpr.cpp, line 2804.

Hide Details

--

Hide Details

******************** PASS: lldb-unit :: Host/./HostTests/ProcessLaunchInfoTest.Constructor (1745 of 2028) PASS: lldb-unit :: Language/CPlusPlus/./LanguageCPlusPlusTests/CPlusPlusLanguage.FindAlternateFunctionManglings (1746 of 2028) PASS: lldb-shell :: SymbolFile/DWARF/dwarf5_locations.s (1747 of 2028) PASS: lldb-unit :: UnwindAssembly/x86/./UnwindAssemblyx86Tests/Testx86AssemblyInspectionEngine.TestPopEBP (1748 of 2028) PASS: lldb-api :: commands/expression/ir-interpreter-phi-nodes/TestIRInterpreterPHINodes.py (1749 of 2028) PASS: lldb-unit :: Signals/./SignalsTests/UnixSignalsTest.GetInfo (1750 of 2028) PASS: lldb-api :: functionalities/breakpoint/address_breakpoints/TestBadAddressBreakpoints.py (1751 of 2028) PASS: lldb-api :: lang/c/modules/TestCModules.py (1752 of 2028) UNSUPPORTED: lldb-api :: linux/sepdebugsymlink/TestTargetSymbolsSepDebugSymlink.py (1753 of 2028) PASS: lldb-api :: lang/c/step-target/TestStepTarget.py (1754 of 2028) PASS: lldb-api :: functionalities/thread/jump/TestThreadJump.py (1755 of 2028) PASS: lldb-shell :: ObjectFile/Breakpad/sections.test (1756 of 2028) PASS: lldb-unit :: Utility/./UtilityTests/StringExtractorTest.GetHexU8_InvalidHex (1757 of 2028) PASS: lldb-api :: functionalities/thread/concurrent_events/TestConcurrentBreakpointOneDelayBreakpointThreads.py (1758 of 2028) PASS: lldb-api :: macosx/load-kext/TestLoadKext.py (1759 of 2028) UNSUPPORTED: lldb-shell :: SymbolFile/PDB/pointers.test (1760 of 2028) PASS: lldb-unit :: Utility/./UtilityTests/StreamTest.PutStringAsRawHex8 (1761 of 2028) UNSUPPORTED: lldb-shell :: SymbolFile/NativePDB/typedefs.cpp (1762 of 2028) UNSUPPORTED: lldb-api :: functionalities/data-formatter/data-formatter-stl/libstdcpp/vector/TestDataFormatterStdVector.py (1763 of 2028) PASS: lldb-unit :: Host/./HostTests/FileSystemTest.EmptyTest (1764 of 2028) PASS: lldb-api :: lang/cpp/const_this/TestConstThis.py (1765 of 2028) PASS: lldb-unit :: Utility/./UtilityTests/RangeDataVector.FindEntryThatContains (1766 of 2028) PASS: lldb-api :: macosx/function-starts/TestFunctionStarts.py (1767 of 2028) UNSUPPORTED: lldb-api :: functionalities/signal/handle-segv/TestHandleSegv.py (1768 of 2028) PASS: lldb-api :: commands/expression/import-std-module/forward_list-dbg-info-content/TestDbgInfoContentForwardListFromStdModule.py (1769 of 2028) PASS: lldb-unit :: Symbol/./SymbolTests/LineEntryTest.GetSameLineContiguousAddressRangeOneInline (1770 of 2028) PASS: lldb-shell :: SymbolFile/Breakpad/unwind-via-raSearch.test (1771 of 2028) PASS: lldb-unit :: ObjectFile/Breakpad/./ObjectFileBreakpadTests/FuncRecord.parse (1772 of 2028) PASS: lldb-api :: lang/cpp/char8_t/TestCxxChar8_t.py (1773 of 2028) PASS: lldb-unit :: SymbolFile/NativePDB/./SymbolFileNativePDBTests/PDBFPOProgramToDWARFExpressionTests.InvalidAssignmentSingle (1774 of 2028) UNSUPPORTED: lldb-api :: functionalities/tsan/multiple/TestTsanMultiple.py (1775 of 2028) PASS: lldb-unit :: Symbol/./SymbolTests/Type.CompilerContextPattern (1776 of 2028) PASS: lldb-api :: macosx/add-dsym/TestAddDsymMidExecutionCommand.py (1777 of 2028) PASS: lldb-api :: functionalities/deleted-executable/TestDeletedExecutable.py (1778 of 2028) PASS: lldb-api :: functionalities/postmortem/mach-core/TestMachCore.py (1779 of 2028) PASS: lldb-api :: commands/expression/anonymous-struct/TestCallUserAnonTypedef.py (1780 of 2028) PASS: lldb-shell :: Breakpoint/jitbp_elf.test (1781 of 2028) FAIL: lldb-api :: lang/objc/foundation/TestObjCMethodsNSArray.py (1782 of 2028) ******************** TEST 'lldb-api :: lang/objc/foundation/TestObjCMethodsNSArray.py' FAILED ******************** Script: -- /Users/buildslave/jenkins/workspace/lldb-cmake-sanitized/lldb-build/lldb-test-build.noindex/copied-system-python /Users/buildslave/jenkins/workspace/lldb-cmake-sanitized/llvm-project/lldb/test/API/dotest.py --arch x86_64 -s /Users/buildslave/jenkins/workspace/lldb-cmake-sanitized/lldb-build/lldb-test-traces -S nm -u CXXFLAGS -u CFLAGS --codesign-identity lldb_codesign --server /Users/buildslave/jenkins/workspace/lldb-cmake-sanitized/lldb-build/./bin/debugserver --arch x86_64 --build-dir /Users/buildslave/jenkins/workspace/lldb-cmake-sanitized/lldb-build/lldb-test-build.noindex -s=/Users/buildslave/jenkins/workspace/lldb-cmake-sanitized/test/logs -t --env TERM=vt100 --env LLVM_LIBS_DIR=/Users/buildslave/jenkins/workspace/lldb-cmake-sanitized/lldb-build/./lib --inferior-env ASAN_OPTIONS=detect_stack_use_after_return=1 --inferior-env DYLD_INSERT_LIBRARIES=/Users/buildslave/jenkins/workspace/lldb-cmake-sanitized/host-compiler/lib/clang/11.0.0/lib/darwin/libclang_rt.asan_osx_dynamic.dylib --build-dir /Users/buildslave/jenkins/workspace/lldb-cmake-sanitized/lldb-build/lldb-test-build.noindex --lldb-module-cache-dir /Users/buildslave/jenkins/workspace/lldb-cmake-sanitized/lldb-build/lldb-test-build.noindex/module-cache-lldb/lldb-api --clang-module-cache-dir /Users/buildslave/jenkins/workspace/lldb-cmake-sanitized/lldb-build/lldb-test-build.noindex/module-cache-clang/lldb-api --executable /Users/buildslave/jenkins/workspace/lldb-cmake-sanitized/lldb-build/./bin/lldb --compiler /Users/buildslave/jenkins/workspace/lldb-cmake-sanitized/lldb-build/./bin/clang --dsymutil /Users/buildslave/jenkins/workspace/lldb-cmake-sanitized/lldb-build/./bin/dsymutil --filecheck /Users/buildslave/jenkins/workspace/lldb-cmake-sanitized/lldb-build/./bin/FileCheck --lldb-libs-dir /Users/buildslave/jenkins/workspace/lldb-cmake-sanitized/lldb-build/./lib /Users/buildslave/jenkins/workspace/lldb-cmake-sanitized/llvm-project/lldb/test/API/lang/objc/foundation -p TestObjCMethodsNSArray.py -- Exit Code: -6

Hide Details

Command Output (stdout): -- lldb version 11.0.99 clang revision 7ad36491cadee1ed91e18215c30328a3d5c104f9 llvm revision 7ad36491cadee1ed91e18215c30328a3d5c104f9

Hide Details

-- Command Output (stderr): -- Assertion failed: (tokenKind == tok::kw___bridge_retain), function ParseParenExpression, file /Users/buildslave/jenkins/workspace/lldb-cmake-sanitized/llvm-project/clang/lib/Parse/ParseExpr.cpp, line 2804.

Hide Details

--

Hide Details

******************** PASS: lldb-unit :: UnwindAssembly/x86/./UnwindAssemblyx86Tests/Testx86AssemblyInspectionEngine.TestSpillRegToStackViaMOVi386 (1783 of 2028) UNSUPPORTED: lldb-shell :: SymbolFile/PDB/variables-locations.test (1784 of 2028) FAIL: lldb-api :: lang/objc/objc-class-method/TestObjCClassMethod.py (1785 of 2028) ******************** TEST 'lldb-api :: lang/objc/objc-class-method/TestObjCClassMethod.py' FAILED ******************** Script: -- /Users/buildslave/jenkins/workspace/lldb-cmake-sanitized/lldb-build/lldb-test-build.noindex/copied-system-python /Users/buildslave/jenkins/workspace/lldb-cmake-sanitized/llvm-project/lldb/test/API/dotest.py --arch x86_64 -s /Users/buildslave/jenkins/workspace/lldb-cmake-sanitized/lldb-build/lldb-test-traces -S nm -u CXXFLAGS -u CFLAGS --codesign-identity lldb_codesign --server /Users/buildslave/jenkins/workspace/lldb-cmake-sanitized/lldb-build/./bin/debugserver --arch x86_64 --build-dir /Users/buildslave/jenkins/workspace/lldb-cmake-sanitized/lldb-build/lldb-test-build.noindex -s=/Users/buildslave/jenkins/workspace/lldb-cmake-sanitized/test/logs -t --env TERM=vt100 --env LLVM_LIBS_DIR=/Users/buildslave/jenkins/workspace/lldb-cmake-sanitized/lldb-build/./lib --inferior-env ASAN_OPTIONS=detect_stack_use_after_return=1 --inferior-env DYLD_INSERT_LIBRARIES=/Users/buildslave/jenkins/workspace/lldb-cmake-sanitized/host-compiler/lib/clang/11.0.0/lib/darwin/libclang_rt.asan_osx_dynamic.dylib --build-dir /Users/buildslave/jenkins/workspace/lldb-cmake-sanitized/lldb-build/lldb-test-build.noindex --lldb-module-cache-dir /Users/buildslave/jenkins/workspace/lldb-cmake-sanitized/lldb-build/lldb-test-build.noindex/module-cache-lldb/lldb-api --clang-module-cache-dir /Users/buildslave/jenkins/workspace/lldb-cmake-sanitized/lldb-build/lldb-test-build.noindex/module-cache-clang/lldb-api --executable /Users/buildslave/jenkins/workspace/lldb-cmake-sanitized/lldb-build/./bin/lldb --compiler /Users/buildslave/jenkins/workspace/lldb-cmake-sanitized/lldb-build/./bin/clang --dsymutil /Users/buildslave/jenkins/workspace/lldb-cmake-sanitized/lldb-build/./bin/dsymutil --filecheck /Users/buildslave/jenkins/workspace/lldb-cmake-sanitized/lldb-build/./bin/FileCheck --lldb-libs-dir /Users/buildslave/jenkins/workspace/lldb-cmake-sanitized/lldb-build/./lib /Users/buildslave/jenkins/workspace/lldb-cmake-sanitized/llvm-project/lldb/test/API/lang/objc/objc-class-method -p TestObjCClassMethod.py -- Exit Code: -6

Hide Details

Command Output (stdout): -- lldb version 11.0.99 clang revision 7ad36491cadee1ed91e18215c30328a3d5c104f9 llvm revision 7ad36491cadee1ed91e18215c30328a3d5c104f9

Hide Details

-- Command Output (stderr): -- Assertion failed: (tokenKind == tok::kw___bridge_retain), function ParseParenExpression, file /Users/buildslave/jenkins/workspace/lldb-cmake-sanitized/llvm-project/clang/lib/Parse/ParseExpr.cpp, line 2804.

Hide Details

--

Hide Details

******************** PASS: lldb-api :: functionalities/inferior-crashing/TestInferiorCrashing.py (1786 of 2028) PASS: lldb-api :: commands/watchpoints/step_over_watchpoint/TestStepOverWatchpoint.py (1787 of 2028) PASS: lldb-api :: commands/expression/unwind_expression/TestUnwindExpression.py (1788 of 2028) PASS: lldb-api :: functionalities/unwind/sigtramp/TestSigtrampUnwind.py (1789 of 2028) PASS: lldb-unit :: Utility/./UtilityTests/StringListTest.InsertStringAtIndexOutOfBounds (1790 of 2028) PASS: lldb-api :: functionalities/data-formatter/data-formatter-stl/libcxx/set/TestDataFormatterLibcxxSet.py (1791 of 2028) PASS: lldb-unit :: Utility/./UtilityTests/SerializationRountripTest.SerializeDeserializeCStringNull (1792 of 2028) PASS: lldb-api :: lang/c/bitfields/TestBitfields.py (1793 of 2028) PASS: lldb-unit :: Utility/./UtilityTests/StringListTest.DefaultConstructor (1794 of 2028) PASS: lldb-unit :: Utility/./UtilityTests/StreamTeeTest.Flush (1795 of 2028) PASS: lldb-unit :: Host/./HostTests/HostInfoTest.GetAugmentedArchSpec (1796 of 2028) UNSUPPORTED: lldb-api :: benchmarks/continue/TestBenchmarkContinue.py (1797 of 2028) FAIL: lldb-api :: functionalities/data-formatter/synthupdate/TestSyntheticFilterRecompute.py (1798 of 2028) ******************** TEST 'lldb-api :: functionalities/data-formatter/synthupdate/TestSyntheticFilterRecompute.py' FAILED ******************** Script: -- /Users/buildslave/jenkins/workspace/lldb-cmake-sanitized/lldb-build/lldb-test-build.noindex/copied-system-python /Users/buildslave/jenkins/workspace/lldb-cmake-sanitized/llvm-project/lldb/test/API/dotest.py --arch x86_64 -s /Users/buildslave/jenkins/workspace/lldb-cmake-sanitized/lldb-build/lldb-test-traces -S nm -u CXXFLAGS -u CFLAGS --codesign-identity lldb_codesign --server /Users/buildslave/jenkins/workspace/lldb-cmake-sanitized/lldb-build/./bin/debugserver --arch x86_64 --build-dir /Users/buildslave/jenkins/workspace/lldb-cmake-sanitized/lldb-build/lldb-test-build.noindex -s=/Users/buildslave/jenkins/workspace/lldb-cmake-sanitized/test/logs -t --env TERM=vt100 --env LLVM_LIBS_DIR=/Users/buildslave/jenkins/workspace/lldb-cmake-sanitized/lldb-build/./lib --inferior-env ASAN_OPTIONS=detect_stack_use_after_return=1 --inferior-env DYLD_INSERT_LIBRARIES=/Users/buildslave/jenkins/workspace/lldb-cmake-sanitized/host-compiler/lib/clang/11.0.0/lib/darwin/libclang_rt.asan_osx_dynamic.dylib --build-dir /Users/buildslave/jenkins/workspace/lldb-cmake-sanitized/lldb-build/lldb-test-build.noindex --lldb-module-cache-dir /Users/buildslave/jenkins/workspace/lldb-cmake-sanitized/lldb-build/lldb-test-build.noindex/module-cache-lldb/lldb-api --clang-module-cache-dir /Users/buildslave/jenkins/workspace/lldb-cmake-sanitized/lldb-build/lldb-test-build.noindex/module-cache-clang/lldb-api --executable /Users/buildslave/jenkins/workspace/lldb-cmake-sanitized/lldb-build/./bin/lldb --compiler /Users/buildslave/jenkins/workspace/lldb-cmake-sanitized/lldb-build/./bin/clang --dsymutil /Users/buildslave/jenkins/workspace/lldb-cmake-sanitized/lldb-build/./bin/dsymutil --filecheck /Users/buildslave/jenkins/workspace/lldb-cmake-sanitized/lldb-build/./bin/FileCheck --lldb-libs-dir /Users/buildslave/jenkins/workspace/lldb-cmake-sanitized/lldb-build/./lib /Users/buildslave/jenkins/workspace/lldb-cmake-sanitized/llvm-project/lldb/test/API/functionalities/data-formatter/synthupdate -p TestSyntheticFilterRecompute.py -- Exit Code: -6

Hide Details

Command Output (stdout): -- lldb version 11.0.99 clang revision 7ad36491cadee1ed91e18215c30328a3d5c104f9 llvm revision 7ad36491cadee1ed91e18215c30328a3d5c104f9

Hide Details

-- Command Output (stderr): --

Hide Details

Session logs for test failures/errors/unexpected successes will go into directory '/Users/buildslave/jenkins/workspace/lldb-cmake-sanitized/test/logs' Command invoked: /Users/buildslave/jenkins/workspace/lldb-cmake-sanitized/llvm-project/lldb/test/API/dotest.py --arch x86_64 -s /Users/buildslave/jenkins/workspace/lldb-cmake-sanitized/lldb-build/lldb-test-traces -S nm -u CXXFLAGS -u CFLAGS --codesign-identity lldb_codesign --server /Users/buildslave/jenkins/workspace/lldb-cmake-sanitized/lldb-build/./bin/debugserver --arch x86_64 --build-dir /Users/buildslave/jenkins/workspace/lldb-cmake-sanitized/lldb-build/lldb-test-build.noindex -s=/Users/buildslave/jenkins/workspace/lldb-cmake-sanitized/test/logs -t --env TERM=vt100 --env LLVM_LIBS_DIR=/Users/buildslave/jenkins/workspace/lldb-cmake-sanitized/lldb-build/./lib --inferior-env ASAN_OPTIONS=detect_stack_use_after_return=1 --inferior-env DYLD_INSERT_LIBRARIES=/Users/buildslave/jenkins/workspace/lldb-cmake-sanitized/host-compiler/lib/clang/11.0.0/lib/darwin/libclang_rt.asan_osx_dynamic.dylib --build-dir /Users/buildslave/jenkins/workspace/lldb-cmake-sanitized/lldb-build/lldb-test-build.noindex --lldb-module-cache-dir /Users/buildslave/jenkins/workspace/lldb-cmake-sanitized/lldb-build/lldb-test-build.noindex/module-cache-lldb/lldb-api --clang-module-cache-dir /Users/buildslave/jenkins/workspace/lldb-cmake-sanitized/lldb-build/lldb-test-build.noindex/module-cache-clang/lldb-api --executable /Users/buildslave/jenkins/workspace/lldb-cmake-sanitized/lldb-build/./bin/lldb --compiler /Users/buildslave/jenkins/workspace/lldb-cmake-sanitized/lldb-build/./bin/clang --dsymutil /Users/buildslave/jenkins/workspace/lldb-cmake-sanitized/lldb-build/./bin/dsymutil --filecheck /Users/buildslave/jenkins/workspace/lldb-cmake-sanitized/lldb-build/./bin/FileCheck --lldb-libs-dir /Users/buildslave/jenkins/workspace/lldb-cmake-sanitized/lldb-build/./lib /Users/buildslave/jenkins/workspace/lldb-cmake-sanitized/llvm-project/lldb/test/API/functionalities/data-formatter/synthupdate -p TestSyntheticFilterRecompute.py Change dir to: /Users/buildslave/jenkins/workspace/lldb-cmake-sanitized/llvm-project/lldb/test/API/functionalities/data-formatter/synthupdate runCmd: settings clear -all output:

Hide Details

runCmd: settings set symbols.enable-external-lookup false output:

Hide Details

runCmd: settings set target.auto-apply-fixits false output:

Hide Details

runCmd: settings set plugin.process.gdb-remote.packet-timeout 60 output:

Hide Details

runCmd: settings set symbols.clang-modules-cache-path "/Users/buildslave/jenkins/workspace/lldb-cmake-sanitized/lldb-build/lldb-test-build.noindex/module-cache-lldb/lldb-api" output:

Hide Details

runCmd: settings set use-color false output:

Hide Details

runCmd: setting set target.prefer-dynamic-value no-dynamic-values output:

Hide Details

runCmd: settings set target.env-vars ASAN_OPTIONS=detect_stack_use_after_return=1 DYLD_INSERT_LIBRARIES=/Users/buildslave/jenkins/workspace/lldb-cmake-sanitized/host-compiler/lib/clang/11.0.0/lib/darwin/libclang_rt.asan_osx_dynamic.dylib output:

Hide Details

runCmd: file /Users/buildslave/jenkins/workspace/lldb-cmake-sanitized/lldb-build/lldb-test-build.noindex/functionalities/data-formatter/synthupdate/TestSyntheticFilterRecompute.test_rdar12437442_with_run_command_dsym/a.out output: Current executable set to '/Users/buildslave/jenkins/workspace/lldb-cmake-sanitized/lldb-build/lldb-test-build.noindex/functionalities/data-formatter/synthupdate/TestSyntheticFilterRecompute.test_rdar12437442_with_run_command_dsym/a.out' (x86_64).

Hide Details

Hide Details

runCmd: breakpoint set -f "main.m" -l 11 output: Breakpoint 1: where = a.out`main + 722 at main.m:11:9, address = 0x0000000100000ec2

Hide Details

Hide Details

Expecting pattern: ^Breakpoint (?P<bpno>[0-9]+): (?P<num_locations>[0-9]+) locations\.$ Not matched

Hide Details

Expecting pattern: ^Breakpoint (?P<bpno>[0-9]+): (?P<num_locations>no) locations \(pending\)\. Not matched

Hide Details

Expecting pattern: ^Breakpoint (?P<bpno>[0-9]+): where = (?P<module>.*)`(?P<symbol>[+\-]{0,1}[^+]+)( \+ (?P<offset>[0-9]+)){0,1}( \[inlined\] (?P<inline_symbol>.*)){0,1} at (?P<file>[^:]+):(?P<line_no>[0-9]+)(?P<column>(:[0-9]+)?), address = (?P<address>0x[0-9a-fA-F]+)$ Matched

Hide Details

runCmd: run output: Process 31019 stopped * thread #1, queue = 'com.apple.main-thread', stop reason = breakpoint 1.1 frame #0: 0x0000000100000ec2 a.out`main(argc=1, argv=0x00007ffeefbff428) at main.m:11:9 8 NSArray* foo = [NSArray arrayWithObjects:@1,@2,@3,@4,@5, nil]; 9 NSDictionary *bar = @{@1 : @"one",@2 : @"two", @3 : @"three", @4 : @"four", @5 : @"five", @6 : @"six", @7 : @"seven"}; 10 id x = foo; -> 11 x = bar; // Set break point at this line. ^ 12 13 [pool drain]; 14 return 0;

Hide Details

Process 31019 launched: '/Users/buildslave/jenkins/workspace/lldb-cmake-sanitized/lldb-build/lldb-test-build.noindex/functionalities/data-formatter/synthupdate/TestSyntheticFilterRecompute.test_rdar12437442_with_run_command_dsym/a.out' (x86_64)

Hide Details

Hide Details

runCmd: thread list output: Process 31019 stopped * thread #1: tid = 0x18ae7e, 0x0000000100000ec2 a.out`main(argc=1, argv=0x00007ffeefbff428) at main.m:11:9, queue = 'com.apple.main-thread', stop reason = breakpoint 1.1

Hide Details

Hide Details

Expecting sub string: stopped Matched

Hide Details

Expecting sub string: stop reason = breakpoint Matched

Hide Details

Adding tearDown hook: def cleanup(): self.runCmd('type format clear', check=False) self.runCmd('type summary clear', check=False) self.runCmd('type synth clear', check=False)

Hide Details

Hide Details

runCmd: expr --dynamic-type run-target --ptr-depth 1 -- x output: (__NSArrayI *) $0 = 0x00006060000087e0 @"5 elements" { [0] = 0xb7d6a64c7c606811 (int)1 [1] = 0xb7d6a64c7c606b11 (int)2 [2] = 0xb7d6a64c7c606a11 (int)3 [3] = 0xb7d6a64c7c606d11 (int)4 [4] = 0xb7d6a64c7c606c11 (int)5 }

Hide Details

Hide Details

runCmd: next output: Process 31019 stopped * thread #1, queue = 'com.apple.main-thread', stop reason = step over frame #0: 0x0000000100000ed0 a.out`main(argc=1, argv=0x00007ffeefbff428) at main.m:13:6 10 id x = foo; 11 x = bar; // Set break point at this line. 12 -> 13 [pool drain]; ^ 14 return 0; 15 } 16

Hide Details

Hide Details

Hide Details

runCmd: frame select 0 output: frame #0: 0x0000000100000ed0 a.out`main(argc=1, argv=0x00007ffeefbff428) at main.m:13:6 10 id x = foo; 11 x = bar; // Set break point at this line. 12 -> 13 [pool drain]; ^ 14 return 0; 15 } 16

Hide Details

Hide Details

runCmd: expr --dynamic-type run-target --ptr-depth 1 -- x output: (__NSDictionaryI *) $1 = 0x0000611000002980 7 key/value pairs { [0] = { key = 0xb7d6a64c7c606c11 (int)5 value = 0x00000001000010b0 @"five" } [1] = { key = 0xb7d6a64c7c606811 (int)1 value = 0x0000000100001030 @"one" } [2] = { key = 0xb7d6a64c7c606f11 (int)6 value = 0x00000001000010d0 @"six" } [3] = { key = 0xb7d6a64c7c606b11 (int)2 value = 0x0000000100001050 @"two" } [4] = { key = 0xb7d6a64c7c606e11 (int)7 value = 0x00000001000010f0 @"seven" } [5] = { key = 0xb7d6a64c7c606a11 (int)3 value = 0x0000000100001070 @"three" } [6] = { key = 0xb7d6a64c7c606d11 (int)4 value = 0x0000000100001090 @"four" } }

Hide Details

Hide Details

<bound method SBProcess.Kill of <lldb.SBProcess; proxy of <Swig Object of type 'lldb::SBProcess *' at 0x10b567990> >>: success

Hide Details

Executing tearDown hook: def cleanup(): self.runCmd('type format clear', check=False) self.runCmd('type summary clear', check=False) self.runCmd('type synth clear', check=False)

Hide Details

Hide Details

runCmd: type format clear check of return status not required output:

Hide Details

runCmd: type summary clear check of return status not required output:

Hide Details

runCmd: type synth clear check of return status not required output:

Hide Details

PASS: LLDB (/Users/buildslave/jenkins/workspace/lldb-cmake-sanitized/lldb-build/bin/clang-11-x86_64) :: test_rdar12437442_with_run_command_dsym (TestSyntheticFilterRecompute.SyntheticFilterRecomputingTestCase) runCmd: settings clear -all output:

Hide Details

runCmd: settings set symbols.enable-external-lookup false output:

Hide Details

runCmd: settings set target.auto-apply-fixits false output:

Hide Details

runCmd: settings set plugin.process.gdb-remote.packet-timeout 60 output: Assertion failed: (tokenKind == tok::kw___bridge_retain), function ParseParenExpression, file /Users/buildslave/jenkins/workspace/lldb-cmake-sanitized/llvm-project/clang/lib/Parse/ParseExpr.cpp, line 2804.

Hide Details

--

Hide Details

******************** PASS: lldb-unit :: Utility/./UtilityTests/PassiveReplayTest.InstrumentedBarRef (1799 of 2028) PASS: lldb-unit :: Host/./HostTests/NativeProcessProtocolTest.SetBreakpointFailWrite (1800 of 2028) PASS: lldb-api :: tools/lldb-vscode/breakpoint/TestVSCode_setFunctionBreakpoints.py (1801 of 2028) PASS: lldb-unit :: Utility/./UtilityTests/StringExtractorTest.DecodeHexU8_Exact (1802 of 2028) PASS: lldb-api :: functionalities/unwind/noreturn/module-end/TestNoReturnModuleEnd.py (1803 of 2028) PASS: lldb-unit :: Utility/./UtilityTests/ArgsTest.GetQuotedCommandString (1804 of 2028) PASS: lldb-unit :: Utility/./UtilityTests/UriParserTest.BracketedHostnameWithColon (1805 of 2028) PASS: lldb-unit :: Process/gdb-remote/./ProcessGdbRemoteTests/GDBRemoteCommunicationServerTest.SendErrorResponse_ErrorNumber (1806 of 2028) PASS: lldb-unit :: Utility/./UtilityTests/UriParserTest.LongPath (1807 of 2028) PASS: lldb-unit :: Utility/./UtilityTests/StringListTest.GetMaxStringLengthDecreasingSize (1808 of 2028) PASS: lldb-api :: lang/objc/objc-builtin-types/TestObjCBuiltinTypes.py (1809 of 2028) PASS: lldb-api :: functionalities/gdb_remote_client/TestNestedRegDefinitions.py (1810 of 2028) PASS: lldb-unit :: Interpreter/./InterpreterTests/OptionArgParserTest.toBoolean (1811 of 2028) PASS: lldb-unit :: Expression/./ExpressionTests/DiagnosticManagerTest.AppendMessageNoDiag (1812 of 2028) PASS: lldb-unit :: Host/./HostTests/HostInfoTest.GetHostname (1813 of 2028) PASS: lldb-api :: python_api/watchpoint/watchlocation/TestSetWatchlocation.py (1814 of 2028) UNSUPPORTED: lldb-api :: tools/lldb-server/thread-name/TestGdbRemoteThreadName.py (1815 of 2028) PASS: lldb-api :: functionalities/conditional_break/TestConditionalBreak.py (1816 of 2028) UNSUPPORTED: lldb-shell :: Register/x86-64-ymm16-read.test (1817 of 2028) PASS: lldb-unit :: Utility/./UtilityTests/FileSpecTest.PrependPathComponent (1818 of 2028) UNSUPPORTED: lldb-api :: benchmarks/expression/TestExpressionCmd.py (1819 of 2028) PASS: lldb-unit :: Utility/./UtilityTests/StreamTeeTest.SetStreamAtIndexOverwrite (1820 of 2028) PASS: lldb-unit :: Utility/./UtilityTests/StreamTest.SetIndentLevel (1821 of 2028) PASS: lldb-unit :: Utility/./UtilityTests/ArgsTest.TestSingleArgWithQuotedSpace (1822 of 2028) PASS: lldb-unit :: Utility/./UtilityTests/StringListTest.GetMaxStringLengthEmpty (1823 of 2028) PASS: lldb-unit :: Utility/./UtilityTests/StreamTest.PutHex32ByteOrderBig (1824 of 2028) PASS: lldb-api :: lang/cpp/template/TestTemplateArgs.py (1825 of 2028) PASS: lldb-api :: functionalities/data-formatter/data-formatter-skip-summary/TestDataFormatterSkipSummary.py (1826 of 2028) PASS: lldb-api :: lang/cpp/type_lookup/TestCppTypeLookup.py (1827 of 2028) PASS: lldb-unit :: Expression/./ExpressionTests/CppModuleConfigurationTest.UnrelatedLibrary (1828 of 2028) UNSUPPORTED: lldb-shell :: Register/x86-64-ymm16-write.test (1829 of 2028) UNSUPPORTED: lldb-api :: commands/watchpoints/multi_watchpoint_slots/TestWatchpointMultipleSlots.py (1830 of 2028) PASS: lldb-shell :: Commands/command-thread-select.test (1831 of 2028) PASS: lldb-shell :: Reproducer/TestDSYM.test (1832 of 2028) UNSUPPORTED: lldb-api :: lang/objc/foundation/TestFoundationDisassembly.py (1833 of 2028) PASS: lldb-unit :: Utility/./UtilityTests/ArgsTest.TestTrailingBackslash (1834 of 2028) PASS: lldb-api :: commands/expression/test/TestExprs2.py (1835 of 2028) PASS: lldb-unit :: ScriptInterpreter/Python/./ScriptInterpreterPythonTests/PythonDataObjectsTest.TestPythonCallableCheck (1836 of 2028) PASS: lldb-unit :: ScriptInterpreter/Python/./ScriptInterpreterPythonTests/PythonDataObjectsTest.TestPythonDictionaryManipulation (1837 of 2028) UNSUPPORTED: lldb-api :: functionalities/thread/state/TestThreadStates.py (1838 of 2028) UNSUPPORTED: lldb-shell :: Register/x86-gp-read.test (1839 of 2028) PASS: lldb-unit :: ObjectFile/Breakpad/./ObjectFileBreakpadTests/StackWinRecord.parse (1840 of 2028) PASS: lldb-api :: functionalities/thread/concurrent_events/TestConcurrentWatchBreak.py (1841 of 2028) PASS: lldb-api :: commands/register/register/register_command/TestRegisters.py (1842 of 2028) PASS: lldb-unit :: Utility/./UtilityTests/StreamTest.PutPtr (1843 of 2028) PASS: lldb-shell :: ObjectFile/PECOFF/uuid.yaml (1844 of 2028) PASS: lldb-unit :: Utility/./UtilityTests/GeneratorTest.Get (1845 of 2028) PASS: lldb-api :: python_api/symbol-context/two-files/TestSymbolContextTwoFiles.py (1846 of 2028) PASS: lldb-api :: functionalities/wrong_commands/TestWrongCommands.py (1847 of 2028) PASS: lldb-api :: functionalities/breakpoint/scripted_bkpt/TestScriptedResolver.py (1848 of 2028) PASS: lldb-api :: functionalities/data-formatter/data-formatter-synth/TestDataFormatterSynth.py (1849 of 2028) PASS: lldb-unit :: Utility/./UtilityTests/BinaryStreamTest.PutSLEB128EightBytes (1850 of 2028) FAIL: lldb-api :: lang/objc/unicode-string/TestUnicodeString.py (1851 of 2028) ******************** TEST 'lldb-api :: lang/objc/unicode-string/TestUnicodeString.py' FAILED ******************** Script: -- /Users/buildslave/jenkins/workspace/lldb-cmake-sanitized/lldb-build/lldb-test-build.noindex/copied-system-python /Users/buildslave/jenkins/workspace/lldb-cmake-sanitized/llvm-project/lldb/test/API/dotest.py --arch x86_64 -s /Users/buildslave/jenkins/workspace/lldb-cmake-sanitized/lldb-build/lldb-test-traces -S nm -u CXXFLAGS -u CFLAGS --codesign-identity lldb_codesign --server /Users/buildslave/jenkins/workspace/lldb-cmake-sanitized/lldb-build/./bin/debugserver --arch x86_64 --build-dir /Users/buildslave/jenkins/workspace/lldb-cmake-sanitized/lldb-build/lldb-test-build.noindex -s=/Users/buildslave/jenkins/workspace/lldb-cmake-sanitized/test/logs -t --env TERM=vt100 --env LLVM_LIBS_DIR=/Users/buildslave/jenkins/workspace/lldb-cmake-sanitized/lldb-build/./lib --inferior-env ASAN_OPTIONS=detect_stack_use_after_return=1 --inferior-env DYLD_INSERT_LIBRARIES=/Users/buildslave/jenkins/workspace/lldb-cmake-sanitized/host-compiler/lib/clang/11.0.0/lib/darwin/libclang_rt.asan_osx_dynamic.dylib --build-dir /Users/buildslave/jenkins/workspace/lldb-cmake-sanitized/lldb-build/lldb-test-build.noindex --lldb-module-cache-dir /Users/buildslave/jenkins/workspace/lldb-cmake-sanitized/lldb-build/lldb-test-build.noindex/module-cache-lldb/lldb-api --clang-module-cache-dir /Users/buildslave/jenkins/workspace/lldb-cmake-sanitized/lldb-build/lldb-test-build.noindex/module-cache-clang/lldb-api --executable /Users/buildslave/jenkins/workspace/lldb-cmake-sanitized/lldb-build/./bin/lldb --compiler /Users/buildslave/jenkins/workspace/lldb-cmake-sanitized/lldb-build/./bin/clang --dsymutil /Users/buildslave/jenkins/workspace/lldb-cmake-sanitized/lldb-build/./bin/dsymutil --filecheck /Users/buildslave/jenkins/workspace/lldb-cmake-sanitized/lldb-build/./bin/FileCheck --lldb-libs-dir /Users/buildslave/jenkins/workspace/lldb-cmake-sanitized/lldb-build/./lib /Users/buildslave/jenkins/workspace/lldb-cmake-sanitized/llvm-project/lldb/test/API/lang/objc/unicode-string -p TestUnicodeString.py -- Exit Code: -6

Hide Details

Command Output (stdout): -- lldb version 11.0.99 clang revision 7ad36491cadee1ed91e18215c30328a3d5c104f9 llvm revision 7ad36491cadee1ed91e18215c30328a3d5c104f9

Hide Details

-- Command Output (stderr): -- Assertion failed: (tokenKind == tok::kw___bridge_retain), function ParseParenExpression, file /Users/buildslave/jenkins/workspace/lldb-cmake-sanitized/llvm-project/clang/lib/Parse/ParseExpr.cpp, line 2804.

Hide Details

--

Hide Details

******************** PASS: lldb-shell :: SymbolFile/NativePDB/globals-bss.cpp (1852 of 2028) PASS: lldb-shell :: Quit/TestQuitExitCode30.test (1853 of 2028) PASS: lldb-unit :: UnwindAssembly/x86/./UnwindAssemblyx86Tests/Testx86AssemblyInspectionEngine.Testi386IgnoredRegisters (1854 of 2028) PASS: lldb-unit :: Utility/./UtilityTests/SubsystemRAIITest.NormalSubsystem (1855 of 2028) PASS: lldb-unit :: Core/./LLDBCoreTests/RichManglingContextTest.Basic (1856 of 2028) PASS: lldb-unit :: Process/gdb-remote/./ProcessGdbRemoteTests/GDBRemoteCommunicationClientTest.GetModulesInfo (1857 of 2028) PASS: lldb-shell :: SymbolFile/DWARF/debug_ranges.s (1858 of 2028) PASS: lldb-unit :: tools/lldb-server/tests/./LLDBServerTests/StandardStartupTest.TestStopReplyContainsThreadPcs (1859 of 2028) PASS: lldb-unit :: Utility/./UtilityTests/RecordReplayTest.InstrumentedBarPtr (1860 of 2028) PASS: lldb-api :: commands/expression/char/TestExprsChar.py (1861 of 2028) PASS: lldb-unit :: Utility/./UtilityTests/StreamTest.PutRawBytesToBigEndian (1862 of 2028) PASS: lldb-shell :: SymbolFile/DWARF/debug-line-basic.s (1863 of 2028) PASS: lldb-api :: python_api/symbol-context/TestSymbolContext.py (1864 of 2028) PASS: lldb-api :: commands/frame/diagnose/local-variable/TestLocalVariable.py (1865 of 2028) PASS: lldb-unit :: Host/./HostTests/NativeProcessProtocolTest.ReadCStringFromMemory (1866 of 2028) PASS: lldb-api :: lang/cpp/class-template-parameter-pack/TestClassTemplateParameterPack.py (1867 of 2028) PASS: lldb-api :: lang/cpp/unique-types/TestUniqueTypes.py (1868 of 2028) PASS: lldb-api :: functionalities/data-formatter/language_category_updates/TestDataFormatterLanguageCategoryUpdates.py (1869 of 2028) PASS: lldb-unit :: Host/./HostTests/Host.GetEnvironment (1870 of 2028) PASS: lldb-unit :: Utility/./UtilityTests/StreamTest.PutNHex8 (1871 of 2028) PASS: lldb-api :: lang/c/set_values/TestSetValues.py (1872 of 2028) PASS: lldb-api :: commands/expression/fixits/TestFixIts.py (1873 of 2028) PASS: lldb-unit :: Process/gdb-remote/./ProcessGdbRemoteTests/GDBRemoteCommunicationClientTest.SyncThreadState (1874 of 2028) PASS: lldb-unit :: Symbol/./SymbolTests/DWARFCallFrameInfoTest.Basic_dwarf3 (1875 of 2028) PASS: lldb-unit :: Process/minidump/./LLDBMinidumpTests/MinidumpParserTest.GetThreadContext_x86_32 (1876 of 2028) PASS: lldb-api :: functionalities/thread/concurrent_events/TestConcurrentCrashWithWatchpoint.py (1877 of 2028) PASS: lldb-unit :: Utility/./UtilityTests/ProcessInstanceInfo.Dump (1878 of 2028) PASS: lldb-unit :: ObjectFile/ELF/./ObjectFileELFTests/ObjectFileELFTest.GetModuleSpecifications_EarlySectionHeaders (1879 of 2028) PASS: lldb-api :: commands/expression/call-function/TestCallStdStringFunction.py (1880 of 2028) PASS: lldb-api :: lang/c/conflicting-symbol/TestConflictingSymbol.py (1881 of 2028) PASS: lldb-unit :: ScriptInterpreter/Python/./ScriptInterpreterPythonTests/PythonDataObjectsTest.TestObjectAttributes (1882 of 2028) PASS: lldb-api :: commands/watchpoints/watchpoint_set_command/TestWatchLocationWithWatchSet.py (1883 of 2028) UNSUPPORTED: lldb-shell :: SymbolFile/PDB/enums-layout.test (1884 of 2028) FAIL: lldb-api :: commands/expression/import_builtin_fileid/TestImportBuiltinFileID.py (1885 of 2028) ******************** TEST 'lldb-api :: commands/expression/import_builtin_fileid/TestImportBuiltinFileID.py' FAILED ******************** Script: -- /Users/buildslave/jenkins/workspace/lldb-cmake-sanitized/lldb-build/lldb-test-build.noindex/copied-system-python /Users/buildslave/jenkins/workspace/lldb-cmake-sanitized/llvm-project/lldb/test/API/dotest.py --arch x86_64 -s /Users/buildslave/jenkins/workspace/lldb-cmake-sanitized/lldb-build/lldb-test-traces -S nm -u CXXFLAGS -u CFLAGS --codesign-identity lldb_codesign --server /Users/buildslave/jenkins/workspace/lldb-cmake-sanitized/lldb-build/./bin/debugserver --arch x86_64 --build-dir /Users/buildslave/jenkins/workspace/lldb-cmake-sanitized/lldb-build/lldb-test-build.noindex -s=/Users/buildslave/jenkins/workspace/lldb-cmake-sanitized/test/logs -t --env TERM=vt100 --env LLVM_LIBS_DIR=/Users/buildslave/jenkins/workspace/lldb-cmake-sanitized/lldb-build/./lib --inferior-env ASAN_OPTIONS=detect_stack_use_after_return=1 --inferior-env DYLD_INSERT_LIBRARIES=/Users/buildslave/jenkins/workspace/lldb-cmake-sanitized/host-compiler/lib/clang/11.0.0/lib/darwin/libclang_rt.asan_osx_dynamic.dylib --build-dir /Users/buildslave/jenkins/workspace/lldb-cmake-sanitized/lldb-build/lldb-test-build.noindex --lldb-module-cache-dir /Users/buildslave/jenkins/workspace/lldb-cmake-sanitized/lldb-build/lldb-test-build.noindex/module-cache-lldb/lldb-api --clang-module-cache-dir /Users/buildslave/jenkins/workspace/lldb-cmake-sanitized/lldb-build/lldb-test-build.noindex/module-cache-clang/lldb-api --executable /Users/buildslave/jenkins/workspace/lldb-cmake-sanitized/lldb-build/./bin/lldb --compiler /Users/buildslave/jenkins/workspace/lldb-cmake-sanitized/lldb-build/./bin/clang --dsymutil /Users/buildslave/jenkins/workspace/lldb-cmake-sanitized/lldb-build/./bin/dsymutil --filecheck /Users/buildslave/jenkins/workspace/lldb-cmake-sanitized/lldb-build/./bin/FileCheck --lldb-libs-dir /Users/buildslave/jenkins/workspace/lldb-cmake-sanitized/lldb-build/./lib /Users/buildslave/jenkins/workspace/lldb-cmake-sanitized/llvm-project/lldb/test/API/commands/expression/import_builtin_fileid -p TestImportBuiltinFileID.py -- Exit Code: -6

Hide Details

Command Output (stdout): -- lldb version 11.0.99 clang revision 7ad36491cadee1ed91e18215c30328a3d5c104f9 llvm revision 7ad36491cadee1ed91e18215c30328a3d5c104f9

Hide Details

-- Command Output (stderr): -- Assertion failed: (tokenKind == tok::kw___bridge_retain), function ParseParenExpression, file /Users/buildslave/jenkins/workspace/lldb-cmake-sanitized/llvm-project/clang/lib/Parse/ParseExpr.cpp, line 2804.

Hide Details

--

Hide Details

******************** PASS: lldb-unit :: ScriptInterpreter/Python/./ScriptInterpreterPythonTests/PythonDataObjectsTest.TestGlobalNameResolutionWithDot (1886 of 2028) PASS: lldb-unit :: Utility/./UtilityTests/ArgsTest.DoubleQuotedItem (1887 of 2028) FAIL: lldb-api :: lang/objc/conflicting-definition/TestConflictingDefinition.py (1888 of 2028) ******************** TEST 'lldb-api :: lang/objc/conflicting-definition/TestConflictingDefinition.py' FAILED ******************** Script: -- /Users/buildslave/jenkins/workspace/lldb-cmake-sanitized/lldb-build/lldb-test-build.noindex/copied-system-python /Users/buildslave/jenkins/workspace/lldb-cmake-sanitized/llvm-project/lldb/test/API/dotest.py --arch x86_64 -s /Users/buildslave/jenkins/workspace/lldb-cmake-sanitized/lldb-build/lldb-test-traces -S nm -u CXXFLAGS -u CFLAGS --codesign-identity lldb_codesign --server /Users/buildslave/jenkins/workspace/lldb-cmake-sanitized/lldb-build/./bin/debugserver --arch x86_64 --build-dir /Users/buildslave/jenkins/workspace/lldb-cmake-sanitized/lldb-build/lldb-test-build.noindex -s=/Users/buildslave/jenkins/workspace/lldb-cmake-sanitized/test/logs -t --env TERM=vt100 --env LLVM_LIBS_DIR=/Users/buildslave/jenkins/workspace/lldb-cmake-sanitized/lldb-build/./lib --inferior-env ASAN_OPTIONS=detect_stack_use_after_return=1 --inferior-env DYLD_INSERT_LIBRARIES=/Users/buildslave/jenkins/workspace/lldb-cmake-sanitized/host-compiler/lib/clang/11.0.0/lib/darwin/libclang_rt.asan_osx_dynamic.dylib --build-dir /Users/buildslave/jenkins/workspace/lldb-cmake-sanitized/lldb-build/lldb-test-build.noindex --lldb-module-cache-dir /Users/buildslave/jenkins/workspace/lldb-cmake-sanitized/lldb-build/lldb-test-build.noindex/module-cache-lldb/lldb-api --clang-module-cache-dir /Users/buildslave/jenkins/workspace/lldb-cmake-sanitized/lldb-build/lldb-test-build.noindex/module-cache-clang/lldb-api --executable /Users/buildslave/jenkins/workspace/lldb-cmake-sanitized/lldb-build/./bin/lldb --compiler /Users/buildslave/jenkins/workspace/lldb-cmake-sanitized/lldb-build/./bin/clang --dsymutil /Users/buildslave/jenkins/workspace/lldb-cmake-sanitized/lldb-build/./bin/dsymutil --filecheck /Users/buildslave/jenkins/workspace/lldb-cmake-sanitized/lldb-build/./bin/FileCheck --lldb-libs-dir /Users/buildslave/jenkins/workspace/lldb-cmake-sanitized/lldb-build/./lib /Users/buildslave/jenkins/workspace/lldb-cmake-sanitized/llvm-project/lldb/test/API/lang/objc/conflicting-definition -p TestConflictingDefinition.py -- Exit Code: -6

Hide Details

Command Output (stdout): -- lldb version 11.0.99 clang revision 7ad36491cadee1ed91e18215c30328a3d5c104f9 llvm revision 7ad36491cadee1ed91e18215c30328a3d5c104f9

Hide Details

-- Command Output (stderr): -- Assertion failed: (tokenKind == tok::kw___bridge_retain), function ParseParenExpression, file /Users/buildslave/jenkins/workspace/lldb-cmake-sanitized/llvm-project/clang/lib/Parse/ParseExpr.cpp, line 2804.

Hide Details

--

Hide Details

******************** PASS: lldb-shell :: SymbolFile/Breakpad/line-table.test (1889 of 2028) PASS: lldb-unit :: Utility/./UtilityTests/RegularExpression.Empty (1890 of 2028) PASS: lldb-api :: functionalities/postmortem/minidump-new/TestMiniDumpNew.py (1891 of 2028) PASS: lldb-api :: commands/frame/diagnose/dereference-argument/TestDiagnoseDereferenceArgument.py (1892 of 2028) PASS: lldb-unit :: Utility/./UtilityTests/OptionsWithRawTest.SingleWhitespaceInput (1893 of 2028) PASS: lldb-shell :: Unwind/thread-step-out-ret-addr-check.test (1894 of 2028) PASS: lldb-unit :: Utility/./UtilityTests/BinaryStreamTest.PutULEB128FourBytes (1895 of 2028) PASS: lldb-shell :: SymbolFile/DWARF/debug_line-relative_path.s (1896 of 2028) PASS: lldb-unit :: Utility/./UtilityTests/StreamTeeTest.Constructor1Stream (1897 of 2028) PASS: lldb-shell :: ObjectFile/ELF/section-permissions.yaml (1898 of 2028) PASS: lldb-api :: functionalities/thread/num_threads/TestNumThreads.py (1899 of 2028) PASS: lldb-api :: macosx/lc-note/kern-ver-str/TestKernVerStrLCNOTE.py (1900 of 2028) PASS: lldb-api :: lang/cpp/unsigned_types/TestUnsignedTypes.py (1901 of 2028) PASS: lldb-unit :: Host/./HostTests/FileSystemTest.EnumerateDirectory (1902 of 2028) PASS: lldb-api :: functionalities/value_md5_crash/TestValueMD5Crash.py (1903 of 2028) FAIL: lldb-api :: lang/objc/orderedset/TestOrderedSet.py (1904 of 2028) ******************** TEST 'lldb-api :: lang/objc/orderedset/TestOrderedSet.py' FAILED ******************** Script: -- /Users/buildslave/jenkins/workspace/lldb-cmake-sanitized/lldb-build/lldb-test-build.noindex/copied-system-python /Users/buildslave/jenkins/workspace/lldb-cmake-sanitized/llvm-project/lldb/test/API/dotest.py --arch x86_64 -s /Users/buildslave/jenkins/workspace/lldb-cmake-sanitized/lldb-build/lldb-test-traces -S nm -u CXXFLAGS -u CFLAGS --codesign-identity lldb_codesign --server /Users/buildslave/jenkins/workspace/lldb-cmake-sanitized/lldb-build/./bin/debugserver --arch x86_64 --build-dir /Users/buildslave/jenkins/workspace/lldb-cmake-sanitized/lldb-build/lldb-test-build.noindex -s=/Users/buildslave/jenkins/workspace/lldb-cmake-sanitized/test/logs -t --env TERM=vt100 --env LLVM_LIBS_DIR=/Users/buildslave/jenkins/workspace/lldb-cmake-sanitized/lldb-build/./lib --inferior-env ASAN_OPTIONS=detect_stack_use_after_return=1 --inferior-env DYLD_INSERT_LIBRARIES=/Users/buildslave/jenkins/workspace/lldb-cmake-sanitized/host-compiler/lib/clang/11.0.0/lib/darwin/libclang_rt.asan_osx_dynamic.dylib --build-dir /Users/buildslave/jenkins/workspace/lldb-cmake-sanitized/lldb-build/lldb-test-build.noindex --lldb-module-cache-dir /Users/buildslave/jenkins/workspace/lldb-cmake-sanitized/lldb-build/lldb-test-build.noindex/module-cache-lldb/lldb-api --clang-module-cache-dir /Users/buildslave/jenkins/workspace/lldb-cmake-sanitized/lldb-build/lldb-test-build.noindex/module-cache-clang/lldb-api --executable /Users/buildslave/jenkins/workspace/lldb-cmake-sanitized/lldb-build/./bin/lldb --compiler /Users/buildslave/jenkins/workspace/lldb-cmake-sanitized/lldb-build/./bin/clang --dsymutil /Users/buildslave/jenkins/workspace/lldb-cmake-sanitized/lldb-build/./bin/dsymutil --filecheck /Users/buildslave/jenkins/workspace/lldb-cmake-sanitized/lldb-build/./bin/FileCheck --lldb-libs-dir /Users/buildslave/jenkins/workspace/lldb-cmake-sanitized/lldb-build/./lib /Users/buildslave/jenkins/workspace/lldb-cmake-sanitized/llvm-project/lldb/test/API/lang/objc/orderedset -p TestOrderedSet.py -- Exit Code: -6

Hide Details

Command Output (stdout): -- lldb version 11.0.99 clang revision 7ad36491cadee1ed91e18215c30328a3d5c104f9 llvm revision 7ad36491cadee1ed91e18215c30328a3d5c104f9

Hide Details

-- Command Output (stderr): -- Assertion failed: (tokenKind == tok::kw___bridge_retain), function ParseParenExpression, file /Users/buildslave/jenkins/workspace/lldb-cmake-sanitized/llvm-project/clang/lib/Parse/ParseExpr.cpp, line 2804.

Hide Details

--

Hide Details

******************** PASS: lldb-api :: python_api/function_symbol/TestDisasmAPI.py (1905 of 2028) PASS: lldb-unit :: Utility/./UtilityTests/StringExtractorTest.GetHexBytesAvail_FullString (1906 of 2028) PASS: lldb-unit :: Utility/./UtilityTests/StreamTest.AddressNoSuffix (1907 of 2028) PASS: lldb-shell :: SymbolFile/DWARF/debug-types-line-tables.s (1908 of 2028) PASS: lldb-shell :: SymbolFile/DWARF/debug-types-missing-signature.test (1909 of 2028) PASS: lldb-unit :: Utility/./UtilityTests/StringExtractorTest.InitMisc (1910 of 2028) PASS: lldb-unit :: Utility/./UtilityTests/StringListTest.SetSize (1911 of 2028) PASS: lldb-api :: python_api/sbstructureddata/TestStructuredDataAPI.py (1912 of 2028) PASS: lldb-api :: functionalities/recursion/TestValueObjectRecursion.py (1913 of 2028) PASS: lldb-unit :: Utility/./UtilityTests/Flags.AllSet (1914 of 2028) PASS: lldb-api :: functionalities/memory/read/TestMemoryRead.py (1915 of 2028) PASS: lldb-api :: commands/target/create-deps/TestTargetCreateDeps.py (1916 of 2028) PASS: lldb-unit :: UnwindAssembly/x86/./UnwindAssemblyx86Tests/Testx86AssemblyInspectionEngine.Test32bitFramelessBigStackFrame (1917 of 2028) PASS: lldb-unit :: Utility/./UtilityTests/StreamTest.ChangingByteOrder (1918 of 2028) PASS: lldb-shell :: Reproducer/TestRelativePath.test (1919 of 2028) PASS: lldb-unit :: debugserver/./debugserverTests/JSON.Parse (1920 of 2028) PASS: lldb-unit :: Utility/./UtilityTests/StringLexerTest.NextIf (1921 of 2028) PASS: lldb-api :: functionalities/thread/concurrent_events/TestConcurrentNWatchNBreak.py (1922 of 2028) PASS: lldb-api :: functionalities/data-formatter/data-formatter-objc/nsstring/TestDataFormatterNSString.py (1923 of 2028) PASS: lldb-unit :: Utility/./UtilityTests/StreamTest.PutBytesAsRawHex8ToLittleEndian (1924 of 2028) PASS: lldb-unit :: ScriptInterpreter/Python/./ScriptInterpreterPythonTests/PythonDataObjectsTest.TestPythonByteArray (1925 of 2028) PASS: lldb-unit :: Host/./HostTests/MainLoopTest.Signal (1926 of 2028) PASS: lldb-unit :: Utility/./UtilityTests/ScalarTest.Equality (1927 of 2028) PASS: lldb-shell :: SymbolFile/DWARF/dwarf5-index-is-used.cpp (1928 of 2028) PASS: lldb-api :: lang/cpp/namespace/TestNamespace.py (1929 of 2028) UNSUPPORTED: lldb-api :: benchmarks/libcxxmap/TestBenchmarkLibcxxMap.py (1930 of 2028) PASS: lldb-api :: sanity/TestSettingSkipping.py (1931 of 2028) PASS: lldb-api :: functionalities/thread/concurrent_events/TestConcurrentBreakpointsDelayedBreakpointOneWatchpoint.py (1932 of 2028) PASS: lldb-api :: arm/emulation/TestEmulations.py (1933 of 2028) PASS: lldb-shell :: Minidump/dump-all.test (1934 of 2028) PASS: lldb-unit :: Expression/./ExpressionTests/DWARFExpression.DW_OP_stack_value (1935 of 2028) PASS: lldb-unit :: Host/./HostTests/FileSystemTest.MakeAbsolute (1936 of 2028) PASS: lldb-api :: lang/cpp/class_types/TestClassTypes.py (1937 of 2028) PASS: lldb-api :: functionalities/thread/concurrent_events/TestConcurrentSignalNWatchNBreak.py (1938 of 2028) PASS: lldb-unit :: Utility/./UtilityTests/BinaryStreamTest.PutSLEB128OneByte (1939 of 2028) PASS: lldb-unit :: Process/minidump/./LLDBMinidumpTests/MinidumpParserTest.GetLinuxProcStatus_no_stream (1940 of 2028) PASS: lldb-unit :: Host/./HostTests/MainLoopTest.ReadObject (1941 of 2028) PASS: lldb-api :: commands/gui/invalid-args/TestInvalidArgsGui.py (1942 of 2028) PASS: lldb-unit :: Utility/./UtilityTests/TimerTest.CategoryTimes2 (1943 of 2028) PASS: lldb-unit :: Language/Highlighting/./HighlighterTests/HighlighterTest.DefaultHighlighterWithCursorOutOfBounds (1944 of 2028) PASS: lldb-unit :: Host/./HostTests/MainLoopTest.UnmonitoredSignal (1945 of 2028) PASS: lldb-api :: functionalities/data-formatter/data-formatter-stl/libcxx/list/TestDataFormatterLibcxxList.py (1946 of 2028) PASS: lldb-api :: lang/c/find_struct_type/TestFindStructTypes.py (1947 of 2028) PASS: lldb-unit :: Utility/./UtilityTests/RangeTest.ContainsRangeStartingFromZero (1948 of 2028) PASS: lldb-unit :: Host/./HostTests/MainLoopTest.DetectsEOF (1949 of 2028) UNSUPPORTED: lldb-api :: tools/lldb-server/platform-process-connect/TestPlatformProcessConnect.py (1950 of 2028) PASS: lldb-api :: functionalities/data-formatter/data-formatter-stl/libcxx/forward_list/TestDataFormatterLibcxxForwardList.py (1951 of 2028) PASS: lldb-unit :: Expression/./ExpressionTests/CppModuleConfigurationTest.AmbiguousLibCpp (1952 of 2028) UNSUPPORTED: lldb-api :: functionalities/tsan/thread_leak/TestTsanThreadLeak.py (1953 of 2028) UNSUPPORTED: lldb-shell :: SymbolFile/dissassemble-entry-point.s (1954 of 2028) PASS: lldb-unit :: Process/gdb-remote/./ProcessGdbRemoteTests/GDBRemoteCommunicationClientTest.ReadRegister (1955 of 2028) PASS: lldb-unit :: Utility/./UtilityTests/UriParserTest.MinimalPort (1956 of 2028) PASS: lldb-unit :: Symbol/./SymbolTests/TestTypeSystemClang.TestIsClangType (1957 of 2028) PASS: lldb-api :: commands/command/history/TestCommandHistory.py (1958 of 2028) PASS: lldb-api :: commands/expression/import-std-module/vector-dbg-info-content/TestDbgInfoContentVectorFromStdModule.py (1959 of 2028) PASS: lldb-unit :: Utility/./UtilityTests/StringExtractorTest.DecodeHexU8_InvalidHex2 (1960 of 2028) PASS: lldb-unit :: Utility/./UtilityTests/StreamTest.AddressEmptyPrefix (1961 of 2028) PASS: lldb-shell :: ScriptInterpreter/None/import_module.test (1962 of 2028) PASS: lldb-api :: functionalities/data-formatter/typedef_array/TestTypedefArray.py (1963 of 2028) UNSUPPORTED: lldb-api :: arm/breakpoint-it/TestBreakpointIt.py (1964 of 2028) PASS: lldb-unit :: Language/Highlighting/./HighlighterTests/HighlighterTest.ClangTrailingBackslashBeforeNewline (1965 of 2028) PASS: lldb-shell :: Settings/TestSettingsSet.test (1966 of 2028) PASS: lldb-shell :: SymbolFile/DWARF/dwarf5-atomic.s (1967 of 2028) PASS: lldb-api :: lang/cpp/multiple-inheritance/TestCppMultipleInheritance.py (1968 of 2028) PASS: lldb-api :: functionalities/thread/concurrent_events/TestConcurrentSignalWatchBreak.py (1969 of 2028) PASS: lldb-api :: functionalities/data-formatter/data-formatter-synthtype/TestDataFormatterSynthType.py (1970 of 2028) PASS: lldb-api :: lang/cpp/operators/TestCppOperators.py (1971 of 2028) PASS: lldb-unit :: Utility/./UtilityTests/BinaryStreamTest.PutULEB128SevenBytes (1972 of 2028) PASS: lldb-unit :: Utility/./UtilityTests/ConstStringTest.CompareConstString (1973 of 2028) UNSUPPORTED: lldb-shell :: SymbolFile/PDB/variables.test (1974 of 2028) UNSUPPORTED: lldb-shell :: Expr/TestIRMemoryMapWindows.test (1975 of 2028) PASS: lldb-api :: functionalities/thread/concurrent_events/TestConcurrentSignalDelayWatch.py (1976 of 2028) PASS: lldb-api :: python_api/breakpoint/TestBreakpointAPI.py (1977 of 2028) PASS: lldb-unit :: Utility/./UtilityTests/StreamTeeTest.CopyConstructor (1978 of 2028) PASS: lldb-shell :: Process/UnsupportedLanguage.test (1979 of 2028) PASS: lldb-shell :: Reproducer/TestVersionCheck.test (1980 of 2028) PASS: lldb-api :: functionalities/thread/step_out/TestThreadStepOut.py (1981 of 2028) PASS: lldb-api :: functionalities/history/TestHistoryRecall.py (1982 of 2028) PASS: lldb-unit :: Host/./HostTests/SocketTest.TCPGetConnectURI (1983 of 2028) PASS: lldb-unit :: Expression/./ExpressionTests/CppModuleConfigurationTest.MissingLibCpp (1984 of 2028) PASS: lldb-unit :: Utility/./UtilityTests/ConstStringTest.NullAndEmptyStates (1985 of 2028) PASS: lldb-api :: functionalities/thread/concurrent_events/TestConcurrentTwoWatchpointsOneSignal.py (1986 of 2028) PASS: lldb-shell :: SymbolFile/DWARF/split-dwarf-inlining.cpp (1987 of 2028) PASS: lldb-api :: python_api/debugger/TestDebuggerAPI.py (1988 of 2028) PASS: lldb-api :: commands/watchpoints/watchpoint_size/TestWatchpointSizes.py (1989 of 2028) PASS: lldb-api :: lang/objcxx/hide-runtime-values/TestObjCXXHideRuntimeValues.py (1990 of 2028) PASS: lldb-api :: types/TestFloatTypesExpr.py (1991 of 2028) PASS: lldb-api :: tools/lldb-server/TestLldbGdbServer.py (1992 of 2028) PASS: lldb-shell :: ObjectFile/MachO/lc_build_version_notools.yaml (1993 of 2028) PASS: lldb-shell :: SymbolFile/DWARF/dwo-type-in-main-file.s (1994 of 2028) PASS: lldb-api :: commands/settings/TestSettings.py (1995 of 2028) PASS: lldb-unit :: Symbol/./SymbolTests/TestTypeSystemClang.TestGetBasicTypeFromName (1996 of 2028) UNSUPPORTED: lldb-api :: functionalities/darwin_log/filter/regex/subsystem/TestDarwinLogFilterRegexSubsystem.py (1997 of 2028) PASS: lldb-api :: functionalities/return-value/TestReturnValue.py (1998 of 2028) PASS: lldb-unit :: Utility/./UtilityTests/StringListTest.GetMaxStringLengthIncreasingSize (1999 of 2028) PASS: lldb-api :: functionalities/object-file/TestImageListMultiArchitecture.py (2000 of 2028) PASS: lldb-api :: functionalities/avoids-fd-leak/TestFdLeak.py (2001 of 2028) PASS: lldb-api :: lang/c/enum_types/TestEnumTypes.py (2002 of 2028) PASS: lldb-unit :: Process/gdb-remote/./ProcessGdbRemoteTests/GDBRemoteCommunicationClientTest.GetModulesInfo_UUID20 (2003 of 2028) PASS: lldb-unit :: Utility/./UtilityTests/UriParserTest.SchemeHostSeparator2 (2004 of 2028) PASS: lldb-unit :: Utility/./UtilityTests/ArgsTest.BareSingleQuote (2005 of 2028) PASS: lldb-unit :: Utility/./UtilityTests/CompletionRequest.ShiftArguments (2006 of 2028) UNSUPPORTED: lldb-api :: tools/intel-features/intel-pt/test/TestIntelPTSimpleBinary.py (2007 of 2028) PASS: lldb-unit :: Process/minidump/./LLDBMinidumpTests/MinidumpParserTest.GetArchitectureWindows (2008 of 2028) PASS: lldb-api :: commands/expression/persistent_types/TestPersistentTypes.py (2009 of 2028) FAIL: lldb-api :: lang/objc/print-obj/TestPrintObj.py (2010 of 2028) ******************** TEST 'lldb-api :: lang/objc/print-obj/TestPrintObj.py' FAILED ******************** Script: -- /Users/buildslave/jenkins/workspace/lldb-cmake-sanitized/lldb-build/lldb-test-build.noindex/copied-system-python /Users/buildslave/jenkins/workspace/lldb-cmake-sanitized/llvm-project/lldb/test/API/dotest.py --arch x86_64 -s /Users/buildslave/jenkins/workspace/lldb-cmake-sanitized/lldb-build/lldb-test-traces -S nm -u CXXFLAGS -u CFLAGS --codesign-identity lldb_codesign --server /Users/buildslave/jenkins/workspace/lldb-cmake-sanitized/lldb-build/./bin/debugserver --arch x86_64 --build-dir /Users/buildslave/jenkins/workspace/lldb-cmake-sanitized/lldb-build/lldb-test-build.noindex -s=/Users/buildslave/jenkins/workspace/lldb-cmake-sanitized/test/logs -t --env TERM=vt100 --env LLVM_LIBS_DIR=/Users/buildslave/jenkins/workspace/lldb-cmake-sanitized/lldb-build/./lib --inferior-env ASAN_OPTIONS=detect_stack_use_after_return=1 --inferior-env DYLD_INSERT_LIBRARIES=/Users/buildslave/jenkins/workspace/lldb-cmake-sanitized/host-compiler/lib/clang/11.0.0/lib/darwin/libclang_rt.asan_osx_dynamic.dylib --build-dir /Users/buildslave/jenkins/workspace/lldb-cmake-sanitized/lldb-build/lldb-test-build.noindex --lldb-module-cache-dir /Users/buildslave/jenkins/workspace/lldb-cmake-sanitized/lldb-build/lldb-test-build.noindex/module-cache-lldb/lldb-api --clang-module-cache-dir /Users/buildslave/jenkins/workspace/lldb-cmake-sanitized/lldb-build/lldb-test-build.noindex/module-cache-clang/lldb-api --executable /Users/buildslave/jenkins/workspace/lldb-cmake-sanitized/lldb-build/./bin/lldb --compiler /Users/buildslave/jenkins/workspace/lldb-cmake-sanitized/lldb-build/./bin/clang --dsymutil /Users/buildslave/jenkins/workspace/lldb-cmake-sanitized/lldb-build/./bin/dsymutil --filecheck /Users/buildslave/jenkins/workspace/lldb-cmake-sanitized/lldb-build/./bin/FileCheck --lldb-libs-dir /Users/buildslave/jenkins/workspace/lldb-cmake-sanitized/lldb-build/./lib /Users/buildslave/jenkins/workspace/lldb-cmake-sanitized/llvm-project/lldb/test/API/lang/objc/print-obj -p TestPrintObj.py -- Exit Code: -6

Hide Details

Command Output (stdout): -- lldb version 11.0.99 clang revision 7ad36491cadee1ed91e18215c30328a3d5c104f9 llvm revision 7ad36491cadee1ed91e18215c30328a3d5c104f9

Hide Details

-- Command Output (stderr): -- Assertion failed: (tokenKind == tok::kw___bridge_retain), function ParseParenExpression, file /Users/buildslave/jenkins/workspace/lldb-cmake-sanitized/llvm-project/clang/lib/Parse/ParseExpr.cpp, line 2804.

Hide Details

--

Hide Details

******************** PASS: lldb-unit :: Utility/./UtilityTests/FileSpecTest.Yaml (2011 of 2028) PASS: lldb-unit :: Signals/./SignalsTests/UnixSignalsTest.GetFilteredSignals (2012 of 2028) PASS: lldb-unit :: Utility/./UtilityTests/FileSpecTest.EqualSeparator (2013 of 2028) UNSUPPORTED: lldb-shell :: Reproducer/TestLuaImport.test (2014 of 2028) PASS: lldb-unit :: Utility/./UtilityTests/FileSpecTest.EqualDotsPosixRoot (2015 of 2028) PASS: lldb-api :: functionalities/thread/concurrent_events/TestConcurrentTwoBreakpointsOneWatchpoint.py (2016 of 2028) PASS: lldb-api :: functionalities/thread/concurrent_events/TestConcurrentTwoWatchpointsOneBreakpoint.py (2017 of 2028) UNSUPPORTED: lldb-api :: benchmarks/frame_variable/TestFrameVariableResponse.py (2018 of 2028) PASS: lldb-unit :: Utility/./UtilityTests/Flags.GetBitSize (2019 of 2028) PASS: lldb-unit :: Utility/./UtilityTests/StringListTest.AppendStringMove (2020 of 2028) PASS: lldb-api :: functionalities/data-formatter/data-formatter-objc/TestDataFormatterObjCNSURL.py (2021 of 2028) UNSUPPORTED: lldb-shell :: ScriptInterpreter/Lua/persistent_state.test (2022 of 2028) PASS: lldb-unit :: Utility/./UtilityTests/BinaryStreamTest.PutULEB128OneByte (2023 of 2028) PASS: lldb-api :: functionalities/data-formatter/data-formatter-stl/libcxx/string/TestDataFormatterLibcxxString.py (2024 of 2028) PASS: lldb-api :: commands/command/script_alias/TestCommandScriptAlias.py (2025 of 2028) PASS: lldb-api :: commands/expression/function_template_specialization_temp_args/TestFunctionTemplateSpecializationTempArgs.py (2026 of 2028) PASS: lldb-api :: functionalities/inferior-crashing/recursive-inferior/TestRecursiveInferior.py (2027 of 2028) PASS: lldb-api :: lang/objc/foundation/TestSymbolTable.py (2028 of 2028) Slowest Tests: -------------------------------------------------------------------------- 352.25s: lldb-api :: tools/lldb-server/TestLldbGdbServer.py 258.32s: lldb-api :: lang/cpp/enum_types/TestCPP11EnumTypes.py 252.81s: lldb-api :: api/multithreaded/TestMultithreaded.py 245.96s: lldb-api :: tools/lldb-server/TestGdbRemoteThreadsInStopReply.py 155.41s: lldb-api :: lang/objc/exceptions/TestObjCExceptions.py 153.77s: lldb-api :: lang/cpp/namespace/TestNamespaceLookup.py 138.53s: lldb-api :: lang/objc/real-definition/TestRealDefinition.py 125.33s: lldb-api :: types/TestLongTypesExpr.py 118.82s: lldb-api :: tools/lldb-server/TestGdbRemote_qThreadStopInfo.py 109.17s: lldb-api :: lang/objc/foundation/TestObjCMethods.py 101.79s: lldb-api :: python_api/lldbutil/iter/TestLLDBIterator.py 98.68s: lldb-api :: lang/objc/forward-decl/TestForwardDecl.py 91.78s: lldb-api :: functionalities/gdb_remote_client/TestWasm.py 89.61s: lldb-api :: commands/settings/TestSettings.py 88.04s: lldb-api :: functionalities/data-formatter/ostypeformatting/TestFormattersOsType.py 86.65s: lldb-api :: functionalities/data-formatter/compactvectors/TestCompactVectors.py 85.46s: lldb-api :: types/TestLongTypes.py 84.56s: lldb-api :: types/TestCharTypeExpr.py 82.45s: lldb-api :: api/check_public_api_headers/TestPublicAPIHeaders.py 75.54s: lldb-api :: types/TestIntegerTypeExpr.py

Hide Details

Tests Times: -------------------------------------------------------------------------- [ Range ] :: [ Percentage ] :: [ Count ] -------------------------------------------------------------------------- [340s,360s) :: [ ] :: [ 1/2028] [320s,340s) :: [ ] :: [ 0/2028] [300s,320s) :: [ ] :: [ 0/2028] [280s,300s) :: [ ] :: [ 0/2028] [260s,280s) :: [ ] :: [ 1/2028] [240s,260s) :: [ ] :: [ 2/2028] [220s,240s) :: [ ] :: [ 0/2028] [200s,220s) :: [ ] :: [ 0/2028] [180s,200s) :: [ ] :: [ 0/2028] [160s,180s) :: [ ] :: [ 0/2028] [140s,160s) :: [ ] :: [ 3/2028] [120s,140s) :: [ ] :: [ 2/2028] [100s,120s) :: [ ] :: [ 3/2028] [ 80s,100s) :: [ ] :: [ 7/2028] [ 60s, 80s) :: [ ] :: [ 20/2028] [ 40s, 60s) :: [* ] :: [ 79/2028] [ 20s, 40s) :: [** ] :: [ 129/2028] [ 0s, 20s) :: [*********************************** ] :: [1781/2028] -------------------------------------------------------------------------- ******************** Failing Tests (53): lldb-api :: commands/expression/context-object-objc/TestContextObjectObjc.py lldb-api :: commands/expression/persist_objc_pointeetype/TestPersistObjCPointeeType.py lldb-api :: lang/objc/variadic_methods/TestVariadicMethods.py lldb-api :: lang/objc/foundation/TestObjCMethods.py lldb-api :: lang/objc/forward-decl/TestForwardDecl.py lldb-api :: commands/expression/namespace_local_var_same_name_obj_c/TestNamespaceLocalVarSameNameObjC.py lldb-api :: lang/objc/self/TestObjCSelf.py lldb-api :: functionalities/data-formatter/data-formatter-objc/TestDataFormatterObjCNSContainer.py lldb-api :: lang/objc/foundation/TestRuntimeTypes.py lldb-api :: lang/objc/foundation/TestObjCMethodsNSError.py lldb-api :: functionalities/data-formatter/data-formatter-objc/TestDataFormatterObjCNSError.py lldb-api :: commands/expression/two-files/TestObjCTypeQueryFromOtherCompileUnit.py lldb-api :: lang/objc/objc-new-syntax/TestObjCNewSyntaxLiteral.py lldb-api :: lang/objc/modules/TestObjCModules.py lldb-api :: lang/objc/foundation/TestObjCMethodsString.py lldb-api :: lang/objc/objc-runtime-ivars/TestRuntimeIvars.py lldb-api :: functionalities/data-formatter/data-formatter-objc/TestDataFormatterObjCCF.py lldb-api :: lang/objc/objc-property/TestObjCProperty.py lldb-api :: lang/objc/objc-new-syntax/TestObjCNewSyntaxDictionary.py lldb-api :: lang/objc/objc-struct-return/TestObjCStructReturn.py lldb-api :: commands/expression/po_verbosity/TestPoVerbosity.py lldb-api :: lang/objc/blocks/TestObjCIvarsInBlocks.py lldb-api :: lang/objc/objc-super/TestObjCSuper.py lldb-api :: functionalities/data-formatter/data-formatter-objc/nsindexpath/TestDataFormatterNSIndexPath.py lldb-api :: lang/objc/objc_direct-methods/TestObjCDirectMethods.py lldb-api :: functionalities/data-formatter/data-formatter-objc/TestDataFormatterObjCExpr.py lldb-api :: lang/objc/objc-new-syntax/TestObjCNewSyntaxArray.py lldb-api :: lang/objc/modules-non-objc-target/TestObjCModulesNonObjCTarget.py lldb-api :: lang/objc/objc-struct-argument/TestObjCStructArgument.py lldb-api :: lang/objc/objc++/TestObjCXX.py lldb-api :: lang/objc/rdar-11355592/TestRdar11355592.py lldb-api :: commands/expression/diagnostics/TestExprDiagnostics.py lldb-api :: commands/expression/call-throws/TestCallThatThrows.py lldb-api :: lang/objc/radar-9691614/TestObjCMethodReturningBOOL.py lldb-api :: lang/objcxx/cxx-bridged-po/TestObjCXXBridgedPO.py lldb-api :: python_api/exprpath_synthetic/TestExprPathSynthetic.py lldb-api :: lang/objc/objc-ivar-protocols/TestIvarProtocols.py lldb-api :: lang/objc/objc-static-method/TestObjCStaticMethod.py lldb-api :: functionalities/set-data/TestSetData.py lldb-api :: lang/objc/foundation/TestConstStrings.py lldb-api :: lang/objc/bitfield_ivars/TestBitfieldIvars.py lldb-api :: functionalities/data-formatter/poarray/TestPrintObjectArray.py lldb-api :: lang/objc/hidden-ivars/TestHiddenIvars.py lldb-api :: lang/objcxx/objcxx-ivar-vector/TestIvarVector.py lldb-api :: lang/objc/objc-optimized/TestObjcOptimized.py lldb-api :: lang/objc/foundation/TestObjCMethodsNSArray.py lldb-api :: lang/objc/objc-class-method/TestObjCClassMethod.py lldb-api :: functionalities/data-formatter/synthupdate/TestSyntheticFilterRecompute.py lldb-api :: lang/objc/unicode-string/TestUnicodeString.py lldb-api :: lang/objc/conflicting-definition/TestConflictingDefinition.py lldb-api :: commands/expression/import_builtin_fileid/TestImportBuiltinFileID.py lldb-api :: lang/objc/orderedset/TestOrderedSet.py lldb-api :: lang/objc/print-obj/TestPrintObj.py

Hide Details

Hide Details

Testing Time: 4152.07s Unsupported Tests : 170 Expected Passes : 1799 Expected Failures : 6 Unexpected Failures: 53 FAILED: tools/lldb/test/CMakeFiles/check-lldb-lit cd /Users/buildslave/jenkins/workspace/lldb-cmake-sanitized/lldb-build/tools/lldb/test && /usr/local/Frameworks/Python.framework/Versions/3.7/bin/python3.7 /Users/buildslave/jenkins/workspace/lldb-cmake-sanitized/lldb-build/./bin/llvm-lit -v --time-tests --shuffle --xunit-xml-output=/Users/buildslave/jenkins/workspace/lldb-cmake-sanitized/test/results.xml -v -j 4 --timeout 1200 /Users/buildslave/jenkins/workspace/lldb-cmake-sanitized/lldb-build/tools/lldb/test ninja: build stopped: subcommand failed. Command failed: Command '['/usr/bin/env', 'TERM=vt100', '/usr/local/bin/ninja', '-v', 'check-lldb']' returned non-zero exit status 1. Command: ['/usr/bin/env', 'TERM=vt100', '/usr/local/bin/ninja', '-v', 'check-lldb'] [Pipeline] } [Pipeline] // timeout [Pipeline] } [Pipeline] // stage [Pipeline] stage [Pipeline] { (Declarative: Post Actions) [Pipeline] scanForIssues [Clang (LLVM based)] Sleeping for 5 seconds due to JENKINS-32191... [Clang (LLVM based)] Parsing console log (workspace: '/Users/buildslave/jenkins/workspace/lldb-cmake-sanitized') [Clang (LLVM based)] Successfully parsed console log [Clang (LLVM based)] -> found 2 issues (skipped 0 duplicates) [Clang (LLVM based)] Post processing issues on 'green-dragon-23' with source code encoding 'UTF-8' [Clang (LLVM based)] Creating SCM blamer to obtain author and commit information for affected files [Clang (LLVM based)] Creating SCM miner to obtain statistics for affected repository files [Clang (LLVM based)] Resolving file names for all issues in source directory '/Users/buildslave/jenkins/workspace/lldb-cmake-sanitized' [Clang (LLVM based)] -> resolved paths in source directory (1 found, 0 not found) [Clang (LLVM based)] Resolving module names from module definitions (build.xml, pom.xml, or Manifest.mf files) [Clang (LLVM based)] -> resolved module names for 2 issues [Clang (LLVM based)] Resolving package names (or namespaces) by parsing the affected files [Clang (LLVM based)] -> resolved package names of 1 affected files [Clang (LLVM based)] No filter has been set, publishing all 2 issues [Clang (LLVM based)] Creating fingerprints for all affected code blocks to track issues over different builds [Clang (LLVM based)] -> created fingerprints for 2 issues (skipped 0 issues) [Clang (LLVM based)] Copying affected files to Jenkins' build folder '/Users/Shared/Jenkins/Home/jobs/lldb-cmake-sanitized/builds/1498/files-with-issues' [Clang (LLVM based)] -> 1 copied, 0 not in workspace, 0 not-found, 0 with I/O error [Pipeline] junit Recording test results [Pipeline] } [Pipeline] // stage [Pipeline] } [Pipeline] // withEnv [Pipeline] } [Pipeline] // node [Pipeline] End of Pipeline ERROR: script returned exit code 1 Finished: FAILURE