FailedConsole Output

Skipping 8,585 KB.. Full Log
onalities/tail_call_frames/thread_step_out_message/main.cpp -implicit-check-not=artificial

Hide Details

FileCheck input: Process 4835 stopped * thread #1, queue = 'com.apple.main-thread', stop reason = step out Stepped out past: frame #1: 0x0000000106f8df79 a.out`func3() at main.cpp:10:42 [artificial]

Hide Details

frame #0: 0x0000000106f8df89 a.out`func2() at main.cpp:12:85 9 10 void __attribute__((noinline)) func3() { sink(); /* tail */ } 11 -> 12 void __attribute__((disable_tail_calls, noinline)) func2() { func3(); /* regular */ } ^ 13 14 void __attribute__((noinline)) func1() { func2(); /* tail */ } 15

Hide Details

Hide Details

Hide Details

FileCheck output:

Hide Details

Hide Details

Hide Details

Hide Details

<bound method SBProcess.Kill of <lldb.SBProcess; proxy of <Swig Object of type 'lldb::SBProcess *' at 0x106614c90> >>: success

Hide Details

PASS: LLDB (/Users/buildslave/jenkins/workspace/lldb-cmake-sanitized/lldb-build/bin/clang-11-x86_64) :: test_dwarf (lldbsuite.test.lldbtest.ArtificialFrameStepOutMessage_GNU) UNSUPPORTED: LLDB (/Users/buildslave/jenkins/workspace/lldb-cmake-sanitized/lldb-build/bin/clang-11-x86_64) :: test_dwo (lldbsuite.test.lldbtest.ArtificialFrameStepOutMessage_GNU) (test case does not fall in any category of interest for this run) runCmd: settings clear -all output:

Hide Details

runCmd: settings set symbols.enable-external-lookup false output:

Hide Details

runCmd: settings set target.auto-apply-fixits false output:

Hide Details

runCmd: settings set plugin.process.gdb-remote.packet-timeout 60 output:

Hide Details

runCmd: settings set symbols.clang-modules-cache-path "/Users/buildslave/jenkins/workspace/lldb-cmake-sanitized/lldb-build/lldb-test-build.noindex/module-cache-lldb/lldb-api" output:

Hide Details

runCmd: settings set use-color false output:

Hide Details

runCmd: setting set target.prefer-dynamic-value no-dynamic-values output:

Hide Details

runCmd: settings set target.env-vars ASAN_OPTIONS=detect_stack_use_after_return=1 DYLD_INSERT_LIBRARIES=/Users/buildslave/jenkins/workspace/lldb-cmake-sanitized/host-compiler/lib/clang/11.0.0/lib/darwin/libclang_rt.asan_osx_dynamic.dylib output:

Hide Details

runCmd: finish output: Process 5016 stopped * thread #1, queue = 'com.apple.main-thread', stop reason = step out Stepped out past: frame #1: 0x000000010dc7df79 a.out`func3() at main.cpp:10:42 [artificial]

Hide Details

frame #0: 0x000000010dc7df89 a.out`func2() at main.cpp:12:85 9 10 void __attribute__((noinline)) func3() { sink(); /* tail */ } 11 -> 12 void __attribute__((disable_tail_calls, noinline)) func2() { func3(); /* regular */ } ^ 13 14 void __attribute__((noinline)) func1() { func2(); /* tail */ } 15

Hide Details

Hide Details

Hide Details

Hide Details

--- FileCheck trace (code=0) --- /Users/buildslave/jenkins/workspace/lldb-cmake-sanitized/lldb-build/bin/FileCheck /Users/buildslave/jenkins/workspace/lldb-cmake-sanitized/llvm-project/lldb/test/API/functionalities/tail_call_frames/thread_step_out_message/main.cpp -implicit-check-not=artificial

Hide Details

FileCheck input: Process 5016 stopped * thread #1, queue = 'com.apple.main-thread', stop reason = step out Stepped out past: frame #1: 0x000000010dc7df79 a.out`func3() at main.cpp:10:42 [artificial]

Hide Details

frame #0: 0x000000010dc7df89 a.out`func2() at main.cpp:12:85 9 10 void __attribute__((noinline)) func3() { sink(); /* tail */ } 11 -> 12 void __attribute__((disable_tail_calls, noinline)) func2() { func3(); /* regular */ } ^ 13 14 void __attribute__((noinline)) func1() { func2(); /* tail */ } 15

Hide Details

Hide Details

Hide Details

FileCheck output:

Hide Details

Hide Details

Hide Details

Hide Details

<bound method SBProcess.Kill of <lldb.SBProcess; proxy of <Swig Object of type 'lldb::SBProcess *' at 0x107287870> >>: success

Hide Details

PASS: LLDB (/Users/buildslave/jenkins/workspace/lldb-cmake-sanitized/lldb-build/bin/clang-11-x86_64) :: test_gmodules (lldbsuite.test.lldbtest.ArtificialFrameStepOutMessage_GNU) Restore dir to: /Users/buildslave/jenkins/workspace/lldb-cmake-sanitized/lldb-build/tools/lldb/test Change dir to: /Users/buildslave/jenkins/workspace/lldb-cmake-sanitized/llvm-project/lldb/test/API/functionalities/tail_call_frames/thread_step_out_message runCmd: settings clear -all output:

Hide Details

runCmd: settings set symbols.enable-external-lookup false output:

Hide Details

runCmd: settings set target.auto-apply-fixits false output:

Hide Details

runCmd: settings set plugin.process.gdb-remote.packet-timeout 60 output:

Hide Details

runCmd: settings set symbols.clang-modules-cache-path "/Users/buildslave/jenkins/workspace/lldb-cmake-sanitized/lldb-build/lldb-test-build.noindex/module-cache-lldb/lldb-api" output:

Hide Details

runCmd: settings set use-color false output:

Hide Details

runCmd: setting set target.prefer-dynamic-value no-dynamic-values output:

Hide Details

runCmd: settings set target.env-vars ASAN_OPTIONS=detect_stack_use_after_return=1 DYLD_INSERT_LIBRARIES=/Users/buildslave/jenkins/workspace/lldb-cmake-sanitized/host-compiler/lib/clang/11.0.0/lib/darwin/libclang_rt.asan_osx_dynamic.dylib output:

Hide Details

runCmd: finish output: Process 5239 stopped * thread #1, queue = 'com.apple.main-thread', stop reason = step out Stepped out past: frame #1: 0x0000000103e06f75 a.out`func3() at main.cpp:10:42 [opt] [artificial]

Hide Details

frame #0: 0x0000000103e06f89 a.out`func2() at main.cpp:12:85 [opt] 9 10 void __attribute__((noinline)) func3() { sink(); /* tail */ } 11 -> 12 void __attribute__((disable_tail_calls, noinline)) func2() { func3(); /* regular */ } ^ 13 14 void __attribute__((noinline)) func1() { func2(); /* tail */ } 15

Hide Details

Hide Details

Hide Details

Hide Details

--- FileCheck trace (code=0) --- /Users/buildslave/jenkins/workspace/lldb-cmake-sanitized/lldb-build/bin/FileCheck /Users/buildslave/jenkins/workspace/lldb-cmake-sanitized/llvm-project/lldb/test/API/functionalities/tail_call_frames/thread_step_out_message/main.cpp -implicit-check-not=artificial

Hide Details

FileCheck input: Process 5239 stopped * thread #1, queue = 'com.apple.main-thread', stop reason = step out Stepped out past: frame #1: 0x0000000103e06f75 a.out`func3() at main.cpp:10:42 [opt] [artificial]

Hide Details

frame #0: 0x0000000103e06f89 a.out`func2() at main.cpp:12:85 [opt] 9 10 void __attribute__((noinline)) func3() { sink(); /* tail */ } 11 -> 12 void __attribute__((disable_tail_calls, noinline)) func2() { func3(); /* regular */ } ^ 13 14 void __attribute__((noinline)) func1() { func2(); /* tail */ } 15

Hide Details

Hide Details

Hide Details

FileCheck output:

Hide Details

Hide Details

Hide Details

Hide Details

<bound method SBProcess.Kill of <lldb.SBProcess; proxy of <Swig Object of type 'lldb::SBProcess *' at 0x106614c60> >>: success

Hide Details

PASS: LLDB (/Users/buildslave/jenkins/workspace/lldb-cmake-sanitized/lldb-build/bin/clang-11-x86_64) :: test_dsym (lldbsuite.test.lldbtest.ArtificialFrameStepOutMessage_V5) runCmd: settings clear -all output:

Hide Details

runCmd: settings set symbols.enable-external-lookup false output:

Hide Details

runCmd: settings set target.auto-apply-fixits false output:

Hide Details

runCmd: settings set plugin.process.gdb-remote.packet-timeout 60 output:

Hide Details

runCmd: settings set symbols.clang-modules-cache-path "/Users/buildslave/jenkins/workspace/lldb-cmake-sanitized/lldb-build/lldb-test-build.noindex/module-cache-lldb/lldb-api" output:

Hide Details

runCmd: settings set use-color false output:

Hide Details

runCmd: setting set target.prefer-dynamic-value no-dynamic-values output:

Hide Details

runCmd: settings set target.env-vars ASAN_OPTIONS=detect_stack_use_after_return=1 DYLD_INSERT_LIBRARIES=/Users/buildslave/jenkins/workspace/lldb-cmake-sanitized/host-compiler/lib/clang/11.0.0/lib/darwin/libclang_rt.asan_osx_dynamic.dylib output:

Hide Details

runCmd: finish output: Process 5451 stopped * thread #1, queue = 'com.apple.main-thread', stop reason = step out Stepped out past: frame #1: 0x00000001039e1f75 a.out`func3() at main.cpp:10:42 [opt] [artificial]

Hide Details

frame #0: 0x00000001039e1f89 a.out`func2() at main.cpp:12:85 [opt] 9 10 void __attribute__((noinline)) func3() { sink(); /* tail */ } 11 -> 12 void __attribute__((disable_tail_calls, noinline)) func2() { func3(); /* regular */ } ^ 13 14 void __attribute__((noinline)) func1() { func2(); /* tail */ } 15

Hide Details

Hide Details

Hide Details

Hide Details

--- FileCheck trace (code=0) --- /Users/buildslave/jenkins/workspace/lldb-cmake-sanitized/lldb-build/bin/FileCheck /Users/buildslave/jenkins/workspace/lldb-cmake-sanitized/llvm-project/lldb/test/API/functionalities/tail_call_frames/thread_step_out_message/main.cpp -implicit-check-not=artificial

Hide Details

FileCheck input: Process 5451 stopped * thread #1, queue = 'com.apple.main-thread', stop reason = step out Stepped out past: frame #1: 0x00000001039e1f75 a.out`func3() at main.cpp:10:42 [opt] [artificial]

Hide Details

frame #0: 0x00000001039e1f89 a.out`func2() at main.cpp:12:85 [opt] 9 10 void __attribute__((noinline)) func3() { sink(); /* tail */ } 11 -> 12 void __attribute__((disable_tail_calls, noinline)) func2() { func3(); /* regular */ } ^ 13 14 void __attribute__((noinline)) func1() { func2(); /* tail */ } 15

Hide Details

Hide Details

Hide Details

FileCheck output:

Hide Details

Hide Details

Hide Details

Hide Details

<bound method SBProcess.Kill of <lldb.SBProcess; proxy of <Swig Object of type 'lldb::SBProcess *' at 0x107287960> >>: success

Hide Details

PASS: LLDB (/Users/buildslave/jenkins/workspace/lldb-cmake-sanitized/lldb-build/bin/clang-11-x86_64) :: test_dwarf (lldbsuite.test.lldbtest.ArtificialFrameStepOutMessage_V5) UNSUPPORTED: LLDB (/Users/buildslave/jenkins/workspace/lldb-cmake-sanitized/lldb-build/bin/clang-11-x86_64) :: test_dwo (lldbsuite.test.lldbtest.ArtificialFrameStepOutMessage_V5) (test case does not fall in any category of interest for this run) runCmd: settings clear -all output:

Hide Details

runCmd: settings set symbols.enable-external-lookup false output:

Hide Details

runCmd: settings set target.auto-apply-fixits false output:

Hide Details

runCmd: settings set plugin.process.gdb-remote.packet-timeout 60 output:

Hide Details

runCmd: settings set symbols.clang-modules-cache-path "/Users/buildslave/jenkins/workspace/lldb-cmake-sanitized/lldb-build/lldb-test-build.noindex/module-cache-lldb/lldb-api" output:

Hide Details

runCmd: settings set use-color false output:

Hide Details

runCmd: setting set target.prefer-dynamic-value no-dynamic-values output:

Hide Details

runCmd: settings set target.env-vars ASAN_OPTIONS=detect_stack_use_after_return=1 DYLD_INSERT_LIBRARIES=/Users/buildslave/jenkins/workspace/lldb-cmake-sanitized/host-compiler/lib/clang/11.0.0/lib/darwin/libclang_rt.asan_osx_dynamic.dylib output:

Hide Details

runCmd: finish output: Process 5728 stopped * thread #1, queue = 'com.apple.main-thread', stop reason = step out Stepped out past: frame #1: 0x000000010f417f75 a.out`func3() at main.cpp:10:42 [opt] [artificial]

Hide Details

frame #0: 0x000000010f417f89 a.out`func2() at main.cpp:12:85 [opt] 9 10 void __attribute__((noinline)) func3() { sink(); /* tail */ } 11 -> 12 void __attribute__((disable_tail_calls, noinline)) func2() { func3(); /* regular */ } ^ 13 14 void __attribute__((noinline)) func1() { func2(); /* tail */ } 15

Hide Details

Hide Details

Hide Details

Hide Details

--- FileCheck trace (code=0) --- /Users/buildslave/jenkins/workspace/lldb-cmake-sanitized/lldb-build/bin/FileCheck /Users/buildslave/jenkins/workspace/lldb-cmake-sanitized/llvm-project/lldb/test/API/functionalities/tail_call_frames/thread_step_out_message/main.cpp -implicit-check-not=artificial

Hide Details

FileCheck input: Process 5728 stopped * thread #1, queue = 'com.apple.main-thread', stop reason = step out Stepped out past: frame #1: 0x000000010f417f75 a.out`func3() at main.cpp:10:42 [opt] [artificial]

Hide Details

frame #0: 0x000000010f417f89 a.out`func2() at main.cpp:12:85 [opt] 9 10 void __attribute__((noinline)) func3() { sink(); /* tail */ } 11 -> 12 void __attribute__((disable_tail_calls, noinline)) func2() { func3(); /* regular */ } ^ 13 14 void __attribute__((noinline)) func1() { func2(); /* tail */ } 15

Hide Details

Hide Details

Hide Details

FileCheck output:

Hide Details

Hide Details

Hide Details

Hide Details

<bound method SBProcess.Kill of <lldb.SBProcess; proxy of <Swig Object of type 'lldb::SBProcess *' at 0x106614c90> >>: success

Hide Details

PASS: LLDB (/Users/buildslave/jenkins/workspace/lldb-cmake-sanitized/lldb-build/bin/clang-11-x86_64) :: test_gmodules (lldbsuite.test.lldbtest.ArtificialFrameStepOutMessage_V5) Restore dir to: /Users/buildslave/jenkins/workspace/lldb-cmake-sanitized/lldb-build/tools/lldb/test ====================================================================== FAIL: test_dsym (lldbsuite.test.lldbtest.ArtificialFrameStepOutMessage_GNU) ---------------------------------------------------------------------- Traceback (most recent call last): File "/Users/buildslave/jenkins/workspace/lldb-cmake-sanitized/llvm-project/lldb/packages/Python/lldbsuite/test/lldbtest.py", line 1768, in test_method return attrvalue(self) File "/Users/buildslave/jenkins/workspace/lldb-cmake-sanitized/llvm-project/lldb/packages/Python/lldbsuite/test/decorators.py", line 140, in wrapper func(*args, **kwargs) File "/Users/buildslave/jenkins/workspace/lldb-cmake-sanitized/llvm-project/lldb/packages/Python/lldbsuite/test/decorators.py", line 140, in wrapper func(*args, **kwargs) File "/Users/buildslave/jenkins/workspace/lldb-cmake-sanitized/llvm-project/lldb/packages/Python/lldbsuite/test/lldbinline.py", line 124, in _test self.do_test() File "/Users/buildslave/jenkins/workspace/lldb-cmake-sanitized/llvm-project/lldb/packages/Python/lldbsuite/test/lldbinline.py", line 156, in do_test parser.handle_breakpoint(self, bp_id) File "/Users/buildslave/jenkins/workspace/lldb-cmake-sanitized/llvm-project/lldb/packages/Python/lldbsuite/test/lldbinline.py", line 80, in handle_breakpoint test.execute_user_command(breakpoint['command']) File "/Users/buildslave/jenkins/workspace/lldb-cmake-sanitized/llvm-project/lldb/packages/Python/lldbsuite/test/lldbinline.py", line 127, in execute_user_command exec(__command, globals(), locals()) File "<string>", line 1, in <module> File "/Users/buildslave/jenkins/workspace/lldb-cmake-sanitized/llvm-project/lldb/packages/Python/lldbsuite/test/lldbtest.py", line 2313, in filecheck self.assertTrue(cmd_status == 0) AssertionError: False is not True Config=x86_64-/Users/buildslave/jenkins/workspace/lldb-cmake-sanitized/lldb-build/bin/clang-11 ---------------------------------------------------------------------- Ran 8 tests in 20.218s

Hide Details

RESULT: FAILED (5 passes, 1 failures, 0 errors, 2 skipped, 0 expected failures, 0 unexpected successes)

Hide Details

--

Hide Details

******************** PASS: lldb-api :: commands/expression/function_template_specialization_temp_args/TestFunctionTemplateSpecializationTempArgs.py (1673 of 2029) PASS: lldb-shell :: ObjectFile/ELF/base-address.yaml (1674 of 2029) PASS: lldb-unit :: Utility/./UtilityTests/StreamTest.PutMaxHex64ByteOrderBig (1675 of 2029) PASS: lldb-unit :: ScriptInterpreter/Python/./ScriptInterpreterPythonTests/PythonDataObjectsTest.TestPythonTupleInitializerList (1676 of 2029) PASS: lldb-api :: lang/c/bitfields/TestBitfields.py (1677 of 2029) PASS: lldb-unit :: Utility/./UtilityTests/StreamTest.PutHex32ByteOrderLittle (1678 of 2029) PASS: lldb-unit :: Utility/./UtilityTests/ScalarTest.Comparison (1679 of 2029) PASS: lldb-unit :: Utility/./UtilityTests/StreamTest.PutCStringWithStringRef (1680 of 2029) PASS: lldb-unit :: Utility/./UtilityTests/VMRange.ContainsRange (1681 of 2029) PASS: lldb-unit :: Utility/./UtilityTests/LogTest.Register (1682 of 2029) UNSUPPORTED: lldb-shell :: Process/Windows/exception_access_violation.cpp (1683 of 2029) PASS: lldb-api :: macosx/lc-note/kern-ver-str/TestKernVerStrLCNOTE.py (1684 of 2029) PASS: lldb-unit :: Utility/./UtilityTests/BinaryStreamTest.PutSLEB128MaxValue (1685 of 2029) PASS: lldb-api :: macosx/find-dsym/bundle-with-dot-in-filename/TestBundleWithDotInFilename.py (1686 of 2029) PASS: lldb-unit :: Expression/./ExpressionTests/CppModuleConfigurationTest.IgnoreLibStdCpp (1687 of 2029) FAIL: lldb-api :: lang/objc/bitfield_ivars/TestBitfieldIvars.py (1688 of 2029) ******************** TEST 'lldb-api :: lang/objc/bitfield_ivars/TestBitfieldIvars.py' FAILED ******************** Script: -- /Users/buildslave/jenkins/workspace/lldb-cmake-sanitized/lldb-build/lldb-test-build.noindex/copied-system-python /Users/buildslave/jenkins/workspace/lldb-cmake-sanitized/llvm-project/lldb/test/API/dotest.py --arch x86_64 -s /Users/buildslave/jenkins/workspace/lldb-cmake-sanitized/lldb-build/lldb-test-traces -S nm -u CXXFLAGS -u CFLAGS --codesign-identity lldb_codesign --server /Users/buildslave/jenkins/workspace/lldb-cmake-sanitized/lldb-build/./bin/debugserver --arch x86_64 --build-dir /Users/buildslave/jenkins/workspace/lldb-cmake-sanitized/lldb-build/lldb-test-build.noindex -s=/Users/buildslave/jenkins/workspace/lldb-cmake-sanitized/test/logs -t --env TERM=vt100 --env LLVM_LIBS_DIR=/Users/buildslave/jenkins/workspace/lldb-cmake-sanitized/lldb-build/./lib --inferior-env ASAN_OPTIONS=detect_stack_use_after_return=1 --inferior-env DYLD_INSERT_LIBRARIES=/Users/buildslave/jenkins/workspace/lldb-cmake-sanitized/host-compiler/lib/clang/11.0.0/lib/darwin/libclang_rt.asan_osx_dynamic.dylib --build-dir /Users/buildslave/jenkins/workspace/lldb-cmake-sanitized/lldb-build/lldb-test-build.noindex --lldb-module-cache-dir /Users/buildslave/jenkins/workspace/lldb-cmake-sanitized/lldb-build/lldb-test-build.noindex/module-cache-lldb/lldb-api --clang-module-cache-dir /Users/buildslave/jenkins/workspace/lldb-cmake-sanitized/lldb-build/lldb-test-build.noindex/module-cache-clang/lldb-api --executable /Users/buildslave/jenkins/workspace/lldb-cmake-sanitized/lldb-build/./bin/lldb --compiler /Users/buildslave/jenkins/workspace/lldb-cmake-sanitized/lldb-build/./bin/clang --dsymutil /Users/buildslave/jenkins/workspace/lldb-cmake-sanitized/lldb-build/./bin/dsymutil --filecheck /Users/buildslave/jenkins/workspace/lldb-cmake-sanitized/lldb-build/./bin/FileCheck --lldb-libs-dir /Users/buildslave/jenkins/workspace/lldb-cmake-sanitized/lldb-build/./lib /Users/buildslave/jenkins/workspace/lldb-cmake-sanitized/llvm-project/lldb/test/API/lang/objc/bitfield_ivars -p TestBitfieldIvars.py -- Exit Code: -6

Hide Details

Command Output (stdout): -- lldb version 11.0.99 clang revision bff0c56ff92106afad22b54a90e1c612da4d6f99 llvm revision bff0c56ff92106afad22b54a90e1c612da4d6f99

Hide Details

-- Command Output (stderr): -- Assertion failed: (tokenKind == tok::kw___bridge_retain), function ParseParenExpression, file /Users/buildslave/jenkins/workspace/lldb-cmake-sanitized/llvm-project/clang/lib/Parse/ParseExpr.cpp, line 2804.

Hide Details

--

Hide Details

******************** FAIL: lldb-api :: functionalities/tail_call_frames/disambiguate_call_site/TestDisambiguateCallSite.py (1689 of 2029) ******************** TEST 'lldb-api :: functionalities/tail_call_frames/disambiguate_call_site/TestDisambiguateCallSite.py' FAILED ******************** Script: -- /Users/buildslave/jenkins/workspace/lldb-cmake-sanitized/lldb-build/lldb-test-build.noindex/copied-system-python /Users/buildslave/jenkins/workspace/lldb-cmake-sanitized/llvm-project/lldb/test/API/dotest.py --arch x86_64 -s /Users/buildslave/jenkins/workspace/lldb-cmake-sanitized/lldb-build/lldb-test-traces -S nm -u CXXFLAGS -u CFLAGS --codesign-identity lldb_codesign --server /Users/buildslave/jenkins/workspace/lldb-cmake-sanitized/lldb-build/./bin/debugserver --arch x86_64 --build-dir /Users/buildslave/jenkins/workspace/lldb-cmake-sanitized/lldb-build/lldb-test-build.noindex -s=/Users/buildslave/jenkins/workspace/lldb-cmake-sanitized/test/logs -t --env TERM=vt100 --env LLVM_LIBS_DIR=/Users/buildslave/jenkins/workspace/lldb-cmake-sanitized/lldb-build/./lib --inferior-env ASAN_OPTIONS=detect_stack_use_after_return=1 --inferior-env DYLD_INSERT_LIBRARIES=/Users/buildslave/jenkins/workspace/lldb-cmake-sanitized/host-compiler/lib/clang/11.0.0/lib/darwin/libclang_rt.asan_osx_dynamic.dylib --build-dir /Users/buildslave/jenkins/workspace/lldb-cmake-sanitized/lldb-build/lldb-test-build.noindex --lldb-module-cache-dir /Users/buildslave/jenkins/workspace/lldb-cmake-sanitized/lldb-build/lldb-test-build.noindex/module-cache-lldb/lldb-api --clang-module-cache-dir /Users/buildslave/jenkins/workspace/lldb-cmake-sanitized/lldb-build/lldb-test-build.noindex/module-cache-clang/lldb-api --executable /Users/buildslave/jenkins/workspace/lldb-cmake-sanitized/lldb-build/./bin/lldb --compiler /Users/buildslave/jenkins/workspace/lldb-cmake-sanitized/lldb-build/./bin/clang --dsymutil /Users/buildslave/jenkins/workspace/lldb-cmake-sanitized/lldb-build/./bin/dsymutil --filecheck /Users/buildslave/jenkins/workspace/lldb-cmake-sanitized/lldb-build/./bin/FileCheck --lldb-libs-dir /Users/buildslave/jenkins/workspace/lldb-cmake-sanitized/lldb-build/./lib /Users/buildslave/jenkins/workspace/lldb-cmake-sanitized/llvm-project/lldb/test/API/functionalities/tail_call_frames/disambiguate_call_site -p TestDisambiguateCallSite.py -- Exit Code: 1

Hide Details

Command Output (stdout): -- lldb version 11.0.99 clang revision bff0c56ff92106afad22b54a90e1c612da4d6f99 llvm revision bff0c56ff92106afad22b54a90e1c612da4d6f99 LLDB library dir: /Users/buildslave/jenkins/workspace/lldb-cmake-sanitized/lldb-build/bin LLDB import library dir: /Users/buildslave/jenkins/workspace/lldb-cmake-sanitized/lldb-build/./lib libstdcxx tests will not be run because: Don't know how to build with libstdcxx on macosx Skipping following debug info categories: ['dwo'] a.out was compiled with optimization - stepping may behave oddly; variables may not be available. a.out was compiled with optimization - stepping may behave oddly; variables may not be available. a.out was compiled with optimization - stepping may behave oddly; variables may not be available.

Hide Details

-- Command Output (stderr): --

Hide Details

Session logs for test failures/errors/unexpected successes will go into directory '/Users/buildslave/jenkins/workspace/lldb-cmake-sanitized/test/logs' Command invoked: /Users/buildslave/jenkins/workspace/lldb-cmake-sanitized/llvm-project/lldb/test/API/dotest.py --arch x86_64 -s /Users/buildslave/jenkins/workspace/lldb-cmake-sanitized/lldb-build/lldb-test-traces -S nm -u CXXFLAGS -u CFLAGS --codesign-identity lldb_codesign --server /Users/buildslave/jenkins/workspace/lldb-cmake-sanitized/lldb-build/./bin/debugserver --arch x86_64 --build-dir /Users/buildslave/jenkins/workspace/lldb-cmake-sanitized/lldb-build/lldb-test-build.noindex -s=/Users/buildslave/jenkins/workspace/lldb-cmake-sanitized/test/logs -t --env TERM=vt100 --env LLVM_LIBS_DIR=/Users/buildslave/jenkins/workspace/lldb-cmake-sanitized/lldb-build/./lib --inferior-env ASAN_OPTIONS=detect_stack_use_after_return=1 --inferior-env DYLD_INSERT_LIBRARIES=/Users/buildslave/jenkins/workspace/lldb-cmake-sanitized/host-compiler/lib/clang/11.0.0/lib/darwin/libclang_rt.asan_osx_dynamic.dylib --build-dir /Users/buildslave/jenkins/workspace/lldb-cmake-sanitized/lldb-build/lldb-test-build.noindex --lldb-module-cache-dir /Users/buildslave/jenkins/workspace/lldb-cmake-sanitized/lldb-build/lldb-test-build.noindex/module-cache-lldb/lldb-api --clang-module-cache-dir /Users/buildslave/jenkins/workspace/lldb-cmake-sanitized/lldb-build/lldb-test-build.noindex/module-cache-clang/lldb-api --executable /Users/buildslave/jenkins/workspace/lldb-cmake-sanitized/lldb-build/./bin/lldb --compiler /Users/buildslave/jenkins/workspace/lldb-cmake-sanitized/lldb-build/./bin/clang --dsymutil /Users/buildslave/jenkins/workspace/lldb-cmake-sanitized/lldb-build/./bin/dsymutil --filecheck /Users/buildslave/jenkins/workspace/lldb-cmake-sanitized/lldb-build/./bin/FileCheck --lldb-libs-dir /Users/buildslave/jenkins/workspace/lldb-cmake-sanitized/lldb-build/./lib /Users/buildslave/jenkins/workspace/lldb-cmake-sanitized/llvm-project/lldb/test/API/functionalities/tail_call_frames/disambiguate_call_site -p TestDisambiguateCallSite.py Change dir to: /Users/buildslave/jenkins/workspace/lldb-cmake-sanitized/llvm-project/lldb/test/API/functionalities/tail_call_frames/disambiguate_call_site runCmd: settings clear -all output:

Hide Details

runCmd: settings set symbols.enable-external-lookup false output:

Hide Details

runCmd: settings set target.auto-apply-fixits false output:

Hide Details

runCmd: settings set plugin.process.gdb-remote.packet-timeout 60 output:

Hide Details

runCmd: settings set symbols.clang-modules-cache-path "/Users/buildslave/jenkins/workspace/lldb-cmake-sanitized/lldb-build/lldb-test-build.noindex/module-cache-lldb/lldb-api" output:

Hide Details

runCmd: settings set use-color false output:

Hide Details

runCmd: setting set target.prefer-dynamic-value no-dynamic-values output:

Hide Details

runCmd: settings set target.env-vars ASAN_OPTIONS=detect_stack_use_after_return=1 DYLD_INSERT_LIBRARIES=/Users/buildslave/jenkins/workspace/lldb-cmake-sanitized/host-compiler/lib/clang/11.0.0/lib/darwin/libclang_rt.asan_osx_dynamic.dylib output:

Hide Details

runCmd: bt output: * thread #1, queue = 'com.apple.main-thread', stop reason = breakpoint 1.1 * frame #0: 0x000000010893bf64 a.out`sink() at main.cpp:4:4 frame #1: 0x000000010893bf9d a.out`main(argc=1, (null)=<unavailable>) at main.cpp:19:3 frame #2: 0x00007fff5962a085 libdyld.dylib`start + 1 frame #3: 0x00007fff5962a085 libdyld.dylib`start + 1

Hide Details

Hide Details

Hide Details

--- FileCheck trace (code=1) --- /Users/buildslave/jenkins/workspace/lldb-cmake-sanitized/lldb-build/bin/FileCheck /Users/buildslave/jenkins/workspace/lldb-cmake-sanitized/llvm-project/lldb/test/API/functionalities/tail_call_frames/disambiguate_call_site/main.cpp -implicit-check-not=artificial

Hide Details

FileCheck input: * thread #1, queue = 'com.apple.main-thread', stop reason = breakpoint 1.1 * frame #0: 0x000000010893bf64 a.out`sink() at main.cpp:4:4 frame #1: 0x000000010893bf9d a.out`main(argc=1, (null)=<unavailable>) at main.cpp:19:3 frame #2: 0x00007fff5962a085 libdyld.dylib`start + 1 frame #3: 0x00007fff5962a085 libdyld.dylib`start + 1

Hide Details

Hide Details

FileCheck output:

Hide Details

/Users/buildslave/jenkins/workspace/lldb-cmake-sanitized/llvm-project/lldb/test/API/functionalities/tail_call_frames/disambiguate_call_site/main.cpp:6:17: error: CHECK-NEXT: expected string not found in input // CHECK-NEXT: func2{{.*}} [artificial] ^ <stdin>:3:2: note: scanning from here frame #1: 0x000000010893bf9d a.out`main(argc=1, (null)=<unavailable>) at main.cpp:19:3 ^ <stdin>:3:62: note: possible intended match here frame #1: 0x000000010893bf9d a.out`main(argc=1, (null)=<unavailable>) at main.cpp:19:3 ^

Hide Details

Hide Details

Hide Details

FAIL: LLDB (/Users/buildslave/jenkins/workspace/lldb-cmake-sanitized/lldb-build/bin/clang-11-x86_64) :: test_dsym (lldbsuite.test.lldbtest.DisambiguateCallSite_GNU) <bound method SBProcess.Kill of <lldb.SBProcess; proxy of <Swig Object of type 'lldb::SBProcess *' at 0x10a93f960> >>: success

Hide Details

runCmd: settings clear -all output:

Hide Details

runCmd: settings set symbols.enable-external-lookup false output:

Hide Details

runCmd: settings set target.auto-apply-fixits false output:

Hide Details

runCmd: settings set plugin.process.gdb-remote.packet-timeout 60 output:

Hide Details

runCmd: settings set symbols.clang-modules-cache-path "/Users/buildslave/jenkins/workspace/lldb-cmake-sanitized/lldb-build/lldb-test-build.noindex/module-cache-lldb/lldb-api" output:

Hide Details

runCmd: settings set use-color false output:

Hide Details

runCmd: setting set target.prefer-dynamic-value no-dynamic-values output:

Hide Details

runCmd: settings set target.env-vars ASAN_OPTIONS=detect_stack_use_after_return=1 DYLD_INSERT_LIBRARIES=/Users/buildslave/jenkins/workspace/lldb-cmake-sanitized/host-compiler/lib/clang/11.0.0/lib/darwin/libclang_rt.asan_osx_dynamic.dylib output:

Hide Details

runCmd: bt output: * thread #1, queue = 'com.apple.main-thread', stop reason = breakpoint 1.1 * frame #0: 0x000000010d10ff64 a.out`sink() at main.cpp:4:4 frame #1: 0x000000010d10ff79 a.out`func2() at main.cpp:11:3 [artificial] frame #2: 0x000000010d10ff9d a.out`main(argc=1, (null)=<unavailable>) at main.cpp:19:3 frame #3: 0x00007fff5962a085 libdyld.dylib`start + 1

Hide Details

Hide Details

Hide Details

--- FileCheck trace (code=0) --- /Users/buildslave/jenkins/workspace/lldb-cmake-sanitized/lldb-build/bin/FileCheck /Users/buildslave/jenkins/workspace/lldb-cmake-sanitized/llvm-project/lldb/test/API/functionalities/tail_call_frames/disambiguate_call_site/main.cpp -implicit-check-not=artificial

Hide Details

FileCheck input: * thread #1, queue = 'com.apple.main-thread', stop reason = breakpoint 1.1 * frame #0: 0x000000010d10ff64 a.out`sink() at main.cpp:4:4 frame #1: 0x000000010d10ff79 a.out`func2() at main.cpp:11:3 [artificial] frame #2: 0x000000010d10ff9d a.out`main(argc=1, (null)=<unavailable>) at main.cpp:19:3 frame #3: 0x00007fff5962a085 libdyld.dylib`start + 1

Hide Details

Hide Details

FileCheck output:

Hide Details

Hide Details

Hide Details

Hide Details

<bound method SBProcess.Kill of <lldb.SBProcess; proxy of <Swig Object of type 'lldb::SBProcess *' at 0x109c8cc90> >>: success

Hide Details

PASS: LLDB (/Users/buildslave/jenkins/workspace/lldb-cmake-sanitized/lldb-build/bin/clang-11-x86_64) :: test_dwarf (lldbsuite.test.lldbtest.DisambiguateCallSite_GNU) UNSUPPORTED: LLDB (/Users/buildslave/jenkins/workspace/lldb-cmake-sanitized/lldb-build/bin/clang-11-x86_64) :: test_dwo (lldbsuite.test.lldbtest.DisambiguateCallSite_GNU) (test case does not fall in any category of interest for this run) runCmd: settings clear -all output:

Hide Details

runCmd: settings set symbols.enable-external-lookup false output:

Hide Details

runCmd: settings set target.auto-apply-fixits false output:

Hide Details

runCmd: settings set plugin.process.gdb-remote.packet-timeout 60 output:

Hide Details

runCmd: settings set symbols.clang-modules-cache-path "/Users/buildslave/jenkins/workspace/lldb-cmake-sanitized/lldb-build/lldb-test-build.noindex/module-cache-lldb/lldb-api" output:

Hide Details

runCmd: settings set use-color false output:

Hide Details

runCmd: setting set target.prefer-dynamic-value no-dynamic-values output:

Hide Details

runCmd: settings set target.env-vars ASAN_OPTIONS=detect_stack_use_after_return=1 DYLD_INSERT_LIBRARIES=/Users/buildslave/jenkins/workspace/lldb-cmake-sanitized/host-compiler/lib/clang/11.0.0/lib/darwin/libclang_rt.asan_osx_dynamic.dylib output:

Hide Details

runCmd: bt output: * thread #1, queue = 'com.apple.main-thread', stop reason = breakpoint 1.1 * frame #0: 0x000000010f392f64 a.out`sink() at main.cpp:4:4 frame #1: 0x000000010f392f79 a.out`func2() at main.cpp:11:3 [artificial] frame #2: 0x000000010f392f9d a.out`main(argc=1, (null)=<unavailable>) at main.cpp:19:3 frame #3: 0x00007fff5962a085 libdyld.dylib`start + 1

Hide Details

Hide Details

Hide Details

--- FileCheck trace (code=0) --- /Users/buildslave/jenkins/workspace/lldb-cmake-sanitized/lldb-build/bin/FileCheck /Users/buildslave/jenkins/workspace/lldb-cmake-sanitized/llvm-project/lldb/test/API/functionalities/tail_call_frames/disambiguate_call_site/main.cpp -implicit-check-not=artificial

Hide Details

FileCheck input: * thread #1, queue = 'com.apple.main-thread', stop reason = breakpoint 1.1 * frame #0: 0x000000010f392f64 a.out`sink() at main.cpp:4:4 frame #1: 0x000000010f392f79 a.out`func2() at main.cpp:11:3 [artificial] frame #2: 0x000000010f392f9d a.out`main(argc=1, (null)=<unavailable>) at main.cpp:19:3 frame #3: 0x00007fff5962a085 libdyld.dylib`start + 1

Hide Details

Hide Details

FileCheck output:

Hide Details

Hide Details

Hide Details

Hide Details

<bound method SBProcess.Kill of <lldb.SBProcess; proxy of <Swig Object of type 'lldb::SBProcess *' at 0x109c8c5d0> >>: success

Hide Details

PASS: LLDB (/Users/buildslave/jenkins/workspace/lldb-cmake-sanitized/lldb-build/bin/clang-11-x86_64) :: test_gmodules (lldbsuite.test.lldbtest.DisambiguateCallSite_GNU) Restore dir to: /Users/buildslave/jenkins/workspace/lldb-cmake-sanitized/lldb-build/tools/lldb/test Change dir to: /Users/buildslave/jenkins/workspace/lldb-cmake-sanitized/llvm-project/lldb/test/API/functionalities/tail_call_frames/disambiguate_call_site runCmd: settings clear -all output:

Hide Details

runCmd: settings set symbols.enable-external-lookup false output:

Hide Details

runCmd: settings set target.auto-apply-fixits false output:

Hide Details

runCmd: settings set plugin.process.gdb-remote.packet-timeout 60 output:

Hide Details

runCmd: settings set symbols.clang-modules-cache-path "/Users/buildslave/jenkins/workspace/lldb-cmake-sanitized/lldb-build/lldb-test-build.noindex/module-cache-lldb/lldb-api" output:

Hide Details

runCmd: settings set use-color false output:

Hide Details

runCmd: setting set target.prefer-dynamic-value no-dynamic-values output:

Hide Details

runCmd: settings set target.env-vars ASAN_OPTIONS=detect_stack_use_after_return=1 DYLD_INSERT_LIBRARIES=/Users/buildslave/jenkins/workspace/lldb-cmake-sanitized/host-compiler/lib/clang/11.0.0/lib/darwin/libclang_rt.asan_osx_dynamic.dylib output:

Hide Details

runCmd: bt output: * thread #1, queue = 'com.apple.main-thread', stop reason = breakpoint 1.1 * frame #0: 0x000000010ee1ef64 a.out`sink() at main.cpp:4:4 [opt] frame #1: 0x000000010ee1ef75 a.out`func2() at main.cpp:11:3 [opt] [artificial] frame #2: 0x000000010ee1ef9d a.out`main(argc=1, (null)=<unavailable>) at main.cpp:19:3 [opt] frame #3: 0x00007fff5962a085 libdyld.dylib`start + 1 frame #4: 0x00007fff5962a085 libdyld.dylib`start + 1

Hide Details

Hide Details

Hide Details

--- FileCheck trace (code=0) --- /Users/buildslave/jenkins/workspace/lldb-cmake-sanitized/lldb-build/bin/FileCheck /Users/buildslave/jenkins/workspace/lldb-cmake-sanitized/llvm-project/lldb/test/API/functionalities/tail_call_frames/disambiguate_call_site/main.cpp -implicit-check-not=artificial

Hide Details

FileCheck input: * thread #1, queue = 'com.apple.main-thread', stop reason = breakpoint 1.1 * frame #0: 0x000000010ee1ef64 a.out`sink() at main.cpp:4:4 [opt] frame #1: 0x000000010ee1ef75 a.out`func2() at main.cpp:11:3 [opt] [artificial] frame #2: 0x000000010ee1ef9d a.out`main(argc=1, (null)=<unavailable>) at main.cpp:19:3 [opt] frame #3: 0x00007fff5962a085 libdyld.dylib`start + 1 frame #4: 0x00007fff5962a085 libdyld.dylib`start + 1

Hide Details

Hide Details

FileCheck output:

Hide Details

Hide Details

Hide Details

Hide Details

<bound method SBProcess.Kill of <lldb.SBProcess; proxy of <Swig Object of type 'lldb::SBProcess *' at 0x109c8cc60> >>: success

Hide Details

PASS: LLDB (/Users/buildslave/jenkins/workspace/lldb-cmake-sanitized/lldb-build/bin/clang-11-x86_64) :: test_dsym (lldbsuite.test.lldbtest.DisambiguateCallSite_V5) runCmd: settings clear -all output:

Hide Details

runCmd: settings set symbols.enable-external-lookup false output:

Hide Details

runCmd: settings set target.auto-apply-fixits false output:

Hide Details

runCmd: settings set plugin.process.gdb-remote.packet-timeout 60 output:

Hide Details

runCmd: settings set symbols.clang-modules-cache-path "/Users/buildslave/jenkins/workspace/lldb-cmake-sanitized/lldb-build/lldb-test-build.noindex/module-cache-lldb/lldb-api" output:

Hide Details

runCmd: settings set use-color false output:

Hide Details

runCmd: setting set target.prefer-dynamic-value no-dynamic-values output:

Hide Details

runCmd: settings set target.env-vars ASAN_OPTIONS=detect_stack_use_after_return=1 DYLD_INSERT_LIBRARIES=/Users/buildslave/jenkins/workspace/lldb-cmake-sanitized/host-compiler/lib/clang/11.0.0/lib/darwin/libclang_rt.asan_osx_dynamic.dylib output:

Hide Details

runCmd: bt output: * thread #1, queue = 'com.apple.main-thread', stop reason = breakpoint 1.1 * frame #0: 0x0000000100921f64 a.out`sink() at main.cpp:4:4 [opt] frame #1: 0x0000000100921f75 a.out`func2() at main.cpp:11:3 [opt] [artificial] frame #2: 0x0000000100921f9d a.out`main(argc=1, (null)=<unavailable>) at main.cpp:19:3 [opt] frame #3: 0x00007fff5962a085 libdyld.dylib`start + 1

Hide Details

Hide Details

Hide Details

--- FileCheck trace (code=0) --- /Users/buildslave/jenkins/workspace/lldb-cmake-sanitized/lldb-build/bin/FileCheck /Users/buildslave/jenkins/workspace/lldb-cmake-sanitized/llvm-project/lldb/test/API/functionalities/tail_call_frames/disambiguate_call_site/main.cpp -implicit-check-not=artificial

Hide Details

FileCheck input: * thread #1, queue = 'com.apple.main-thread', stop reason = breakpoint 1.1 * frame #0: 0x0000000100921f64 a.out`sink() at main.cpp:4:4 [opt] frame #1: 0x0000000100921f75 a.out`func2() at main.cpp:11:3 [opt] [artificial] frame #2: 0x0000000100921f9d a.out`main(argc=1, (null)=<unavailable>) at main.cpp:19:3 [opt] frame #3: 0x00007fff5962a085 libdyld.dylib`start + 1

Hide Details

Hide Details

FileCheck output:

Hide Details

Hide Details

Hide Details

Hide Details

<bound method SBProcess.Kill of <lldb.SBProcess; proxy of <Swig Object of type 'lldb::SBProcess *' at 0x10a93f960> >>: success

Hide Details

PASS: LLDB (/Users/buildslave/jenkins/workspace/lldb-cmake-sanitized/lldb-build/bin/clang-11-x86_64) :: test_dwarf (lldbsuite.test.lldbtest.DisambiguateCallSite_V5) UNSUPPORTED: LLDB (/Users/buildslave/jenkins/workspace/lldb-cmake-sanitized/lldb-build/bin/clang-11-x86_64) :: test_dwo (lldbsuite.test.lldbtest.DisambiguateCallSite_V5) (test case does not fall in any category of interest for this run) runCmd: settings clear -all output:

Hide Details

runCmd: settings set symbols.enable-external-lookup false output:

Hide Details

runCmd: settings set target.auto-apply-fixits false output:

Hide Details

runCmd: settings set plugin.process.gdb-remote.packet-timeout 60 output:

Hide Details

runCmd: settings set symbols.clang-modules-cache-path "/Users/buildslave/jenkins/workspace/lldb-cmake-sanitized/lldb-build/lldb-test-build.noindex/module-cache-lldb/lldb-api" output:

Hide Details

runCmd: settings set use-color false output:

Hide Details

runCmd: setting set target.prefer-dynamic-value no-dynamic-values output:

Hide Details

runCmd: settings set target.env-vars ASAN_OPTIONS=detect_stack_use_after_return=1 DYLD_INSERT_LIBRARIES=/Users/buildslave/jenkins/workspace/lldb-cmake-sanitized/host-compiler/lib/clang/11.0.0/lib/darwin/libclang_rt.asan_osx_dynamic.dylib output:

Hide Details

runCmd: bt output: * thread #1, queue = 'com.apple.main-thread', stop reason = breakpoint 1.1 * frame #0: 0x0000000106048f64 a.out`sink() at main.cpp:4:4 [opt] frame #1: 0x0000000106048f75 a.out`func2() at main.cpp:11:3 [opt] [artificial] frame #2: 0x0000000106048f9d a.out`main(argc=1, (null)=<unavailable>) at main.cpp:19:3 [opt] frame #3: 0x00007fff5962a085 libdyld.dylib`start + 1

Hide Details

Hide Details

Hide Details

--- FileCheck trace (code=0) --- /Users/buildslave/jenkins/workspace/lldb-cmake-sanitized/lldb-build/bin/FileCheck /Users/buildslave/jenkins/workspace/lldb-cmake-sanitized/llvm-project/lldb/test/API/functionalities/tail_call_frames/disambiguate_call_site/main.cpp -implicit-check-not=artificial

Hide Details

FileCheck input: * thread #1, queue = 'com.apple.main-thread', stop reason = breakpoint 1.1 * frame #0: 0x0000000106048f64 a.out`sink() at main.cpp:4:4 [opt] frame #1: 0x0000000106048f75 a.out`func2() at main.cpp:11:3 [opt] [artificial] frame #2: 0x0000000106048f9d a.out`main(argc=1, (null)=<unavailable>) at main.cpp:19:3 [opt] frame #3: 0x00007fff5962a085 libdyld.dylib`start + 1

Hide Details

Hide Details

FileCheck output:

Hide Details

Hide Details

Hide Details

Hide Details

<bound method SBProcess.Kill of <lldb.SBProcess; proxy of <Swig Object of type 'lldb::SBProcess *' at 0x109c8cc90> >>: success

Hide Details

PASS: LLDB (/Users/buildslave/jenkins/workspace/lldb-cmake-sanitized/lldb-build/bin/clang-11-x86_64) :: test_gmodules (lldbsuite.test.lldbtest.DisambiguateCallSite_V5) Restore dir to: /Users/buildslave/jenkins/workspace/lldb-cmake-sanitized/lldb-build/tools/lldb/test ====================================================================== FAIL: test_dsym (lldbsuite.test.lldbtest.DisambiguateCallSite_GNU) ---------------------------------------------------------------------- Traceback (most recent call last): File "/Users/buildslave/jenkins/workspace/lldb-cmake-sanitized/llvm-project/lldb/packages/Python/lldbsuite/test/lldbtest.py", line 1768, in test_method return attrvalue(self) File "/Users/buildslave/jenkins/workspace/lldb-cmake-sanitized/llvm-project/lldb/packages/Python/lldbsuite/test/decorators.py", line 140, in wrapper func(*args, **kwargs) File "/Users/buildslave/jenkins/workspace/lldb-cmake-sanitized/llvm-project/lldb/packages/Python/lldbsuite/test/decorators.py", line 140, in wrapper func(*args, **kwargs) File "/Users/buildslave/jenkins/workspace/lldb-cmake-sanitized/llvm-project/lldb/packages/Python/lldbsuite/test/lldbinline.py", line 124, in _test self.do_test() File "/Users/buildslave/jenkins/workspace/lldb-cmake-sanitized/llvm-project/lldb/packages/Python/lldbsuite/test/lldbinline.py", line 156, in do_test parser.handle_breakpoint(self, bp_id) File "/Users/buildslave/jenkins/workspace/lldb-cmake-sanitized/llvm-project/lldb/packages/Python/lldbsuite/test/lldbinline.py", line 80, in handle_breakpoint test.execute_user_command(breakpoint['command']) File "/Users/buildslave/jenkins/workspace/lldb-cmake-sanitized/llvm-project/lldb/packages/Python/lldbsuite/test/lldbinline.py", line 127, in execute_user_command exec(__command, globals(), locals()) File "<string>", line 1, in <module> File "/Users/buildslave/jenkins/workspace/lldb-cmake-sanitized/llvm-project/lldb/packages/Python/lldbsuite/test/lldbtest.py", line 2313, in filecheck self.assertTrue(cmd_status == 0) AssertionError: False is not True Config=x86_64-/Users/buildslave/jenkins/workspace/lldb-cmake-sanitized/lldb-build/bin/clang-11 ---------------------------------------------------------------------- Ran 8 tests in 19.255s

Hide Details

RESULT: FAILED (5 passes, 1 failures, 0 errors, 2 skipped, 0 expected failures, 0 unexpected successes)

Hide Details

--

Hide Details

******************** PASS: lldb-api :: commands/expression/completion-in-lambda-and-unnamed-class/TestCompletionInLambdaAndUnnamedClass.py (1690 of 2029) PASS: lldb-shell :: SymbolFile/NativePDB/ast-methods.cpp (1691 of 2029) PASS: lldb-unit :: Host/./HostTests/NativeProcessProtocolTest.ReadCStringFromMemory_CrossPageBoundary (1692 of 2029) PASS: lldb-shell :: Quit/TestQuitExitCode30.test (1693 of 2029) PASS: lldb-shell :: SymbolFile/DWARF/clang-ast-from-dwarf-objc-property.m (1694 of 2029) PASS: lldb-unit :: Utility/./UtilityTests/ArgsTest.ReplaceArgumentAtIndexShort (1695 of 2029) PASS: lldb-api :: python_api/target/TestTargetAPI.py (1696 of 2029) PASS: lldb-unit :: Utility/./UtilityTests/FileSpecTest.Match (1697 of 2029) PASS: lldb-shell :: SymbolFile/Breakpad/symtab-macho.test (1698 of 2029) UNSUPPORTED: lldb-api :: commands/expression/macros/TestMacros.py (1699 of 2029) PASS: lldb-api :: functionalities/deleted-executable/TestDeletedExecutable.py (1700 of 2029) PASS: lldb-api :: lang/c/local_types/TestUseClosestType.py (1701 of 2029) PASS: lldb-unit :: DataFormatter/./LLDBFormatterTests/StringPrinterTests.CxxASCII (1702 of 2029) PASS: lldb-unit :: Utility/./UtilityTests/StringListTest.JoinNonSpace (1703 of 2029) PASS: lldb-unit :: Utility/./UtilityTests/CompletionRequest.DuplicateFiltering (1704 of 2029) PASS: lldb-unit :: ScriptInterpreter/Python/./ScriptInterpreterPythonTests/PythonDataObjectsTest.TestRun (1705 of 2029) PASS: lldb-api :: python_api/name_lookup/TestNameLookup.py (1706 of 2029) PASS: lldb-unit :: Utility/./UtilityTests/Flags.AnySet (1707 of 2029) PASS: lldb-unit :: Utility/./UtilityTests/NameMatchesTest.Ignore (1708 of 2029) PASS: lldb-api :: lang/cpp/member-and-local-vars-with-same-name/TestMembersAndLocalsWithSameName.py (1709 of 2029) PASS: lldb-api :: macosx/function-starts/TestFunctionStarts.py (1710 of 2029) PASS: lldb-unit :: Language/Highlighting/./HighlighterTests/HighlighterTest.DefaultHighlighter (1711 of 2029) UNSUPPORTED: lldb-shell :: SymbolFile/PDB/function-nested-block.test (1712 of 2029) PASS: lldb-unit :: Utility/./UtilityTests/ArgsTest.GetQuotedCommandString (1713 of 2029) PASS: lldb-unit :: Utility/./UtilityTests/StringListTest.GetMaxStringLengthIncreasingSize (1714 of 2029) UNSUPPORTED: lldb-shell :: SymbolFile/PDB/enums-layout.test (1715 of 2029) PASS: lldb-unit :: SymbolFile/NativePDB/./SymbolFileNativePDBTests/PDBFPOProgramToDWARFExpressionTests.InvalidAssignmentSingle (1716 of 2029) PASS: lldb-shell :: ObjectFile/PECOFF/uuid.yaml (1717 of 2029) PASS: lldb-api :: commands/expression/import-std-module/weak_ptr/TestWeakPtrFromStdModule.py (1718 of 2029) PASS: lldb-unit :: Utility/./UtilityTests/StreamTest.PutBytesAsRawHex8ToMixedEndian (1719 of 2029) PASS: lldb-unit :: ObjectFile/ELF/./ObjectFileELFTests/ObjectFileELFTest.GetSymtab_NoSymEntryPointArmAddressClass (1720 of 2029) PASS: lldb-shell :: ObjectFile/ELF/minidebuginfo-corrupt-xz.yaml (1721 of 2029) PASS: lldb-unit :: UnwindAssembly/x86/./UnwindAssemblyx86Tests/Testx86AssemblyInspectionEngine.TestSimplex86_64Augmented (1722 of 2029) PASS: lldb-unit :: Utility/./UtilityTests/StringExtractorTest.GetU32LittleEndian (1723 of 2029) FAIL: lldb-api :: lang/objc/objc-new-syntax/TestObjCNewSyntaxDictionary.py (1724 of 2029) ******************** TEST 'lldb-api :: lang/objc/objc-new-syntax/TestObjCNewSyntaxDictionary.py' FAILED ******************** Script: -- /Users/buildslave/jenkins/workspace/lldb-cmake-sanitized/lldb-build/lldb-test-build.noindex/copied-system-python /Users/buildslave/jenkins/workspace/lldb-cmake-sanitized/llvm-project/lldb/test/API/dotest.py --arch x86_64 -s /Users/buildslave/jenkins/workspace/lldb-cmake-sanitized/lldb-build/lldb-test-traces -S nm -u CXXFLAGS -u CFLAGS --codesign-identity lldb_codesign --server /Users/buildslave/jenkins/workspace/lldb-cmake-sanitized/lldb-build/./bin/debugserver --arch x86_64 --build-dir /Users/buildslave/jenkins/workspace/lldb-cmake-sanitized/lldb-build/lldb-test-build.noindex -s=/Users/buildslave/jenkins/workspace/lldb-cmake-sanitized/test/logs -t --env TERM=vt100 --env LLVM_LIBS_DIR=/Users/buildslave/jenkins/workspace/lldb-cmake-sanitized/lldb-build/./lib --inferior-env ASAN_OPTIONS=detect_stack_use_after_return=1 --inferior-env DYLD_INSERT_LIBRARIES=/Users/buildslave/jenkins/workspace/lldb-cmake-sanitized/host-compiler/lib/clang/11.0.0/lib/darwin/libclang_rt.asan_osx_dynamic.dylib --build-dir /Users/buildslave/jenkins/workspace/lldb-cmake-sanitized/lldb-build/lldb-test-build.noindex --lldb-module-cache-dir /Users/buildslave/jenkins/workspace/lldb-cmake-sanitized/lldb-build/lldb-test-build.noindex/module-cache-lldb/lldb-api --clang-module-cache-dir /Users/buildslave/jenkins/workspace/lldb-cmake-sanitized/lldb-build/lldb-test-build.noindex/module-cache-clang/lldb-api --executable /Users/buildslave/jenkins/workspace/lldb-cmake-sanitized/lldb-build/./bin/lldb --compiler /Users/buildslave/jenkins/workspace/lldb-cmake-sanitized/lldb-build/./bin/clang --dsymutil /Users/buildslave/jenkins/workspace/lldb-cmake-sanitized/lldb-build/./bin/dsymutil --filecheck /Users/buildslave/jenkins/workspace/lldb-cmake-sanitized/lldb-build/./bin/FileCheck --lldb-libs-dir /Users/buildslave/jenkins/workspace/lldb-cmake-sanitized/lldb-build/./lib /Users/buildslave/jenkins/workspace/lldb-cmake-sanitized/llvm-project/lldb/test/API/lang/objc/objc-new-syntax -p TestObjCNewSyntaxDictionary.py -- Exit Code: -6

Hide Details

Command Output (stdout): -- lldb version 11.0.99 clang revision bff0c56ff92106afad22b54a90e1c612da4d6f99 llvm revision bff0c56ff92106afad22b54a90e1c612da4d6f99

Hide Details

-- Command Output (stderr): -- Assertion failed: (tokenKind == tok::kw___bridge_retain), function ParseParenExpression, file /Users/buildslave/jenkins/workspace/lldb-cmake-sanitized/llvm-project/clang/lib/Parse/ParseExpr.cpp, line 2804.

Hide Details

--

Hide Details

******************** PASS: lldb-shell :: SymbolFile/DWARF/find-qualified-variable.cpp (1725 of 2029) PASS: lldb-api :: commands/target/basic/TestTargetCommand.py (1726 of 2029) PASS: lldb-api :: lang/cpp/global_variables/TestCPPGlobalVariables.py (1727 of 2029) PASS: lldb-shell :: Register/x86-64-ymm-read.test (1728 of 2029) PASS: lldb-unit :: ScriptInterpreter/Python/./ScriptInterpreterPythonTests/PythonDataObjectsTest.TestPythonDictionaryValueEquality (1729 of 2029) PASS: lldb-unit :: tools/lldb-server/tests/./LLDBServerTests/StandardStartupTest.TestStopReplyContainsThreadPcs (1730 of 2029) PASS: lldb-api :: macosx/dyld-trie-symbols/TestDyldTrieSymbols.py (1731 of 2029) PASS: lldb-api :: functionalities/breakpoint/hardware_breakpoints/hardware_breakpoint_on_multiple_threads/TestHWBreakMultiThread.py (1732 of 2029) PASS: lldb-unit :: Utility/./UtilityTests/SubsystemRAIITest.NormalSubsystem (1733 of 2029) UNSUPPORTED: lldb-shell :: BuildScript/toolchain-clang-cl.test (1734 of 2029) UNSUPPORTED: lldb-shell :: SymbolFile/PDB/func-symbols.test (1735 of 2029) PASS: lldb-api :: functionalities/thread/concurrent_events/TestConcurrentCrashWithWatchpointBreakpointSignal.py (1736 of 2029) PASS: lldb-unit :: Utility/./UtilityTests/ArchSpecTest.MergeFromMachOUnknown (1737 of 2029) PASS: lldb-api :: functionalities/target_var/TestTargetVar.py (1738 of 2029) PASS: lldb-api :: api/check_public_api_headers/TestPublicAPIHeaders.py (1739 of 2029) FAIL: lldb-api :: commands/expression/po_verbosity/TestPoVerbosity.py (1740 of 2029) ******************** TEST 'lldb-api :: commands/expression/po_verbosity/TestPoVerbosity.py' FAILED ******************** Script: -- /Users/buildslave/jenkins/workspace/lldb-cmake-sanitized/lldb-build/lldb-test-build.noindex/copied-system-python /Users/buildslave/jenkins/workspace/lldb-cmake-sanitized/llvm-project/lldb/test/API/dotest.py --arch x86_64 -s /Users/buildslave/jenkins/workspace/lldb-cmake-sanitized/lldb-build/lldb-test-traces -S nm -u CXXFLAGS -u CFLAGS --codesign-identity lldb_codesign --server /Users/buildslave/jenkins/workspace/lldb-cmake-sanitized/lldb-build/./bin/debugserver --arch x86_64 --build-dir /Users/buildslave/jenkins/workspace/lldb-cmake-sanitized/lldb-build/lldb-test-build.noindex -s=/Users/buildslave/jenkins/workspace/lldb-cmake-sanitized/test/logs -t --env TERM=vt100 --env LLVM_LIBS_DIR=/Users/buildslave/jenkins/workspace/lldb-cmake-sanitized/lldb-build/./lib --inferior-env ASAN_OPTIONS=detect_stack_use_after_return=1 --inferior-env DYLD_INSERT_LIBRARIES=/Users/buildslave/jenkins/workspace/lldb-cmake-sanitized/host-compiler/lib/clang/11.0.0/lib/darwin/libclang_rt.asan_osx_dynamic.dylib --build-dir /Users/buildslave/jenkins/workspace/lldb-cmake-sanitized/lldb-build/lldb-test-build.noindex --lldb-module-cache-dir /Users/buildslave/jenkins/workspace/lldb-cmake-sanitized/lldb-build/lldb-test-build.noindex/module-cache-lldb/lldb-api --clang-module-cache-dir /Users/buildslave/jenkins/workspace/lldb-cmake-sanitized/lldb-build/lldb-test-build.noindex/module-cache-clang/lldb-api --executable /Users/buildslave/jenkins/workspace/lldb-cmake-sanitized/lldb-build/./bin/lldb --compiler /Users/buildslave/jenkins/workspace/lldb-cmake-sanitized/lldb-build/./bin/clang --dsymutil /Users/buildslave/jenkins/workspace/lldb-cmake-sanitized/lldb-build/./bin/dsymutil --filecheck /Users/buildslave/jenkins/workspace/lldb-cmake-sanitized/lldb-build/./bin/FileCheck --lldb-libs-dir /Users/buildslave/jenkins/workspace/lldb-cmake-sanitized/lldb-build/./lib /Users/buildslave/jenkins/workspace/lldb-cmake-sanitized/llvm-project/lldb/test/API/commands/expression/po_verbosity -p TestPoVerbosity.py -- Exit Code: -6

Hide Details

Command Output (stdout): -- lldb version 11.0.99 clang revision bff0c56ff92106afad22b54a90e1c612da4d6f99 llvm revision bff0c56ff92106afad22b54a90e1c612da4d6f99

Hide Details

-- Command Output (stderr): -- Assertion failed: (tokenKind == tok::kw___bridge_retain), function ParseParenExpression, file /Users/buildslave/jenkins/workspace/lldb-cmake-sanitized/llvm-project/clang/lib/Parse/ParseExpr.cpp, line 2804.

Hide Details

--

Hide Details

******************** PASS: lldb-unit :: ScriptInterpreter/Python/./ScriptInterpreterPythonTests/PythonDataObjectsTest.TestPythonBoolean (1741 of 2029) PASS: lldb-unit :: ScriptInterpreter/Python/./ScriptInterpreterPythonTests/PythonDataObjectsTest.TestTypeNameResolutionNoDot (1742 of 2029) UNSUPPORTED: lldb-shell :: SymbolFile/NativePDB/typedefs.cpp (1743 of 2029) PASS: lldb-unit :: SymbolFile/DWARF/./SymbolFileDWARFTests/SymbolFileDWARFTests.ParseArangesNonzeroSegmentSize (1744 of 2029) UNSUPPORTED: lldb-api :: api/multiple-debuggers/TestMultipleDebuggers.py (1745 of 2029) PASS: lldb-unit :: Utility/./UtilityTests/StreamTest.PutRawBytesToMixedEndian (1746 of 2029) PASS: lldb-unit :: Breakpoint/./LLDBBreakpointTests/BreakpointIDTest.StringIsBreakpointName (1747 of 2029) PASS: lldb-shell :: ObjectFile/Breakpad/sections-trailing-func.test (1748 of 2029) PASS: lldb-unit :: Utility/./UtilityTests/OptionsWithRawTest.EmptySuffix (1749 of 2029) PASS: lldb-api :: lang/c/blocks/TestBlocks.py (1750 of 2029) PASS: lldb-api :: commands/expression/persistent_types/TestNestedPersistentTypes.py (1751 of 2029) PASS: lldb-unit :: Utility/./UtilityTests/StreamTest.PutHex8 (1752 of 2029) PASS: lldb-api :: functionalities/archives/TestBSDArchives.py (1753 of 2029) PASS: lldb-unit :: Platform/./LLDBPlatformTests/PlatformDarwinTest.FindXcodeContentsDirectoryInPath (1754 of 2029) PASS: lldb-shell :: ObjectFile/ELF/avr-basic-info.yaml (1755 of 2029) PASS: lldb-api :: commands/expression/dont_allow_jit/TestAllowJIT.py (1756 of 2029) PASS: lldb-api :: commands/expression/import-std-module/deque-dbg-info-content/TestDbgInfoContentDequeFromStdModule.py (1757 of 2029) PASS: lldb-unit :: ScriptInterpreter/Python/./ScriptInterpreterPythonTests/PythonDataObjectsTest.TestModuleNameResolutionNoDot (1758 of 2029) PASS: lldb-shell :: ObjectFile/MachO/symtab.yaml (1759 of 2029) PASS: lldb-api :: functionalities/history/TestHistoryRecall.py (1760 of 2029) PASS: lldb-api :: functionalities/mtc/simple/TestMTCSimple.py (1761 of 2029) PASS: lldb-api :: commands/expression/invalid-args/TestInvalidArgsExpression.py (1762 of 2029) UNSUPPORTED: lldb-api :: functionalities/thread/multi_break/TestMultipleBreakpoints.py (1763 of 2029) PASS: lldb-shell :: ObjectFile/Breakpad/breakpad-identification.test (1764 of 2029) PASS: lldb-unit :: Utility/./UtilityTests/StringListTest.GetMaxStringLengthMixed (1765 of 2029) PASS: lldb-unit :: SymbolFile/DWARF/./SymbolFileDWARFTests/SymbolFileDWARFTests.TestAbbrevOrder1Start5 (1766 of 2029) PASS: lldb-api :: commands/platform/basic/TestPlatformCommand.py (1767 of 2029) PASS: lldb-unit :: Utility/./UtilityTests/StreamTest.PutULEB128 (1768 of 2029) PASS: lldb-api :: lang/cpp/bool/TestCPPBool.py (1769 of 2029) PASS: lldb-unit :: UnwindAssembly/x86/./UnwindAssemblyx86Tests/Testx86AssemblyInspectionEngine.TestSpArithx86_64Augmented (1770 of 2029) PASS: lldb-shell :: Settings/TestDisableColor.test (1771 of 2029) UNSUPPORTED: lldb-api :: functionalities/darwin_log/filter/exact_match/category/TestDarwinLogFilterMatchCategory.py (1772 of 2029) PASS: lldb-unit :: Utility/./UtilityTests/VASprintfTest.NoBufferResize (1773 of 2029) PASS: lldb-api :: functionalities/data-formatter/data-formatter-stl/libcxx/initializerlist/TestInitializerList.py (1774 of 2029) PASS: lldb-unit :: Core/./LLDBCoreTests/RichManglingContextTest.Basic (1775 of 2029) PASS: lldb-unit :: Utility/./UtilityTests/BinaryStreamTest.PutULEB128SixBytes (1776 of 2029) PASS: lldb-api :: lang/cpp/stl/TestSTL.py (1777 of 2029) UNSUPPORTED: lldb-shell :: Minidump/Windows/arm-fp-unwind.test (1778 of 2029) PASS: lldb-unit :: Utility/./UtilityTests/ArchSpecTest.Compatibility (1779 of 2029) PASS: lldb-api :: commands/expression/formatters/TestFormatters.py (1780 of 2029) PASS: lldb-api :: functionalities/breakpoint/scripted_bkpt/TestScriptedResolver.py (1781 of 2029) PASS: lldb-unit :: Symbol/./SymbolTests/TestTypeSystemClang.TestGetBasicTypeFromEnum (1782 of 2029) PASS: lldb-api :: commands/expression/top-level/TestTopLevelExprs.py (1783 of 2029) UNSUPPORTED: lldb-shell :: Register/x86-gp-write.test (1784 of 2029) PASS: lldb-api :: lang/cpp/rvalue-references/TestRvalueReferences.py (1785 of 2029) PASS: lldb-api :: lang/cpp/this/TestCPPThis.py (1786 of 2029) PASS: lldb-api :: functionalities/thread/exit_during_break/TestExitDuringBreak.py (1787 of 2029) PASS: lldb-unit :: Utility/./UtilityTests/RangeTest.LessThanInvalid (1788 of 2029) UNSUPPORTED: lldb-api :: functionalities/tty/TestTerminal.py (1789 of 2029) PASS: lldb-unit :: Expression/./ExpressionTests/DWARFExpression.DW_OP_pick (1790 of 2029) PASS: lldb-shell :: ObjectFile/ELF/netbsd-exec-8.99.30-amd64.yaml (1791 of 2029) PASS: lldb-shell :: SymbolFile/NativePDB/globals-fundamental.cpp (1792 of 2029) PASS: lldb-api :: commands/expression/import-std-module/queue/TestQueueFromStdModule.py (1793 of 2029) PASS: lldb-unit :: Expression/./ExpressionTests/CppModuleConfigurationTest.LibCppV2 (1794 of 2029) PASS: lldb-unit :: Host/./HostTests/FileSystemTest.GetPermissions (1795 of 2029) PASS: lldb-shell :: SymbolFile/DWARF/static_scope.s (1796 of 2029) PASS: lldb-unit :: UnwindAssembly/x86/./UnwindAssemblyx86Tests/Testx86AssemblyInspectionEngine.TestPushEAX (1797 of 2029) PASS: lldb-api :: functionalities/data-formatter/data-formatter-stl/libcxx/multiset/TestDataFormatterLibcxxMultiSet.py (1798 of 2029) PASS: lldb-unit :: ScriptInterpreter/Python/./ScriptInterpreterPythonTests/PythonDataObjectsTest.TestPythonIntegerToStructuredInteger (1799 of 2029) PASS: lldb-unit :: Symbol/./SymbolTests/LineEntryTest.GetSameLineContiguousAddressRangeNestedInline (1800 of 2029) PASS: lldb-unit :: Host/./HostTests/MainLoopTest.UnmonitoredSignal (1801 of 2029) PASS: lldb-unit :: Symbol/./SymbolTests/TestTypeSystemClang.TestConvertAccessTypeToAccessSpecifier (1802 of 2029) PASS: lldb-api :: commands/watchpoints/watchpoint_set_command/TestWatchLocationWithWatchSet.py (1803 of 2029) PASS: lldb-api :: commands/apropos/with-process/TestAproposWithProcess.py (1804 of 2029) PASS: lldb-unit :: Utility/./UtilityTests/OptionsWithRawTest.ArgsButNoLeadingDash (1805 of 2029) PASS: lldb-unit :: Utility/./UtilityTests/FileSpecTest.FormatFileSpec (1806 of 2029) PASS: lldb-api :: functionalities/data-formatter/data-formatter-stl/libcxx/map/TestDataFormatterLibccMap.py (1807 of 2029) PASS: lldb-api :: lang/cpp/dynamic-value/TestDynamicValue.py (1808 of 2029) PASS: lldb-unit :: Host/./HostTests/MainLoopTest.ReadObject (1809 of 2029) PASS: lldb-api :: functionalities/breakpoint/breakpoint_options/TestBreakpointOptions.py (1810 of 2029) PASS: lldb-unit :: Utility/./UtilityTests/UriParserTest.BracketedHostnameWithPortIPv6 (1811 of 2029) PASS: lldb-unit :: Utility/./UtilityTests/ConstStringTest.YAML (1812 of 2029) PASS: lldb-unit :: Host/./HostTests/MainLoopTest.DetectsEOF (1813 of 2029) PASS: lldb-unit :: Host/./HostTests/FileSystemTest.EmptyTest (1814 of 2029) PASS: lldb-unit :: Utility/./UtilityTests/StringListTest.AppendListCStringArray (1815 of 2029) PASS: lldb-api :: python_api/module_section/TestModuleAndSection.py (1816 of 2029) UNSUPPORTED: lldb-api :: arm/breakpoint-it/TestBreakpointIt.py (1817 of 2029) PASS: lldb-api :: functionalities/data-formatter/refpointer-recursion/TestDataFormatterRefPtrRecursion.py (1818 of 2029) PASS: lldb-unit :: Utility/./UtilityTests/XcodeSDKTest.GetCanonicalNameAndConstruct (1819 of 2029) PASS: lldb-unit :: Process/gdb-remote/./ProcessGdbRemoteTests/GDBRemoteClientBaseTest.SendContinueAndWait (1820 of 2029) PASS: lldb-shell :: SymbolFile/Breakpad/line-table-edgecases.test (1821 of 2029) PASS: lldb-api :: lang/c/offsetof/TestOffsetof.py (1822 of 2029) PASS: lldb-unit :: Language/CPlusPlus/./LanguageCPlusPlusTests/CPlusPlusLanguage.ExtractContextAndIdentifier (1823 of 2029) PASS: lldb-unit :: Process/minidump/./LLDBMinidumpTests/MinidumpParserTest.GetPidWindows (1824 of 2029) PASS: lldb-api :: commands/target/create-deps/TestTargetCreateDeps.py (1825 of 2029) PASS: lldb-unit :: Utility/./UtilityTests/RecordReplayTest.InstrumentedFooSameThis (1826 of 2029) PASS: lldb-unit :: Utility/./UtilityTests/ArgsTest.TestOverwriteArgs (1827 of 2029) PASS: lldb-api :: functionalities/gdb_remote_client/TestNoGPacketSupported.py (1828 of 2029) PASS: lldb-unit :: UnwindAssembly/x86/./UnwindAssemblyx86Tests/Testx86AssemblyInspectionEngine.TestSpillRegToStackViaMOVi386 (1829 of 2029) PASS: lldb-api :: functionalities/breakpoint/breakpoint_command/TestBreakpointCommandsFromPython.py (1830 of 2029) PASS: lldb-api :: commands/expression/call-function/TestCallStopAndContinue.py (1831 of 2029) PASS: lldb-unit :: Utility/./UtilityTests/UserIDResolver.GetUserName (1832 of 2029) PASS: lldb-api :: lang/objc/objc-static-method-stripped/TestObjCStaticMethodStripped.py (1833 of 2029) PASS: lldb-unit :: Utility/./UtilityTests/UUIDTest.StringConverion (1834 of 2029) PASS: lldb-api :: commands/source/info/TestSourceInfo.py (1835 of 2029) PASS: lldb-unit :: Language/Highlighting/./HighlighterTests/HighlighterTest.ClangEmptyInput (1836 of 2029) PASS: lldb-api :: functionalities/gdb_remote_client/TestRecognizeBreakpoint.py (1837 of 2029) PASS: lldb-api :: python_api/sbvalue_persist/TestSBValuePersist.py (1838 of 2029) PASS: lldb-shell :: SymbolFile/DWARF/compilercontext.ll (1839 of 2029) PASS: lldb-api :: commands/expression/completion/TestExprCompletion.py (1840 of 2029) PASS: lldb-unit :: Utility/./UtilityTests/TimerTest.CategoryTimes2 (1841 of 2029) PASS: lldb-api :: macosx/find-app-in-bundle/TestFindAppInBundle.py (1842 of 2029) PASS: lldb-unit :: Language/Highlighting/./HighlighterTests/HighlighterTest.ClangSquareBrackets (1843 of 2029) PASS: lldb-api :: functionalities/postmortem/wow64_minidump/TestWow64MiniDump.py (1844 of 2029) PASS: lldb-unit :: Utility/./UtilityTests/FileSpecTest.AppendPathComponent (1845 of 2029) PASS: lldb-unit :: Utility/./UtilityTests/StreamTest.PutHex16ByteOrderBig (1846 of 2029) PASS: lldb-shell :: Breakpoint/debug_rnglist_rlestartend.test (1847 of 2029) PASS: lldb-api :: functionalities/data-formatter/data-formatter-stl/libcxx/queue/TestDataFormatterLibcxxQueue.py (1848 of 2029) PASS: lldb-api :: lang/c/anonymous/TestAnonymous.py (1849 of 2029) PASS: lldb-unit :: SymbolFile/DWARF/./SymbolFileDWARFTests/SymbolFileDWARFTests.TestAbbrevOutOfOrder (1850 of 2029) PASS: lldb-unit :: Utility/./UtilityTests/StreamTest.PutHex64ByteOrderBig (1851 of 2029) PASS: lldb-api :: source-manager/TestSourceManager.py (1852 of 2029) PASS: lldb-api :: commands/expression/calculator_mode/TestCalculatorMode.py (1853 of 2029) PASS: lldb-unit :: Host/./HostTests/MainLoopTest.TerminatesImmediately (1854 of 2029) PASS: lldb-unit :: Utility/./UtilityTests/StringListTest.AppendList (1855 of 2029) PASS: lldb-shell :: ObjectFile/ELF/compressed-sections.yaml (1856 of 2029) PASS: lldb-api :: functionalities/abbreviation/TestAbbreviations.py (1857 of 2029) PASS: lldb-api :: commands/expression/persistent_ptr_update/TestPersistentPtrUpdate.py (1858 of 2029) PASS: lldb-api :: types/TestFloatTypes.py (1859 of 2029) PASS: lldb-unit :: Host/./HostTests/SocketTest.DomainGetConnectURI (1860 of 2029) PASS: lldb-api :: tools/lldb-vscode/breakpoint/TestVSCode_setFunctionBreakpoints.py (1861 of 2029) PASS: lldb-unit :: Utility/./UtilityTests/RangeTest.ClearWithStarAddress (1862 of 2029) PASS: lldb-unit :: Utility/./UtilityTests/StringExtractorTest.DecodeHexU8_InvalidHex (1863 of 2029) PASS: lldb-unit :: Utility/./UtilityTests/StreamTest.ShiftOperatorStrings (1864 of 2029) PASS: lldb-unit :: Target/./TargetTests/ExecutionContextTest.GetByteOrderProcess (1865 of 2029) PASS: lldb-shell :: SymbolFile/DWARF/dwarf5_locations.s (1866 of 2029) UNSUPPORTED: lldb-shell :: SymbolFile/NativePDB/ast-functions-msvc.cpp (1867 of 2029) PASS: lldb-unit :: Process/minidump/./LLDBMinidumpTests/MinidumpParserTest.GetThreadContext_x86_32 (1868 of 2029) PASS: lldb-api :: api/log/TestAPILog.py (1869 of 2029) UNSUPPORTED: lldb-api :: functionalities/darwin_log/filter/exact_match/message/TestDarwinLogFilterMatchMessage.py (1870 of 2029) PASS: lldb-unit :: Language/Highlighting/./HighlighterTests/HighlighterTest.ClangCursorPosAfterOtherToken (1871 of 2029) UNSUPPORTED: lldb-api :: functionalities/darwin_log/filter/regex/activity-chain/TestDarwinLogFilterRegexActivityChain.py (1872 of 2029) PASS: lldb-api :: lang/c/register_variables/TestRegisterVariables.py (1873 of 2029) PASS: lldb-unit :: Utility/./UtilityTests/UriParserTest.MinimalPath (1874 of 2029) PASS: lldb-unit :: Process/minidump/./LLDBMinidumpTests/MinidumpParserTest.GetThreadContext_x86_32_wow64 (1875 of 2029) PASS: lldb-api :: functionalities/data-formatter/data-formatter-objc/TestDataFormatterObjCNSDate.py (1876 of 2029) PASS: lldb-api :: commands/apropos/basic/TestApropos.py (1877 of 2029) PASS: lldb-api :: commands/expression/static-initializers/TestStaticInitializers.py (1878 of 2029) PASS: lldb-shell :: Reproducer/TestPythonImport.test (1879 of 2029) FAIL: lldb-api :: lang/objc/self/TestObjCSelf.py (1880 of 2029) ******************** TEST 'lldb-api :: lang/objc/self/TestObjCSelf.py' FAILED ******************** Script: -- /Users/buildslave/jenkins/workspace/lldb-cmake-sanitized/lldb-build/lldb-test-build.noindex/copied-system-python /Users/buildslave/jenkins/workspace/lldb-cmake-sanitized/llvm-project/lldb/test/API/dotest.py --arch x86_64 -s /Users/buildslave/jenkins/workspace/lldb-cmake-sanitized/lldb-build/lldb-test-traces -S nm -u CXXFLAGS -u CFLAGS --codesign-identity lldb_codesign --server /Users/buildslave/jenkins/workspace/lldb-cmake-sanitized/lldb-build/./bin/debugserver --arch x86_64 --build-dir /Users/buildslave/jenkins/workspace/lldb-cmake-sanitized/lldb-build/lldb-test-build.noindex -s=/Users/buildslave/jenkins/workspace/lldb-cmake-sanitized/test/logs -t --env TERM=vt100 --env LLVM_LIBS_DIR=/Users/buildslave/jenkins/workspace/lldb-cmake-sanitized/lldb-build/./lib --inferior-env ASAN_OPTIONS=detect_stack_use_after_return=1 --inferior-env DYLD_INSERT_LIBRARIES=/Users/buildslave/jenkins/workspace/lldb-cmake-sanitized/host-compiler/lib/clang/11.0.0/lib/darwin/libclang_rt.asan_osx_dynamic.dylib --build-dir /Users/buildslave/jenkins/workspace/lldb-cmake-sanitized/lldb-build/lldb-test-build.noindex --lldb-module-cache-dir /Users/buildslave/jenkins/workspace/lldb-cmake-sanitized/lldb-build/lldb-test-build.noindex/module-cache-lldb/lldb-api --clang-module-cache-dir /Users/buildslave/jenkins/workspace/lldb-cmake-sanitized/lldb-build/lldb-test-build.noindex/module-cache-clang/lldb-api --executable /Users/buildslave/jenkins/workspace/lldb-cmake-sanitized/lldb-build/./bin/lldb --compiler /Users/buildslave/jenkins/workspace/lldb-cmake-sanitized/lldb-build/./bin/clang --dsymutil /Users/buildslave/jenkins/workspace/lldb-cmake-sanitized/lldb-build/./bin/dsymutil --filecheck /Users/buildslave/jenkins/workspace/lldb-cmake-sanitized/lldb-build/./bin/FileCheck --lldb-libs-dir /Users/buildslave/jenkins/workspace/lldb-cmake-sanitized/lldb-build/./lib /Users/buildslave/jenkins/workspace/lldb-cmake-sanitized/llvm-project/lldb/test/API/lang/objc/self -p TestObjCSelf.py -- Exit Code: -6

Hide Details

Command Output (stdout): -- lldb version 11.0.99 clang revision bff0c56ff92106afad22b54a90e1c612da4d6f99 llvm revision bff0c56ff92106afad22b54a90e1c612da4d6f99

Hide Details

-- Command Output (stderr): -- Assertion failed: (tokenKind == tok::kw___bridge_retain), function ParseParenExpression, file /Users/buildslave/jenkins/workspace/lldb-cmake-sanitized/llvm-project/clang/lib/Parse/ParseExpr.cpp, line 2804.

Hide Details

--

Hide Details

******************** PASS: lldb-api :: commands/expression/entry-bp/TestExprEntryBP.py (1881 of 2029) PASS: lldb-api :: commands/command/delete/TestCommandDelete.py (1882 of 2029) PASS: lldb-unit :: Platform/./LLDBPlatformTests/PlatformDarwinTest.FindComponentInPath (1883 of 2029) PASS: lldb-unit :: Utility/./UtilityTests/StringListTest.GetMaxStringLengthEqualSize (1884 of 2029) PASS: lldb-api :: functionalities/memory-region/TestMemoryRegion.py (1885 of 2029) PASS: lldb-api :: functionalities/data-formatter/summary-string-onfail/Test-rdar-9974002.py (1886 of 2029) PASS: lldb-unit :: Utility/./UtilityTests/OptionsWithRawTest.MultiWordSuffix (1887 of 2029) PASS: lldb-unit :: Interpreter/./InterpreterTests/CompletionTest.DirCompletionUsername (1888 of 2029) UNSUPPORTED: lldb-api :: functionalities/darwin_log/format/TestDarwinLogMessageFormat.py (1889 of 2029) PASS: lldb-api :: functionalities/thread/concurrent_events/TestConcurrentCrashWithWatchpoint.py (1890 of 2029) PASS: lldb-shell :: SymbolFile/NativePDB/ast-types.cpp (1891 of 2029) PASS: lldb-shell :: SymbolFile/DWARF/debug_ranges_and_rnglists.test (1892 of 2029) XFAIL: lldb-shell :: Unwind/prefer-debug-over-eh-frame.test (1893 of 2029) PASS: lldb-unit :: Language/CPlusPlus/./LanguageCPlusPlusTests/CPlusPlusLanguage.CPlusPlusNameParser (1894 of 2029) XFAIL: lldb-shell :: Register/x86-mm-xmm-write.test (1895 of 2029) UNSUPPORTED: lldb-api :: functionalities/thread/create_during_step/TestCreateDuringStep.py (1896 of 2029) PASS: lldb-unit :: Utility/./UtilityTests/GeneratorTest.GetOrCreate (1897 of 2029) PASS: lldb-api :: commands/expression/import-std-module/list-dbg-info-content/TestDbgInfoContentListFromStdModule.py (1898 of 2029) PASS: lldb-api :: commands/command/script_alias/TestCommandScriptAlias.py (1899 of 2029) FAIL: lldb-api :: lang/objc/foundation/TestRuntimeTypes.py (1900 of 2029) ******************** TEST 'lldb-api :: lang/objc/foundation/TestRuntimeTypes.py' FAILED ******************** Script: -- /Users/buildslave/jenkins/workspace/lldb-cmake-sanitized/lldb-build/lldb-test-build.noindex/copied-system-python /Users/buildslave/jenkins/workspace/lldb-cmake-sanitized/llvm-project/lldb/test/API/dotest.py --arch x86_64 -s /Users/buildslave/jenkins/workspace/lldb-cmake-sanitized/lldb-build/lldb-test-traces -S nm -u CXXFLAGS -u CFLAGS --codesign-identity lldb_codesign --server /Users/buildslave/jenkins/workspace/lldb-cmake-sanitized/lldb-build/./bin/debugserver --arch x86_64 --build-dir /Users/buildslave/jenkins/workspace/lldb-cmake-sanitized/lldb-build/lldb-test-build.noindex -s=/Users/buildslave/jenkins/workspace/lldb-cmake-sanitized/test/logs -t --env TERM=vt100 --env LLVM_LIBS_DIR=/Users/buildslave/jenkins/workspace/lldb-cmake-sanitized/lldb-build/./lib --inferior-env ASAN_OPTIONS=detect_stack_use_after_return=1 --inferior-env DYLD_INSERT_LIBRARIES=/Users/buildslave/jenkins/workspace/lldb-cmake-sanitized/host-compiler/lib/clang/11.0.0/lib/darwin/libclang_rt.asan_osx_dynamic.dylib --build-dir /Users/buildslave/jenkins/workspace/lldb-cmake-sanitized/lldb-build/lldb-test-build.noindex --lldb-module-cache-dir /Users/buildslave/jenkins/workspace/lldb-cmake-sanitized/lldb-build/lldb-test-build.noindex/module-cache-lldb/lldb-api --clang-module-cache-dir /Users/buildslave/jenkins/workspace/lldb-cmake-sanitized/lldb-build/lldb-test-build.noindex/module-cache-clang/lldb-api --executable /Users/buildslave/jenkins/workspace/lldb-cmake-sanitized/lldb-build/./bin/lldb --compiler /Users/buildslave/jenkins/workspace/lldb-cmake-sanitized/lldb-build/./bin/clang --dsymutil /Users/buildslave/jenkins/workspace/lldb-cmake-sanitized/lldb-build/./bin/dsymutil --filecheck /Users/buildslave/jenkins/workspace/lldb-cmake-sanitized/lldb-build/./bin/FileCheck --lldb-libs-dir /Users/buildslave/jenkins/workspace/lldb-cmake-sanitized/lldb-build/./lib /Users/buildslave/jenkins/workspace/lldb-cmake-sanitized/llvm-project/lldb/test/API/lang/objc/foundation -p TestRuntimeTypes.py -- Exit Code: -6

Hide Details

Command Output (stdout): -- lldb version 11.0.99 clang revision bff0c56ff92106afad22b54a90e1c612da4d6f99 llvm revision bff0c56ff92106afad22b54a90e1c612da4d6f99

Hide Details

-- Command Output (stderr): -- Assertion failed: (tokenKind == tok::kw___bridge_retain), function ParseParenExpression, file /Users/buildslave/jenkins/workspace/lldb-cmake-sanitized/llvm-project/clang/lib/Parse/ParseExpr.cpp, line 2804.

Hide Details

--

Hide Details

******************** PASS: lldb-unit :: Utility/./UtilityTests/XcodeSDKTest.GetSDKTypeForTriple (1901 of 2029) PASS: lldb-api :: lang/c/set_values/TestSetValues.py (1902 of 2029) PASS: lldb-api :: types/TestLongTypesExpr.py (1903 of 2029) PASS: lldb-shell :: Commands/command-backtrace.test (1904 of 2029) PASS: lldb-unit :: Core/./LLDBCoreTests/StreamCallbackTest.Callback (1905 of 2029) PASS: lldb-unit :: Symbol/./SymbolTests/TestClangASTImporter.RecordLayout (1906 of 2029) PASS: lldb-shell :: ObjectFile/PECOFF/dep-modules.yaml (1907 of 2029) PASS: lldb-unit :: Utility/./UtilityTests/StringListTest.InsertStringAtIndexOutOfBounds (1908 of 2029) PASS: lldb-unit :: Process/minidump/./LLDBMinidumpTests/RegisterContextMinidump.CheckRegisterContextMinidump_ARM (1909 of 2029) PASS: lldb-unit :: Utility/./UtilityTests/VMRange.CollectionContains (1910 of 2029) PASS: lldb-unit :: Utility/./UtilityTests/TimeoutTest.Format (1911 of 2029) PASS: lldb-api :: tools/lldb-vscode/breakpoint-events/TestVSCode_breakpointEvents.py (1912 of 2029) PASS: lldb-unit :: Utility/./UtilityTests/StreamTest.AddressRangeSize (1913 of 2029) PASS: lldb-unit :: Process/gdb-remote/./ProcessGdbRemoteTests/GDBRemoteCommunicationClientTest.GetMemoryRegionInfo (1914 of 2029) PASS: lldb-shell :: Commands/command-disassemble.s (1915 of 2029) PASS: lldb-api :: lang/objc/foundation/TestSymbolTable.py (1916 of 2029) PASS: lldb-unit :: UnwindAssembly/x86/./UnwindAssemblyx86Tests/Testx86AssemblyInspectionEngine.TestLEAVE (1917 of 2029) FAIL: lldb-api :: functionalities/tail_call_frames/disambiguate_paths_to_common_sink/TestDisambiguatePathsToCommonSink.py (1918 of 2029) ******************** TEST 'lldb-api :: functionalities/tail_call_frames/disambiguate_paths_to_common_sink/TestDisambiguatePathsToCommonSink.py' FAILED ******************** Script: -- /Users/buildslave/jenkins/workspace/lldb-cmake-sanitized/lldb-build/lldb-test-build.noindex/copied-system-python /Users/buildslave/jenkins/workspace/lldb-cmake-sanitized/llvm-project/lldb/test/API/dotest.py --arch x86_64 -s /Users/buildslave/jenkins/workspace/lldb-cmake-sanitized/lldb-build/lldb-test-traces -S nm -u CXXFLAGS -u CFLAGS --codesign-identity lldb_codesign --server /Users/buildslave/jenkins/workspace/lldb-cmake-sanitized/lldb-build/./bin/debugserver --arch x86_64 --build-dir /Users/buildslave/jenkins/workspace/lldb-cmake-sanitized/lldb-build/lldb-test-build.noindex -s=/Users/buildslave/jenkins/workspace/lldb-cmake-sanitized/test/logs -t --env TERM=vt100 --env LLVM_LIBS_DIR=/Users/buildslave/jenkins/workspace/lldb-cmake-sanitized/lldb-build/./lib --inferior-env ASAN_OPTIONS=detect_stack_use_after_return=1 --inferior-env DYLD_INSERT_LIBRARIES=/Users/buildslave/jenkins/workspace/lldb-cmake-sanitized/host-compiler/lib/clang/11.0.0/lib/darwin/libclang_rt.asan_osx_dynamic.dylib --build-dir /Users/buildslave/jenkins/workspace/lldb-cmake-sanitized/lldb-build/lldb-test-build.noindex --lldb-module-cache-dir /Users/buildslave/jenkins/workspace/lldb-cmake-sanitized/lldb-build/lldb-test-build.noindex/module-cache-lldb/lldb-api --clang-module-cache-dir /Users/buildslave/jenkins/workspace/lldb-cmake-sanitized/lldb-build/lldb-test-build.noindex/module-cache-clang/lldb-api --executable /Users/buildslave/jenkins/workspace/lldb-cmake-sanitized/lldb-build/./bin/lldb --compiler /Users/buildslave/jenkins/workspace/lldb-cmake-sanitized/lldb-build/./bin/clang --dsymutil /Users/buildslave/jenkins/workspace/lldb-cmake-sanitized/lldb-build/./bin/dsymutil --filecheck /Users/buildslave/jenkins/workspace/lldb-cmake-sanitized/lldb-build/./bin/FileCheck --lldb-libs-dir /Users/buildslave/jenkins/workspace/lldb-cmake-sanitized/lldb-build/./lib /Users/buildslave/jenkins/workspace/lldb-cmake-sanitized/llvm-project/lldb/test/API/functionalities/tail_call_frames/disambiguate_paths_to_common_sink -p TestDisambiguatePathsToCommonSink.py -- Exit Code: 1

Hide Details

Command Output (stdout): -- lldb version 11.0.99 clang revision bff0c56ff92106afad22b54a90e1c612da4d6f99 llvm revision bff0c56ff92106afad22b54a90e1c612da4d6f99 LLDB library dir: /Users/buildslave/jenkins/workspace/lldb-cmake-sanitized/lldb-build/bin LLDB import library dir: /Users/buildslave/jenkins/workspace/lldb-cmake-sanitized/lldb-build/./lib libstdcxx tests will not be run because: Don't know how to build with libstdcxx on macosx Skipping following debug info categories: ['dwo'] a.out was compiled with optimization - stepping may behave oddly; variables may not be available. a.out was compiled with optimization - stepping may behave oddly; variables may not be available. a.out was compiled with optimization - stepping may behave oddly; variables may not be available.

Hide Details

-- Command Output (stderr): --

Hide Details

Session logs for test failures/errors/unexpected successes will go into directory '/Users/buildslave/jenkins/workspace/lldb-cmake-sanitized/test/logs' Command invoked: /Users/buildslave/jenkins/workspace/lldb-cmake-sanitized/llvm-project/lldb/test/API/dotest.py --arch x86_64 -s /Users/buildslave/jenkins/workspace/lldb-cmake-sanitized/lldb-build/lldb-test-traces -S nm -u CXXFLAGS -u CFLAGS --codesign-identity lldb_codesign --server /Users/buildslave/jenkins/workspace/lldb-cmake-sanitized/lldb-build/./bin/debugserver --arch x86_64 --build-dir /Users/buildslave/jenkins/workspace/lldb-cmake-sanitized/lldb-build/lldb-test-build.noindex -s=/Users/buildslave/jenkins/workspace/lldb-cmake-sanitized/test/logs -t --env TERM=vt100 --env LLVM_LIBS_DIR=/Users/buildslave/jenkins/workspace/lldb-cmake-sanitized/lldb-build/./lib --inferior-env ASAN_OPTIONS=detect_stack_use_after_return=1 --inferior-env DYLD_INSERT_LIBRARIES=/Users/buildslave/jenkins/workspace/lldb-cmake-sanitized/host-compiler/lib/clang/11.0.0/lib/darwin/libclang_rt.asan_osx_dynamic.dylib --build-dir /Users/buildslave/jenkins/workspace/lldb-cmake-sanitized/lldb-build/lldb-test-build.noindex --lldb-module-cache-dir /Users/buildslave/jenkins/workspace/lldb-cmake-sanitized/lldb-build/lldb-test-build.noindex/module-cache-lldb/lldb-api --clang-module-cache-dir /Users/buildslave/jenkins/workspace/lldb-cmake-sanitized/lldb-build/lldb-test-build.noindex/module-cache-clang/lldb-api --executable /Users/buildslave/jenkins/workspace/lldb-cmake-sanitized/lldb-build/./bin/lldb --compiler /Users/buildslave/jenkins/workspace/lldb-cmake-sanitized/lldb-build/./bin/clang --dsymutil /Users/buildslave/jenkins/workspace/lldb-cmake-sanitized/lldb-build/./bin/dsymutil --filecheck /Users/buildslave/jenkins/workspace/lldb-cmake-sanitized/lldb-build/./bin/FileCheck --lldb-libs-dir /Users/buildslave/jenkins/workspace/lldb-cmake-sanitized/lldb-build/./lib /Users/buildslave/jenkins/workspace/lldb-cmake-sanitized/llvm-project/lldb/test/API/functionalities/tail_call_frames/disambiguate_paths_to_common_sink -p TestDisambiguatePathsToCommonSink.py Change dir to: /Users/buildslave/jenkins/workspace/lldb-cmake-sanitized/llvm-project/lldb/test/API/functionalities/tail_call_frames/disambiguate_paths_to_common_sink runCmd: settings clear -all output:

Hide Details

runCmd: settings set symbols.enable-external-lookup false output:

Hide Details

runCmd: settings set target.auto-apply-fixits false output:

Hide Details

runCmd: settings set plugin.process.gdb-remote.packet-timeout 60 output:

Hide Details

runCmd: settings set symbols.clang-modules-cache-path "/Users/buildslave/jenkins/workspace/lldb-cmake-sanitized/lldb-build/lldb-test-build.noindex/module-cache-lldb/lldb-api" output:

Hide Details

runCmd: settings set use-color false output:

Hide Details

runCmd: setting set target.prefer-dynamic-value no-dynamic-values output:

Hide Details

runCmd: settings set target.env-vars ASAN_OPTIONS=detect_stack_use_after_return=1 DYLD_INSERT_LIBRARIES=/Users/buildslave/jenkins/workspace/lldb-cmake-sanitized/host-compiler/lib/clang/11.0.0/lib/darwin/libclang_rt.asan_osx_dynamic.dylib output:

Hide Details

runCmd: bt output: * thread #1, queue = 'com.apple.main-thread', stop reason = breakpoint 2.1 * frame #0: 0x000000010ff7bf79 a.out`sink(called_from_main=true) at main.cpp:14:6 frame #1: 0x000000010ff7bfae a.out`main(argc=<unavailable>, (null)=<unavailable>) at main.cpp:27:3 frame #2: 0x00007fff5962a085 libdyld.dylib`start + 1 frame #3: 0x00007fff5962a085 libdyld.dylib`start + 1

Hide Details

Hide Details

Hide Details

--- FileCheck trace (code=0) --- /Users/buildslave/jenkins/workspace/lldb-cmake-sanitized/lldb-build/bin/FileCheck /Users/buildslave/jenkins/workspace/lldb-cmake-sanitized/llvm-project/lldb/test/API/functionalities/tail_call_frames/disambiguate_paths_to_common_sink/main.cpp -check-prefix=FROM-MAIN

Hide Details

FileCheck input: * thread #1, queue = 'com.apple.main-thread', stop reason = breakpoint 2.1 * frame #0: 0x000000010ff7bf79 a.out`sink(called_from_main=true) at main.cpp:14:6 frame #1: 0x000000010ff7bfae a.out`main(argc=<unavailable>, (null)=<unavailable>) at main.cpp:27:3 frame #2: 0x00007fff5962a085 libdyld.dylib`start + 1 frame #3: 0x00007fff5962a085 libdyld.dylib`start + 1

Hide Details

Hide Details

FileCheck output:

Hide Details

Hide Details

Hide Details

Hide Details

runCmd: bt output: * thread #1, queue = 'com.apple.main-thread', stop reason = breakpoint 1.1 * frame #0: 0x000000010ff7bf64 a.out`sink2() at main.cpp:4:4 frame #1: 0x000000010ff7bfb3 a.out`main(argc=<unavailable>, (null)=<unavailable>) at main.cpp:28:3 frame #2: 0x00007fff5962a085 libdyld.dylib`start + 1 frame #3: 0x00007fff5962a085 libdyld.dylib`start + 1

Hide Details

Hide Details

Hide Details

--- FileCheck trace (code=1) --- /Users/buildslave/jenkins/workspace/lldb-cmake-sanitized/lldb-build/bin/FileCheck /Users/buildslave/jenkins/workspace/lldb-cmake-sanitized/llvm-project/lldb/test/API/functionalities/tail_call_frames/disambiguate_paths_to_common_sink/main.cpp -check-prefix=FROM-FUNC1

Hide Details

FileCheck input: * thread #1, queue = 'com.apple.main-thread', stop reason = breakpoint 1.1 * frame #0: 0x000000010ff7bf64 a.out`sink2() at main.cpp:4:4 frame #1: 0x000000010ff7bfb3 a.out`main(argc=<unavailable>, (null)=<unavailable>) at main.cpp:28:3 frame #2: 0x00007fff5962a085 libdyld.dylib`start + 1 frame #3: 0x00007fff5962a085 libdyld.dylib`start + 1

Hide Details

Hide Details

FileCheck output:

Hide Details

/Users/buildslave/jenkins/workspace/lldb-cmake-sanitized/llvm-project/lldb/test/API/functionalities/tail_call_frames/disambiguate_paths_to_common_sink/main.cpp:6:22: error: FROM-FUNC1-NEXT: expected string not found in input // FROM-FUNC1-NEXT: sink ^ <stdin>:2:60: note: scanning from here * frame #0: 0x000000010ff7bf64 a.out`sink2() at main.cpp:4:4 ^ <stdin>:3:38: note: possible intended match here frame #1: 0x000000010ff7bfb3 a.out`main(argc=<unavailable>, (null)=<unavailable>) at main.cpp:28:3 ^

Hide Details

Hide Details

Hide Details

FAIL: LLDB (/Users/buildslave/jenkins/workspace/lldb-cmake-sanitized/lldb-build/bin/clang-11-x86_64) :: test_dsym (lldbsuite.test.lldbtest.DisambiguatePathsToCommonSink_GNU) <bound method SBProcess.Kill of <lldb.SBProcess; proxy of <Swig Object of type 'lldb::SBProcess *' at 0x1272d0780> >>: success

Hide Details

runCmd: settings clear -all output:

Hide Details

runCmd: settings set symbols.enable-external-lookup false output:

Hide Details

runCmd: settings set target.auto-apply-fixits false output:

Hide Details

runCmd: settings set plugin.process.gdb-remote.packet-timeout 60 output:

Hide Details

runCmd: settings set symbols.clang-modules-cache-path "/Users/buildslave/jenkins/workspace/lldb-cmake-sanitized/lldb-build/lldb-test-build.noindex/module-cache-lldb/lldb-api" output:

Hide Details

runCmd: settings set use-color false output:

Hide Details

runCmd: setting set target.prefer-dynamic-value no-dynamic-values output:

Hide Details

runCmd: settings set target.env-vars ASAN_OPTIONS=detect_stack_use_after_return=1 DYLD_INSERT_LIBRARIES=/Users/buildslave/jenkins/workspace/lldb-cmake-sanitized/host-compiler/lib/clang/11.0.0/lib/darwin/libclang_rt.asan_osx_dynamic.dylib output:

Hide Details

runCmd: bt output: * thread #1, queue = 'com.apple.main-thread', stop reason = breakpoint 2.1 * frame #0: 0x000000010673af79 a.out`sink(called_from_main=true) at main.cpp:14:6 frame #1: 0x000000010673afae a.out`main(argc=<unavailable>, (null)=<unavailable>) at main.cpp:27:3 frame #2: 0x00007fff5962a085 libdyld.dylib`start + 1

Hide Details

Hide Details

Hide Details

--- FileCheck trace (code=0) --- /Users/buildslave/jenkins/workspace/lldb-cmake-sanitized/lldb-build/bin/FileCheck /Users/buildslave/jenkins/workspace/lldb-cmake-sanitized/llvm-project/lldb/test/API/functionalities/tail_call_frames/disambiguate_paths_to_common_sink/main.cpp -check-prefix=FROM-MAIN

Hide Details

FileCheck input: * thread #1, queue = 'com.apple.main-thread', stop reason = breakpoint 2.1 * frame #0: 0x000000010673af79 a.out`sink(called_from_main=true) at main.cpp:14:6 frame #1: 0x000000010673afae a.out`main(argc=<unavailable>, (null)=<unavailable>) at main.cpp:27:3 frame #2: 0x00007fff5962a085 libdyld.dylib`start + 1

Hide Details

Hide Details

FileCheck output:

Hide Details

Hide Details

Hide Details

Hide Details

runCmd: bt output: * thread #1, queue = 'com.apple.main-thread', stop reason = breakpoint 1.1 * frame #0: 0x000000010673af64 a.out`sink2() at main.cpp:4:4 frame #1: 0x000000010673af85 a.out`sink(called_from_main=<unavailable>) at main.cpp:18:5 [artificial] frame #2: 0x000000010673af9b a.out`func1() at main.cpp:22:42 [artificial] frame #3: 0x000000010673afb3 a.out`main(argc=<unavailable>, (null)=<unavailable>) at main.cpp:28:3 frame #4: 0x00007fff5962a085 libdyld.dylib`start + 1

Hide Details

Hide Details

Hide Details

--- FileCheck trace (code=0) --- /Users/buildslave/jenkins/workspace/lldb-cmake-sanitized/lldb-build/bin/FileCheck /Users/buildslave/jenkins/workspace/lldb-cmake-sanitized/llvm-project/lldb/test/API/functionalities/tail_call_frames/disambiguate_paths_to_common_sink/main.cpp -check-prefix=FROM-FUNC1

Hide Details

FileCheck input: * thread #1, queue = 'com.apple.main-thread', stop reason = breakpoint 1.1 * frame #0: 0x000000010673af64 a.out`sink2() at main.cpp:4:4 frame #1: 0x000000010673af85 a.out`sink(called_from_main=<unavailable>) at main.cpp:18:5 [artificial] frame #2: 0x000000010673af9b a.out`func1() at main.cpp:22:42 [artificial] frame #3: 0x000000010673afb3 a.out`main(argc=<unavailable>, (null)=<unavailable>) at main.cpp:28:3 frame #4: 0x00007fff5962a085 libdyld.dylib`start + 1

Hide Details

Hide Details

FileCheck output:

Hide Details

Hide Details

Hide Details

Hide Details

<bound method SBProcess.Kill of <lldb.SBProcess; proxy of <Swig Object of type 'lldb::SBProcess *' at 0x1100eac90> >>: success

Hide Details

PASS: LLDB (/Users/buildslave/jenkins/workspace/lldb-cmake-sanitized/lldb-build/bin/clang-11-x86_64) :: test_dwarf (lldbsuite.test.lldbtest.DisambiguatePathsToCommonSink_GNU) UNSUPPORTED: LLDB (/Users/buildslave/jenkins/workspace/lldb-cmake-sanitized/lldb-build/bin/clang-11-x86_64) :: test_dwo (lldbsuite.test.lldbtest.DisambiguatePathsToCommonSink_GNU) (test case does not fall in any category of interest for this run) runCmd: settings clear -all output:

Hide Details

runCmd: settings set symbols.enable-external-lookup false output:

Hide Details

runCmd: settings set target.auto-apply-fixits false output:

Hide Details

runCmd: settings set plugin.process.gdb-remote.packet-timeout 60 output:

Hide Details

runCmd: settings set symbols.clang-modules-cache-path "/Users/buildslave/jenkins/workspace/lldb-cmake-sanitized/lldb-build/lldb-test-build.noindex/module-cache-lldb/lldb-api" output:

Hide Details

runCmd: settings set use-color false output:

Hide Details

runCmd: setting set target.prefer-dynamic-value no-dynamic-values output:

Hide Details

runCmd: settings set target.env-vars ASAN_OPTIONS=detect_stack_use_after_return=1 DYLD_INSERT_LIBRARIES=/Users/buildslave/jenkins/workspace/lldb-cmake-sanitized/host-compiler/lib/clang/11.0.0/lib/darwin/libclang_rt.asan_osx_dynamic.dylib output:

Hide Details

runCmd: bt output: * thread #1, queue = 'com.apple.main-thread', stop reason = breakpoint 2.1 * frame #0: 0x000000010a576f79 a.out`sink(called_from_main=true) at main.cpp:14:6 frame #1: 0x000000010a576fae a.out`main(argc=<unavailable>, (null)=<unavailable>) at main.cpp:27:3 frame #2: 0x00007fff5962a085 libdyld.dylib`start + 1 frame #3: 0x00007fff5962a085 libdyld.dylib`start + 1

Hide Details

Hide Details

Hide Details

--- FileCheck trace (code=0) --- /Users/buildslave/jenkins/workspace/lldb-cmake-sanitized/lldb-build/bin/FileCheck /Users/buildslave/jenkins/workspace/lldb-cmake-sanitized/llvm-project/lldb/test/API/functionalities/tail_call_frames/disambiguate_paths_to_common_sink/main.cpp -check-prefix=FROM-MAIN

Hide Details

FileCheck input: * thread #1, queue = 'com.apple.main-thread', stop reason = breakpoint 2.1 * frame #0: 0x000000010a576f79 a.out`sink(called_from_main=true) at main.cpp:14:6 frame #1: 0x000000010a576fae a.out`main(argc=<unavailable>, (null)=<unavailable>) at main.cpp:27:3 frame #2: 0x00007fff5962a085 libdyld.dylib`start + 1 frame #3: 0x00007fff5962a085 libdyld.dylib`start + 1

Hide Details

Hide Details

FileCheck output:

Hide Details

Hide Details

Hide Details

Hide Details

runCmd: bt output: * thread #1, queue = 'com.apple.main-thread', stop reason = breakpoint 1.1 * frame #0: 0x000000010a576f64 a.out`sink2() at main.cpp:4:4 frame #1: 0x000000010a576f85 a.out`sink(called_from_main=<unavailable>) at main.cpp:18:5 [artificial] frame #2: 0x000000010a576f9b a.out`func1() at main.cpp:22:42 [artificial] frame #3: 0x000000010a576fb3 a.out`main(argc=<unavailable>, (null)=<unavailable>) at main.cpp:28:3 frame #4: 0x00007fff5962a085 libdyld.dylib`start + 1 frame #5: 0x00007fff5962a085 libdyld.dylib`start + 1

Hide Details

Hide Details

Hide Details

--- FileCheck trace (code=0) --- /Users/buildslave/jenkins/workspace/lldb-cmake-sanitized/lldb-build/bin/FileCheck /Users/buildslave/jenkins/workspace/lldb-cmake-sanitized/llvm-project/lldb/test/API/functionalities/tail_call_frames/disambiguate_paths_to_common_sink/main.cpp -check-prefix=FROM-FUNC1

Hide Details

FileCheck input: * thread #1, queue = 'com.apple.main-thread', stop reason = breakpoint 1.1 * frame #0: 0x000000010a576f64 a.out`sink2() at main.cpp:4:4 frame #1: 0x000000010a576f85 a.out`sink(called_from_main=<unavailable>) at main.cpp:18:5 [artificial] frame #2: 0x000000010a576f9b a.out`func1() at main.cpp:22:42 [artificial] frame #3: 0x000000010a576fb3 a.out`main(argc=<unavailable>, (null)=<unavailable>) at main.cpp:28:3 frame #4: 0x00007fff5962a085 libdyld.dylib`start + 1 frame #5: 0x00007fff5962a085 libdyld.dylib`start + 1

Hide Details

Hide Details

FileCheck output:

Hide Details

Hide Details

Hide Details

Hide Details

<bound method SBProcess.Kill of <lldb.SBProcess; proxy of <Swig Object of type 'lldb::SBProcess *' at 0x1272d0870> >>: success

Hide Details

PASS: LLDB (/Users/buildslave/jenkins/workspace/lldb-cmake-sanitized/lldb-build/bin/clang-11-x86_64) :: test_gmodules (lldbsuite.test.lldbtest.DisambiguatePathsToCommonSink_GNU) Restore dir to: /Users/buildslave/jenkins/workspace/lldb-cmake-sanitized/lldb-build/tools/lldb/test Change dir to: /Users/buildslave/jenkins/workspace/lldb-cmake-sanitized/llvm-project/lldb/test/API/functionalities/tail_call_frames/disambiguate_paths_to_common_sink runCmd: settings clear -all output:

Hide Details

runCmd: settings set symbols.enable-external-lookup false output:

Hide Details

runCmd: settings set target.auto-apply-fixits false output:

Hide Details

runCmd: settings set plugin.process.gdb-remote.packet-timeout 60 output:

Hide Details

runCmd: settings set symbols.clang-modules-cache-path "/Users/buildslave/jenkins/workspace/lldb-cmake-sanitized/lldb-build/lldb-test-build.noindex/module-cache-lldb/lldb-api" output:

Hide Details

runCmd: settings set use-color false output:

Hide Details

runCmd: setting set target.prefer-dynamic-value no-dynamic-values output:

Hide Details

runCmd: settings set target.env-vars ASAN_OPTIONS=detect_stack_use_after_return=1 DYLD_INSERT_LIBRARIES=/Users/buildslave/jenkins/workspace/lldb-cmake-sanitized/host-compiler/lib/clang/11.0.0/lib/darwin/libclang_rt.asan_osx_dynamic.dylib output:

Hide Details

runCmd: bt output: * thread #1, queue = 'com.apple.main-thread', stop reason = breakpoint 2.1 * frame #0: 0x0000000104d23f79 a.out`sink(called_from_main=true) at main.cpp:14:6 [opt] frame #1: 0x0000000104d23fae a.out`main(argc=<unavailable>, (null)=<unavailable>) at main.cpp:27:3 [opt] frame #2: 0x00007fff5962a085 libdyld.dylib`start + 1

Hide Details

Hide Details

Hide Details

--- FileCheck trace (code=0) --- /Users/buildslave/jenkins/workspace/lldb-cmake-sanitized/lldb-build/bin/FileCheck /Users/buildslave/jenkins/workspace/lldb-cmake-sanitized/llvm-project/lldb/test/API/functionalities/tail_call_frames/disambiguate_paths_to_common_sink/main.cpp -check-prefix=FROM-MAIN

Hide Details

FileCheck input: * thread #1, queue = 'com.apple.main-thread', stop reason = breakpoint 2.1 * frame #0: 0x0000000104d23f79 a.out`sink(called_from_main=true) at main.cpp:14:6 [opt] frame #1: 0x0000000104d23fae a.out`main(argc=<unavailable>, (null)=<unavailable>) at main.cpp:27:3 [opt] frame #2: 0x00007fff5962a085 libdyld.dylib`start + 1

Hide Details

Hide Details

FileCheck output:

Hide Details

Hide Details

Hide Details

Hide Details

runCmd: bt output: * thread #1, queue = 'com.apple.main-thread', stop reason = breakpoint 1.1 * frame #0: 0x0000000104d23f64 a.out`sink2() at main.cpp:4:4 [opt] frame #1: 0x0000000104d23f81 a.out`sink(called_from_main=<unavailable>) at main.cpp:18:5 [opt] [artificial] frame #2: 0x0000000104d23f97 a.out`func1() at main.cpp:22:42 [opt] [artificial] frame #3: 0x0000000104d23fb3 a.out`main(argc=<unavailable>, (null)=<unavailable>) at main.cpp:28:3 [opt] frame #4: 0x00007fff5962a085 libdyld.dylib`start + 1

Hide Details

Hide Details

Hide Details

--- FileCheck trace (code=0) --- /Users/buildslave/jenkins/workspace/lldb-cmake-sanitized/lldb-build/bin/FileCheck /Users/buildslave/jenkins/workspace/lldb-cmake-sanitized/llvm-project/lldb/test/API/functionalities/tail_call_frames/disambiguate_paths_to_common_sink/main.cpp -check-prefix=FROM-FUNC1

Hide Details

FileCheck input: * thread #1, queue = 'com.apple.main-thread', stop reason = breakpoint 1.1 * frame #0: 0x0000000104d23f64 a.out`sink2() at main.cpp:4:4 [opt] frame #1: 0x0000000104d23f81 a.out`sink(called_from_main=<unavailable>) at main.cpp:18:5 [opt] [artificial] frame #2: 0x0000000104d23f97 a.out`func1() at main.cpp:22:42 [opt] [artificial] frame #3: 0x0000000104d23fb3 a.out`main(argc=<unavailable>, (null)=<unavailable>) at main.cpp:28:3 [opt] frame #4: 0x00007fff5962a085 libdyld.dylib`start + 1

Hide Details

Hide Details

FileCheck output:

Hide Details

Hide Details

Hide Details

Hide Details

<bound method SBProcess.Kill of <lldb.SBProcess; proxy of <Swig Object of type 'lldb::SBProcess *' at 0x1272d0f90> >>: success

Hide Details

PASS: LLDB (/Users/buildslave/jenkins/workspace/lldb-cmake-sanitized/lldb-build/bin/clang-11-x86_64) :: test_dsym (lldbsuite.test.lldbtest.DisambiguatePathsToCommonSink_V5) runCmd: settings clear -all output:

Hide Details

runCmd: settings set symbols.enable-external-lookup false output:

Hide Details

runCmd: settings set target.auto-apply-fixits false output:

Hide Details

runCmd: settings set plugin.process.gdb-remote.packet-timeout 60 output:

Hide Details

runCmd: settings set symbols.clang-modules-cache-path "/Users/buildslave/jenkins/workspace/lldb-cmake-sanitized/lldb-build/lldb-test-build.noindex/module-cache-lldb/lldb-api" output:

Hide Details

runCmd: settings set use-color false output:

Hide Details

runCmd: setting set target.prefer-dynamic-value no-dynamic-values output:

Hide Details

runCmd: settings set target.env-vars ASAN_OPTIONS=detect_stack_use_after_return=1 DYLD_INSERT_LIBRARIES=/Users/buildslave/jenkins/workspace/lldb-cmake-sanitized/host-compiler/lib/clang/11.0.0/lib/darwin/libclang_rt.asan_osx_dynamic.dylib output:

Hide Details

runCmd: bt output: * thread #1, queue = 'com.apple.main-thread', stop reason = breakpoint 2.1 * frame #0: 0x000000010a9f6f79 a.out`sink(called_from_main=true) at main.cpp:14:6 [opt] frame #1: 0x000000010a9f6fae a.out`main(argc=<unavailable>, (null)=<unavailable>) at main.cpp:27:3 [opt] frame #2: 0x00007fff5962a085 libdyld.dylib`start + 1

Hide Details

Hide Details

Hide Details

--- FileCheck trace (code=0) --- /Users/buildslave/jenkins/workspace/lldb-cmake-sanitized/lldb-build/bin/FileCheck /Users/buildslave/jenkins/workspace/lldb-cmake-sanitized/llvm-project/lldb/test/API/functionalities/tail_call_frames/disambiguate_paths_to_common_sink/main.cpp -check-prefix=FROM-MAIN

Hide Details

FileCheck input: * thread #1, queue = 'com.apple.main-thread', stop reason = breakpoint 2.1 * frame #0: 0x000000010a9f6f79 a.out`sink(called_from_main=true) at main.cpp:14:6 [opt] frame #1: 0x000000010a9f6fae a.out`main(argc=<unavailable>, (null)=<unavailable>) at main.cpp:27:3 [opt] frame #2: 0x00007fff5962a085 libdyld.dylib`start + 1

Hide Details

Hide Details

FileCheck output:

Hide Details

Hide Details

Hide Details

Hide Details

runCmd: bt output: * thread #1, queue = 'com.apple.main-thread', stop reason = breakpoint 1.1 * frame #0: 0x000000010a9f6f64 a.out`sink2() at main.cpp:4:4 [opt] frame #1: 0x000000010a9f6f81 a.out`sink(called_from_main=<unavailable>) at main.cpp:18:5 [opt] [artificial] frame #2: 0x000000010a9f6f97 a.out`func1() at main.cpp:22:42 [opt] [artificial] frame #3: 0x000000010a9f6fb3 a.out`main(argc=<unavailable>, (null)=<unavailable>) at main.cpp:28:3 [opt] frame #4: 0x00007fff5962a085 libdyld.dylib`start + 1

Hide Details

Hide Details

Hide Details

--- FileCheck trace (code=0) --- /Users/buildslave/jenkins/workspace/lldb-cmake-sanitized/lldb-build/bin/FileCheck /Users/buildslave/jenkins/workspace/lldb-cmake-sanitized/llvm-project/lldb/test/API/functionalities/tail_call_frames/disambiguate_paths_to_common_sink/main.cpp -check-prefix=FROM-FUNC1

Hide Details

FileCheck input: * thread #1, queue = 'com.apple.main-thread', stop reason = breakpoint 1.1 * frame #0: 0x000000010a9f6f64 a.out`sink2() at main.cpp:4:4 [opt] frame #1: 0x000000010a9f6f81 a.out`sink(called_from_main=<unavailable>) at main.cpp:18:5 [opt] [artificial] frame #2: 0x000000010a9f6f97 a.out`func1() at main.cpp:22:42 [opt] [artificial] frame #3: 0x000000010a9f6fb3 a.out`main(argc=<unavailable>, (null)=<unavailable>) at main.cpp:28:3 [opt] frame #4: 0x00007fff5962a085 libdyld.dylib`start + 1

Hide Details

Hide Details

FileCheck output:

Hide Details

Hide Details

Hide Details

Hide Details

<bound method SBProcess.Kill of <lldb.SBProcess; proxy of <Swig Object of type 'lldb::SBProcess *' at 0x1272d0f00> >>: success

Hide Details

PASS: LLDB (/Users/buildslave/jenkins/workspace/lldb-cmake-sanitized/lldb-build/bin/clang-11-x86_64) :: test_dwarf (lldbsuite.test.lldbtest.DisambiguatePathsToCommonSink_V5) UNSUPPORTED: LLDB (/Users/buildslave/jenkins/workspace/lldb-cmake-sanitized/lldb-build/bin/clang-11-x86_64) :: test_dwo (lldbsuite.test.lldbtest.DisambiguatePathsToCommonSink_V5) (test case does not fall in any category of interest for this run) runCmd: settings clear -all output:

Hide Details

runCmd: settings set symbols.enable-external-lookup false output:

Hide Details

runCmd: settings set target.auto-apply-fixits false output:

Hide Details

runCmd: settings set plugin.process.gdb-remote.packet-timeout 60 output:

Hide Details

runCmd: settings set symbols.clang-modules-cache-path "/Users/buildslave/jenkins/workspace/lldb-cmake-sanitized/lldb-build/lldb-test-build.noindex/module-cache-lldb/lldb-api" output:

Hide Details

runCmd: settings set use-color false output:

Hide Details

runCmd: setting set target.prefer-dynamic-value no-dynamic-values output:

Hide Details

runCmd: settings set target.env-vars ASAN_OPTIONS=detect_stack_use_after_return=1 DYLD_INSERT_LIBRARIES=/Users/buildslave/jenkins/workspace/lldb-cmake-sanitized/host-compiler/lib/clang/11.0.0/lib/darwin/libclang_rt.asan_osx_dynamic.dylib output:

Hide Details

runCmd: bt output: * thread #1, queue = 'com.apple.main-thread', stop reason = breakpoint 2.1 * frame #0: 0x000000010f8a7f79 a.out`sink(called_from_main=true) at main.cpp:14:6 [opt] frame #1: 0x000000010f8a7fae a.out`main(argc=<unavailable>, (null)=<unavailable>) at main.cpp:27:3 [opt] frame #2: 0x00007fff5962a085 libdyld.dylib`start + 1 frame #3: 0x00007fff5962a085 libdyld.dylib`start + 1

Hide Details

Hide Details

Hide Details

--- FileCheck trace (code=0) --- /Users/buildslave/jenkins/workspace/lldb-cmake-sanitized/lldb-build/bin/FileCheck /Users/buildslave/jenkins/workspace/lldb-cmake-sanitized/llvm-project/lldb/test/API/functionalities/tail_call_frames/disambiguate_paths_to_common_sink/main.cpp -check-prefix=FROM-MAIN

Hide Details

FileCheck input: * thread #1, queue = 'com.apple.main-thread', stop reason = breakpoint 2.1 * frame #0: 0x000000010f8a7f79 a.out`sink(called_from_main=true) at main.cpp:14:6 [opt] frame #1: 0x000000010f8a7fae a.out`main(argc=<unavailable>, (null)=<unavailable>) at main.cpp:27:3 [opt] frame #2: 0x00007fff5962a085 libdyld.dylib`start + 1 frame #3: 0x00007fff5962a085 libdyld.dylib`start + 1

Hide Details

Hide Details

FileCheck output:

Hide Details

Hide Details

Hide Details

Hide Details

runCmd: bt output: * thread #1, queue = 'com.apple.main-thread', stop reason = breakpoint 1.1 * frame #0: 0x000000010f8a7f64 a.out`sink2() at main.cpp:4:4 [opt] frame #1: 0x000000010f8a7f81 a.out`sink(called_from_main=<unavailable>) at main.cpp:18:5 [opt] [artificial] frame #2: 0x000000010f8a7f97 a.out`func1() at main.cpp:22:42 [opt] [artificial] frame #3: 0x000000010f8a7fb3 a.out`main(argc=<unavailable>, (null)=<unavailable>) at main.cpp:28:3 [opt] frame #4: 0x00007fff5962a085 libdyld.dylib`start + 1 frame #5: 0x00007fff5962a085 libdyld.dylib`start + 1

Hide Details

Hide Details

Hide Details

--- FileCheck trace (code=0) --- /Users/buildslave/jenkins/workspace/lldb-cmake-sanitized/lldb-build/bin/FileCheck /Users/buildslave/jenkins/workspace/lldb-cmake-sanitized/llvm-project/lldb/test/API/functionalities/tail_call_frames/disambiguate_paths_to_common_sink/main.cpp -check-prefix=FROM-FUNC1

Hide Details

FileCheck input: * thread #1, queue = 'com.apple.main-thread', stop reason = breakpoint 1.1 * frame #0: 0x000000010f8a7f64 a.out`sink2() at main.cpp:4:4 [opt] frame #1: 0x000000010f8a7f81 a.out`sink(called_from_main=<unavailable>) at main.cpp:18:5 [opt] [artificial] frame #2: 0x000000010f8a7f97 a.out`func1() at main.cpp:22:42 [opt] [artificial] frame #3: 0x000000010f8a7fb3 a.out`main(argc=<unavailable>, (null)=<unavailable>) at main.cpp:28:3 [opt] frame #4: 0x00007fff5962a085 libdyld.dylib`start + 1 frame #5: 0x00007fff5962a085 libdyld.dylib`start + 1

Hide Details

Hide Details

FileCheck output:

Hide Details

Hide Details

Hide Details

Hide Details

<bound method SBProcess.Kill of <lldb.SBProcess; proxy of <Swig Object of type 'lldb::SBProcess *' at 0x1272d0f30> >>: success

Hide Details

PASS: LLDB (/Users/buildslave/jenkins/workspace/lldb-cmake-sanitized/lldb-build/bin/clang-11-x86_64) :: test_gmodules (lldbsuite.test.lldbtest.DisambiguatePathsToCommonSink_V5) Restore dir to: /Users/buildslave/jenkins/workspace/lldb-cmake-sanitized/lldb-build/tools/lldb/test ====================================================================== FAIL: test_dsym (lldbsuite.test.lldbtest.DisambiguatePathsToCommonSink_GNU) ---------------------------------------------------------------------- Traceback (most recent call last): File "/Users/buildslave/jenkins/workspace/lldb-cmake-sanitized/llvm-project/lldb/packages/Python/lldbsuite/test/lldbtest.py", line 1768, in test_method return attrvalue(self) File "/Users/buildslave/jenkins/workspace/lldb-cmake-sanitized/llvm-project/lldb/packages/Python/lldbsuite/test/decorators.py", line 140, in wrapper func(*args, **kwargs) File "/Users/buildslave/jenkins/workspace/lldb-cmake-sanitized/llvm-project/lldb/packages/Python/lldbsuite/test/decorators.py", line 140, in wrapper func(*args, **kwargs) File "/Users/buildslave/jenkins/workspace/lldb-cmake-sanitized/llvm-project/lldb/packages/Python/lldbsuite/test/lldbinline.py", line 124, in _test self.do_test() File "/Users/buildslave/jenkins/workspace/lldb-cmake-sanitized/llvm-project/lldb/packages/Python/lldbsuite/test/lldbinline.py", line 156, in do_test parser.handle_breakpoint(self, bp_id) File "/Users/buildslave/jenkins/workspace/lldb-cmake-sanitized/llvm-project/lldb/packages/Python/lldbsuite/test/lldbinline.py", line 80, in handle_breakpoint test.execute_user_command(breakpoint['command']) File "/Users/buildslave/jenkins/workspace/lldb-cmake-sanitized/llvm-project/lldb/packages/Python/lldbsuite/test/lldbinline.py", line 127, in execute_user_command exec(__command, globals(), locals()) File "<string>", line 1, in <module> File "/Users/buildslave/jenkins/workspace/lldb-cmake-sanitized/llvm-project/lldb/packages/Python/lldbsuite/test/lldbtest.py", line 2313, in filecheck self.assertTrue(cmd_status == 0) AssertionError: False is not True Config=x86_64-/Users/buildslave/jenkins/workspace/lldb-cmake-sanitized/lldb-build/bin/clang-11 ---------------------------------------------------------------------- Ran 8 tests in 19.784s

Hide Details

RESULT: FAILED (5 passes, 1 failures, 0 errors, 2 skipped, 0 expected failures, 0 unexpected successes)

Hide Details

--

Hide Details

******************** PASS: lldb-unit :: Core/./LLDBCoreTests/UniqueCStringMap.NoDefaultConstructor (1919 of 2029) PASS: lldb-unit :: Utility/./UtilityTests/SerializationRountripTest.SerializeDeserializePodReferences (1920 of 2029) UNSUPPORTED: lldb-shell :: Register/x86-64-gp-write.test (1921 of 2029) PASS: lldb-unit :: Target/./TargetTests/PathMappingListTest.RemapRoot (1922 of 2029) PASS: lldb-unit :: Utility/./UtilityTests/UriParserTest.MinimalPortPath (1923 of 2029) PASS: lldb-api :: python_api/frame/get-variables/TestGetVariables.py (1924 of 2029) PASS: lldb-api :: functionalities/thread/concurrent_events/TestConcurrentDelaySignalBreak.py (1925 of 2029) PASS: lldb-unit :: Language/Highlighting/./HighlighterTests/HighlighterTest.Keywords (1926 of 2029) PASS: lldb-unit :: Utility/./UtilityTests/RangeTest.Slide (1927 of 2029) PASS: lldb-unit :: UnwindAssembly/x86/./UnwindAssemblyx86Tests/Testx86AssemblyInspectionEngine.TestPushECX (1928 of 2029) PASS: lldb-api :: commands/expression/import-std-module/unique_ptr-dbg-info-content/TestUniquePtrDbgInfoContent.py (1929 of 2029) PASS: lldb-unit :: Utility/./UtilityTests/StringListTest.CopyListEmpty (1930 of 2029) PASS: lldb-api :: functionalities/data-formatter/typedef_array/TestTypedefArray.py (1931 of 2029) PASS: lldb-api :: lang/c/unicode/TestUnicodeSymbols.py (1932 of 2029) PASS: lldb-api :: functionalities/paths/TestPaths.py (1933 of 2029) PASS: lldb-api :: python_api/value/change_values/TestChangeValueAPI.py (1934 of 2029) PASS: lldb-unit :: Utility/./UtilityTests/StringExtractorTest.GetNameColonValueNoSemicolon (1935 of 2029) UNSUPPORTED: lldb-shell :: Breakpoint/ppc64-localentry.test (1936 of 2029) PASS: lldb-unit :: Symbol/./SymbolTests/TestTypeSystemClang.TestGetBasicTypeFromName (1937 of 2029) PASS: lldb-shell :: Reproducer/TestGDBRemoteRepro.test (1938 of 2029) PASS: lldb-unit :: Utility/./UtilityTests/ArgsTest.DoubleQuotedItem (1939 of 2029) PASS: lldb-unit :: Utility/./UtilityTests/XcodeSDKTest.SDKSupportsModules (1940 of 2029) PASS: lldb-unit :: Utility/./UtilityTests/OptionsWithRawTest.EmptyArgsOnlySuffix (1941 of 2029) PASS: lldb-unit :: UnwindAssembly/x86/./UnwindAssemblyx86Tests/Testx86AssemblyInspectionEngine.Test32bitFramelessBigStackFrame (1942 of 2029) PASS: lldb-api :: functionalities/gdb_remote_client/TestJLink6Armv7RegisterDefinition.py (1943 of 2029) PASS: lldb-api :: commands/command/script/import/rdar-12586188/TestRdar12586188.py (1944 of 2029) PASS: lldb-unit :: Process/gdb-remote/./ProcessGdbRemoteTests/GDBRemoteClientBaseTest.SendPacketAndReceiveResponseWithOutputSupport (1945 of 2029) FAIL: lldb-api :: lang/objc/unicode-string/TestUnicodeString.py (1946 of 2029) ******************** TEST 'lldb-api :: lang/objc/unicode-string/TestUnicodeString.py' FAILED ******************** Script: -- /Users/buildslave/jenkins/workspace/lldb-cmake-sanitized/lldb-build/lldb-test-build.noindex/copied-system-python /Users/buildslave/jenkins/workspace/lldb-cmake-sanitized/llvm-project/lldb/test/API/dotest.py --arch x86_64 -s /Users/buildslave/jenkins/workspace/lldb-cmake-sanitized/lldb-build/lldb-test-traces -S nm -u CXXFLAGS -u CFLAGS --codesign-identity lldb_codesign --server /Users/buildslave/jenkins/workspace/lldb-cmake-sanitized/lldb-build/./bin/debugserver --arch x86_64 --build-dir /Users/buildslave/jenkins/workspace/lldb-cmake-sanitized/lldb-build/lldb-test-build.noindex -s=/Users/buildslave/jenkins/workspace/lldb-cmake-sanitized/test/logs -t --env TERM=vt100 --env LLVM_LIBS_DIR=/Users/buildslave/jenkins/workspace/lldb-cmake-sanitized/lldb-build/./lib --inferior-env ASAN_OPTIONS=detect_stack_use_after_return=1 --inferior-env DYLD_INSERT_LIBRARIES=/Users/buildslave/jenkins/workspace/lldb-cmake-sanitized/host-compiler/lib/clang/11.0.0/lib/darwin/libclang_rt.asan_osx_dynamic.dylib --build-dir /Users/buildslave/jenkins/workspace/lldb-cmake-sanitized/lldb-build/lldb-test-build.noindex --lldb-module-cache-dir /Users/buildslave/jenkins/workspace/lldb-cmake-sanitized/lldb-build/lldb-test-build.noindex/module-cache-lldb/lldb-api --clang-module-cache-dir /Users/buildslave/jenkins/workspace/lldb-cmake-sanitized/lldb-build/lldb-test-build.noindex/module-cache-clang/lldb-api --executable /Users/buildslave/jenkins/workspace/lldb-cmake-sanitized/lldb-build/./bin/lldb --compiler /Users/buildslave/jenkins/workspace/lldb-cmake-sanitized/lldb-build/./bin/clang --dsymutil /Users/buildslave/jenkins/workspace/lldb-cmake-sanitized/lldb-build/./bin/dsymutil --filecheck /Users/buildslave/jenkins/workspace/lldb-cmake-sanitized/lldb-build/./bin/FileCheck --lldb-libs-dir /Users/buildslave/jenkins/workspace/lldb-cmake-sanitized/lldb-build/./lib /Users/buildslave/jenkins/workspace/lldb-cmake-sanitized/llvm-project/lldb/test/API/lang/objc/unicode-string -p TestUnicodeString.py -- Exit Code: -6

Hide Details

Command Output (stdout): -- lldb version 11.0.99 clang revision bff0c56ff92106afad22b54a90e1c612da4d6f99 llvm revision bff0c56ff92106afad22b54a90e1c612da4d6f99

Hide Details

-- Command Output (stderr): -- Assertion failed: (tokenKind == tok::kw___bridge_retain), function ParseParenExpression, file /Users/buildslave/jenkins/workspace/lldb-cmake-sanitized/llvm-project/clang/lib/Parse/ParseExpr.cpp, line 2804.

Hide Details

--

Hide Details

******************** PASS: lldb-api :: commands/quit/TestQuit.py (1947 of 2029) PASS: lldb-unit :: Utility/./UtilityTests/CompletionRequest.FakeLastArg (1948 of 2029) PASS: lldb-unit :: Utility/./UtilityTests/OptionsWithRawTest.TerminatedQuote (1949 of 2029) PASS: lldb-shell :: Settings/TestFrameFormatMangling.test (1950 of 2029) PASS: lldb-shell :: Quit/TestQuitExitCodeNonInt.test (1951 of 2029) PASS: lldb-api :: commands/watchpoints/watchpoint_size/TestWatchpointSizes.py (1952 of 2029) PASS: lldb-api :: lang/objc/modules-update/TestClangModulesUpdate.py (1953 of 2029) PASS: lldb-shell :: ObjectFile/ELF/aarch64-relocations.yaml (1954 of 2029) PASS: lldb-shell :: SymbolFile/DWARF/dir-separator-no-comp-dir.s (1955 of 2029) PASS: lldb-shell :: ObjectFile/ELF/gnu-debuglink.yaml (1956 of 2029) PASS: lldb-api :: functionalities/thread/concurrent_events/TestConcurrentSignalWatch.py (1957 of 2029) PASS: lldb-shell :: Host/TestCustomShell.test (1958 of 2029) PASS: lldb-api :: commands/watchpoints/watchpoint_disable/TestWatchpointDisable.py (1959 of 2029) PASS: lldb-unit :: Utility/./UtilityTests/BinaryStreamTest.PutULEB128One (1960 of 2029) PASS: lldb-shell :: Breakpoint/debug_rnglistx_rlex.test (1961 of 2029) PASS: lldb-unit :: Utility/./UtilityTests/ProcessInstanceInfo.Dump (1962 of 2029) PASS: lldb-unit :: Utility/./UtilityTests/StringExtractorTest.GetHexBytes (1963 of 2029) PASS: lldb-unit :: Utility/./UtilityTests/Predicate.WaitForValueEqualTo (1964 of 2029) PASS: lldb-unit :: Symbol/./SymbolTests/DWARFCallFrameInfoTest.Basic_dwarf4 (1965 of 2029) PASS: lldb-api :: commands/expression/completion-crash-incomplete-record/TestCompletionCrashIncompleteRecord.py (1966 of 2029) PASS: lldb-api :: commands/frame/var/TestFrameVar.py (1967 of 2029) UNSUPPORTED: lldb-shell :: Reproducer/TestLuaImport.test (1968 of 2029) PASS: lldb-unit :: Process/minidump/./LLDBMinidumpTests/MinidumpParserTest.GetThreadContext_x86_64 (1969 of 2029) PASS: lldb-unit :: Utility/./UtilityTests/OptionsWithRawTest.WhitespaceSuffix (1970 of 2029) PASS: lldb-unit :: Utility/./UtilityTests/StreamTest.PutHex16ByteOrderLittle (1971 of 2029) UNSUPPORTED: lldb-shell :: Unwind/eh-frame-small-fde.test (1972 of 2029) PASS: lldb-api :: functionalities/data-formatter/data-formatter-stl/libcxx/variant/TestDataFormatterLibcxxVariant.py (1973 of 2029) PASS: lldb-api :: macosx/duplicate-archive-members/TestDuplicateMembers.py (1974 of 2029) PASS: lldb-unit :: Host/./HostTests/SocketTest.UDPConnect (1975 of 2029) PASS: lldb-unit :: Utility/./UtilityTests/AnsiTerminal.AtEnd (1976 of 2029) PASS: lldb-api :: commands/expression/import-std-module/stack/TestStackFromStdModule.py (1977 of 2029) PASS: lldb-api :: macosx/add-dsym/TestAddDsymMidExecutionCommand.py (1978 of 2029) PASS: lldb-unit :: Utility/./UtilityTests/ReproducerTest.SetReplay (1979 of 2029) PASS: lldb-shell :: ObjectFile/ELF/section-overlap.yaml (1980 of 2029) PASS: lldb-unit :: SymbolFile/DWARF/./SymbolFileDWARFTests/DWARFASTParserClangTests.EnsureAllDIEsInDeclContextHaveBeenParsedParsesOnlyMatchingEntries (1981 of 2029) PASS: lldb-shell :: Minidump/memory-region.yaml (1982 of 2029) UNSUPPORTED: lldb-api :: functionalities/thread/thread_specific_break_plus_condition/TestThreadSpecificBpPlusCondition.py (1983 of 2029) PASS: lldb-unit :: Utility/./UtilityTests/VMRange.SetEndAddress (1984 of 2029) PASS: lldb-api :: functionalities/thread/concurrent_events/TestConcurrentTwoWatchpointsOneDelayBreakpoint.py (1985 of 2029) FAIL: lldb-api :: lang/objc/objc-class-method/TestObjCClassMethod.py (1986 of 2029) ******************** TEST 'lldb-api :: lang/objc/objc-class-method/TestObjCClassMethod.py' FAILED ******************** Script: -- /Users/buildslave/jenkins/workspace/lldb-cmake-sanitized/lldb-build/lldb-test-build.noindex/copied-system-python /Users/buildslave/jenkins/workspace/lldb-cmake-sanitized/llvm-project/lldb/test/API/dotest.py --arch x86_64 -s /Users/buildslave/jenkins/workspace/lldb-cmake-sanitized/lldb-build/lldb-test-traces -S nm -u CXXFLAGS -u CFLAGS --codesign-identity lldb_codesign --server /Users/buildslave/jenkins/workspace/lldb-cmake-sanitized/lldb-build/./bin/debugserver --arch x86_64 --build-dir /Users/buildslave/jenkins/workspace/lldb-cmake-sanitized/lldb-build/lldb-test-build.noindex -s=/Users/buildslave/jenkins/workspace/lldb-cmake-sanitized/test/logs -t --env TERM=vt100 --env LLVM_LIBS_DIR=/Users/buildslave/jenkins/workspace/lldb-cmake-sanitized/lldb-build/./lib --inferior-env ASAN_OPTIONS=detect_stack_use_after_return=1 --inferior-env DYLD_INSERT_LIBRARIES=/Users/buildslave/jenkins/workspace/lldb-cmake-sanitized/host-compiler/lib/clang/11.0.0/lib/darwin/libclang_rt.asan_osx_dynamic.dylib --build-dir /Users/buildslave/jenkins/workspace/lldb-cmake-sanitized/lldb-build/lldb-test-build.noindex --lldb-module-cache-dir /Users/buildslave/jenkins/workspace/lldb-cmake-sanitized/lldb-build/lldb-test-build.noindex/module-cache-lldb/lldb-api --clang-module-cache-dir /Users/buildslave/jenkins/workspace/lldb-cmake-sanitized/lldb-build/lldb-test-build.noindex/module-cache-clang/lldb-api --executable /Users/buildslave/jenkins/workspace/lldb-cmake-sanitized/lldb-build/./bin/lldb --compiler /Users/buildslave/jenkins/workspace/lldb-cmake-sanitized/lldb-build/./bin/clang --dsymutil /Users/buildslave/jenkins/workspace/lldb-cmake-sanitized/lldb-build/./bin/dsymutil --filecheck /Users/buildslave/jenkins/workspace/lldb-cmake-sanitized/lldb-build/./bin/FileCheck --lldb-libs-dir /Users/buildslave/jenkins/workspace/lldb-cmake-sanitized/lldb-build/./lib /Users/buildslave/jenkins/workspace/lldb-cmake-sanitized/llvm-project/lldb/test/API/lang/objc/objc-class-method -p TestObjCClassMethod.py -- Exit Code: -6

Hide Details

Command Output (stdout): -- lldb version 11.0.99 clang revision bff0c56ff92106afad22b54a90e1c612da4d6f99 llvm revision bff0c56ff92106afad22b54a90e1c612da4d6f99

Hide Details

-- Command Output (stderr): -- Assertion failed: (tokenKind == tok::kw___bridge_retain), function ParseParenExpression, file /Users/buildslave/jenkins/workspace/lldb-cmake-sanitized/llvm-project/clang/lib/Parse/ParseExpr.cpp, line 2804.

Hide Details

--

Hide Details

******************** PASS: lldb-api :: api/multithreaded/TestMultithreaded.py (1987 of 2029) PASS: lldb-shell :: Driver/TestConvenienceVariables.test (1988 of 2029) FAIL: lldb-api :: commands/expression/two-files/TestObjCTypeQueryFromOtherCompileUnit.py (1989 of 2029) ******************** TEST 'lldb-api :: commands/expression/two-files/TestObjCTypeQueryFromOtherCompileUnit.py' FAILED ******************** Script: -- /Users/buildslave/jenkins/workspace/lldb-cmake-sanitized/lldb-build/lldb-test-build.noindex/copied-system-python /Users/buildslave/jenkins/workspace/lldb-cmake-sanitized/llvm-project/lldb/test/API/dotest.py --arch x86_64 -s /Users/buildslave/jenkins/workspace/lldb-cmake-sanitized/lldb-build/lldb-test-traces -S nm -u CXXFLAGS -u CFLAGS --codesign-identity lldb_codesign --server /Users/buildslave/jenkins/workspace/lldb-cmake-sanitized/lldb-build/./bin/debugserver --arch x86_64 --build-dir /Users/buildslave/jenkins/workspace/lldb-cmake-sanitized/lldb-build/lldb-test-build.noindex -s=/Users/buildslave/jenkins/workspace/lldb-cmake-sanitized/test/logs -t --env TERM=vt100 --env LLVM_LIBS_DIR=/Users/buildslave/jenkins/workspace/lldb-cmake-sanitized/lldb-build/./lib --inferior-env ASAN_OPTIONS=detect_stack_use_after_return=1 --inferior-env DYLD_INSERT_LIBRARIES=/Users/buildslave/jenkins/workspace/lldb-cmake-sanitized/host-compiler/lib/clang/11.0.0/lib/darwin/libclang_rt.asan_osx_dynamic.dylib --build-dir /Users/buildslave/jenkins/workspace/lldb-cmake-sanitized/lldb-build/lldb-test-build.noindex --lldb-module-cache-dir /Users/buildslave/jenkins/workspace/lldb-cmake-sanitized/lldb-build/lldb-test-build.noindex/module-cache-lldb/lldb-api --clang-module-cache-dir /Users/buildslave/jenkins/workspace/lldb-cmake-sanitized/lldb-build/lldb-test-build.noindex/module-cache-clang/lldb-api --executable /Users/buildslave/jenkins/workspace/lldb-cmake-sanitized/lldb-build/./bin/lldb --compiler /Users/buildslave/jenkins/workspace/lldb-cmake-sanitized/lldb-build/./bin/clang --dsymutil /Users/buildslave/jenkins/workspace/lldb-cmake-sanitized/lldb-build/./bin/dsymutil --filecheck /Users/buildslave/jenkins/workspace/lldb-cmake-sanitized/lldb-build/./bin/FileCheck --lldb-libs-dir /Users/buildslave/jenkins/workspace/lldb-cmake-sanitized/lldb-build/./lib /Users/buildslave/jenkins/workspace/lldb-cmake-sanitized/llvm-project/lldb/test/API/commands/expression/two-files -p TestObjCTypeQueryFromOtherCompileUnit.py -- Exit Code: -6

Hide Details

Command Output (stdout): -- lldb version 11.0.99 clang revision bff0c56ff92106afad22b54a90e1c612da4d6f99 llvm revision bff0c56ff92106afad22b54a90e1c612da4d6f99

Hide Details

-- Command Output (stderr): -- Assertion failed: (tokenKind == tok::kw___bridge_retain), function ParseParenExpression, file /Users/buildslave/jenkins/workspace/lldb-cmake-sanitized/llvm-project/clang/lib/Parse/ParseExpr.cpp, line 2804.

Hide Details

--

Hide Details

******************** PASS: lldb-shell :: Breakpoint/implicit_const_form_support.test (1990 of 2029) UNSUPPORTED: lldb-api :: functionalities/longjmp/TestLongjmp.py (1991 of 2029) UNSUPPORTED: lldb-shell :: SymbolFile/dissassemble-entry-point.s (1992 of 2029) PASS: lldb-shell :: ObjectFile/MachO/lc_build_version_notools.yaml (1993 of 2029) PASS: lldb-shell :: Recognizer/assert.test (1994 of 2029) PASS: lldb-api :: tools/lldb-vscode/step/TestVSCode_step.py (1995 of 2029) FAIL: lldb-api :: lang/objc/radar-9691614/TestObjCMethodReturningBOOL.py (1996 of 2029) ******************** TEST 'lldb-api :: lang/objc/radar-9691614/TestObjCMethodReturningBOOL.py' FAILED ******************** Script: -- /Users/buildslave/jenkins/workspace/lldb-cmake-sanitized/lldb-build/lldb-test-build.noindex/copied-system-python /Users/buildslave/jenkins/workspace/lldb-cmake-sanitized/llvm-project/lldb/test/API/dotest.py --arch x86_64 -s /Users/buildslave/jenkins/workspace/lldb-cmake-sanitized/lldb-build/lldb-test-traces -S nm -u CXXFLAGS -u CFLAGS --codesign-identity lldb_codesign --server /Users/buildslave/jenkins/workspace/lldb-cmake-sanitized/lldb-build/./bin/debugserver --arch x86_64 --build-dir /Users/buildslave/jenkins/workspace/lldb-cmake-sanitized/lldb-build/lldb-test-build.noindex -s=/Users/buildslave/jenkins/workspace/lldb-cmake-sanitized/test/logs -t --env TERM=vt100 --env LLVM_LIBS_DIR=/Users/buildslave/jenkins/workspace/lldb-cmake-sanitized/lldb-build/./lib --inferior-env ASAN_OPTIONS=detect_stack_use_after_return=1 --inferior-env DYLD_INSERT_LIBRARIES=/Users/buildslave/jenkins/workspace/lldb-cmake-sanitized/host-compiler/lib/clang/11.0.0/lib/darwin/libclang_rt.asan_osx_dynamic.dylib --build-dir /Users/buildslave/jenkins/workspace/lldb-cmake-sanitized/lldb-build/lldb-test-build.noindex --lldb-module-cache-dir /Users/buildslave/jenkins/workspace/lldb-cmake-sanitized/lldb-build/lldb-test-build.noindex/module-cache-lldb/lldb-api --clang-module-cache-dir /Users/buildslave/jenkins/workspace/lldb-cmake-sanitized/lldb-build/lldb-test-build.noindex/module-cache-clang/lldb-api --executable /Users/buildslave/jenkins/workspace/lldb-cmake-sanitized/lldb-build/./bin/lldb --compiler /Users/buildslave/jenkins/workspace/lldb-cmake-sanitized/lldb-build/./bin/clang --dsymutil /Users/buildslave/jenkins/workspace/lldb-cmake-sanitized/lldb-build/./bin/dsymutil --filecheck /Users/buildslave/jenkins/workspace/lldb-cmake-sanitized/lldb-build/./bin/FileCheck --lldb-libs-dir /Users/buildslave/jenkins/workspace/lldb-cmake-sanitized/lldb-build/./lib /Users/buildslave/jenkins/workspace/lldb-cmake-sanitized/llvm-project/lldb/test/API/lang/objc/radar-9691614 -p TestObjCMethodReturningBOOL.py -- Exit Code: -6

Hide Details

Command Output (stdout): -- lldb version 11.0.99 clang revision bff0c56ff92106afad22b54a90e1c612da4d6f99 llvm revision bff0c56ff92106afad22b54a90e1c612da4d6f99

Hide Details

-- Command Output (stderr): -- Assertion failed: (tokenKind == tok::kw___bridge_retain), function ParseParenExpression, file /Users/buildslave/jenkins/workspace/lldb-cmake-sanitized/llvm-project/clang/lib/Parse/ParseExpr.cpp, line 2804.

Hide Details

--

Hide Details

******************** PASS: lldb-shell :: SymbolFile/DWARF/array-sizes.s (1997 of 2029) PASS: lldb-unit :: Utility/./UtilityTests/BinaryStreamTest.PutSLEB128EightBytes (1998 of 2029) FAIL: lldb-api :: lang/objc/foundation/TestConstStrings.py (1999 of 2029) ******************** TEST 'lldb-api :: lang/objc/foundation/TestConstStrings.py' FAILED ******************** Script: -- /Users/buildslave/jenkins/workspace/lldb-cmake-sanitized/lldb-build/lldb-test-build.noindex/copied-system-python /Users/buildslave/jenkins/workspace/lldb-cmake-sanitized/llvm-project/lldb/test/API/dotest.py --arch x86_64 -s /Users/buildslave/jenkins/workspace/lldb-cmake-sanitized/lldb-build/lldb-test-traces -S nm -u CXXFLAGS -u CFLAGS --codesign-identity lldb_codesign --server /Users/buildslave/jenkins/workspace/lldb-cmake-sanitized/lldb-build/./bin/debugserver --arch x86_64 --build-dir /Users/buildslave/jenkins/workspace/lldb-cmake-sanitized/lldb-build/lldb-test-build.noindex -s=/Users/buildslave/jenkins/workspace/lldb-cmake-sanitized/test/logs -t --env TERM=vt100 --env LLVM_LIBS_DIR=/Users/buildslave/jenkins/workspace/lldb-cmake-sanitized/lldb-build/./lib --inferior-env ASAN_OPTIONS=detect_stack_use_after_return=1 --inferior-env DYLD_INSERT_LIBRARIES=/Users/buildslave/jenkins/workspace/lldb-cmake-sanitized/host-compiler/lib/clang/11.0.0/lib/darwin/libclang_rt.asan_osx_dynamic.dylib --build-dir /Users/buildslave/jenkins/workspace/lldb-cmake-sanitized/lldb-build/lldb-test-build.noindex --lldb-module-cache-dir /Users/buildslave/jenkins/workspace/lldb-cmake-sanitized/lldb-build/lldb-test-build.noindex/module-cache-lldb/lldb-api --clang-module-cache-dir /Users/buildslave/jenkins/workspace/lldb-cmake-sanitized/lldb-build/lldb-test-build.noindex/module-cache-clang/lldb-api --executable /Users/buildslave/jenkins/workspace/lldb-cmake-sanitized/lldb-build/./bin/lldb --compiler /Users/buildslave/jenkins/workspace/lldb-cmake-sanitized/lldb-build/./bin/clang --dsymutil /Users/buildslave/jenkins/workspace/lldb-cmake-sanitized/lldb-build/./bin/dsymutil --filecheck /Users/buildslave/jenkins/workspace/lldb-cmake-sanitized/lldb-build/./bin/FileCheck --lldb-libs-dir /Users/buildslave/jenkins/workspace/lldb-cmake-sanitized/lldb-build/./lib /Users/buildslave/jenkins/workspace/lldb-cmake-sanitized/llvm-project/lldb/test/API/lang/objc/foundation -p TestConstStrings.py -- Exit Code: -6

Hide Details

Command Output (stdout): -- lldb version 11.0.99 clang revision bff0c56ff92106afad22b54a90e1c612da4d6f99 llvm revision bff0c56ff92106afad22b54a90e1c612da4d6f99

Hide Details

-- Command Output (stderr): -- Assertion failed: (tokenKind == tok::kw___bridge_retain), function ParseParenExpression, file /Users/buildslave/jenkins/workspace/lldb-cmake-sanitized/llvm-project/clang/lib/Parse/ParseExpr.cpp, line 2804.

Hide Details

--

Hide Details

******************** PASS: lldb-shell :: SymbolFile/DWARF/dwp-separate-debug-file.cpp (2000 of 2029) PASS: lldb-shell :: SymbolFile/Breakpad/line-table-mixed-path-styles.test (2001 of 2029) PASS: lldb-unit :: Utility/./UtilityTests/CompletionRequest.ShiftArguments (2002 of 2029) PASS: lldb-unit :: Host/./HostTests/NativeProcessProtocolTest.SetBreakpointFailVerify (2003 of 2029) PASS: lldb-api :: lang/cpp/dynamic-value/TestCppValueCast.py (2004 of 2029) FAIL: lldb-api :: functionalities/data-formatter/data-formatter-objc/nsindexpath/TestDataFormatterNSIndexPath.py (2005 of 2029) ******************** TEST 'lldb-api :: functionalities/data-formatter/data-formatter-objc/nsindexpath/TestDataFormatterNSIndexPath.py' FAILED ******************** Script: -- /Users/buildslave/jenkins/workspace/lldb-cmake-sanitized/lldb-build/lldb-test-build.noindex/copied-system-python /Users/buildslave/jenkins/workspace/lldb-cmake-sanitized/llvm-project/lldb/test/API/dotest.py --arch x86_64 -s /Users/buildslave/jenkins/workspace/lldb-cmake-sanitized/lldb-build/lldb-test-traces -S nm -u CXXFLAGS -u CFLAGS --codesign-identity lldb_codesign --server /Users/buildslave/jenkins/workspace/lldb-cmake-sanitized/lldb-build/./bin/debugserver --arch x86_64 --build-dir /Users/buildslave/jenkins/workspace/lldb-cmake-sanitized/lldb-build/lldb-test-build.noindex -s=/Users/buildslave/jenkins/workspace/lldb-cmake-sanitized/test/logs -t --env TERM=vt100 --env LLVM_LIBS_DIR=/Users/buildslave/jenkins/workspace/lldb-cmake-sanitized/lldb-build/./lib --inferior-env ASAN_OPTIONS=detect_stack_use_after_return=1 --inferior-env DYLD_INSERT_LIBRARIES=/Users/buildslave/jenkins/workspace/lldb-cmake-sanitized/host-compiler/lib/clang/11.0.0/lib/darwin/libclang_rt.asan_osx_dynamic.dylib --build-dir /Users/buildslave/jenkins/workspace/lldb-cmake-sanitized/lldb-build/lldb-test-build.noindex --lldb-module-cache-dir /Users/buildslave/jenkins/workspace/lldb-cmake-sanitized/lldb-build/lldb-test-build.noindex/module-cache-lldb/lldb-api --clang-module-cache-dir /Users/buildslave/jenkins/workspace/lldb-cmake-sanitized/lldb-build/lldb-test-build.noindex/module-cache-clang/lldb-api --executable /Users/buildslave/jenkins/workspace/lldb-cmake-sanitized/lldb-build/./bin/lldb --compiler /Users/buildslave/jenkins/workspace/lldb-cmake-sanitized/lldb-build/./bin/clang --dsymutil /Users/buildslave/jenkins/workspace/lldb-cmake-sanitized/lldb-build/./bin/dsymutil --filecheck /Users/buildslave/jenkins/workspace/lldb-cmake-sanitized/lldb-build/./bin/FileCheck --lldb-libs-dir /Users/buildslave/jenkins/workspace/lldb-cmake-sanitized/lldb-build/./lib /Users/buildslave/jenkins/workspace/lldb-cmake-sanitized/llvm-project/lldb/test/API/functionalities/data-formatter/data-formatter-objc/nsindexpath -p TestDataFormatterNSIndexPath.py -- Exit Code: -6

Hide Details

Command Output (stdout): -- lldb version 11.0.99 clang revision bff0c56ff92106afad22b54a90e1c612da4d6f99 llvm revision bff0c56ff92106afad22b54a90e1c612da4d6f99

Hide Details

-- Command Output (stderr): --

Hide Details

Session logs for test failures/errors/unexpected successes will go into directory '/Users/buildslave/jenkins/workspace/lldb-cmake-sanitized/test/logs' Command invoked: /Users/buildslave/jenkins/workspace/lldb-cmake-sanitized/llvm-project/lldb/test/API/dotest.py --arch x86_64 -s /Users/buildslave/jenkins/workspace/lldb-cmake-sanitized/lldb-build/lldb-test-traces -S nm -u CXXFLAGS -u CFLAGS --codesign-identity lldb_codesign --server /Users/buildslave/jenkins/workspace/lldb-cmake-sanitized/lldb-build/./bin/debugserver --arch x86_64 --build-dir /Users/buildslave/jenkins/workspace/lldb-cmake-sanitized/lldb-build/lldb-test-build.noindex -s=/Users/buildslave/jenkins/workspace/lldb-cmake-sanitized/test/logs -t --env TERM=vt100 --env LLVM_LIBS_DIR=/Users/buildslave/jenkins/workspace/lldb-cmake-sanitized/lldb-build/./lib --inferior-env ASAN_OPTIONS=detect_stack_use_after_return=1 --inferior-env DYLD_INSERT_LIBRARIES=/Users/buildslave/jenkins/workspace/lldb-cmake-sanitized/host-compiler/lib/clang/11.0.0/lib/darwin/libclang_rt.asan_osx_dynamic.dylib --build-dir /Users/buildslave/jenkins/workspace/lldb-cmake-sanitized/lldb-build/lldb-test-build.noindex --lldb-module-cache-dir /Users/buildslave/jenkins/workspace/lldb-cmake-sanitized/lldb-build/lldb-test-build.noindex/module-cache-lldb/lldb-api --clang-module-cache-dir /Users/buildslave/jenkins/workspace/lldb-cmake-sanitized/lldb-build/lldb-test-build.noindex/module-cache-clang/lldb-api --executable /Users/buildslave/jenkins/workspace/lldb-cmake-sanitized/lldb-build/./bin/lldb --compiler /Users/buildslave/jenkins/workspace/lldb-cmake-sanitized/lldb-build/./bin/clang --dsymutil /Users/buildslave/jenkins/workspace/lldb-cmake-sanitized/lldb-build/./bin/dsymutil --filecheck /Users/buildslave/jenkins/workspace/lldb-cmake-sanitized/lldb-build/./bin/FileCheck --lldb-libs-dir /Users/buildslave/jenkins/workspace/lldb-cmake-sanitized/lldb-build/./lib /Users/buildslave/jenkins/workspace/lldb-cmake-sanitized/llvm-project/lldb/test/API/functionalities/data-formatter/data-formatter-objc/nsindexpath -p TestDataFormatterNSIndexPath.py Change dir to: /Users/buildslave/jenkins/workspace/lldb-cmake-sanitized/llvm-project/lldb/test/API/functionalities/data-formatter/data-formatter-objc/nsindexpath runCmd: settings clear -all output:

Hide Details

runCmd: settings set symbols.enable-external-lookup false output:

Hide Details

runCmd: settings set target.auto-apply-fixits false output:

Hide Details

runCmd: settings set plugin.process.gdb-remote.packet-timeout 60 output:

Hide Details

runCmd: settings set symbols.clang-modules-cache-path "/Users/buildslave/jenkins/workspace/lldb-cmake-sanitized/lldb-build/lldb-test-build.noindex/module-cache-lldb/lldb-api" output:

Hide Details

runCmd: settings set use-color false output:

Hide Details

runCmd: setting set target.prefer-dynamic-value no-dynamic-values output:

Hide Details

runCmd: settings set target.env-vars ASAN_OPTIONS=detect_stack_use_after_return=1 DYLD_INSERT_LIBRARIES=/Users/buildslave/jenkins/workspace/lldb-cmake-sanitized/host-compiler/lib/clang/11.0.0/lib/darwin/libclang_rt.asan_osx_dynamic.dylib output:

Hide Details

runCmd: file /Users/buildslave/jenkins/workspace/lldb-cmake-sanitized/lldb-build/lldb-test-build.noindex/functionalities/data-formatter/data-formatter-objc/nsindexpath/TestDataFormatterNSIndexPath.test_nsindexpath_with_run_command_dsym/a.out output: Current executable set to '/Users/buildslave/jenkins/workspace/lldb-cmake-sanitized/lldb-build/lldb-test-build.noindex/functionalities/data-formatter/data-formatter-objc/nsindexpath/TestDataFormatterNSIndexPath.test_nsindexpath_with_run_command_dsym/a.out' (x86_64).

Hide Details

Hide Details

runCmd: breakpoint set -f "main.m" -l 15 output: Breakpoint 1: where = a.out`main + 301 at main.m:15:22, address = 0x0000000100000e9d

Hide Details

Hide Details

Expecting pattern: ^Breakpoint (?P<bpno>[0-9]+): (?P<num_locations>[0-9]+) locations\.$ Not matched

Hide Details

Expecting pattern: ^Breakpoint (?P<bpno>[0-9]+): (?P<num_locations>no) locations \(pending\)\. Not matched

Hide Details

Expecting pattern: ^Breakpoint (?P<bpno>[0-9]+): where = (?P<module>.*)`(?P<symbol>[+\-]{0,1}[^+]+)( \+ (?P<offset>[0-9]+)){0,1}( \[inlined\] (?P<inline_symbol>.*)){0,1} at (?P<file>[^:]+):(?P<line_no>[0-9]+)(?P<column>(:[0-9]+)?), address = (?P<address>0x[0-9a-fA-F]+)$ Matched

Hide Details

runCmd: run output: Process 30801 stopped * thread #1, queue = 'com.apple.main-thread', stop reason = breakpoint 1.1 frame #0: 0x0000000100000e9d a.out`main(argc=1, argv=0x00007ffeefbff400) at main.m:15:22 12 NSIndexPath* indexPath4 = [NSIndexPath indexPathWithIndexes:values length:4]; 13 NSIndexPath* indexPath5 = [NSIndexPath indexPathWithIndexes:values length:5]; 14 -> 15 NSLog(@"%@", indexPath1); // break here ^ 16 NSLog(@"%@", indexPath2); 17 NSLog(@"%@", indexPath3); 18 NSLog(@"%@", indexPath4);

Hide Details

Process 30801 launched: '/Users/buildslave/jenkins/workspace/lldb-cmake-sanitized/lldb-build/lldb-test-build.noindex/functionalities/data-formatter/data-formatter-objc/nsindexpath/TestDataFormatterNSIndexPath.test_nsindexpath_with_run_command_dsym/a.out' (x86_64)

Hide Details

Hide Details

runCmd: thread list output: Process 30801 stopped * thread #1: tid = 0x21771d, 0x0000000100000e9d a.out`main(argc=1, argv=0x00007ffeefbff400) at main.m:15:22, queue = 'com.apple.main-thread', stop reason = breakpoint 1.1

Hide Details

Hide Details

Expecting sub string: stopped Matched

Hide Details

Expecting sub string: stop reason = breakpoint Matched

Hide Details

Adding tearDown hook: def cleanup(): self.runCmd('type format clear', check=False) self.runCmd('type summary clear', check=False) self.runCmd('type synth clear', check=False)

Hide Details

Hide Details

runCmd: frame variable --ptr-depth=1 -d run -- indexPath1 output: (NSIndexPath *) indexPath1 = 0x01bfddb85b628fd3 { [0] = 1 }

Hide Details

Hide Details

Expecting sub string: [0] = 1 Matched

Hide Details

runCmd: frame variable --ptr-depth=1 -d run -- indexPath2 output: (NSIndexPath *) indexPath2 = 0x01bfddb85f628e53 { [0] = 1 [1] = 2 }

Hide Details

Hide Details

Expecting sub string: [0] = 1 Matched

Hide Details

Expecting sub string: [1] = 2 Matched

Hide Details

runCmd: frame variable --ptr-depth=1 -d run -- indexPath3 output: (NSIndexPath *) indexPath3 = 0x01bfdd785f628ed3 { [0] = 1 [1] = 2 [2] = 3 }

Hide Details

Hide Details

Expecting sub string: [0] = 1 Matched

Hide Details

Expecting sub string: [1] = 2 Matched

Hide Details

Expecting sub string: [2] = 3 Matched

Hide Details

runCmd: frame variable --ptr-depth=1 -d run -- indexPath4 output: (NSIndexPath *) indexPath4 = 0x019fdd785f628d53 { [0] = 1 [1] = 2 [2] = 3 [3] = 4 }

Hide Details

Hide Details

Expecting sub string: [0] = 1 Matched

Hide Details

Expecting sub string: [1] = 2 Matched

Hide Details

Expecting sub string: [2] = 3 Matched

Hide Details

Expecting sub string: [3] = 4 Matched

Hide Details

runCmd: frame variable --ptr-depth=1 -d run -- indexPath5 output: (NSIndexPath *) indexPath5 = 0x0000603000002f20 { [0] = 1 [1] = 2 [2] = 3 [3] = 4 [4] = 5 }

Hide Details

Hide Details

Expecting sub string: [0] = 1 Matched

Hide Details

Expecting sub string: [1] = 2 Matched

Hide Details

Expecting sub string: [2] = 3 Matched

Hide Details

Expecting sub string: [3] = 4 Matched

Hide Details

Expecting sub string: [4] = 5 Matched

Hide Details

runCmd: expression --ptr-depth=1 -d run -- indexPath1 output: (NSIndexPath *) $0 = 0x01bfddb85b628fd3 { [0] = 1 }

Hide Details

Hide Details

Expecting sub string: [0] = 1 Matched

Hide Details

runCmd: expression --ptr-depth=1 -d run -- indexPath2 output: (NSIndexPath *) $1 = 0x01bfddb85f628e53 { [0] = 1 [1] = 2 }

Hide Details

Hide Details

Expecting sub string: [0] = 1 Matched

Hide Details

Expecting sub string: [1] = 2 Matched

Hide Details

runCmd: expression --ptr-depth=1 -d run -- indexPath3 output: (NSIndexPath *) $2 = 0x01bfdd785f628ed3 { [0] = 1 [1] = 2 [2] = 3 }

Hide Details

Hide Details

Expecting sub string: [0] = 1 Matched

Hide Details

Expecting sub string: [1] = 2 Matched

Hide Details

Expecting sub string: [2] = 3 Matched

Hide Details

runCmd: expression --ptr-depth=1 -d run -- indexPath4 output: (NSIndexPath *) $3 = 0x019fdd785f628d53 { [0] = 1 [1] = 2 [2] = 3 [3] = 4 }

Hide Details

Hide Details

Expecting sub string: [0] = 1 Matched

Hide Details

Expecting sub string: [1] = 2 Matched

Hide Details

Expecting sub string: [2] = 3 Matched

Hide Details

Expecting sub string: [3] = 4 Matched

Hide Details

runCmd: expression --ptr-depth=1 -d run -- indexPath5 output: (NSIndexPath *) $4 = 0x0000603000002f20 { [0] = 1 [1] = 2 [2] = 3 [3] = 4 [4] = 5 }

Hide Details

Hide Details

Expecting sub string: [0] = 1 Matched

Hide Details

Expecting sub string: [1] = 2 Matched

Hide Details

Expecting sub string: [2] = 3 Matched

Hide Details

Expecting sub string: [3] = 4 Matched Assertion failed: (tokenKind == tok::kw___bridge_retain), function ParseParenExpression, file /Users/buildslave/jenkins/workspace/lldb-cmake-sanitized/llvm-project/clang/lib/Parse/ParseExpr.cpp, line 2804.

Hide Details

--

Hide Details

******************** PASS: lldb-api :: driver/batch_mode/TestBatchMode.py (2006 of 2029) PASS: lldb-unit :: Utility/./UtilityTests/StringExtractorTest.GetHexU8_Underflow (2007 of 2029) UNSUPPORTED: lldb-api :: functionalities/darwin_log/filter/regex/activity/TestDarwinLogFilterRegexActivity.py (2008 of 2029) UNSUPPORTED: lldb-api :: android/platform/TestDefaultCacheLineSize.py (2009 of 2029) PASS: lldb-api :: functionalities/unwind/sigtramp/TestSigtrampUnwind.py (2010 of 2029) PASS: lldb-unit :: Signals/./SignalsTests/UnixSignalsTest.GetInfo (2011 of 2029) UNSUPPORTED: lldb-api :: functionalities/data-formatter/data-formatter-stl/libstdcpp/smart_ptr/TestDataFormatterStdSmartPtr.py (2012 of 2029) PASS: lldb-unit :: Process/gdb-remote/./ProcessGdbRemoteTests/GDBRemoteCommunicationClientTest.SaveRestoreRegistersNoSuffix (2013 of 2029) PASS: lldb-unit :: Utility/./UtilityTests/BinaryStreamTest.PutSLEB128SevenBytes (2014 of 2029) PASS: lldb-api :: commands/log/basic/TestLogging.py (2015 of 2029) PASS: lldb-unit :: Process/minidump/./LLDBMinidumpTests/MinidumpParserTest.GetMemoryRegionInfoLinuxMaps (2016 of 2029) PASS: lldb-unit :: Utility/./UtilityTests/ConstStringTest.format_provider (2017 of 2029) PASS: lldb-shell :: Driver/TestProcessAttach.test (2018 of 2029) PASS: lldb-shell :: SymbolFile/Breakpad/line-table-discontinuous-file-ids.test (2019 of 2029) PASS: lldb-unit :: ScriptInterpreter/Python/./ScriptInterpreterPythonTests/PythonDataObjectsTest.TestPythonTupleInitializerList2 (2020 of 2029) PASS: lldb-api :: lang/cpp/template-function/TestTemplateFunctions.py (2021 of 2029) PASS: lldb-unit :: Symbol/./SymbolTests/PostfixExpression.ToDWARF (2022 of 2029) PASS: lldb-unit :: SymbolFile/DWARF/./SymbolFileDWARFTests/XcodeSDKModuleTests.TestModuleGetXcodeSDK (2023 of 2029) PASS: lldb-unit :: Utility/./UtilityTests/StringListTest.ShiftStdString (2024 of 2029) UNSUPPORTED: lldb-api :: benchmarks/startup/TestStartupDelays.py (2025 of 2029) PASS: lldb-api :: functionalities/data-formatter/pyobjsynthprovider/TestPyObjSynthProvider.py (2026 of 2029) PASS: lldb-api :: functionalities/thread/backtrace_all/TestBacktraceAll.py (2027 of 2029) FAIL: lldb-api :: lang/objc/print-obj/TestPrintObj.py (2028 of 2029) ******************** TEST 'lldb-api :: lang/objc/print-obj/TestPrintObj.py' FAILED ******************** Script: -- /Users/buildslave/jenkins/workspace/lldb-cmake-sanitized/lldb-build/lldb-test-build.noindex/copied-system-python /Users/buildslave/jenkins/workspace/lldb-cmake-sanitized/llvm-project/lldb/test/API/dotest.py --arch x86_64 -s /Users/buildslave/jenkins/workspace/lldb-cmake-sanitized/lldb-build/lldb-test-traces -S nm -u CXXFLAGS -u CFLAGS --codesign-identity lldb_codesign --server /Users/buildslave/jenkins/workspace/lldb-cmake-sanitized/lldb-build/./bin/debugserver --arch x86_64 --build-dir /Users/buildslave/jenkins/workspace/lldb-cmake-sanitized/lldb-build/lldb-test-build.noindex -s=/Users/buildslave/jenkins/workspace/lldb-cmake-sanitized/test/logs -t --env TERM=vt100 --env LLVM_LIBS_DIR=/Users/buildslave/jenkins/workspace/lldb-cmake-sanitized/lldb-build/./lib --inferior-env ASAN_OPTIONS=detect_stack_use_after_return=1 --inferior-env DYLD_INSERT_LIBRARIES=/Users/buildslave/jenkins/workspace/lldb-cmake-sanitized/host-compiler/lib/clang/11.0.0/lib/darwin/libclang_rt.asan_osx_dynamic.dylib --build-dir /Users/buildslave/jenkins/workspace/lldb-cmake-sanitized/lldb-build/lldb-test-build.noindex --lldb-module-cache-dir /Users/buildslave/jenkins/workspace/lldb-cmake-sanitized/lldb-build/lldb-test-build.noindex/module-cache-lldb/lldb-api --clang-module-cache-dir /Users/buildslave/jenkins/workspace/lldb-cmake-sanitized/lldb-build/lldb-test-build.noindex/module-cache-clang/lldb-api --executable /Users/buildslave/jenkins/workspace/lldb-cmake-sanitized/lldb-build/./bin/lldb --compiler /Users/buildslave/jenkins/workspace/lldb-cmake-sanitized/lldb-build/./bin/clang --dsymutil /Users/buildslave/jenkins/workspace/lldb-cmake-sanitized/lldb-build/./bin/dsymutil --filecheck /Users/buildslave/jenkins/workspace/lldb-cmake-sanitized/lldb-build/./bin/FileCheck --lldb-libs-dir /Users/buildslave/jenkins/workspace/lldb-cmake-sanitized/lldb-build/./lib /Users/buildslave/jenkins/workspace/lldb-cmake-sanitized/llvm-project/lldb/test/API/lang/objc/print-obj -p TestPrintObj.py -- Exit Code: -6

Hide Details

Command Output (stdout): -- lldb version 11.0.99 clang revision bff0c56ff92106afad22b54a90e1c612da4d6f99 llvm revision bff0c56ff92106afad22b54a90e1c612da4d6f99

Hide Details

-- Command Output (stderr): -- Assertion failed: (tokenKind == tok::kw___bridge_retain), function ParseParenExpression, file /Users/buildslave/jenkins/workspace/lldb-cmake-sanitized/llvm-project/clang/lib/Parse/ParseExpr.cpp, line 2804.

Hide Details

--

Hide Details

******************** PASS: lldb-api :: types/TestShortTypeExpr.py (2029 of 2029) Slowest Tests: -------------------------------------------------------------------------- 353.38s: lldb-api :: tools/lldb-server/TestLldbGdbServer.py 258.33s: lldb-api :: lang/cpp/enum_types/TestCPP11EnumTypes.py 252.26s: lldb-api :: api/multithreaded/TestMultithreaded.py 245.44s: lldb-api :: tools/lldb-server/TestGdbRemoteThreadsInStopReply.py 156.34s: lldb-api :: lang/objc/exceptions/TestObjCExceptions.py 153.76s: lldb-api :: lang/cpp/namespace/TestNamespaceLookup.py 139.17s: lldb-api :: lang/objc/real-definition/TestRealDefinition.py 119.69s: lldb-api :: tools/lldb-server/TestGdbRemote_qThreadStopInfo.py 118.26s: lldb-api :: types/TestLongTypesExpr.py 109.65s: lldb-api :: lang/objc/foundation/TestObjCMethods.py 98.80s: lldb-api :: lang/objc/forward-decl/TestForwardDecl.py 91.74s: lldb-api :: functionalities/gdb_remote_client/TestWasm.py 90.18s: lldb-api :: commands/settings/TestSettings.py 86.06s: lldb-api :: functionalities/data-formatter/compactvectors/TestCompactVectors.py 85.63s: lldb-api :: types/TestCharTypeExpr.py 84.49s: lldb-api :: types/TestLongTypes.py 82.29s: lldb-api :: api/check_public_api_headers/TestPublicAPIHeaders.py 78.77s: lldb-api :: python_api/lldbutil/iter/TestLLDBIterator.py 75.19s: lldb-api :: commands/expression/import-std-module/stack/TestStackFromStdModule.py 73.09s: lldb-api :: python_api/exprpath_synthetic/TestExprPathSynthetic.py

Hide Details

Tests Times: -------------------------------------------------------------------------- [ Range ] :: [ Percentage ] :: [ Count ] -------------------------------------------------------------------------- [340s,360s) :: [ ] :: [ 1/2029] [320s,340s) :: [ ] :: [ 0/2029] [300s,320s) :: [ ] :: [ 0/2029] [280s,300s) :: [ ] :: [ 0/2029] [260s,280s) :: [ ] :: [ 1/2029] [240s,260s) :: [ ] :: [ 2/2029] [220s,240s) :: [ ] :: [ 0/2029] [200s,220s) :: [ ] :: [ 0/2029] [180s,200s) :: [ ] :: [ 0/2029] [160s,180s) :: [ ] :: [ 0/2029] [140s,160s) :: [ ] :: [ 3/2029] [120s,140s) :: [ ] :: [ 2/2029] [100s,120s) :: [ ] :: [ 2/2029] [ 80s,100s) :: [ ] :: [ 7/2029] [ 60s, 80s) :: [ ] :: [ 21/2029] [ 40s, 60s) :: [* ] :: [ 78/2029] [ 20s, 40s) :: [** ] :: [ 137/2029] [ 0s, 20s) :: [********************************** ] :: [1775/2029] -------------------------------------------------------------------------- ******************** Failing Tests (60): lldb-api :: lang/objc/objc-super/TestObjCSuper.py lldb-api :: lang/objc/foundation/TestObjCMethodsString.py lldb-api :: lang/objc/objc-runtime-ivars/TestRuntimeIvars.py lldb-api :: lang/objcxx/cxx-bridged-po/TestObjCXXBridgedPO.py lldb-api :: lang/objc/forward-decl/TestForwardDecl.py lldb-api :: functionalities/data-formatter/data-formatter-objc/TestDataFormatterObjCNSContainer.py lldb-api :: python_api/exprpath_synthetic/TestExprPathSynthetic.py lldb-api :: commands/expression/namespace_local_var_same_name_obj_c/TestNamespaceLocalVarSameNameObjC.py lldb-api :: lang/objc/blocks/TestObjCIvarsInBlocks.py lldb-api :: commands/expression/import_builtin_fileid/TestImportBuiltinFileID.py lldb-api :: lang/objc/hidden-ivars/TestHiddenIvars.py lldb-api :: lang/objc/objc-new-syntax/TestObjCNewSyntaxLiteral.py lldb-api :: lang/objc/objc-property/TestObjCProperty.py lldb-api :: lang/objc/objc-static-method/TestObjCStaticMethod.py lldb-api :: lang/objc/objc-ivar-protocols/TestIvarProtocols.py lldb-api :: lang/objc/foundation/TestObjCMethods.py lldb-api :: functionalities/data-formatter/data-formatter-objc/TestDataFormatterObjCExpr.py lldb-api :: functionalities/param_entry_vals/basic_entry_values/TestBasicEntryValues.py lldb-api :: lang/objc/objc-struct-return/TestObjCStructReturn.py lldb-api :: lang/objc/objc++/TestObjCXX.py lldb-api :: functionalities/data-formatter/synthupdate/TestSyntheticFilterRecompute.py lldb-api :: functionalities/tail_call_frames/unambiguous_sequence/TestUnambiguousTailCalls.py lldb-api :: lang/objc/foundation/TestObjCMethodsNSError.py lldb-api :: lang/objc/objc-struct-argument/TestObjCStructArgument.py lldb-api :: lang/objcxx/objcxx-ivar-vector/TestIvarVector.py lldb-api :: lang/objc/conflicting-definition/TestConflictingDefinition.py lldb-api :: functionalities/set-data/TestSetData.py lldb-api :: commands/expression/context-object-objc/TestContextObjectObjc.py lldb-api :: lang/objc/objc-new-syntax/TestObjCNewSyntaxArray.py lldb-api :: functionalities/data-formatter/poarray/TestPrintObjectArray.py lldb-api :: lang/objc/modules-non-objc-target/TestObjCModulesNonObjCTarget.py lldb-api :: lang/objc/modules/TestObjCModules.py lldb-api :: commands/expression/call-throws/TestCallThatThrows.py lldb-api :: lang/objc/foundation/TestObjCMethodsNSArray.py lldb-api :: lang/objc/rdar-11355592/TestRdar11355592.py lldb-api :: functionalities/tail_call_frames/disambiguate_tail_call_seq/TestDisambiguateTailCallSeq.py lldb-api :: lang/objc/objc_direct-methods/TestObjCDirectMethods.py lldb-api :: functionalities/data-formatter/data-formatter-objc/TestDataFormatterObjCNSError.py lldb-api :: functionalities/data-formatter/data-formatter-objc/TestDataFormatterObjCCF.py lldb-api :: lang/objc/variadic_methods/TestVariadicMethods.py lldb-api :: lang/objc/orderedset/TestOrderedSet.py lldb-api :: commands/expression/diagnostics/TestExprDiagnostics.py lldb-api :: commands/expression/persist_objc_pointeetype/TestPersistObjCPointeeType.py lldb-api :: lang/objc/objc-optimized/TestObjcOptimized.py lldb-api :: functionalities/tail_call_frames/inlining_and_tail_calls/TestInliningAndTailCalls.py lldb-api :: functionalities/tail_call_frames/thread_step_out_message/TestArtificialFrameStepOutMessage.py lldb-api :: lang/objc/bitfield_ivars/TestBitfieldIvars.py lldb-api :: functionalities/tail_call_frames/disambiguate_call_site/TestDisambiguateCallSite.py lldb-api :: lang/objc/objc-new-syntax/TestObjCNewSyntaxDictionary.py lldb-api :: commands/expression/po_verbosity/TestPoVerbosity.py lldb-api :: lang/objc/self/TestObjCSelf.py lldb-api :: lang/objc/foundation/TestRuntimeTypes.py lldb-api :: functionalities/tail_call_frames/disambiguate_paths_to_common_sink/TestDisambiguatePathsToCommonSink.py lldb-api :: lang/objc/unicode-string/TestUnicodeString.py lldb-api :: commands/expression/two-files/TestObjCTypeQueryFromOtherCompileUnit.py lldb-api :: lang/objc/objc-class-method/TestObjCClassMethod.py lldb-api :: lang/objc/radar-9691614/TestObjCMethodReturningBOOL.py lldb-api :: lang/objc/foundation/TestConstStrings.py lldb-api :: functionalities/data-formatter/data-formatter-objc/nsindexpath/TestDataFormatterNSIndexPath.py lldb-api :: lang/objc/print-obj/TestPrintObj.py

Hide Details

Hide Details

Testing Time: 4172.53s Unsupported Tests : 170 Expected Passes : 1793 Expected Failures : 6 Unexpected Failures: 60 FAILED: tools/lldb/test/CMakeFiles/check-lldb-lit cd /Users/buildslave/jenkins/workspace/lldb-cmake-sanitized/lldb-build/tools/lldb/test && /usr/local/Frameworks/Python.framework/Versions/3.7/bin/python3.7 /Users/buildslave/jenkins/workspace/lldb-cmake-sanitized/lldb-build/./bin/llvm-lit -v --time-tests --shuffle --xunit-xml-output=/Users/buildslave/jenkins/workspace/lldb-cmake-sanitized/test/results.xml -v -j 4 --timeout 1200 /Users/buildslave/jenkins/workspace/lldb-cmake-sanitized/lldb-build/tools/lldb/test ninja: build stopped: subcommand failed. Command failed: Command '['/usr/bin/env', 'TERM=vt100', '/usr/local/bin/ninja', '-v', 'check-lldb']' returned non-zero exit status 1. Command: ['/usr/bin/env', 'TERM=vt100', '/usr/local/bin/ninja', '-v', 'check-lldb'] [Pipeline] } [Pipeline] // timeout [Pipeline] } [Pipeline] // stage [Pipeline] stage [Pipeline] { (Declarative: Post Actions) [Pipeline] scanForIssues [Clang (LLVM based)] Sleeping for 5 seconds due to JENKINS-32191... [Clang (LLVM based)] Parsing console log (workspace: '/Users/buildslave/jenkins/workspace/lldb-cmake-sanitized') [Clang (LLVM based)] Successfully parsed console log [Clang (LLVM based)] -> found 9 issues (skipped 0 duplicates) [Clang (LLVM based)] Post processing issues on 'green-dragon-23' with source code encoding 'UTF-8' [Clang (LLVM based)] Creating SCM blamer to obtain author and commit information for affected files [Clang (LLVM based)] Creating SCM miner to obtain statistics for affected repository files [Clang (LLVM based)] Resolving file names for all issues in source directory '/Users/buildslave/jenkins/workspace/lldb-cmake-sanitized' [Clang (LLVM based)] -> resolved paths in source directory (8 found, 0 not found) [Clang (LLVM based)] Resolving module names from module definitions (build.xml, pom.xml, or Manifest.mf files) [Clang (LLVM based)] -> resolved module names for 9 issues [Clang (LLVM based)] Resolving package names (or namespaces) by parsing the affected files [Clang (LLVM based)] -> resolved package names of 8 affected files [Clang (LLVM based)] No filter has been set, publishing all 9 issues [Clang (LLVM based)] Creating fingerprints for all affected code blocks to track issues over different builds [Clang (LLVM based)] -> created fingerprints for 9 issues (skipped 0 issues) [Clang (LLVM based)] Copying affected files to Jenkins' build folder '/Users/Shared/Jenkins/Home/jobs/lldb-cmake-sanitized/builds/1501/files-with-issues' [Clang (LLVM based)] -> 8 copied, 0 not in workspace, 0 not-found, 0 with I/O error [Pipeline] junit Recording test results [Pipeline] } [Pipeline] // stage [Pipeline] } [Pipeline] // withEnv [Pipeline] } [Pipeline] // node [Pipeline] End of Pipeline ERROR: script returned exit code 1 Finished: FAILURE