FailedConsole Output

Skipping 10,054 KB.. Full Log
of 2045)
PASS: lldb-shell :: Quit/TestQuitExitCode-30.test (573 of 2045)
PASS: lldb-unit :: Symbol/./SymbolTests/TestTypeSystemClang.TestGetTypeClassTypeOfExpr (574 of 2045)
PASS: lldb-api :: python_api/sbplatform/TestSBPlatform.py (575 of 2045)
PASS: lldb-api :: lang/objc/foundation/TestObjCMethodsNSError.py (576 of 2045)
PASS: lldb-api :: functionalities/plugins/command_plugin/TestPluginCommands.py (577 of 2045)
PASS: lldb-unit :: Utility/./UtilityTests/OptionsWithRawTest.WhitespaceSuffix (578 of 2045)
PASS: lldb-unit :: Language/Highlighting/./HighlighterTests/HighlighterTest.ClangCursorPosEndOfLine (579 of 2045)
PASS: lldb-unit :: SymbolFile/NativePDB/./SymbolFileNativePDBTests/PDBFPOProgramToDWARFExpressionTests.UnresolvedDependentCyclicRegisterAssignmentReference (580 of 2045)
PASS: lldb-unit :: Host/./HostTests/SocketAddressTest.Set (581 of 2045)
PASS: lldb-shell :: SymbolFile/DWARF/find-inline-method.s (582 of 2045)
PASS: lldb-unit :: ScriptInterpreter/Python/./ScriptInterpreterPythonTests/PythonDataObjectsTest.TestPythonTupleInitializerList (583 of 2045)
PASS: lldb-api :: commands/command/nested_alias/TestNestedAlias.py (584 of 2045)
PASS: lldb-unit :: Utility/./UtilityTests/StringListTest.SplitIntoLines (585 of 2045)
PASS: lldb-shell :: Commands/command-target-modules-dump-sections.yaml (586 of 2045)
PASS: lldb-api :: lang/cpp/stl/TestSTL.py (587 of 2045)
PASS: lldb-unit :: Utility/./UtilityTests/FileSpecTest.FileAndDirectoryComponents (588 of 2045)
PASS: lldb-api :: functionalities/thread/jump/TestThreadJump.py (589 of 2045)
PASS: lldb-api :: functionalities/multiword-commands/TestMultiWordCommands.py (590 of 2045)
PASS: lldb-unit :: Process/minidump/./LLDBMinidumpTests/MinidumpParserTest.GetThreadContext_x86_32 (591 of 2045)
PASS: lldb-api :: commands/expression/import_builtin_fileid/TestImportBuiltinFileID.py (592 of 2045)
PASS: lldb-api :: python_api/disassemble-raw-data/TestDisassemble_VST1_64.py (593 of 2045)
PASS: lldb-api :: functionalities/thread/concurrent_events/TestConcurrentSignalDelayBreak.py (594 of 2045)
PASS: lldb-api :: commands/expression/import-std-module/list-dbg-info-content/TestDbgInfoContentListFromStdModule.py (595 of 2045)
PASS: lldb-unit :: Host/./HostTests/FileSystemTest.Resolve (596 of 2045)
PASS: lldb-unit :: Symbol/./SymbolTests/TestTypeSystemClang.TestGetEnumIntegerTypeBasicTypes (597 of 2045)
PASS: lldb-unit :: Utility/./UtilityTests/RangeTest.ContainsRangeStartingFromZero (598 of 2045)
PASS: lldb-unit :: Utility/./UtilityTests/StringLexerTest.PutBack (599 of 2045)
PASS: lldb-api :: functionalities/data-formatter/compactvectors/TestCompactVectors.py (600 of 2045)
PASS: lldb-shell :: SymbolFile/DWARF/debug_loc-aslr.s (601 of 2045)
PASS: lldb-unit :: Utility/./UtilityTests/SerializationRountripTest.SerializeDeserializeObjectPointer (602 of 2045)
PASS: lldb-unit :: Utility/./UtilityTests/OptionsWithRawTest.WhitespaceInput (603 of 2045)
PASS: lldb-unit :: Utility/./UtilityTests/CompletionRequest.TryCompleteCurrentArgBad (604 of 2045)
PASS: lldb-shell :: Reproducer/TestFileRepro.test (605 of 2045)
PASS: lldb-unit :: Utility/./UtilityTests/TimerTest.CategoryTimesNested (606 of 2045)
PASS: lldb-unit :: Utility/./UtilityTests/StreamTest.PutBytesAsRawHex8ToLittleEndian (607 of 2045)
PASS: lldb-api :: commands/expression/deleting-implicit-copy-constructor/TestDeletingImplicitCopyConstructor.py (608 of 2045)
PASS: lldb-unit :: Utility/./UtilityTests/BinaryStreamTest.PutULEB128One (609 of 2045)
PASS: lldb-api :: lang/objc/real-definition/TestRealDefinition.py (610 of 2045)
PASS: lldb-api :: tools/lldb-server/commandline/TestStubReverseConnect.py (611 of 2045)
UNSUPPORTED: lldb-shell :: SymbolFile/NativePDB/typedefs.cpp (612 of 2045)
PASS: lldb-api :: functionalities/gdb_remote_client/TestIOSSimulator.py (613 of 2045)
PASS: lldb-api :: commands/disassemble/basic/TestDisassembleBreakpoint.py (614 of 2045)
PASS: lldb-unit :: UnwindAssembly/x86/./UnwindAssemblyx86Tests/Testx86AssemblyInspectionEngine.TestPushESI (615 of 2045)
PASS: lldb-api :: types/TestIntegerTypeExpr.py (616 of 2045)
UNSUPPORTED: lldb-api :: tools/lldb-server/signal-filtering/TestGdbRemote_QPassSignals.py (617 of 2045)
PASS: lldb-api :: functionalities/data-formatter/ostypeformatting/TestFormattersOsType.py (618 of 2045)
PASS: lldb-unit :: Symbol/./SymbolTests/PostfixExpression.ParseFPOProgram (619 of 2045)
PASS: lldb-unit :: Utility/./UtilityTests/StringListTest.AppendListCStringArrayEmpty (620 of 2045)
PASS: lldb-unit :: Utility/./UtilityTests/RangeTest.ContainsAddrInvalid (621 of 2045)
PASS: lldb-api :: functionalities/unwind/noreturn/module-end/TestNoReturnModuleEnd.py (622 of 2045)
UNSUPPORTED: lldb-api :: lang/objc/rdar-12408181/TestRdar12408181.py (623 of 2045)
PASS: lldb-unit :: UnwindAssembly/PPC64/./PPC64InstEmulationTests/TestPPC64InstEmulation.TestSimpleFunction (624 of 2045)
PASS: lldb-unit :: Utility/./UtilityTests/UriParserTest.BracketedHostname (625 of 2045)
PASS: lldb-shell :: ObjectFile/ELF/duplicate-section.yaml (626 of 2045)
PASS: lldb-unit :: ObjectFile/Breakpad/./ObjectFileBreakpadTests/ModuleRecord.parse (627 of 2045)
PASS: lldb-unit :: ScriptInterpreter/Python/./ScriptInterpreterPythonTests/PythonDataObjectsTest.TestPythonIntegerToStructuredInteger (628 of 2045)
PASS: lldb-shell :: Reproducer/Functionalities/TestDataFormatter.test (629 of 2045)
PASS: lldb-api :: lang/cpp/namespace/TestNamespace.py (630 of 2045)
PASS: lldb-unit :: UnwindAssembly/ARM64/./Arm64InstEmulationTests/TestArm64InstEmulation.TestSimpleDarwinFunction (631 of 2045)
PASS: lldb-unit :: Utility/./UtilityTests/StringExtractorTest.GetHexU8_Extra_NoEof (632 of 2045)
PASS: lldb-shell :: Minidump/fb-dump.test (633 of 2045)
PASS: lldb-unit :: UnwindAssembly/x86/./UnwindAssemblyx86Tests/Testx86AssemblyInspectionEngine.TestAddESP (634 of 2045)
PASS: lldb-unit :: Language/Highlighting/./HighlighterTests/HighlighterTest.Keywords (635 of 2045)
PASS: lldb-api :: lang/objc/objc-new-syntax/TestObjCNewSyntaxArray.py (636 of 2045)
PASS: lldb-unit :: UnwindAssembly/x86/./UnwindAssemblyx86Tests/Testx86AssemblyInspectionEngine.TestPushEDI (637 of 2045)
PASS: lldb-unit :: Language/Highlighting/./HighlighterTests/HighlighterTest.ClangBraces (638 of 2045)
PASS: lldb-unit :: Symbol/./SymbolTests/TestClangASTImporter.DeportTypeTagDecl (639 of 2045)
PASS: lldb-unit :: Utility/./UtilityTests/FileSpecTest.RemoveLastPathComponent (640 of 2045)
PASS: lldb-unit :: Utility/./UtilityTests/StringListTest.SetSize (641 of 2045)
PASS: lldb-unit :: Utility/./UtilityTests/OptionsWithRawTest.UnterminatedQuote (642 of 2045)
PASS: lldb-api :: lang/cpp/constructors/TestCppConstructors.py (643 of 2045)
PASS: lldb-unit :: Utility/./UtilityTests/IndexToObjectTest.ObjectForIndex (644 of 2045)
PASS: lldb-shell :: SymbolFile/DWARF/debug-types-missing-signature.test (645 of 2045)
PASS: lldb-unit :: Interpreter/./InterpreterTests/OptionArgParserTest.toScriptLanguage (646 of 2045)
PASS: lldb-api :: tools/lldb-server/TestLldbGdbServer.py (647 of 2045)
PASS: lldb-unit :: Utility/./UtilityTests/UriParserTest.TypicalPortPathIPv4 (648 of 2045)
PASS: lldb-api :: functionalities/thread/concurrent_events/TestConcurrentWatchpointDelayWatchpointOneBreakpoint.py (649 of 2045)
PASS: lldb-api :: lang/cpp/signed_types/TestSignedTypes.py (650 of 2045)
PASS: lldb-shell :: ObjectFile/MachO/lc_build_version.yaml (651 of 2045)
PASS: lldb-unit :: Process/gdb-remote/./ProcessGdbRemoteTests/GDBRemoteClientBaseTest.SendContinueAndAsyncPacket (652 of 2045)
PASS: lldb-unit :: Utility/./UtilityTests/StringExtractorTest.GetHexU8_Underflow (653 of 2045)
PASS: lldb-shell :: Watchpoint/SetErrorCases.test (654 of 2045)
PASS: lldb-unit :: Utility/./UtilityTests/EventTest.DumpEventDataBytes (655 of 2045)
PASS: lldb-unit :: Target/./TargetTests/PathMappingListTest.RelativeTests (656 of 2045)
PASS: lldb-unit :: Utility/./UtilityTests/ScalarTest.CastOperations (657 of 2045)
PASS: lldb-api :: lang/c/find_struct_type/TestFindStructTypes.py (658 of 2045)
PASS: lldb-unit :: Process/minidump/./LLDBMinidumpTests/MinidumpParserTest.GetMiscInfoWindows (659 of 2045)
PASS: lldb-shell :: SymbolFile/DWARF/debug-types-address-ranges.s (660 of 2045)
PASS: lldb-api :: functionalities/data-formatter/data-formatter-stl/libcxx/function/TestLibCxxFunction.py (661 of 2045)
PASS: lldb-unit :: Language/Highlighting/./HighlighterTests/HighlighterTest.ClangPPDirectives (662 of 2045)
PASS: lldb-api :: functionalities/data-formatter/data-formatter-stl/libcxx/iterator/TestDataFormatterLibccIterator.py (663 of 2045)
UNSUPPORTED: lldb-api :: commands/expression/call-restarts/TestCallThatRestarts.py (664 of 2045)
PASS: lldb-shell :: SymbolFile/DWARF/dwarf5-index-is-used.cpp (665 of 2045)
PASS: lldb-api :: functionalities/breakpoint/cpp_exception/TestCPPExceptionBreakpoint.py (666 of 2045)
PASS: lldb-shell :: ScriptInterpreter/Lua/convenience_variables.test (667 of 2045)
PASS: lldb-unit :: Host/./HostTests/FileSystemTest.GetPermissions (668 of 2045)
PASS: lldb-api :: iohandler/resize/TestIOHandlerResize.py (669 of 2045)
PASS: lldb-shell :: Settings/TestModuleCacheSanity.test (670 of 2045)
PASS: lldb-unit :: UnwindAssembly/x86/./UnwindAssemblyx86Tests/Testx86AssemblyInspectionEngine.TestAddRSP (671 of 2045)
PASS: lldb-unit :: Utility/./UtilityTests/BinaryStreamTest.PutSLEB128SevenBytes (672 of 2045)
PASS: lldb-unit :: Utility/./UtilityTests/StringExtractorTest.GetHexBytes_Underflow (673 of 2045)
PASS: lldb-api :: commands/frame/diagnose/dereference-argument/TestDiagnoseDereferenceArgument.py (674 of 2045)
PASS: lldb-shell :: ObjectFile/PECOFF/sections.yaml (675 of 2045)
PASS: lldb-shell :: SymbolFile/DWARF/dwp-debug-types.s (676 of 2045)
PASS: lldb-unit :: SymbolFile/DWARF/./SymbolFileDWARFTests/SymbolFileDWARFTests.TestAbilitiesForDWARF (677 of 2045)
PASS: lldb-unit :: Symbol/./SymbolTests/TestTypeSystemClang.TestUnifyAccessSpecifiers (678 of 2045)
PASS: lldb-unit :: UnwindAssembly/x86/./UnwindAssemblyx86Tests/Testx86AssemblyInspectionEngine.TestPushRBPWithREX (679 of 2045)
PASS: lldb-api :: functionalities/thread/thread_specific_break/TestThreadSpecificBreakpoint.py (680 of 2045)
PASS: lldb-unit :: Utility/./UtilityTests/RangeTest.Slide (681 of 2045)
PASS: lldb-api :: macosx/thread_suspend/TestInternalThreadSuspension.py (682 of 2045)
PASS: lldb-api :: commands/target/create-deps/TestTargetCreateDeps.py (683 of 2045)
PASS: lldb-unit :: Expression/./ExpressionTests/DiagnosticManagerTest.HasFixits (684 of 2045)
PASS: lldb-api :: functionalities/thread/concurrent_events/TestConcurrentCrashWithWatchpoint.py (685 of 2045)
PASS: lldb-shell :: Minidump/Windows/find-module.test (686 of 2045)
PASS: lldb-api :: functionalities/thread/step_until/TestStepUntil.py (687 of 2045)
PASS: lldb-unit :: ScriptInterpreter/Python/./ScriptInterpreterPythonTests/PythonDataObjectsTest.TestPythonCallableInvoke (688 of 2045)
PASS: lldb-unit :: ScriptInterpreter/Python/./ScriptInterpreterPythonTests/PythonDataObjectsTest.TestBorrowedReferences (689 of 2045)
PASS: lldb-shell :: Settings/TestSettingsWrite.test (690 of 2045)
PASS: lldb-unit :: Process/gdb-remote/./ProcessGdbRemoteTests/GDBRemoteClientBaseTest.InterruptNoResponse (691 of 2045)
PASS: lldb-shell :: SymbolFile/Breakpad/line-table-discontinuous-file-ids.test (692 of 2045)
UNSUPPORTED: lldb-shell :: BuildScript/toolchain-clang-cl.test (693 of 2045)
PASS: lldb-unit :: Utility/./UtilityTests/StringExtractorTest.GetHexU8_Underflow2 (694 of 2045)
PASS: lldb-unit :: Signals/./SignalsTests/UnixSignalsTest.GetInfo (695 of 2045)
PASS: lldb-api :: functionalities/tail_call_frames/thread_step_out_or_return/TestSteppingOutWithArtificialFrames.py (696 of 2045)
PASS: lldb-api :: functionalities/thread/concurrent_events/TestConcurrentNWatchNBreak.py (697 of 2045)
PASS: lldb-unit :: Utility/./UtilityTests/StringExtractorTest.DecodeHexU8_Underflow2 (698 of 2045)
PASS: lldb-api :: functionalities/breakpoint/inlined_breakpoints/TestInlinedBreakpoints.py (699 of 2045)
PASS: lldb-unit :: ScriptInterpreter/Python/./ScriptInterpreterPythonTests/PythonDataObjectsTest.TestPythonFile (700 of 2045)
PASS: lldb-unit :: Utility/./UtilityTests/UserIDResolver.GetGroupName (701 of 2045)
PASS: lldb-shell :: ObjectFile/wasm/basic.yaml (702 of 2045)
PASS: lldb-unit :: Utility/./UtilityTests/LogChannelEnabledTest.LogGetLogThread (703 of 2045)
PASS: lldb-api :: lang/cpp/unicode-literals/TestUnicodeLiterals.py (704 of 2045)
PASS: lldb-unit :: Utility/./UtilityTests/OptionsWithRawTest.EmptySuffix (705 of 2045)
PASS: lldb-api :: lang/cpp/char8_t/TestCxxChar8_t.py (706 of 2045)
PASS: lldb-unit :: Utility/./UtilityTests/RangeTest.LessThan (707 of 2045)
PASS: lldb-shell :: ObjectFile/Breakpad/uuid-matching-mac.test (708 of 2045)
XFAIL: lldb-shell :: Register/x86-64-write.test (709 of 2045)
PASS: lldb-unit :: Language/Highlighting/./HighlighterTests/HighlighterTest.ClangCursorOutOfBounds (710 of 2045)
PASS: lldb-shell :: SymbolFile/Breakpad/unwind-via-stack-cfi.test (711 of 2045)
PASS: lldb-unit :: Utility/./UtilityTests/ListenerTest.GetEventImmediate (712 of 2045)
PASS: lldb-api :: functionalities/lazy-loading/TestLazyLoading.py (713 of 2045)
PASS: lldb-api :: functionalities/abbreviation/TestCommonShortSpellings.py (714 of 2045)
PASS: lldb-shell :: Breakpoint/single-file-split-dwarf.test (715 of 2045)
PASS: lldb-api :: lang/objc/objc-runtime-ivars/TestRuntimeIvars.py (716 of 2045)
PASS: lldb-unit :: Utility/./UtilityTests/OptionsWithRawTest.ArgsButNoLeadingDash (717 of 2045)
UNSUPPORTED: lldb-shell :: SymbolFile/PDB/function-level-linking.test (718 of 2045)
PASS: lldb-unit :: Utility/./UtilityTests/CompletionRequest.TryCompleteCurrentArgGood (719 of 2045)
PASS: lldb-api :: functionalities/thread/num_threads/TestNumThreads.py (720 of 2045)
PASS: lldb-shell :: Register/x86-64-ymm-read.test (721 of 2045)
PASS: lldb-shell :: ObjectFile/MachO/subsections.yaml (722 of 2045)
PASS: lldb-api :: commands/frame/diagnose/bad-reference/TestBadReference.py (723 of 2045)
PASS: lldb-api :: lang/cpp/virtual-overload/TestVirtualOverload.py (724 of 2045)
PASS: lldb-unit :: Utility/./UtilityTests/RegularExpression.CopyAssignment (725 of 2045)
PASS: lldb-unit :: Utility/./UtilityTests/Flags.Test (726 of 2045)
PASS: lldb-unit :: Utility/./UtilityTests/ArgsTest.TestInsertArg (727 of 2045)
UNSUPPORTED: lldb-api :: functionalities/thread/concurrent_events/TestConcurrentManySignals.py (728 of 2045)
PASS: lldb-shell :: Heap/heap-cstr.test (729 of 2045)
PASS: lldb-api :: functionalities/inline-stepping/TestInlineStepping.py (730 of 2045)
PASS: lldb-api :: lang/objc/objc-baseclass-sbtype/TestObjCBaseClassSBType.py (731 of 2045)
PASS: lldb-unit :: debugserver/./debugserverTests/RNBSocket.LoopBackListenIPv4 (732 of 2045)
PASS: lldb-unit :: Host/./HostTests/MainLoopTest.Signal (733 of 2045)
PASS: lldb-shell :: SymbolFile/DWARF/module-ownership.mm (734 of 2045)
PASS: lldb-api :: commands/expression/multiline-navigation/TestMultilineNavigation.py (735 of 2045)
PASS: lldb-api :: commands/frame/language/TestGuessLanguage.py (736 of 2045)
PASS: lldb-api :: functionalities/gdb_remote_client/TestNoWatchpointSupportInfo.py (737 of 2045)
PASS: lldb-unit :: Utility/./UtilityTests/BinaryStreamTest.PutSLEB128MaxValue (738 of 2045)
PASS: lldb-unit :: Utility/./UtilityTests/BinaryStreamTest.PutSLEB128OneByte (739 of 2045)
PASS: lldb-shell :: Commands/CommandScriptImmediateOutput/CommandScriptImmediateOutputFile.test (740 of 2045)
PASS: lldb-api :: python_api/frame/inlines/TestInlinedFrame.py (741 of 2045)
PASS: lldb-unit :: Utility/./UtilityTests/StringExtractorTest.GetHexU8_Extra (742 of 2045)
PASS: lldb-unit :: Core/./LLDBCoreTests/UniqueCStringMap.NoDefaultConstructor (743 of 2045)
PASS: lldb-shell :: Reproducer/TestDiscard.test (744 of 2045)
PASS: lldb-api :: commands/quit/TestQuit.py (745 of 2045)
PASS: lldb-shell :: ObjectFile/PECOFF/invalid-export-table.yaml (746 of 2045)
PASS: lldb-unit :: UnwindAssembly/x86/./UnwindAssemblyx86Tests/Testx86AssemblyInspectionEngine.TestPushExtended (747 of 2045)
PASS: lldb-unit :: Utility/./UtilityTests/ArgsTest.GetQuotedCommandString (748 of 2045)
PASS: lldb-api :: functionalities/data-formatter/data-formatter-stl/libcxx/queue/TestDataFormatterLibcxxQueue.py (749 of 2045)
PASS: lldb-unit :: Core/./LLDBCoreTests/RichManglingContextTest.SwitchProvider (750 of 2045)
PASS: lldb-shell :: ObjectFile/PECOFF/disassemble-thumb.yaml (751 of 2045)
PASS: lldb-api :: tools/lldb-vscode/stackTrace/TestVSCode_stackTrace.py (752 of 2045)
PASS: lldb-api :: python_api/sblaunchinfo/TestSBLaunchInfo.py (753 of 2045)
UNSUPPORTED: lldb-api :: functionalities/signal/handle-segv/TestHandleSegv.py (754 of 2045)
PASS: lldb-shell :: ObjectFile/PECOFF/basic-info-arm64.yaml (755 of 2045)
PASS: lldb-api :: lang/objc/modules-non-objc-target/TestObjCModulesNonObjCTarget.py (756 of 2045)
PASS: lldb-api :: functionalities/data-formatter/data-formatter-objc/TestDataFormatterObjCNSURL.py (757 of 2045)
PASS: lldb-unit :: UnwindAssembly/x86/./UnwindAssemblyx86Tests/Testx86AssemblyInspectionEngine.TestPushRBX (758 of 2045)
PASS: lldb-unit :: ScriptInterpreter/Python/./ScriptInterpreterPythonTests/PythonDataObjectsTest.TestDictionaryResolutionWithDot (759 of 2045)
PASS: lldb-api :: commands/expression/rdar42038760/TestScalarURem.py (760 of 2045)
PASS: lldb-unit :: Process/minidump/./LLDBMinidumpTests/MinidumpParserTest.GetExceptionStream (761 of 2045)
PASS: lldb-unit :: Utility/./UtilityTests/RangeTest.SetRangeBase (762 of 2045)
PASS: lldb-api :: commands/expression/regression-access-function-template-in-record/TestRegressionAccessFunctionTemplateInRecord.py (763 of 2045)
PASS: lldb-unit :: UnwindAssembly/x86/./UnwindAssemblyx86Tests/Testx86AssemblyInspectionEngine.TestPopRBX (764 of 2045)
PASS: lldb-api :: commands/expression/argument_passing_restrictions/TestArgumentPassingRestrictions.py (765 of 2045)
PASS: lldb-unit :: Utility/./UtilityTests/StreamTest.PutCharNull (766 of 2045)
PASS: lldb-api :: python_api/debugger/TestDebuggerAPI.py (767 of 2045)
PASS: lldb-unit :: Utility/./UtilityTests/RegularExpression.Valid (768 of 2045)
PASS: lldb-unit :: Symbol/./SymbolTests/TestTypeSystemClang.TestFunctionTemplateConstruction (769 of 2045)
PASS: lldb-unit :: Utility/./UtilityTests/StringListTest.JoinEmpty (770 of 2045)
PASS: lldb-api :: commands/disassemble/basic/TestFrameDisassemble.py (771 of 2045)
PASS: lldb-shell :: Settings/TestFrameFormatNoColor.test (772 of 2045)
PASS: lldb-api :: functionalities/thread/exit_during_step/TestExitDuringStep.py (773 of 2045)
PASS: lldb-api :: source-manager/TestSourceManager.py (774 of 2045)
PASS: lldb-api :: functionalities/data-formatter/data-formatter-stl/libcxx/tuple/TestDataFormatterLibcxxTuple.py (775 of 2045)
PASS: lldb-api :: commands/platform/basic/TestPlatformCommand.py (776 of 2045)
PASS: lldb-api :: lang/c/global_variables/TestGlobalVariables.py (777 of 2045)
UNSUPPORTED: lldb-api :: functionalities/tty/TestTerminal.py (778 of 2045)
PASS: lldb-api :: lang/cpp/trivial_abi/TestTrivialABI.py (779 of 2045)
PASS: lldb-api :: types/TestLongTypes.py (780 of 2045)
PASS: lldb-shell :: Reproducer/TestVersionCheck.test (781 of 2045)
PASS: lldb-unit :: Utility/./UtilityTests/NameMatchesTest.Contains (782 of 2045)
UNSUPPORTED: lldb-api :: functionalities/thread/break_after_join/TestBreakAfterJoin.py (783 of 2045)
PASS: lldb-unit :: Language/Highlighting/./HighlighterTests/HighlighterTest.ClangIdentifiers (784 of 2045)
PASS: lldb-api :: functionalities/inferior-crashing/TestInferiorCrashing.py (785 of 2045)
PASS: lldb-unit :: Utility/./UtilityTests/ScalarTest.SetValueFromCString (786 of 2045)
PASS: lldb-unit :: Utility/./UtilityTests/EnvironmentTest.EnvpConstruction (787 of 2045)
PASS: lldb-unit :: DataFormatter/./LLDBFormatterTests/StringPrinterTests.SwiftUTF8 (788 of 2045)
PASS: lldb-unit :: SymbolFile/NativePDB/./SymbolFileNativePDBTests/PDBFPOProgramToDWARFExpressionTests.InvalidOpUnary (789 of 2045)
PASS: lldb-shell :: Driver/TestRepl.test (790 of 2045)
PASS: lldb-unit :: Process/gdb-remote/./ProcessGdbRemoteTests/GDBRemoteCommunicationClientTest.SendStartTracePacket (791 of 2045)
PASS: lldb-api :: tools/lldb-server/TestGdbRemoteAttach.py (792 of 2045)
PASS: lldb-api :: functionalities/data-formatter/data-formatter-globals/TestDataFormatterGlobals.py (793 of 2045)
UNSUPPORTED: lldb-api :: benchmarks/expression/TestExpressionCmd.py (794 of 2045)
PASS: lldb-unit :: UnwindAssembly/x86/./UnwindAssemblyx86Tests/Testx86AssemblyInspectionEngine.TestPopESI (795 of 2045)
PASS: lldb-unit :: SymbolFile/DWARF/./SymbolFileDWARFTests/SymbolFileDWARFTests.TestAbbrevOutOfOrder (796 of 2045)
UNSUPPORTED: lldb-shell :: Unwind/eh-frame-small-fde.test (797 of 2045)
PASS: lldb-unit :: Utility/./UtilityTests/StreamTest.PutHex32ByteOrderBig (798 of 2045)
PASS: lldb-unit :: Utility/./UtilityTests/UriParserTest.Empty (799 of 2045)
PASS: lldb-api :: functionalities/postmortem/netbsd-core/TestNetBSDCore.py (800 of 2045)
PASS: lldb-api :: commands/expression/import-std-module/sysroot/TestStdModuleSysroot.py (801 of 2045)
PASS: lldb-api :: functionalities/tail_call_frames/ambiguous_tail_call_seq2/TestAmbiguousTailCallSeq2.py (802 of 2045)
PASS: lldb-unit :: Symbol/./SymbolTests/Type.CompilerContextPattern (803 of 2045)
PASS: lldb-api :: lang/cpp/incomplete-types/TestCppIncompleteTypes.py (804 of 2045)
UNSUPPORTED: lldb-api :: functionalities/darwin_log/source/info/TestDarwinLogSourceInfo.py (805 of 2045)
PASS: lldb-unit :: Utility/./UtilityTests/Flags.AnySet (806 of 2045)
PASS: lldb-api :: functionalities/data-formatter/data-formatter-stl/libcxx/set/TestDataFormatterLibcxxSet.py (807 of 2045)
PASS: lldb-unit :: Utility/./UtilityTests/RecordReplayTest.InstrumentedFooSameThis (808 of 2045)
PASS: lldb-api :: commands/expression/import-std-module/deque-dbg-info-content/TestDbgInfoContentDequeFromStdModule.py (809 of 2045)
PASS: lldb-unit :: Platform/./LLDBPlatformTests/PlatformDarwinTest.TestParseVersionBuildDir (810 of 2045)
PASS: lldb-api :: functionalities/thread/concurrent_events/TestConcurrentDelaySignalBreak.py (811 of 2045)
PASS: lldb-unit :: Utility/./UtilityTests/RangeTest.EqualInvalid (812 of 2045)
PASS: lldb-api :: macosx/queues/TestQueues.py (813 of 2045)
PASS: lldb-unit :: Language/Highlighting/./HighlighterTests/HighlighterTest.ClangOperators (814 of 2045)
PASS: lldb-api :: tools/lldb-server/TestGdbRemoteExpeditedRegisters.py (815 of 2045)
PASS: lldb-unit :: ObjectFile/Breakpad/./ObjectFileBreakpadTests/StackCFIRecord.parse (816 of 2045)
PASS: lldb-api :: commands/expression/rdar44436068/Test128BitsInteger.py (817 of 2045)
UNSUPPORTED: lldb-api :: benchmarks/continue/TestBenchmarkContinue.py (818 of 2045)
PASS: lldb-unit :: Utility/./UtilityTests/StringListTest.JoinThree (819 of 2045)
PASS: lldb-shell :: ObjectFile/ELF/section-permissions.yaml (820 of 2045)
PASS: lldb-api :: functionalities/thread/concurrent_events/TestConcurrentTwoWatchpointsOneDelayBreakpoint.py (821 of 2045)
PASS: lldb-api :: lang/objc/modules-app-update/TestClangModulesAppUpdate.py (822 of 2045)
PASS: lldb-unit :: UnwindAssembly/ARM64/./Arm64InstEmulationTests/TestArm64InstEmulation.TestFramelessThreeEpilogueFunction (823 of 2045)
PASS: lldb-unit :: Utility/./UtilityTests/BinaryStreamTest.PutULEB128Zero (824 of 2045)
PASS: lldb-unit :: Utility/./UtilityTests/UriParserTest.BracketedHostnamePort (825 of 2045)
PASS: lldb-api :: lang/objc/single-entry-dictionary/TestObjCSingleEntryDictionary.py (826 of 2045)
PASS: lldb-api :: api/multithreaded/TestMultithreaded.py (827 of 2045)
PASS: lldb-unit :: Utility/./UtilityTests/RangeTest.ContainsAddr (828 of 2045)
PASS: lldb-shell :: Breakpoint/debug_rnglist_offset_pair.test (829 of 2045)
PASS: lldb-api :: functionalities/breakpoint/cpp/TestCPPBreakpointLocations.py (830 of 2045)
PASS: lldb-api :: tools/lldb-vscode/breakpoint/TestVSCode_setFunctionBreakpoints.py (831 of 2045)
PASS: lldb-unit :: Language/CPlusPlus/./LanguageCPlusPlusTests/CPlusPlusLanguage.MethodNameParsing (832 of 2045)
PASS: lldb-unit :: Core/./LLDBCoreTests/MangledTest.EmptyForInvalidName (833 of 2045)
PASS: lldb-unit :: Utility/./UtilityTests/FileSpecTest.OperatorBool (834 of 2045)
PASS: lldb-unit :: Utility/./UtilityTests/SerializationRountripTest.SerializeDeserializeCStringArray (835 of 2045)
PASS: lldb-shell :: SymbolFile/DWARF/clang-ast-from-dwarf-objc-property.m (836 of 2045)
PASS: lldb-unit :: Utility/./UtilityTests/StringListTest.LongestCommonPrefixSingleElement (837 of 2045)
PASS: lldb-unit :: Symbol/./SymbolTests/TestTypeSystemClang.AddMethodToObjCObjectType (838 of 2045)
PASS: lldb-api :: arm/emulation/TestEmulations.py (839 of 2045)
PASS: lldb-unit :: Target/./TargetTests/RemoteAwarePlatformTest.TestResolveExecutabelOnClientByPlatform (840 of 2045)
PASS: lldb-api :: commands/expression/codegen-crash-typedefdecl-not-in_declcontext/TestCodegenCrashTypedefDeclNotInDeclContext.py (841 of 2045)
PASS: lldb-shell :: SymbolFile/Breakpad/stack-cfi-parsing.test (842 of 2045)
PASS: lldb-unit :: Host/./HostTests/NativeProcessProtocolTest.ReadCStringFromMemory_CrossPageBoundary (843 of 2045)
UNSUPPORTED: lldb-shell :: SymbolFile/DWARF/debug-types-expressions.test (844 of 2045)
PASS: lldb-unit :: Host/./HostTests/SocketTest.TCPListen0GetPort (845 of 2045)
PASS: lldb-shell :: Driver/TestTarget.test (846 of 2045)
PASS: lldb-unit :: UnwindAssembly/x86/./UnwindAssemblyx86Tests/Testx86AssemblyInspectionEngine.TestPushRBP (847 of 2045)
PASS: lldb-api :: functionalities/breakpoint/serialize/TestBreakpointSerialization.py (848 of 2045)
UNSUPPORTED: lldb-shell :: Breakpoint/case-insensitive.test (849 of 2045)
PASS: lldb-api :: functionalities/step-avoids-no-debug/TestStepNoDebug.py (850 of 2045)
PASS: lldb-unit :: Utility/./UtilityTests/StreamTest.AddressRange (851 of 2045)
PASS: lldb-api :: lang/objc/objc-new-syntax/TestObjCNewSyntaxLiteral.py (852 of 2045)
PASS: lldb-shell :: Reproducer/Functionalities/TestExpressionEvaluation.test (853 of 2045)
PASS: lldb-unit :: ObjectFile/ELF/./ObjectFileELFTests/ObjectFileELFTest.GetSymtab_NoSymEntryPointArmThumbAddressClass (854 of 2045)
UNSUPPORTED: lldb-api :: tools/intel-features/intel-pt/test/TestIntelPTSimpleBinary.py (855 of 2045)
PASS: lldb-api :: commands/expression/expr-in-syscall/TestExpressionInSyscall.py (856 of 2045)
PASS: lldb-unit :: Utility/./UtilityTests/StreamTest.PutRawBytesToLittleEndian (857 of 2045)
PASS: lldb-shell :: SymbolFile/DWARF/dir-separator-windows.s (858 of 2045)
PASS: lldb-api :: functionalities/tsan/global_location/TestTsanGlobalLocation.py (859 of 2045)
PASS: lldb-unit :: Language/Highlighting/./HighlighterTests/HighlighterTest.DefaultHighlighterWithCursor (860 of 2045)
PASS: lldb-api :: functionalities/thread/concurrent_events/TestConcurrentTwoBreakpointsOneWatchpoint.py (861 of 2045)
PASS: lldb-shell :: SymbolFile/DWARF/DW_OP_piece-struct.s (862 of 2045)
PASS: lldb-api :: python_api/value/empty_class/TestValueAPIEmptyClass.py (863 of 2045)
PASS: lldb-api :: macosx/load-kext/TestLoadKext.py (864 of 2045)
PASS: lldb-unit :: Core/./LLDBCoreTests/RichManglingContextTest.FromCxxMethodName (865 of 2045)
PASS: lldb-unit :: Expression/./ExpressionTests/DiagnosticManagerTest.GetStringBasic (866 of 2045)
PASS: lldb-unit :: Utility/./UtilityTests/ScalarTest.APIntConstructor (867 of 2045)
PASS: lldb-api :: commands/command/script/import/rdar-12586188/TestRdar12586188.py (868 of 2045)
PASS: lldb-api :: functionalities/type_lookup/TestTypeLookup.py (869 of 2045)
PASS: lldb-unit :: Expression/./ExpressionTests/DiagnosticManagerTest.AddDiagnostic (870 of 2045)
PASS: lldb-api :: commands/expression/save_jit_objects/TestSaveJITObjects.py (871 of 2045)
PASS: lldb-api :: lang/c/local_types/TestUseClosestType.py (872 of 2045)
PASS: lldb-shell :: SymbolFile/DWARF/debug_aranges-empty-section.s (873 of 2045)
PASS: lldb-shell :: Settings/TestFrameFormatColor.test (874 of 2045)
UNSUPPORTED: lldb-shell :: SymbolFile/NativePDB/local-variables.cpp (875 of 2045)
PASS: lldb-unit :: Symbol/./SymbolTests/TestClangASTImporter.MetadataPropagationIndirectImport (876 of 2045)
PASS: lldb-api :: functionalities/data-formatter/data-formatter-objc/TestDataFormatterObjCNSContainer.py (877 of 2045)
PASS: lldb-unit :: Utility/./UtilityTests/BinaryStreamTest.PutULEB128EightBytes (878 of 2045)
PASS: lldb-shell :: Driver/TestCommands.test (879 of 2045)
PASS: lldb-unit :: Process/minidump/./LLDBMinidumpTests/MinidumpParserTest.GetMemory (880 of 2045)
PASS: lldb-unit :: Utility/./UtilityTests/TimerTest.CategoryTimes (881 of 2045)
PASS: lldb-shell :: Settings/TestDisableColor.test (882 of 2045)
PASS: lldb-unit :: Process/gdb-remote/./ProcessGdbRemoteTests/GDBRemoteClientBaseTest.SendContinueAndInterrupt2PacketBug (883 of 2045)
PASS: lldb-unit :: Utility/./UtilityTests/ArgsTest.ReplaceArgumentAtIndexEqual (884 of 2045)
PASS: lldb-api :: functionalities/inferior-crashing/recursive-inferior/TestRecursiveInferiorStep.py (885 of 2045)
PASS: lldb-api :: lang/cpp/nsimport/TestCppNsImport.py (886 of 2045)
PASS: lldb-api :: functionalities/data-formatter/data-formatter-categories/TestDataFormatterCategories.py (887 of 2045)
PASS: lldb-api :: commands/add-dsym/uuid/TestAddDsymCommand.py (888 of 2045)
PASS: lldb-api :: commands/expression/import-std-module/list/TestListFromStdModule.py (889 of 2045)
PASS: lldb-shell :: ObjectFile/PECOFF/sections-names.yaml (890 of 2045)
PASS: lldb-api :: lang/objc/objc-struct-return/TestObjCStructReturn.py (891 of 2045)
PASS: lldb-unit :: Symbol/./SymbolTests/TestClangASTImporter.CopyTypeTagDecl (892 of 2045)
PASS: lldb-api :: functionalities/data-formatter/data-formatter-synthtype/TestDataFormatterSynthType.py (893 of 2045)
PASS: lldb-unit :: Symbol/./SymbolTests/TestClangASTImporter.ImportInvalidType (894 of 2045)
PASS: lldb-api :: lang/mixed/TestMixedLanguages.py (895 of 2045)
PASS: lldb-api :: macosx/lc-note/kern-ver-str/TestKernVerStrLCNOTE.py (896 of 2045)
PASS: lldb-unit :: Process/gdb-remote/./ProcessGdbRemoteTests/GDBRemoteCommunicationServerTest.SendErrorResponse_StringError (897 of 2045)
PASS: lldb-api :: lang/cpp/nested-class-other-compilation-unit/TestNestedClassWithParentInAnotherCU.py (898 of 2045)
PASS: lldb-shell :: Quit/TestQuitExitCode0.test (899 of 2045)
PASS: lldb-unit :: Utility/./UtilityTests/StringLexerTest.GetUnlexed (900 of 2045)
PASS: lldb-api :: functionalities/target-new-solib-notifications/TestModuleLoadedNotifys.py (901 of 2045)
PASS: lldb-shell :: SymbolFile/DWARF/DW_OP_piece-smaller-than-struct.s (902 of 2045)
PASS: lldb-unit :: Utility/./UtilityTests/StringExtractorTest.GetU64LittleEndian (903 of 2045)
XFAIL: lldb-shell :: Unwind/prefer-debug-over-eh-frame.test (904 of 2045)
UNSUPPORTED: lldb-shell :: Register/arm-gp-read.test (905 of 2045)
UNSUPPORTED: lldb-api :: tools/lldb-server/thread-name/TestGdbRemoteThreadName.py (906 of 2045)
PASS: lldb-unit :: Utility/./UtilityTests/ConstStringTest.CompareStringRef (907 of 2045)
PASS: lldb-unit :: Utility/./UtilityTests/TimeoutTest.Format (908 of 2045)
PASS: lldb-api :: commands/expression/call-function/TestCallStopAndContinue.py (909 of 2045)
PASS: lldb-shell :: SymbolFile/NativePDB/function-types-builtins.cpp (910 of 2045)
PASS: lldb-shell :: Reproducer/TestDump.test (911 of 2045)
PASS: lldb-api :: python_api/disassemble-raw-data/TestDisassembleRawData.py (912 of 2045)
PASS: lldb-api :: functionalities/load_using_paths/TestLoadUsingPaths.py (913 of 2045)
PASS: lldb-api :: python_api/watchpoint/watchlocation/TestSetWatchlocation.py (914 of 2045)
PASS: lldb-api :: lang/objc/modules-auto-import/TestModulesAutoImport.py (915 of 2045)
PASS: lldb-unit :: Utility/./UtilityTests/BinaryStreamTest.PutSLEB128EightBytes (916 of 2045)
PASS: lldb-unit :: Editline/./EditlineTests/EditlineTestFixture.EditlineReceivesSingleLineText (917 of 2045)
PASS: lldb-unit :: Utility/./UtilityTests/StringListTest.ForRangeEmpty (918 of 2045)
PASS: lldb-api :: lang/cpp/wchar_t/TestCxxWCharT.py (919 of 2045)
PASS: lldb-api :: commands/expression/issue_11588/Test11588.py (920 of 2045)
PASS: lldb-unit :: Utility/./UtilityTests/UriParserTest.TypicalPortPathIPv6 (921 of 2045)
PASS: lldb-shell :: Commands/command-backtrace.test (922 of 2045)
PASS: lldb-unit :: Utility/./UtilityTests/RangeDataVector.FindEntryIndexesThatContain_Overlap (923 of 2045)
PASS: lldb-unit :: Utility/./UtilityTests/Flags.Clear (924 of 2045)
PASS: lldb-unit :: Utility/./UtilityTests/UserIDResolver.GetUserName (925 of 2045)
PASS: lldb-api :: functionalities/data-formatter/data-formatter-objc/TestDataFormatterObjCPlain.py (926 of 2045)
PASS: lldb-api :: functionalities/wrong_commands/TestWrongCommands.py (927 of 2045)
PASS: lldb-api :: functionalities/postmortem/elf-core/gcore/TestGCore.py (928 of 2045)
PASS: lldb-unit :: Utility/./UtilityTests/OptionsWithRawTest.TerminatedQuote (929 of 2045)
PASS: lldb-unit :: Utility/./UtilityTests/ArchSpecTest.TestParseMachCPUDashSubtypeTripleSimple (930 of 2045)
PASS: lldb-unit :: Host/./HostTests/FileSystemTest.EmptyTest (931 of 2045)
PASS: lldb-api :: functionalities/data-formatter/data-formatter-enum-format/TestDataFormatterEnumFormat.py (932 of 2045)
PASS: lldb-unit :: Language/Highlighting/./HighlighterTests/HighlighterTest.ClangUnterminatedString (933 of 2045)
PASS: lldb-api :: lang/c/const_variables/TestConstVariables.py (934 of 2045)
PASS: lldb-shell :: Minidump/dump-all.test (935 of 2045)
UNSUPPORTED: lldb-api :: functionalities/darwin_log/filter/regex/activity-chain/TestDarwinLogFilterRegexActivityChain.py (936 of 2045)
PASS: lldb-unit :: UnwindAssembly/x86/./UnwindAssemblyx86Tests/Testx86AssemblyInspectionEngine.TestCALLNextInsn (937 of 2045)
PASS: lldb-unit :: SymbolFile/NativePDB/./SymbolFileNativePDBTests/PDBFPOProgramToDWARFExpressionTests.UnresolvedRegisterAssignmentReference (938 of 2045)
PASS: lldb-unit :: Utility/./UtilityTests/FileSpecTest.Equal (939 of 2045)
PASS: lldb-api :: macosx/duplicate-archive-members/TestDuplicateMembers.py (940 of 2045)
PASS: lldb-api :: lang/objc/objc-struct-argument/TestObjCStructArgument.py (941 of 2045)
PASS: lldb-unit :: Utility/./UtilityTests/StringExtractorTest.GetHexBytesAvail (942 of 2045)
PASS: lldb-unit :: Language/Highlighting/./HighlighterTests/HighlighterTest.ClangCursorPosAfterOtherToken (943 of 2045)
PASS: lldb-unit :: Process/minidump/./LLDBMinidumpTests/RegisterContextMinidump.ConvertMinidumpContext_x86_64 (944 of 2045)
PASS: lldb-api :: types/TestCharType.py (945 of 2045)
PASS: lldb-api :: functionalities/memory/read/TestMemoryRead.py (946 of 2045)
PASS: lldb-shell :: Quit/TestQuitExitCodeTooManyArgs.test (947 of 2045)
UNSUPPORTED: lldb-api :: commands/watchpoints/hello_watchlocation/TestWatchLocation.py (948 of 2045)
PASS: lldb-api :: lang/c/step_over_no_deadlock/TestStepOverDoesntBlock.py (949 of 2045)
PASS: lldb-unit :: Utility/./UtilityTests/ScalarTest.Division (950 of 2045)
PASS: lldb-shell :: SymbolFile/DWARF/debug-names-compressed.cpp (951 of 2045)
PASS: lldb-api :: commands/breakpoint/command/list/TestBreakpointCommandList.py (952 of 2045)
PASS: lldb-unit :: Utility/./UtilityTests/OptionsWithRawTest.LeadingSpaceArgs (953 of 2045)
PASS: lldb-unit :: Core/./LLDBCoreTests/StreamCallbackTest.Callback (954 of 2045)
PASS: lldb-unit :: Utility/./UtilityTests/Flags.AllSet (955 of 2045)
PASS: lldb-api :: driver/batch_mode/TestBatchMode.py (956 of 2045)
PASS: lldb-api :: functionalities/gdb_remote_client/TestRegDefinitionInParts.py (957 of 2045)
PASS: lldb-unit :: Utility/./UtilityTests/StringListTest.Assignment (958 of 2045)
PASS: lldb-api :: functionalities/var_path/TestVarPath.py (959 of 2045)
PASS: lldb-unit :: Utility/./UtilityTests/OptionsWithRawTest.EmptySuffixSingleWhitespace (960 of 2045)
PASS: lldb-api :: lang/objc/foundation/TestObjCMethodsString.py (961 of 2045)
PASS: lldb-api :: functionalities/target_var/TestTargetVar.py (962 of 2045)
PASS: lldb-unit :: Utility/./UtilityTests/StringListTest.PopBack (963 of 2045)
PASS: lldb-unit :: Utility/./UtilityTests/StreamTest.PutBytesAsRawHex8ToBigEndian (964 of 2045)
PASS: lldb-unit :: Utility/./UtilityTests/ArgsTest.TestQuotedTrailingBackslash (965 of 2045)
PASS: lldb-unit :: Utility/./UtilityTests/StringListTest.LongestCommonPrefixDuplicateElement (966 of 2045)
PASS: lldb-unit :: Symbol/./SymbolTests/TestClangASTImporter.CompleteFwdDeclWithOtherOrigin (967 of 2045)
PASS: lldb-api :: commands/frame/diagnose/array/TestArray.py (968 of 2045)
PASS: lldb-api :: commands/source/info/TestSourceInfo.py (969 of 2045)
PASS: lldb-api :: functionalities/tail_call_frames/cross_dso/TestCrossDSOTailCalls.py (970 of 2045)
PASS: lldb-api :: functionalities/signal/TestSendSignal.py (971 of 2045)
PASS: lldb-api :: lang/cpp/const_this/TestConstThis.py (972 of 2045)
PASS: lldb-unit :: UnwindAssembly/x86/./UnwindAssemblyx86Tests/Testx86AssemblyInspectionEngine.TestPopRBP (973 of 2045)
PASS: lldb-api :: commands/expression/import-std-module/empty-module/TestEmptyStdModule.py (974 of 2045)
PASS: lldb-shell :: ScriptInterpreter/Lua/nested_sessions.test (975 of 2045)
PASS: lldb-api :: functionalities/thread/concurrent_events/TestConcurrentDelaySignalWatch.py (976 of 2045)
PASS: lldb-unit :: Process/minidump/./LLDBMinidumpTests/MinidumpParserTest.MinidumpDuplicateModuleMinAddress (977 of 2045)
PASS: lldb-api :: commands/frame/diagnose/virtual-method-call/TestDiagnoseDereferenceVirtualMethodCall.py (978 of 2045)
PASS: lldb-unit :: Process/minidump/./LLDBMinidumpTests/MinidumpParserTest.GetArchitectureWindows (979 of 2045)
PASS: lldb-unit :: Utility/./UtilityTests/StringExtractorTest.DecodeHexU8_Extra (980 of 2045)
PASS: lldb-api :: commands/expression/import-std-module/forward_list-dbg-info-content/TestDbgInfoContentForwardListFromStdModule.py (981 of 2045)
PASS: lldb-unit :: Utility/./UtilityTests/Flags.GetBitSize (982 of 2045)
PASS: lldb-api :: sanity/TestSettingSkipping.py (983 of 2045)
PASS: lldb-api :: commands/reproducer/invalid-args/TestInvalidArgsReproducer.py (984 of 2045)
PASS: lldb-unit :: ScriptInterpreter/Lua/./ScriptInterpreterLuaTests/ScriptInterpreterTest.ExecuteOneLine (985 of 2045)
PASS: lldb-unit :: Utility/./UtilityTests/ArgsTest.StringListConstructor (986 of 2045)
PASS: lldb-api :: lang/cpp/llvm-style/TestLLVMStyle.py (987 of 2045)
PASS: lldb-unit :: Language/Highlighting/./HighlighterTests/HighlighterTest.ClangTrailingBackslashBeforeNewline (988 of 2045)
PASS: lldb-api :: lang/cpp/inlines/TestInlines.py (989 of 2045)
PASS: lldb-api :: lang/objc/print-obj/TestPrintObj.py (990 of 2045)
PASS: lldb-api :: types/TestIntegerType.py (991 of 2045)
PASS: lldb-api :: macosx/version_zero/TestGetVersionZeroVersion.py (992 of 2045)
PASS: lldb-shell :: Commands/command-script-import.test (993 of 2045)
PASS: lldb-unit :: Utility/./UtilityTests/DataExtractorTest.GetCStrAtEnd (994 of 2045)
PASS: lldb-api :: functionalities/mtc/simple/TestMTCSimple.py (995 of 2045)
PASS: lldb-shell :: Reproducer/TestRelativePath.test (996 of 2045)
PASS: lldb-api :: python_api/signals/TestSignalsAPI.py (997 of 2045)
PASS: lldb-unit :: Utility/./UtilityTests/StringListTest.AppendStringCString (998 of 2045)
PASS: lldb-unit :: Language/CPlusPlus/./LanguageCPlusPlusTests/CPlusPlusLanguage.CPlusPlusNameParser (999 of 2045)
PASS: lldb-api :: functionalities/breakpoint/step_over_breakpoint/TestStepOverBreakpoint.py (1000 of 2045)
PASS: lldb-unit :: tools/lldb-server/tests/./LLDBServerTests/TestBase.DebugserverEnv (1001 of 2045)
PASS: lldb-unit :: Symbol/./SymbolTests/TestTypeSystemClang.TestGetTypeClassTypeOf (1002 of 2045)
PASS: lldb-unit :: Platform/./LLDBPlatformTests/PlatformDarwinTest.FindComponentInPath (1003 of 2045)
PASS: lldb-unit :: Utility/./UtilityTests/StringListTest.InsertStringAtIndexMove (1004 of 2045)
PASS: lldb-unit :: Utility/./UtilityTests/OptionsWithRawTest.EmptyArgsOnlySuffix (1005 of 2045)
UNSUPPORTED: lldb-api :: functionalities/darwin_log/format/TestDarwinLogMessageFormat.py (1006 of 2045)
PASS: lldb-api :: commands/expression/class_template_specialization_empty_pack/TestClassTemplateSpecializationParametersHandling.py (1007 of 2045)
PASS: lldb-shell :: Reproducer/TestGDBRemoteRepro.test (1008 of 2045)
PASS: lldb-unit :: Interpreter/./InterpreterTests/CompletionTest.DirCompletionUsername (1009 of 2045)
PASS: lldb-unit :: Target/./TargetTests/ModuleCacheTest.GetAndPutStrangeHostname (1010 of 2045)
PASS: lldb-unit :: Utility/./UtilityTests/FileSpecTest.GetPath (1011 of 2045)
UNSUPPORTED: lldb-api :: functionalities/darwin_log/source/debug/TestDarwinLogSourceDebug.py (1012 of 2045)
PASS: lldb-shell :: SymbolFile/DWARF/find-basic-type.cpp (1013 of 2045)
PASS: lldb-unit :: Utility/./UtilityTests/CompletionRequest.DuplicateFiltering (1014 of 2045)
PASS: lldb-api :: macosx/universal/TestUniversal.py (1015 of 2045)
PASS: lldb-unit :: Utility/./UtilityTests/RegularExpression.Invalid (1016 of 2045)
PASS: lldb-api :: lang/cpp/breakpoint-commands/TestCPPBreakpointCommands.py (1017 of 2045)
PASS: lldb-api :: functionalities/tsan/thread_numbers/TestTsanThreadNumbers.py (1018 of 2045)
PASS: lldb-api :: lang/cpp/global_variables/TestCPPGlobalVariables.py (1019 of 2045)
PASS: lldb-unit :: Utility/./UtilityTests/StreamTest.PutMaxHex64ByteOrderLittle (1020 of 2045)
PASS: lldb-api :: commands/expression/function_template_specialization_temp_args/TestFunctionTemplateSpecializationTempArgs.py (1021 of 2045)
PASS: lldb-unit :: UnwindAssembly/x86/./UnwindAssemblyx86Tests/Testx86AssemblyInspectionEngine.TestStackRealignMSVC_i386 (1022 of 2045)
PASS: lldb-shell :: ObjectFile/MachO/symtab.yaml (1023 of 2045)
PASS: lldb-unit :: Utility/./UtilityTests/VMRange.Comparison (1024 of 2045)
PASS: lldb-unit :: Utility/./UtilityTests/ArchSpecTest.YAML (1025 of 2045)
PASS: lldb-api :: tools/lldb-vscode/attach/TestVSCode_attach.py (1026 of 2045)
PASS: lldb-unit :: Utility/./UtilityTests/StreamTeeTest.Assignment (1027 of 2045)
PASS: lldb-shell :: ObjectFile/ELF/short-build-id.yaml (1028 of 2045)
PASS: lldb-unit :: Utility/./UtilityTests/LogTest.LLDB_LOG_nullptr (1029 of 2045)
PASS: lldb-unit :: Utility/./UtilityTests/StringListTest.GetMaxStringLengthDecreasingSize (1030 of 2045)
PASS: lldb-api :: functionalities/unwind/zeroth_frame/TestZerothFrame.py (1031 of 2045)
PASS: lldb-shell :: Reproducer/TestCaptureEnvOverride.test (1032 of 2045)
PASS: lldb-api :: iohandler/unicode/TestUnicode.py (1033 of 2045)
PASS: lldb-unit :: Symbol/./SymbolTests/TestTypeSystemClang.TestGetEnumIntegerTypeUnexpectedType (1034 of 2045)
PASS: lldb-unit :: Utility/./UtilityTests/XcodeSDKTest.MergeTest (1035 of 2045)
PASS: lldb-unit :: Language/Highlighting/./HighlighterTests/HighlighterTest.ClangScalarLiterals (1036 of 2045)
PASS: lldb-api :: functionalities/inferior-changed/TestInferiorChanged.py (1037 of 2045)
PASS: lldb-api :: lang/c/conflicting-symbol/TestConflictingSymbol.py (1038 of 2045)
PASS: lldb-api :: functionalities/breakpoint/breakpoint_language/TestBreakpointLanguage.py (1039 of 2045)
PASS: lldb-unit :: Utility/./UtilityTests/EnvironmentTest.EnvpConversion (1040 of 2045)
UNSUPPORTED: lldb-api :: functionalities/darwin_log/filter/exact_match/message/TestDarwinLogFilterMatchMessage.py (1041 of 2045)
PASS: lldb-api :: functionalities/breakpoint/address_breakpoints/TestAddressBreakpoints.py (1042 of 2045)
PASS: lldb-unit :: Expression/./ExpressionTests/CppModuleConfigurationTest.LibCppV2 (1043 of 2045)
PASS: lldb-unit :: Utility/./UtilityTests/StringExtractorTest.GetHexU8_Exact_NoEof (1044 of 2045)
PASS: lldb-api :: types/TestFloatTypesExpr.py (1045 of 2045)
PASS: lldb-unit :: ObjectFile/Breakpad/./ObjectFileBreakpadTests/InfoRecord.parse (1046 of 2045)
PASS: lldb-shell :: SymbolFile/DWARF/static_scope.s (1047 of 2045)
PASS: lldb-unit :: ScriptInterpreter/Python/./ScriptInterpreterPythonTests/PythonDataObjectsTest.TestGlobalNameResolutionNoDot (1048 of 2045)
PASS: lldb-unit :: Utility/./UtilityTests/StringLexerTest.HasAtLeast (1049 of 2045)
PASS: lldb-api :: python_api/get-value-32bit-int/TestGetValue32BitInt.py (1050 of 2045)
PASS: lldb-api :: lang/cpp/type_lookup/TestCppTypeLookup.py (1051 of 2045)
PASS: lldb-api :: lang/c/function_types/TestFunctionTypes.py (1052 of 2045)
PASS: lldb-api :: python_api/frame/TestFrames.py (1053 of 2045)
PASS: lldb-api :: commands/expression/top-level/TestTopLevelExprs.py (1054 of 2045)
PASS: lldb-unit :: ScriptInterpreter/Python/./ScriptInterpreterPythonTests/PythonDataObjectsTest.TestPythonDictionaryValueEquality (1055 of 2045)
PASS: lldb-unit :: SymbolFile/NativePDB/./SymbolFileNativePDBTests/PDBFPOProgramToDWARFExpressionTests.MultipleIndependentAssignments (1056 of 2045)
PASS: lldb-api :: functionalities/data-formatter/hexcaps/TestDataFormatterHexCaps.py (1057 of 2045)
PASS: lldb-unit :: UnwindAssembly/x86/./UnwindAssemblyx86Tests/Testx86AssemblyInspectionEngine.TestDisassemblyMidFunctionEpilogues (1058 of 2045)
PASS: lldb-api :: lang/c/unicode/TestUnicodeSymbols.py (1059 of 2045)
PASS: lldb-shell :: SymbolFile/DWARF/find-variable-dwo.cpp (1060 of 2045)
PASS: lldb-api :: lang/c/modules/TestCModules.py (1061 of 2045)
PASS: lldb-api :: functionalities/breakpoint/dummy_target_breakpoints/TestBreakpointsWithNoTargets.py (1062 of 2045)
PASS: lldb-unit :: UnwindAssembly/x86/./UnwindAssemblyx86Tests/Testx86AssemblyInspectionEngine.TestPopEBX (1063 of 2045)
PASS: lldb-unit :: Utility/./UtilityTests/NameMatchesTest.Equals (1064 of 2045)
PASS: lldb-api :: python_api/sbenvironment/TestSBEnvironment.py (1065 of 2045)
PASS: lldb-shell :: ObjectFile/ELF/minidebuginfo-find-symbols.yaml (1066 of 2045)
PASS: lldb-api :: functionalities/thread/thread_exit/TestThreadExit.py (1067 of 2045)
PASS: lldb-shell :: SymbolFile/DWARF/clang-ast-from-dwarf-unamed-and-anon-structs.cpp (1068 of 2045)
UNSUPPORTED: lldb-api :: functionalities/unwind/ehframe/TestEhFrameUnwind.py (1069 of 2045)
PASS: lldb-unit :: Utility/./UtilityTests/UriParserTest.MinimalPath (1070 of 2045)
PASS: lldb-api :: functionalities/abbreviation/TestAbbreviations.py (1071 of 2045)
PASS: lldb-unit :: ObjectFile/Breakpad/./ObjectFileBreakpadTests/FuncRecord.parse (1072 of 2045)
PASS: lldb-api :: commands/expression/import-std-module/unique_ptr-dbg-info-content/TestUniquePtrDbgInfoContent.py (1073 of 2045)
UNSUPPORTED: lldb-api :: functionalities/darwin_log/filter/exact_match/subsystem/TestDarwinLogFilterMatchSubsystem.py (1074 of 2045)
PASS: lldb-api :: lang/objcxx/hide-runtime-values/TestObjCXXHideRuntimeValues.py (1075 of 2045)
PASS: lldb-api :: functionalities/breakpoint/breakpoint_locations/TestBreakpointLocations.py (1076 of 2045)
PASS: lldb-unit :: Core/./LLDBCoreTests/MangledTest.ResultForBlockInvocation (1077 of 2045)
PASS: lldb-unit :: ScriptInterpreter/Python/./ScriptInterpreterPythonTests/PythonDataObjectsTest.TestExtractingUInt64ThroughStructuredData (1078 of 2045)
UNSUPPORTED: lldb-api :: functionalities/darwin_log/filter/exact_match/category/TestDarwinLogFilterMatchCategory.py (1079 of 2045)
PASS: lldb-api :: functionalities/tail_call_frames/disambiguate_paths_to_common_sink/TestDisambiguatePathsToCommonSink.py (1080 of 2045)
PASS: lldb-unit :: Symbol/./SymbolTests/PostfixExpression.ParseOneExpression (1081 of 2045)
PASS: lldb-api :: lang/objc/direct-dispatch-step/TestObjCDirectDispatchStepping.py (1082 of 2045)
PASS: lldb-shell :: Minidump/Windows/arm-fp-unwind.test (1083 of 2045)
PASS: lldb-api :: macosx/DBGSourcePathRemapping/TestDSYMSourcePathRemapping.py (1084 of 2045)
UNSUPPORTED: lldb-api :: benchmarks/stepping/TestSteppingSpeed.py (1085 of 2045)
PASS: lldb-unit :: Process/gdb-remote/./ProcessGdbRemoteTests/GDBRemoteCommunicationClientTest.GetModulesInfoInvalidResponse (1086 of 2045)
PASS: lldb-unit :: DataFormatter/./LLDBFormatterTests/StringPrinterTests.CxxUTF8 (1087 of 2045)
UNSUPPORTED: lldb-shell :: SymbolFile/PDB/vbases.test (1088 of 2045)
PASS: lldb-unit :: Language/Highlighting/./HighlighterTests/HighlighterTest.DefaultHighlighterWithCursorOutOfBounds (1089 of 2045)
PASS: lldb-api :: functionalities/archives/TestBSDArchives.py (1090 of 2045)
PASS: lldb-shell :: SymbolFile/Breakpad/unwind-via-raSearch.test (1091 of 2045)
PASS: lldb-unit :: Utility/./UtilityTests/ArgsTest.TestMultipleArgs (1092 of 2045)
PASS: lldb-shell :: ObjectFile/ELF/many-sections.s (1093 of 2045)
PASS: lldb-unit :: Host/./HostTests/FileSystemTest.GetByteSize (1094 of 2045)
PASS: lldb-unit :: Process/gdb-remote/./ProcessGdbRemoteTests/GDBRemoteCommunicationServerTest.SendErrorResponse_UnimplementedError (1095 of 2045)
UNSUPPORTED: lldb-api :: arm/breakpoint-thumb-codesection/TestBreakpointThumbCodesection.py (1096 of 2045)
PASS: lldb-unit :: Utility/./UtilityTests/ArgsTest.TestSingleArg (1097 of 2045)
PASS: lldb-api :: commands/log/invalid-args/TestInvalidArgsLog.py (1098 of 2045)
PASS: lldb-shell :: Driver/TestCore.test (1099 of 2045)
PASS: lldb-api :: lang/c/step-target/TestStepTarget.py (1100 of 2045)
PASS: lldb-api :: functionalities/pointer_num_children/TestPointerNumChildren.py (1101 of 2045)
PASS: lldb-unit :: Expression/./ExpressionTests/DiagnosticManagerTest.PutStringMultiple (1102 of 2045)
PASS: lldb-shell :: SymbolFile/NativePDB/ast-methods.cpp (1103 of 2045)
UNSUPPORTED: lldb-api :: functionalities/thread/thread_specific_break_plus_condition/TestThreadSpecificBpPlusCondition.py (1104 of 2045)
PASS: lldb-unit :: Symbol/./SymbolTests/TestClangASTImporter.DeportDeclTagDecl (1105 of 2045)
PASS: lldb-shell :: SymbolFile/DWARF/debug_rnglists.s (1106 of 2045)
PASS: lldb-api :: functionalities/thread/concurrent_events/TestConcurrentCrashWithWatchpointBreakpointSignal.py (1107 of 2045)
PASS: lldb-api :: commands/command/invalid-args/TestInvalidArgsCommand.py (1108 of 2045)
PASS: lldb-unit :: Process/minidump/./LLDBMinidumpTests/MinidumpParserTest.GetThreadContext_x86_64 (1109 of 2045)
PASS: lldb-unit :: Utility/./UtilityTests/ArgsTest.TestSingleArgWithQuotedSpace (1110 of 2045)
PASS: lldb-api :: python_api/hello_world/TestHelloWorld.py (1111 of 2045)
PASS: lldb-unit :: ObjectFile/PECOFF/./ObjectFilePECOFFTests/PECallFrameInfoTest.Basic_eh (1112 of 2045)
PASS: lldb-api :: functionalities/tail_call_frames/thread_step_out_message/TestArtificialFrameStepOutMessage.py (1113 of 2045)
PASS: lldb-unit :: Process/gdb-remote/./ProcessGdbRemoteTests/GDBRemoteCommunicationClientTest.WriteRegister (1114 of 2045)
PASS: lldb-unit :: Target/./TargetTests/ModuleCacheTest.GetAndPutUuidExists (1115 of 2045)
PASS: lldb-unit :: UnwindAssembly/x86/./UnwindAssemblyx86Tests/Testx86AssemblyInspectionEngine.TestPushR12 (1116 of 2045)
PASS: lldb-unit :: Utility/./UtilityTests/VMRange.Ordering (1117 of 2045)
PASS: lldb-api :: commands/target/stop-hooks/TestStopHooks.py (1118 of 2045)
PASS: lldb-unit :: Host/./HostTests/NativeProcessProtocolTest.SetBreakpointFailWrite (1119 of 2045)
PASS: lldb-shell :: ObjectFile/ELF/build-id-case.yaml (1120 of 2045)
PASS: lldb-shell :: SymbolFile/NativePDB/globals-bss.cpp (1121 of 2045)
PASS: lldb-unit :: Signals/./SignalsTests/UnixSignalsTest.Iteration (1122 of 2045)
PASS: lldb-api :: commands/expression/import-std-module/queue/TestQueueFromStdModule.py (1123 of 2045)
PASS: lldb-api :: functionalities/data-formatter/array_typedef/TestArrayTypedef.py (1124 of 2045)
PASS: lldb-unit :: Utility/./UtilityTests/StreamTest.ShiftOperatorChars (1125 of 2045)
PASS: lldb-api :: commands/process/attach/TestProcessAttach.py (1126 of 2045)
PASS: lldb-api :: tools/lldb-vscode/breakpoint/TestVSCode_setExceptionBreakpoints.py (1127 of 2045)
PASS: lldb-api :: python_api/function_symbol/TestSymbolAPI.py (1128 of 2045)
PASS: lldb-unit :: Utility/./UtilityTests/CompletionRequest.TestCompletionOwnership (1129 of 2045)
PASS: lldb-unit :: Utility/./UtilityTests/UriParserTest.BadPort (1130 of 2045)
PASS: lldb-api :: functionalities/thread/concurrent_events/TestConcurrentTwoBreakpointsOneDelaySignal.py (1131 of 2045)
PASS: lldb-api :: lang/cpp/class_types/TestClassTypes.py (1132 of 2045)
PASS: lldb-api :: functionalities/tail_call_frames/cross_object/TestCrossObjectTailCalls.py (1133 of 2045)
PASS: lldb-unit :: Symbol/./SymbolTests/TestClangASTImporter.RecordLayout (1134 of 2045)
PASS: lldb-api :: functionalities/memory/find/TestMemoryFind.py (1135 of 2045)
PASS: lldb-api :: functionalities/thread/concurrent_events/TestConcurrentSignalNWatchNBreak.py (1136 of 2045)
PASS: lldb-api :: lang/objc/modules-cache/TestClangModulesCache.py (1137 of 2045)
PASS: lldb-shell :: Minidump/Windows/broken-unwind.test (1138 of 2045)
PASS: lldb-api :: commands/expression/import-std-module/shared_ptr/TestSharedPtrFromStdModule.py (1139 of 2045)
XFAIL: lldb-shell :: Register/x86-64-ymm-write.test (1140 of 2045)
PASS: lldb-unit :: Symbol/./SymbolTests/LineEntryTest.GetSameLineContiguousAddressRangeNoInlines (1141 of 2045)
PASS: lldb-api :: functionalities/testid/TestTestId.py (1142 of 2045)
PASS: lldb-shell :: Breakpoint/debug_rnglist_basic.test (1143 of 2045)
PASS: lldb-unit :: Utility/./UtilityTests/VMRange.IsValid (1144 of 2045)
PASS: lldb-unit :: Language/Highlighting/./HighlighterTests/HighlighterTest.HighlighterSelectionPath (1145 of 2045)
PASS: lldb-unit :: API/./APITests/SBCommandInterpreterTest.SingleWordCommand (1146 of 2045)
PASS: lldb-api :: tools/lldb-server/TestGdbRemoteThreadsInStopReply.py (1147 of 2045)
PASS: lldb-unit :: Utility/./UtilityTests/UriParserTest.BracketedHostnameWithPortIPv6 (1148 of 2045)
PASS: lldb-api :: python_api/lldbutil/iter/TestLLDBIterator.py (1149 of 2045)
PASS: lldb-api :: functionalities/breakpoint/address_breakpoints/TestBadAddressBreakpoints.py (1150 of 2045)
PASS: lldb-api :: commands/expression/import-std-module/vector-dbg-info-content/TestDbgInfoContentVectorFromStdModule.py (1151 of 2045)
PASS: lldb-api :: commands/expression/formatters/TestFormatters.py (1152 of 2045)
PASS: lldb-api :: functionalities/thread/concurrent_events/TestConcurrentCrashWithSignal.py (1153 of 2045)
PASS: lldb-api :: functionalities/thread/concurrent_events/TestConcurrentTwoWatchpointsOneSignal.py (1154 of 2045)
PASS: lldb-unit :: Utility/./UtilityTests/FileSpecTest.GuessPathStyle (1155 of 2045)
UNSUPPORTED: lldb-api :: functionalities/thread/create_during_step/TestCreateDuringStep.py (1156 of 2045)
PASS: lldb-api :: commands/expression/call-throws/TestCallThatThrows.py (1157 of 2045)
PASS: lldb-api :: commands/expression/ignore-artificial-constructors/TestIgnoreArtificialConstructors.py (1158 of 2045)
PASS: lldb-api :: api/check_public_api_headers/TestPublicAPIHeaders.py (1159 of 2045)
PASS: lldb-api :: lang/objc/objc-static-method-stripped/TestObjCStaticMethodStripped.py (1160 of 2045)
PASS: lldb-shell :: ObjectFile/MachO/lc_build_version_notools.yaml (1161 of 2045)
PASS: lldb-api :: functionalities/thread/step_out/TestThreadStepOut.py (1162 of 2045)
PASS: lldb-api :: commands/expression/xvalue/TestXValuePrinting.py (1163 of 2045)
PASS: lldb-unit :: SymbolFile/DWARF/./SymbolFileDWARFTests/SymbolFileDWARFTests.TestAbbrevNullAttrValidForm (1164 of 2045)
PASS: lldb-api :: functionalities/deleted-executable/TestDeletedExecutable.py (1165 of 2045)
PASS: lldb-unit :: Process/gdb-remote/./ProcessGdbRemoteTests/GDBRemoteCommunicationTest.ReadPacket_checksum (1166 of 2045)
PASS: lldb-unit :: ObjectFile/Breakpad/./ObjectFileBreakpadTests/LineRecord.parse (1167 of 2045)
PASS: lldb-unit :: Utility/./UtilityTests/XcodeSDKTest.SDKSupportsSwift (1168 of 2045)
PASS: lldb-unit :: Utility/./UtilityTests/StringExtractorTest.GetHexBytes_FullString (1169 of 2045)
PASS: lldb-unit :: Utility/./UtilityTests/ConstStringTest.format_provider (1170 of 2045)
PASS: lldb-unit :: Utility/./UtilityTests/RecordReplayTest.InstrumentedBarRef (1171 of 2045)
PASS: lldb-shell :: Commands/CommandScriptImmediateOutput/CommandScriptImmediateOutputConsole.test (1172 of 2045)
PASS: lldb-api :: functionalities/tail_call_frames/disambiguate_call_site/TestDisambiguateCallSite.py (1173 of 2045)
PASS: lldb-unit :: Utility/./UtilityTests/ArgsTest.TestAppendArg (1174 of 2045)
PASS: lldb-unit :: Utility/./UtilityTests/StreamTest.PutChar (1175 of 2045)
PASS: lldb-api :: commands/frame/var-scope/TestFrameVariableScope.py (1176 of 2045)
PASS: lldb-unit :: Utility/./UtilityTests/UUIDTest.SetFromStringRef (1177 of 2045)
PASS: lldb-unit :: Utility/./UtilityTests/ConstStringTest.UpdateMangledCounterpart (1178 of 2045)
UNSUPPORTED: lldb-shell :: Register/x86-gp-write.test (1179 of 2045)
PASS: lldb-api :: functionalities/gdb_remote_client/TestqOffsets.py (1180 of 2045)
UNSUPPORTED: lldb-shell :: BuildScript/toolchain-msvc.test (1181 of 2045)
PASS: lldb-api :: python_api/section/TestSectionAPI.py (1182 of 2045)
PASS: lldb-unit :: Utility/./UtilityTests/ConstStringTest.NullAndEmptyStates (1183 of 2045)
PASS: lldb-unit :: ObjectFile/Breakpad/./ObjectFileBreakpadTests/PublicRecord.parse (1184 of 2045)
PASS: lldb-unit :: Host/./HostTests/ConnectionFileDescriptorTest.TCPGetURIv4 (1185 of 2045)
PASS: lldb-api :: commands/expression/char/TestExprsChar.py (1186 of 2045)
PASS: lldb-unit :: Host/./HostTests/SocketTest.TCPGetConnectURI (1187 of 2045)
PASS: lldb-api :: python_api/formatters/TestFormattersSBAPI.py (1188 of 2045)
PASS: lldb-api :: macosx/dyld-trie-symbols/TestDyldTrieSymbols.py (1189 of 2045)
PASS: lldb-api :: functionalities/breakpoint/consecutive_breakpoints/TestConsecutiveBreakpoints.py (1190 of 2045)
PASS: lldb-api :: functionalities/data-formatter/data-formatter-objc/TestDataFormatterObjNSException.py (1191 of 2045)
PASS: lldb-unit :: Utility/./UtilityTests/CompletionRequest.DuplicateFilteringWithComments (1192 of 2045)
PASS: lldb-unit :: Utility/./UtilityTests/SubsystemRAIITest.SubsystemWithErrorFailure (1193 of 2045)
PASS: lldb-api :: functionalities/data-formatter/synthcapping/TestSyntheticCapping.py (1194 of 2045)
PASS: lldb-unit :: Host/./HostTests/MainLoopTest.DetectsEOF (1195 of 2045)
PASS: lldb-unit :: Process/minidump/./LLDBMinidumpTests/MinidumpParserTest.GetMemoryRegionInfoLinuxMaps (1196 of 2045)
PASS: lldb-unit :: Utility/./UtilityTests/StringListTest.Join (1197 of 2045)
PASS: lldb-unit :: Utility/./UtilityTests/DataExtractorTest.GetMaxS64 (1198 of 2045)
PASS: lldb-unit :: Host/./HostTests/SocketTest.UDPConnect (1199 of 2045)
PASS: lldb-unit :: ScriptInterpreter/Python/./ScriptInterpreterPythonTests/PythonDataObjectsTest.TestScript (1200 of 2045)
PASS: lldb-shell :: Reproducer/TestReuseDirectory.test (1201 of 2045)
PASS: lldb-shell :: ObjectFile/PECOFF/dep-modules.yaml (1202 of 2045)
PASS: lldb-api :: lang/c/local_variables/TestLocalVariables.py (1203 of 2045)
UNSUPPORTED: lldb-shell :: SymbolFile/PDB/pointers.test (1204 of 2045)
UNSUPPORTED: lldb-api :: functionalities/longjmp/TestLongjmp.py (1205 of 2045)
PASS: lldb-unit :: Utility/./UtilityTests/DataExtractorTest.GetMaxU64_unchecked (1206 of 2045)
PASS: lldb-unit :: Host/./HostTests/FileSystemTest.OpenErrno (1207 of 2045)
PASS: lldb-api :: functionalities/dead-strip/TestDeadStrip.py (1208 of 2045)
PASS: lldb-unit :: Utility/./UtilityTests/StringLexerTest.NextIf (1209 of 2045)
PASS: lldb-unit :: Host/./HostTests/FileSystemTest.EnumerateDirectory (1210 of 2045)
PASS: lldb-api :: types/TestDoubleTypes.py (1211 of 2045)
PASS: lldb-api :: commands/watchpoints/watchpoint_commands/TestWatchpointCommands.py (1212 of 2045)
PASS: lldb-api :: functionalities/data-formatter/data-formatter-stl/libcxx/unordered/TestDataFormatterUnordered.py (1213 of 2045)
PASS: lldb-unit :: Process/gdb-remote/./ProcessGdbRemoteTests/GDBRemoteClientBaseTest.SendContinueAndAsyncSignal (1214 of 2045)
PASS: lldb-unit :: ScriptInterpreter/Python/./ScriptInterpreterPythonTests/PythonDataObjectsTest.TestPythonTupleValues (1215 of 2045)
PASS: lldb-api :: python_api/value/linked_list/TestValueAPILinkedList.py (1216 of 2045)
PASS: lldb-unit :: UnwindAssembly/x86/./UnwindAssemblyx86Tests/Testx86AssemblyInspectionEngine.Testi386IgnoredRegisters (1217 of 2045)
PASS: lldb-unit :: Utility/./UtilityTests/ArgsTest.ReplaceArgumentAtIndexShort (1218 of 2045)
PASS: lldb-unit :: Utility/./UtilityTests/UriParserTest.BracketedHostnameWithPortIPv4 (1219 of 2045)
PASS: lldb-api :: lang/cpp/dynamic-value/TestCppValueCast.py (1220 of 2045)
PASS: lldb-unit :: Interpreter/./InterpreterTests/OptionArgParserTest.toChar (1221 of 2045)
PASS: lldb-unit :: Utility/./UtilityTests/AnsiTerminal.KnownPrefix (1222 of 2045)
PASS: lldb-unit :: Utility/./UtilityTests/CompletionRequest.FakeLastArg (1223 of 2045)
PASS: lldb-unit :: Host/./HostTests/MainLoopTest.TerminatesImmediately (1224 of 2045)
PASS: lldb-shell :: Reproducer/Functionalities/TestImageList.test (1225 of 2045)
PASS: lldb-unit :: UnwindAssembly/x86/./UnwindAssemblyx86Tests/Testx86AssemblyInspectionEngine.TestSimple32bitFrameFunction (1226 of 2045)
PASS: lldb-unit :: Utility/./UtilityTests/ProcessInstanceInfo.Yaml (1227 of 2045)
PASS: lldb-unit :: Utility/./UtilityTests/StreamTest.PutBytesAsRawHex8ToMixedEndian (1228 of 2045)
PASS: lldb-api :: tools/lldb-server/inferior-crash/TestGdbRemoteSegFault.py (1229 of 2045)
PASS: lldb-unit :: Utility/./UtilityTests/StringListTest.ShiftMove (1230 of 2045)
PASS: lldb-unit :: Symbol/./SymbolTests/TestTypeSystemClang.TestNotDeletingUserCopyCstrDueToMoveCStr (1231 of 2045)
PASS: lldb-unit :: Interpreter/./InterpreterTests/CompletionTest.FileCompletionAbsolute (1232 of 2045)
PASS: lldb-shell :: SymbolFile/NativePDB/ast-functions.cpp (1233 of 2045)
PASS: lldb-unit :: UnwindAssembly/ARM64/./Arm64InstEmulationTests/TestArm64InstEmulation.TestRegisterDoubleSpills (1234 of 2045)
PASS: lldb-api :: python_api/lldbutil/process/TestPrintStackTraces.py (1235 of 2045)
PASS: lldb-shell :: SymbolFile/NativePDB/source-list.cpp (1236 of 2045)
PASS: lldb-unit :: Utility/./UtilityTests/ConstStringTest.MangledCounterpart (1237 of 2045)
PASS: lldb-api :: iohandler/completion/TestIOHandlerCompletion.py (1238 of 2045)
PASS: lldb-unit :: Utility/./UtilityTests/GeneratorTest.Create (1239 of 2045)
PASS: lldb-unit :: Utility/./UtilityTests/DataExtractorTest.GetCStr (1240 of 2045)
PASS: lldb-shell :: SymbolFile/Breakpad/line-table-mixed-path-styles.test (1241 of 2045)
PASS: lldb-api :: lang/objc/objc-super/TestObjCSuper.py (1242 of 2045)
PASS: lldb-unit :: Utility/./UtilityTests/RangeTest.ContainsRange (1243 of 2045)
PASS: lldb-api :: functionalities/type_completion/TestTypeCompletion.py (1244 of 2045)
PASS: lldb-unit :: Utility/./UtilityTests/SerializationRountripTest.SerializeDeserializeCStringArrayNullptr (1245 of 2045)
PASS: lldb-api :: functionalities/data-formatter/data-formatter-python-synth/TestDataFormatterPythonSynth.py (1246 of 2045)
PASS: lldb-unit :: Symbol/./SymbolTests/TestTypeSystemClang.TestGetBasicTypeFromEnum (1247 of 2045)
PASS: lldb-api :: commands/frame/var/TestFrameVar.py (1248 of 2045)
PASS: lldb-api :: functionalities/thread/concurrent_events/TestConcurrentBreakpointsDelayedBreakpointOneWatchpoint.py (1249 of 2045)
PASS: lldb-api :: functionalities/data-formatter/data-formatter-caching/TestDataFormatterCaching.py (1250 of 2045)
PASS: lldb-shell :: Breakpoint/split-dwarf5-debug-stroffsets.test (1251 of 2045)
PASS: lldb-unit :: Symbol/./SymbolTests/TestTypeSystemClang.TestConvertAccessTypeToAccessSpecifier (1252 of 2045)
PASS: lldb-shell :: Commands/command-disassemble-process.yaml (1253 of 2045)
PASS: lldb-api :: functionalities/data-formatter/data-formatter-objc/TestDataFormatterObjCExpr.py (1254 of 2045)
PASS: lldb-unit :: UnwindAssembly/ARM64/./Arm64InstEmulationTests/TestArm64InstEmulation.TestRegisterSavedTwice (1255 of 2045)
PASS: lldb-api :: commands/expression/dont_allow_jit/TestAllowJIT.py (1256 of 2045)
PASS: lldb-shell :: SymbolFile/DWARF/parallel-indexing-stress.s (1257 of 2045)
PASS: lldb-shell :: ObjectFile/ELF/section-types.yaml (1258 of 2045)
PASS: lldb-api :: functionalities/data-formatter/language_category_updates/TestDataFormatterLanguageCategoryUpdates.py (1259 of 2045)
PASS: lldb-api :: commands/expression/cast_int_to_anonymous_enum/TestCastIntToAnonymousEnum.py (1260 of 2045)
PASS: lldb-unit :: Utility/./UtilityTests/StringListTest.CopyList (1261 of 2045)
PASS: lldb-shell :: Quit/TestQuitExitCodeImplicit0.test (1262 of 2045)
PASS: lldb-unit :: UnwindAssembly/x86/./UnwindAssemblyx86Tests/Testx86AssemblyInspectionEngine.TestPopRBPWithREX (1263 of 2045)
PASS: lldb-api :: functionalities/thread/concurrent_events/TestConcurrentTwoBreakpointThreads.py (1264 of 2045)
PASS: lldb-api :: lang/cpp/function_refs/TestFunctionRefs.py (1265 of 2045)
PASS: lldb-unit :: Process/gdb-remote/./ProcessGdbRemoteTests/GDBRemoteCommunicationClientTest.TestPacketSpeedJSON (1266 of 2045)
PASS: lldb-api :: macosx/thread-names/TestInterruptThreadNames.py (1267 of 2045)
PASS: lldb-unit :: Symbol/./SymbolTests/Type.GetTypeScopeAndBasename (1268 of 2045)
PASS: lldb-unit :: ScriptInterpreter/Python/./ScriptInterpreterPythonTests/PythonDataObjectsTest.TestExceptions (1269 of 2045)
PASS: lldb-api :: commands/watchpoints/watchpoint_count/TestWatchpointCount.py (1270 of 2045)
PASS: lldb-api :: lang/objcxx/objcxx-ivar-vector/TestIvarVector.py (1271 of 2045)
PASS: lldb-shell :: SymbolFile/DWARF/dwo-type-in-main-file.s (1272 of 2045)
PASS: lldb-unit :: Symbol/./SymbolTests/TestTypeSystemClang.TestBuiltinTypeForEncodingAndBitSize (1273 of 2045)
PASS: lldb-api :: commands/expression/static-initializers/TestStaticInitializers.py (1274 of 2045)
PASS: lldb-api :: functionalities/gdb_remote_client/TestTargetXMLArch.py (1275 of 2045)
PASS: lldb-api :: functionalities/signal/raise/TestRaise.py (1276 of 2045)
PASS: lldb-api :: functionalities/data-formatter/summary-string-onfail/Test-rdar-9974002.py (1277 of 2045)
PASS: lldb-unit :: UnwindAssembly/x86/./UnwindAssemblyx86Tests/Testx86AssemblyInspectionEngine.TestPopEBP (1278 of 2045)
PASS: lldb-api :: lang/objc/modules/TestObjCModules.py (1279 of 2045)
PASS: lldb-shell :: SymbolFile/DWARF/find-qualified-variable.cpp (1280 of 2045)
PASS: lldb-api :: functionalities/breakpoint/auto_continue/TestBreakpointAutoContinue.py (1281 of 2045)
PASS: lldb-shell :: Driver/TestHelp.test (1282 of 2045)
PASS: lldb-api :: lang/cpp/rvalue-references/TestRvalueReferences.py (1283 of 2045)
PASS: lldb-shell :: SymbolFile/DWARF/debug-line-basic.s (1284 of 2045)
PASS: lldb-unit :: Utility/./UtilityTests/StringExtractorTest.GetU64BigEndian (1285 of 2045)
PASS: lldb-api :: commands/expression/call-function/TestCallUserDefinedFunction.py (1286 of 2045)
PASS: lldb-unit :: Utility/./UtilityTests/SerializationRountripTest.SerializeDeserializePodPointers (1287 of 2045)
PASS: lldb-api :: lang/cpp/multiple-inheritance/TestCppMultipleInheritance.py (1288 of 2045)
PASS: lldb-api :: functionalities/breakpoint/breakpoint_command/TestBreakpointCommandsFromPython.py (1289 of 2045)
PASS: lldb-unit :: Utility/./UtilityTests/FileSpecTest.AppendPathComponent (1290 of 2045)
UNSUPPORTED: lldb-api :: commands/watchpoints/multi_watchpoint_slots/TestWatchpointMultipleSlots.py (1291 of 2045)
PASS: lldb-unit :: Utility/./UtilityTests/StringExtractorTest.GetHexBytes_OddPair (1292 of 2045)
PASS: lldb-unit :: Utility/./UtilityTests/VMRange.ContainsRange (1293 of 2045)
PASS: lldb-api :: functionalities/data-formatter/cstring-utf8-summary/TestCstringUnicode.py (1294 of 2045)
PASS: lldb-unit :: Utility/./UtilityTests/AnsiTerminal.Twice (1295 of 2045)
PASS: lldb-api :: functionalities/gdb_remote_client/TestThreadSelectionBug.py (1296 of 2045)
PASS: lldb-unit :: Utility/./UtilityTests/BinaryStreamTest.PutSLEB128ThreeBytes (1297 of 2045)
PASS: lldb-unit :: Utility/./UtilityTests/StreamTeeTest.Constructor1Stream (1298 of 2045)
PASS: lldb-shell :: Settings/TestSettingsSet.test (1299 of 2045)
PASS: lldb-api :: functionalities/tail_call_frames/inlining_and_tail_calls/TestInliningAndTailCalls.py (1300 of 2045)
PASS: lldb-unit :: Utility/./UtilityTests/RangeDataVector.FindEntryIndexesThatContain (1301 of 2045)
PASS: lldb-shell :: ObjectFile/PECOFF/uuid.yaml (1302 of 2045)
PASS: lldb-api :: functionalities/inferior-assert/TestInferiorAssert.py (1303 of 2045)
PASS: lldb-api :: functionalities/thread/concurrent_events/TestConcurrentManyBreakpoints.py (1304 of 2045)
UNSUPPORTED: lldb-api :: tools/lldb-server/platform-process-connect/TestPlatformProcessConnect.py (1305 of 2045)
PASS: lldb-shell :: Settings/TestFrameFormatMangling.test (1306 of 2045)
PASS: lldb-unit :: Utility/./UtilityTests/StringListTest.AppendStringStdString (1307 of 2045)
PASS: lldb-unit :: ScriptInterpreter/Python/./ScriptInterpreterPythonTests/PythonDataObjectsTest.TestPythonBoolean (1308 of 2045)
PASS: lldb-unit :: Expression/./ExpressionTests/CppModuleConfigurationTest.Xcode (1309 of 2045)
UNSUPPORTED: lldb-api :: benchmarks/libcxxlist/TestBenchmarkLibcxxList.py (1310 of 2045)
UNSUPPORTED: lldb-api :: commands/watchpoints/variable_out_of_scope/TestWatchedVarHitWhenInScope.py (1311 of 2045)
PASS: lldb-unit :: Utility/./UtilityTests/RangeTest.SlideZero (1312 of 2045)
PASS: lldb-api :: functionalities/postmortem/elf-core/thread_crash/TestLinuxCoreThreads.py (1313 of 2045)
PASS: lldb-api :: commands/watchpoints/watchpoint_events/TestWatchpointEvents.py (1314 of 2045)
PASS: lldb-unit :: Utility/./UtilityTests/StringLexerTest.Next (1315 of 2045)
PASS: lldb-shell :: SymbolFile/DWARF/dwp.s (1316 of 2045)
PASS: lldb-shell :: SymbolFile/NativePDB/function-types-calling-conv.cpp (1317 of 2045)
PASS: lldb-shell :: Minidump/no-process-id.yaml (1318 of 2045)
PASS: lldb-api :: functionalities/thread/concurrent_events/TestConcurrentTwoWatchpointThreads.py (1319 of 2045)
PASS: lldb-shell :: ScriptInterpreter/Lua/lua.test (1320 of 2045)
PASS: lldb-api :: lang/cpp/bitfields/TestCppBitfields.py (1321 of 2045)
PASS: lldb-unit :: Symbol/./SymbolTests/LineEntryTest.GetSameLineContiguousAddressRangeOneInline (1322 of 2045)
PASS: lldb-shell :: SymbolFile/DWARF/forward-declarations.s (1323 of 2045)
PASS: lldb-unit :: Utility/./UtilityTests/PassiveReplayTest.InstrumentedFoo (1324 of 2045)
PASS: lldb-shell :: Quit/TestQuitExitCodeHexA.test (1325 of 2045)
UNSUPPORTED: lldb-shell :: ObjectFile/ELF/minidebuginfo-set-and-hit-breakpoint.test (1326 of 2045)
PASS: lldb-unit :: Host/./HostTests/HostInfoTest.GetXcodeSDK (1327 of 2045)
UNSUPPORTED: lldb-shell :: SymbolFile/PDB/class-layout.test (1328 of 2045)
PASS: lldb-unit :: Host/./HostTests/NativeProcessProtocolTest.SetBreakpointFailVerify (1329 of 2045)
PASS: lldb-unit :: SymbolFile/DWARF/./SymbolFileDWARFTests/SymbolFileDWARFTests.TestAbbrevMissingTerminator (1330 of 2045)
PASS: lldb-shell :: SymbolFile/DWARF/win-i386-line-table.s (1331 of 2045)
PASS: lldb-api :: functionalities/data-formatter/data-formatter-synth/TestDataFormatterSynth.py (1332 of 2045)
PASS: lldb-api :: commands/log/basic/TestLogging.py (1333 of 2045)
PASS: lldb-unit :: Utility/./UtilityTests/OptionsWithRawTest.MultiWordSuffix (1334 of 2045)
XFAIL: lldb-shell :: Register/x86-mm-xmm-write.test (1335 of 2045)
UNSUPPORTED: lldb-api :: benchmarks/startup/TestStartupDelays.py (1336 of 2045)
PASS: lldb-shell :: Unwind/thread-step-out-ret-addr-check.test (1337 of 2045)
PASS: lldb-shell :: SymbolFile/DWARF/debug_ranges_and_rnglists.test (1338 of 2045)
PASS: lldb-unit :: Utility/./UtilityTests/StringExtractorTest.DecodeHexU8_InvalidHex (1339 of 2045)
PASS: lldb-api :: lang/cpp/function-qualifiers/TestCppFunctionQualifiers.py (1340 of 2045)
UNSUPPORTED: lldb-api :: functionalities/data-formatter/data-formatter-stl/libstdcpp/vector/TestDataFormatterStdVector.py (1341 of 2045)
PASS: lldb-unit :: UnwindAssembly/x86/./UnwindAssemblyx86Tests/Testx86AssemblyInspectionEngine.TestPushEBX (1342 of 2045)
PASS: lldb-shell :: Commands/command-disassemble.s (1343 of 2045)
PASS: lldb-shell :: SymbolFile/DWARF/find-method.cpp (1344 of 2045)
UNSUPPORTED: lldb-api :: functionalities/data-formatter/data-formatter-stl/libstdcpp/string/TestDataFormatterStdString.py (1345 of 2045)
PASS: lldb-unit :: UnwindAssembly/x86/./UnwindAssemblyx86Tests/Testx86AssemblyInspectionEngine.TestPopR12 (1346 of 2045)
UNSUPPORTED: lldb-api :: functionalities/data-formatter/data-formatter-stl/libstdcpp/tuple/TestDataFormatterStdTuple.py (1347 of 2045)
PASS: lldb-api :: lang/objc/modules-update/TestClangModulesUpdate.py (1348 of 2045)
PASS: lldb-unit :: Utility/./UtilityTests/LogTest.Unregister (1349 of 2045)
UNSUPPORTED: lldb-api :: linux/sepdebugsymlink/TestTargetSymbolsSepDebugSymlink.py (1350 of 2045)
PASS: lldb-unit :: Utility/./UtilityTests/AnsiTerminal.Basic (1351 of 2045)
PASS: lldb-unit :: Utility/./UtilityTests/DataExtractorTest.GetBitfield (1352 of 2045)
PASS: lldb-api :: functionalities/data-formatter/data-formatter-objc/nsindexpath/TestDataFormatterNSIndexPath.py (1353 of 2045)
PASS: lldb-unit :: Utility/./UtilityTests/VMRange.Clear (1354 of 2045)
PASS: lldb-unit :: Utility/./UtilityTests/StringListTest.ForRange (1355 of 2045)
PASS: lldb-unit :: UnwindAssembly/x86/./UnwindAssemblyx86Tests/Testx86AssemblyInspectionEngine.TestSpillRegToStackViaMOVi386 (1356 of 2045)
PASS: lldb-unit :: Expression/./ExpressionTests/DWARFExpression.DW_OP_stack_value (1357 of 2045)
PASS: lldb-shell :: Breakpoint/implicit_const_form_support.test (1358 of 2045)
PASS: lldb-shell :: Unwind/eh-frame-dwarf-unwind.test (1359 of 2045)
PASS: lldb-api :: commands/expression/calculator_mode/TestCalculatorMode.py (1360 of 2045)
PASS: lldb-unit :: Process/gdb-remote/./ProcessGdbRemoteTests/GDBRemoteCommunicationClientTest.ReadRegister (1361 of 2045)
PASS: lldb-unit :: SymbolFile/DWARF/./SymbolFileDWARFTests/SymbolFileDWARFTests.ParseArangesNonzeroSegmentSize (1362 of 2045)
PASS: lldb-api :: python_api/findvalue_duplist/TestSBFrameFindValue.py (1363 of 2045)
PASS: lldb-api :: lang/objc/objc-ivar-stripped/TestObjCIvarStripped.py (1364 of 2045)
PASS: lldb-api :: python_api/interpreter/TestCommandInterpreterAPI.py (1365 of 2045)
UNSUPPORTED: lldb-api :: functionalities/darwin_log/filter/regex/category/TestDarwinLogFilterRegexCategory.py (1366 of 2045)
PASS: lldb-unit :: Utility/./UtilityTests/StreamTest.PutHex8 (1367 of 2045)
PASS: lldb-unit :: Utility/./UtilityTests/RangeTest.Union (1368 of 2045)
PASS: lldb-shell :: SymbolFile/DWARF/debug-types-line-tables.s (1369 of 2045)
PASS: lldb-api :: commands/expression/context-object/TestContextObject.py (1370 of 2045)
PASS: lldb-api :: lang/cpp/operator-overload/TestOperatorOverload.py (1371 of 2045)
PASS: lldb-api :: commands/frame/recognizer/TestFrameRecognizer.py (1372 of 2045)
PASS: lldb-api :: lang/cpp/std-function-step-into-callable/TestStdFunctionStepIntoCallable.py (1373 of 2045)
PASS: lldb-shell :: Reproducer/TestDriverOptions.test (1374 of 2045)
PASS: lldb-unit :: ScriptInterpreter/Python/./ScriptInterpreterPythonTests/PythonDataObjectsTest.TestPythonListManipulation (1375 of 2045)
PASS: lldb-api :: lang/objc/objc++/TestObjCXX.py (1376 of 2045)
PASS: lldb-api :: tools/lldb-server/TestGdbRemoteExitCode.py (1377 of 2045)
PASS: lldb-unit :: Utility/./UtilityTests/Predicate.WaitForValueEqualTo (1378 of 2045)
PASS: lldb-api :: functionalities/data-formatter/data-formatter-smart-array/TestDataFormatterSmartArray.py (1379 of 2045)
PASS: lldb-unit :: Process/gdb-remote/./ProcessGdbRemoteTests/GDBRemoteCommunicationClientTest.GetModulesInfo_UUID20 (1380 of 2045)
PASS: lldb-api :: functionalities/asan/TestReportData.py (1381 of 2045)
PASS: lldb-api :: commands/expression/call-function/TestCallStdStringFunction.py (1382 of 2045)
PASS: lldb-unit :: ScriptInterpreter/Python/./ScriptInterpreterPythonTests/PythonDataObjectsTest.TestOwnedReferences (1383 of 2045)
PASS: lldb-unit :: Expression/./ExpressionTests/DiagnosticManagerTest.PutStringSeverities (1384 of 2045)
PASS: lldb-unit :: Utility/./UtilityTests/BinaryStreamTest.PutSLEB128SixBytes (1385 of 2045)
PASS: lldb-unit :: Utility/./UtilityTests/StreamTest.AddressEmptyPrefix (1386 of 2045)
PASS: lldb-unit :: Utility/./UtilityTests/BinaryStreamTest.PutULEB128ThreeBytes (1387 of 2045)
PASS: lldb-api :: functionalities/unwind/sigtramp/TestSigtrampUnwind.py (1388 of 2045)
PASS: lldb-unit :: Utility/./UtilityTests/TimerTest.CategoryTimes2 (1389 of 2045)
PASS: lldb-shell :: SymbolFile/DWARF/debug_rnglists-dwo.s (1390 of 2045)
PASS: lldb-unit :: SymbolFile/NativePDB/./SymbolFileNativePDBTests/PDBFPOProgramToDWARFExpressionTests.UnsupportedRASearch (1391 of 2045)
PASS: lldb-api :: lang/cpp/namespace_conflicts/TestNamespaceConflicts.py (1392 of 2045)
UNSUPPORTED: lldb-shell :: Register/aarch64-fp-read.test (1393 of 2045)
PASS: lldb-unit :: Utility/./UtilityTests/StatusTest.ErrorConstructor (1394 of 2045)
PASS: lldb-unit :: Utility/./UtilityTests/ArgsTest.TestTrailingBackslash (1395 of 2045)
PASS: lldb-unit :: Utility/./UtilityTests/StringExtractorTest.GetU32LittleEndian (1396 of 2045)
UNSUPPORTED: lldb-api :: tools/lldb-vscode/completions/TestVSCode_completions.py (1397 of 2045)
PASS: lldb-api :: commands/watchpoints/watchpoint_on_vectors/TestValueOfVectorVariable.py (1398 of 2045)
PASS: lldb-unit :: Utility/./UtilityTests/StringExtractorTest.GetHexU8_Exact (1399 of 2045)
PASS: lldb-unit :: Utility/./UtilityTests/StringExtractorTest.GetHexBytes_Partial (1400 of 2045)
PASS: lldb-api :: functionalities/memory/cache/TestMemoryCache.py (1401 of 2045)
PASS: lldb-unit :: Symbol/./SymbolTests/TestTypeSystemClang.TestGetEnumIntegerTypeInvalid (1402 of 2045)
PASS: lldb-api :: lang/cpp/dynamic-value/TestDynamicValue.py (1403 of 2045)
PASS: lldb-api :: lang/objc/objc-static-method/TestObjCStaticMethod.py (1404 of 2045)
PASS: lldb-unit :: Process/minidump/./LLDBMinidumpTests/MinidumpParserTest.GetLinuxProcStatus (1405 of 2045)
PASS: lldb-api :: functionalities/gdb_remote_client/TestNoGPacketSupported.py (1406 of 2045)
PASS: lldb-unit :: Utility/./UtilityTests/UriParserTest.SchemeHostSeparator (1407 of 2045)
PASS: lldb-shell :: SymbolFile/DWARF/debug-types-dwo-cross-reference.cpp (1408 of 2045)
PASS: lldb-api :: lang/objc/objc-builtin-types/TestObjCBuiltinTypes.py (1409 of 2045)
PASS: lldb-shell :: SymbolFile/Breakpad/symtab-macho.test (1410 of 2045)
PASS: lldb-unit :: Utility/./UtilityTests/StreamTest.PutCharWhitespace (1411 of 2045)
PASS: lldb-unit :: Process/gdb-remote/./ProcessGdbRemoteTests/GDBRemoteCommunicationClientTest.GetMemoryRegionInfo (1412 of 2045)
PASS: lldb-api :: types/TestDoubleTypesExpr.py (1413 of 2045)
PASS: lldb-api :: commands/register/register/register_command/TestRegisters.py (1414 of 2045)
PASS: lldb-unit :: Language/Highlighting/./HighlighterTests/HighlighterTest.ClangSquareBrackets (1415 of 2045)
PASS: lldb-api :: lang/c/blocks/TestBlocks.py (1416 of 2045)
PASS: lldb-api :: functionalities/gdb_remote_client/TestWriteMemory.py (1417 of 2045)
PASS: lldb-api :: commands/expression/timeout/TestCallWithTimeout.py (1418 of 2045)
PASS: lldb-unit :: Symbol/./SymbolTests/TestClangASTImporter.MetadataPropagation (1419 of 2045)
PASS: lldb-api :: functionalities/breakpoint/hardware_breakpoints/hardware_breakpoint_on_multiple_threads/TestHWBreakMultiThread.py (1420 of 2045)
PASS: lldb-api :: lang/cpp/global_operators/TestCppGlobalOperators.py (1421 of 2045)
PASS: lldb-unit :: Utility/./UtilityTests/RangeDataVector.CustomSort (1422 of 2045)
PASS: lldb-unit :: ScriptInterpreter/Python/./ScriptInterpreterPythonTests/PythonDataObjectsTest.TestPythonStringToStructuredString (1423 of 2045)
PASS: lldb-api :: functionalities/data-formatter/data-formatter-stl/libcxx/optional/TestDataFormatterLibcxxOptional.py (1424 of 2045)
PASS: lldb-unit :: Utility/./UtilityTests/Flags.IsClear (1425 of 2045)
PASS: lldb-shell :: SymbolFile/DWARF/compilercontext.ll (1426 of 2045)
PASS: lldb-shell :: ObjectFile/ELF/gnu-debuglink.yaml (1427 of 2045)
PASS: lldb-api :: functionalities/data-formatter/stringprinter/TestStringPrinter.py (1428 of 2045)
PASS: lldb-api :: commands/expression/diagnostics/TestExprDiagnostics.py (1429 of 2045)
PASS: lldb-unit :: Utility/./UtilityTests/ScalarTest.Promotion (1430 of 2045)
PASS: lldb-api :: functionalities/data-formatter/data-formatter-disabling/TestDataFormatterDisabling.py (1431 of 2045)
PASS: lldb-unit :: Process/gdb-remote/./ProcessGdbRemoteTests/GDBRemoteCommunicationClientTest.SendSignalsToIgnore (1432 of 2045)
PASS: lldb-unit :: Utility/./UtilityTests/ArgsTest.BareSingleQuote (1433 of 2045)
PASS: lldb-api :: lang/cpp/member-and-local-vars-with-same-name/TestMembersAndLocalsWithSameName.py (1434 of 2045)
PASS: lldb-unit :: Utility/./UtilityTests/RangeTest.ContainsEndInclusive (1435 of 2045)
PASS: lldb-unit :: UnwindAssembly/x86/./UnwindAssemblyx86Tests/Testx86AssemblyInspectionEngine.TestSubRSP (1436 of 2045)
PASS: lldb-unit :: Target/./TargetTests/MemoryRegionInfoTest.Formatv (1437 of 2045)
PASS: lldb-shell :: ScriptInterpreter/Python/scripted_breakpoint.test (1438 of 2045)
PASS: lldb-shell :: ObjectFile/wasm/stripped-debug-sections.yaml (1439 of 2045)
UNSUPPORTED: lldb-shell :: SymbolFile/PDB/typedefs.test (1440 of 2045)
PASS: lldb-shell :: Expr/TestTypeOfDeclTypeExpr.test (1441 of 2045)
PASS: lldb-unit :: UnwindAssembly/x86/./UnwindAssemblyx86Tests/Testx86AssemblyInspectionEngine.Test32bitFramelessBigStackFrame (1442 of 2045)
PASS: lldb-unit :: Host/./HostTests/SocketTest.TCPGetAddress (1443 of 2045)
PASS: lldb-api :: commands/expression/inline-namespace/TestInlineNamespace.py (1444 of 2045)
PASS: lldb-unit :: Host/./HostTests/File.GetStreamFromDescriptor (1445 of 2045)
PASS: lldb-unit :: Signals/./SignalsTests/UnixSignalsTest.GetFilteredSignals (1446 of 2045)
PASS: lldb-shell :: SymbolFile/NativePDB/break-by-line.cpp (1447 of 2045)
PASS: lldb-api :: lang/objc/objc-foundation-dictionary-empty/TestNSDictionary0.py (1448 of 2045)
PASS: lldb-api :: functionalities/data-formatter/data-formatter-stl/libcxx/atomic/TestLibCxxAtomic.py (1449 of 2045)
UNSUPPORTED: lldb-shell :: Unwind/unwind-plan-dwarf-dump.test (1450 of 2045)
UNSUPPORTED: lldb-api :: tools/lldb-server/TestGdbRemoteAuxvSupport.py (1451 of 2045)
PASS: lldb-unit :: Symbol/./SymbolTests/SymbolsTest.LocateExecutableSymbolFileForUnknownExecutableAndMissingSymbolFile (1452 of 2045)
PASS: lldb-api :: python_api/process/read-mem-cstring/TestReadMemCString.py (1453 of 2045)
PASS: lldb-unit :: Process/gdb-remote/./ProcessGdbRemoteTests/GDBRemoteCommunicationClientTest.SendStopTracePacket (1454 of 2045)
PASS: lldb-unit :: Symbol/./SymbolTests/TestTypeSystemClang.TestGetTypeClassNested (1455 of 2045)
PASS: lldb-unit :: ObjectFile/Breakpad/./ObjectFileBreakpadTests/Record.classify (1456 of 2045)
PASS: lldb-api :: functionalities/breakpoint/breakpoint_command/TestBreakpointCommand.py (1457 of 2045)
PASS: lldb-unit :: Target/./TargetTests/PathMappingListTest.RemapRoot (1458 of 2045)
PASS: lldb-api :: functionalities/data-formatter/data-formatter-named-summaries/TestDataFormatterNamedSummaries.py (1459 of 2045)
PASS: lldb-unit :: Host/./HostTests/NativeProcessProtocolTest.SetBreakpoint (1460 of 2045)
PASS: lldb-api :: commands/expression/completion/TestExprCompletion.py (1461 of 2045)
PASS: lldb-unit :: Utility/./UtilityTests/StringExtractorTest.InitMisc (1462 of 2045)
PASS: lldb-unit :: Utility/./UtilityTests/DataExtractorTest.PeekData (1463 of 2045)
PASS: lldb-api :: commands/expression/unwind_expression/TestUnwindExpression.py (1464 of 2045)
PASS: lldb-shell :: SymbolFile/DWARF/DW_AT_low_pc-addrx.s (1465 of 2045)
UNSUPPORTED: lldb-shell :: Register/x86-ymm-write.test (1466 of 2045)
PASS: lldb-shell :: ObjectFile/ELF/section-addresses.yaml (1467 of 2045)
PASS: lldb-api :: functionalities/breakpoint/debugbreak/TestDebugBreak.py (1468 of 2045)
PASS: lldb-unit :: Utility/./UtilityTests/StreamTeeTest.Constructor2Streams (1469 of 2045)
PASS: lldb-unit :: Symbol/./SymbolTests/TestTypeSystemClang.TestRecordHasFields (1470 of 2045)
UNSUPPORTED: lldb-shell :: ExecControl/StopHook/stop-hook-threads.test (1471 of 2045)
PASS: lldb-shell :: Settings/TestStopCommandSourceOnError.test (1472 of 2045)
PASS: lldb-unit :: Utility/./UtilityTests/RangeDataVector.FindEntryThatContains (1473 of 2045)
PASS: lldb-api :: functionalities/data-formatter/var-in-aggregate-misuse/TestVarInAggregateMisuse.py (1474 of 2045)
PASS: lldb-api :: tools/lldb-server/TestGdbRemoteKill.py (1475 of 2045)
PASS: lldb-unit :: Utility/./UtilityTests/StringListTest.AppendListCStringArray (1476 of 2045)
PASS: lldb-api :: commands/expression/namespace_local_var_same_name_obj_c/TestNamespaceLocalVarSameNameObjC.py (1477 of 2045)
PASS: lldb-api :: lang/objc/modules-inline-functions/TestModulesInlineFunctions.py (1478 of 2045)
PASS: lldb-api :: lang/cpp/namespace/TestNamespaceLookup.py (1479 of 2045)
PASS: lldb-unit :: Utility/./UtilityTests/Flags.AllClear (1480 of 2045)
PASS: lldb-api :: functionalities/breakpoint/breakpoint_hit_count/TestBreakpointHitCount.py (1481 of 2045)
PASS: lldb-api :: sample_test/TestSampleInlineTest.py (1482 of 2045)
PASS: lldb-unit :: Utility/./UtilityTests/UriParserTest.Minimal (1483 of 2045)
PASS: lldb-unit :: Utility/./UtilityTests/AnsiTerminal.WhiteSpace (1484 of 2045)
PASS: lldb-shell :: ObjectFile/ELF/base-address.yaml (1485 of 2045)
PASS: lldb-shell :: ObjectFile/ELF/PT_LOAD-overlap-PT_TLS.yaml (1486 of 2045)
UNSUPPORTED: lldb-shell :: SymbolFile/PDB/compilands.test (1487 of 2045)
PASS: lldb-api :: functionalities/data-formatter/format-propagation/TestFormatPropagation.py (1488 of 2045)
PASS: lldb-api :: lang/objc/radar-9691614/TestObjCMethodReturningBOOL.py (1489 of 2045)
PASS: lldb-unit :: Utility/./UtilityTests/UriParserTest.MinimalPortPath (1490 of 2045)
PASS: lldb-unit :: Target/./TargetTests/ExecutionContextTest.GetByteOrderTarget (1491 of 2045)
PASS: lldb-api :: lang/cpp/stl/TestStdCXXDisassembly.py (1492 of 2045)
PASS: lldb-unit :: Utility/./UtilityTests/ConstStringTest.CompareConstString (1493 of 2045)
PASS: lldb-shell :: Quit/TestQuitExitCodeHex0.test (1494 of 2045)
PASS: lldb-unit :: Utility/./UtilityTests/BinaryStreamTest.PutSLEB128FiveBytes (1495 of 2045)
PASS: lldb-unit :: UnwindAssembly/x86/./UnwindAssemblyx86Tests/Testx86AssemblyInspectionEngine.Test32BitOnlyInstruction (1496 of 2045)
PASS: lldb-unit :: ScriptInterpreter/Python/./ScriptInterpreterPythonTests/PythonDataObjectsTest.TestPythonListToStructuredList (1497 of 2045)
PASS: lldb-unit :: Utility/./UtilityTests/NameMatchesTest.Ignore (1498 of 2045)
PASS: lldb-api :: commands/expression/entry-bp/TestExprEntryBP.py (1499 of 2045)
PASS: lldb-unit :: Utility/./UtilityTests/StringExtractorTest.GetNameColonValueContainsColon (1500 of 2045)
PASS: lldb-api :: commands/expression/import-std-module/stack/TestStackFromStdModule.py (1501 of 2045)
PASS: lldb-api :: functionalities/plugins/python_os_plugin/stepping_plugin_threads/TestOSPluginStepping.py (1502 of 2045)
PASS: lldb-shell :: ObjectFile/ELF/PT_LOAD-overlap.yaml (1503 of 2045)
PASS: lldb-unit :: Utility/./UtilityTests/Predicate.WaitForValueNotEqualTo (1504 of 2045)
PASS: lldb-unit :: debugserver/./debugserverTests/JSON.Parse (1505 of 2045)
PASS: lldb-unit :: Utility/./UtilityTests/SerializationRountripTest.SerializeDeserializeCStringArrayNullptrElem (1506 of 2045)
PASS: lldb-unit :: Expression/./ExpressionTests/CppModuleConfigurationTest.LinuxLocalLibCpp (1507 of 2045)
PASS: lldb-api :: functionalities/history/TestHistoryRecall.py (1508 of 2045)
PASS: lldb-unit :: Symbol/./SymbolTests/TestTypeSystemClang.TestDisplayName (1509 of 2045)
PASS: lldb-api :: commands/expression/completion-crash-incomplete-record/TestCompletionCrashIncompleteRecord.py (1510 of 2045)
PASS: lldb-api :: functionalities/gdb_remote_client/TestStopPCs.py (1511 of 2045)
PASS: lldb-unit :: Utility/./UtilityTests/ConstStringTest.FromMidOfBufferStringRef (1512 of 2045)
PASS: lldb-shell :: SymbolFile/DWARF/dwarf5-atomic.s (1513 of 2045)
UNSUPPORTED: lldb-api :: commands/register/register/intel_xtended_registers/mpx_bound_violation/TestBoundViolation.py (1514 of 2045)
PASS: lldb-unit :: Utility/./UtilityTests/StreamTest.AddressRangeInvalidRange (1515 of 2045)
UNSUPPORTED: lldb-shell :: Register/x86-64-ymm16-read.test (1516 of 2045)
PASS: lldb-unit :: UnwindAssembly/x86/./UnwindAssemblyx86Tests/Testx86AssemblyInspectionEngine.TestSimplex86_64Augmented (1517 of 2045)
PASS: lldb-unit :: ScriptInterpreter/Python/./ScriptInterpreterPythonTests/PythonDataObjectsTest.TestResetting (1518 of 2045)
PASS: lldb-api :: api/multiple-targets/TestMultipleTargets.py (1519 of 2045)
UNSUPPORTED: lldb-api :: arm/breakpoint-it/TestBreakpointIt.py (1520 of 2045)
PASS: lldb-unit :: Symbol/./SymbolTests/TestTypeSystemClang.TemplateArguments (1521 of 2045)
PASS: lldb-api :: python_api/function_symbol/TestDisasmAPI.py (1522 of 2045)
PASS: lldb-unit :: UnwindAssembly/x86/./UnwindAssemblyx86Tests/Testx86AssemblyInspectionEngine.TestPushR13 (1523 of 2045)
PASS: lldb-api :: functionalities/pre_run_dylibs/TestPreRunDylibs.py (1524 of 2045)
PASS: lldb-api :: commands/apropos/basic/TestApropos.py (1525 of 2045)
PASS: lldb-api :: python_api/lldbutil/TestSwigVersion.py (1526 of 2045)
PASS: lldb-api :: functionalities/jitloader_gdb/TestJITLoaderGDB.py (1527 of 2045)
PASS: lldb-api :: functionalities/gdb_remote_client/TestWasm.py (1528 of 2045)
PASS: lldb-api :: lang/cpp/thread_local/TestThreadLocal.py (1529 of 2045)
PASS: lldb-api :: python_api/exprpath_synthetic/TestExprPathSynthetic.py (1530 of 2045)
PASS: lldb-unit :: Utility/./UtilityTests/GeneratorTest.Get (1531 of 2045)
PASS: lldb-unit :: Core/./LLDBCoreTests/SourceFileCache.FindSourceFileFound (1532 of 2045)
PASS: lldb-unit :: Utility/./UtilityTests/UUIDTest.StringConverion (1533 of 2045)
PASS: lldb-shell :: Reproducer/TestDSYM.test (1534 of 2045)
PASS: lldb-api :: functionalities/breakpoint/scripted_bkpt/TestScriptedResolver.py (1535 of 2045)
PASS: lldb-unit :: Utility/./UtilityTests/ArgsTest.TestOverwriteArgs (1536 of 2045)
PASS: lldb-unit :: Utility/./UtilityTests/ArchSpecTest.OperatorBool (1537 of 2045)
PASS: lldb-api :: python_api/target/TestTargetAPI.py (1538 of 2045)
PASS: lldb-unit :: Utility/./UtilityTests/StreamTest.PutPtr (1539 of 2045)
PASS: lldb-api :: python_api/thread/TestThreadAPI.py (1540 of 2045)
PASS: lldb-shell :: SymbolFile/DWARF/find-basic-function.cpp (1541 of 2045)
PASS: lldb-unit :: Utility/./UtilityTests/StringListTest.Clear (1542 of 2045)
PASS: lldb-unit :: Symbol/./SymbolTests/TestTypeSystemClang.TestOwningModule (1543 of 2045)
PASS: lldb-api :: python_api/lldbutil/iter/TestRegistersIterator.py (1544 of 2045)
PASS: lldb-api :: sample_test/TestSampleTest.py (1545 of 2045)
PASS: lldb-api :: lang/cpp/offsetof/TestOffsetofCpp.py (1546 of 2045)
PASS: lldb-shell :: BuildScript/toolchain-clang.test (1547 of 2045)
PASS: lldb-unit :: Utility/./UtilityTests/SerializationRountripTest.SerializeDeserializeObjectReference (1548 of 2045)
UNSUPPORTED: lldb-api :: functionalities/darwin_log/filter/exact_match/activity/TestDarwinLogFilterMatchActivity.py (1549 of 2045)
PASS: lldb-unit :: SymbolFile/DWARF/./SymbolFileDWARFTests/XcodeSDKModuleTests.TestModuleGetXcodeSDK (1550 of 2045)
PASS: lldb-unit :: Language/Highlighting/./HighlighterTests/HighlighterTest.ClangCursorPosBeforeOtherToken (1551 of 2045)
PASS: lldb-shell :: SymbolFile/DWARF/dir-separator-no-comp-dir.s (1552 of 2045)
PASS: lldb-unit :: Utility/./UtilityTests/StringExtractorTest.GetNameColonValueSuccess (1553 of 2045)
PASS: lldb-unit :: Expression/./ExpressionTests/DWARFExpression.DW_OP_convert (1554 of 2045)
PASS: lldb-unit :: Utility/./UtilityTests/VMRange.SetEndAddress (1555 of 2045)
PASS: lldb-unit :: Utility/./UtilityTests/StreamTest.PutNHex8 (1556 of 2045)
UNSUPPORTED: lldb-shell :: SymbolFile/PDB/udt-layout.test (1557 of 2045)
PASS: lldb-api :: python_api/sbvalue_const_addrof/TestSBValueConstAddrOf.py (1558 of 2045)
PASS: lldb-api :: commands/expression/import_base_class_when_class_has_derived_member/TestImportBaseClassWhenClassHasDerivedMember.py (1559 of 2045)
PASS: lldb-unit :: UnwindAssembly/x86/./UnwindAssemblyx86Tests/Testx86AssemblyInspectionEngine.TestStackRealign8BitDisp_i386 (1560 of 2045)
PASS: lldb-api :: python_api/sbdata/TestSBData.py (1561 of 2045)
PASS: lldb-shell :: Reproducer/TestLuaImport.test (1562 of 2045)
PASS: lldb-unit :: Language/Highlighting/./HighlighterTests/HighlighterTest.DefaultHighlighter (1563 of 2045)
PASS: lldb-api :: commands/frame/diagnose/dereference-this/TestDiagnoseDereferenceThis.py (1564 of 2045)
PASS: lldb-unit :: Host/./HostTests/NativeProcessProtocolTest.ReadMemoryWithoutTrap (1565 of 2045)
PASS: lldb-unit :: Utility/./UtilityTests/ProcessInstanceInfo.DumpTable_invalidUID (1566 of 2045)
PASS: lldb-api :: lang/objc/variadic_methods/TestVariadicMethods.py (1567 of 2045)
PASS: lldb-api :: commands/watchpoints/multiple_threads/TestWatchpointMultipleThreads.py (1568 of 2045)
PASS: lldb-api :: functionalities/return-value/TestReturnValue.py (1569 of 2045)
PASS: lldb-api :: commands/process/launch-with-shellexpand/TestLaunchWithShellExpand.py (1570 of 2045)
PASS: lldb-unit :: Utility/./UtilityTests/StringLexerTest.NextIfList (1571 of 2045)
PASS: lldb-shell :: Expr/TestMultilineExpr.test (1572 of 2045)
PASS: lldb-api :: lang/c/forward/TestForwardDeclaration.py (1573 of 2045)
PASS: lldb-api :: lang/cpp/symbols/TestSymbols.py (1574 of 2045)
PASS: lldb-api :: lang/c/register_variables/TestRegisterVariables.py (1575 of 2045)
PASS: lldb-api :: functionalities/data-formatter/data-formatter-stl/libcxx/string/TestDataFormatterLibcxxString.py (1576 of 2045)
PASS: lldb-unit :: UnwindAssembly/x86/./UnwindAssemblyx86Tests/Testx86AssemblyInspectionEngine.TestPush0 (1577 of 2045)
PASS: lldb-unit :: Utility/./UtilityTests/LogChannelEnabledTest.log_options (1578 of 2045)
PASS: lldb-unit :: Utility/./UtilityTests/StructuredDataTest.ParseJSONFromFile (1579 of 2045)
PASS: lldb-api :: functionalities/data-formatter/data-formatter-stl/libcxx/map/TestDataFormatterLibccMap.py (1580 of 2045)
UNSUPPORTED: lldb-api :: commands/target/auto-install-main-executable/TestAutoInstallMainExecutable.py (1581 of 2045)
PASS: lldb-shell :: Quit/TestQuitExitCodeNonInt.test (1582 of 2045)
PASS: lldb-api :: lang/cpp/operators/TestCppOperators.py (1583 of 2045)
PASS: lldb-shell :: Breakpoint/case-sensitive.test (1584 of 2045)
PASS: lldb-unit :: Expression/./ExpressionTests/DiagnosticManagerTest.GetStringPreserveOrder (1585 of 2045)
PASS: lldb-api :: commands/target/dump-symtab-demangle/TestDumpSymtabDemangle.py (1586 of 2045)
PASS: lldb-api :: sanity/TestModuleCacheSanity.py (1587 of 2045)
PASS: lldb-api :: linux/builtin_trap/TestBuiltinTrap.py (1588 of 2045)
PASS: lldb-api :: functionalities/breakpoint/require_hw_breakpoints/TestRequireHWBreakpoints.py (1589 of 2045)
PASS: lldb-api :: lang/objc/rdar-10967107/TestRdar10967107.py (1590 of 2045)
PASS: lldb-api :: commands/expression/pr35310/TestExprsBug35310.py (1591 of 2045)
PASS: lldb-shell :: SymbolFile/DWARF/deterministic-build.cpp (1592 of 2045)
PASS: lldb-unit :: Language/Highlighting/./HighlighterTests/HighlighterTest.FallbackHighlighter (1593 of 2045)
PASS: lldb-unit :: Utility/./UtilityTests/StreamTest.Indent (1594 of 2045)
PASS: lldb-shell :: ObjectFile/ELF/PT_LOAD-overlap-section.yaml (1595 of 2045)
PASS: lldb-api :: commands/expression/import-std-module/basic/TestImportStdModule.py (1596 of 2045)
PASS: lldb-api :: functionalities/process_crash_info/TestProcessCrashInfo.py (1597 of 2045)
PASS: lldb-unit :: Expression/./ExpressionTests/DiagnosticManagerTest.PutString (1598 of 2045)
PASS: lldb-unit :: ObjectFile/PECOFF/./ObjectFilePECOFFTests/PECallFrameInfoTest.Chained_eh (1599 of 2045)
PASS: lldb-api :: commands/expression/import-std-module/forward_list/TestForwardListFromStdModule.py (1600 of 2045)
PASS: lldb-api :: commands/settings/use_source_cache/TestUseSourceCache.py (1601 of 2045)
UNSUPPORTED: lldb-api :: linux/thread/create_during_instruction_step/TestCreateDuringInstructionStep.py (1602 of 2045)
PASS: lldb-unit :: Utility/./UtilityTests/ScalarTest.Equality (1603 of 2045)
PASS: lldb-api :: commands/settings/TestSettings.py (1604 of 2045)
PASS: lldb-unit :: Utility/./UtilityTests/StreamTest.QuotedCString (1605 of 2045)
PASS: lldb-api :: functionalities/avoids-fd-leak/TestFdLeak.py (1606 of 2045)
PASS: lldb-api :: commands/gui/basic/TestGuiBasic.py (1607 of 2045)
PASS: lldb-unit :: SymbolFile/DWARF/./SymbolFileDWARFTests/SymbolFileDWARFTests.TestAbbrevOrder1Start5 (1608 of 2045)
PASS: lldb-shell :: Driver/TestSingleQuote.test (1609 of 2045)
PASS: lldb-unit :: Utility/./UtilityTests/StringListTest.InsertStringAtIndexEnd (1610 of 2045)
PASS: lldb-unit :: SymbolFile/DWARF/./SymbolFileDWARFTests/SymbolFileDWARFTests.TestAbbrevInvalidNULLTag (1611 of 2045)
PASS: lldb-api :: python_api/sbvalue_persist/TestSBValuePersist.py (1612 of 2045)
PASS: lldb-unit :: Utility/./UtilityTests/ArchSpecTest.MergeFrom (1613 of 2045)
PASS: lldb-shell :: SymbolFile/DWARF/debug-types-dwarf5.s (1614 of 2045)
PASS: lldb-api :: functionalities/source-map/TestTargetSourceMap.py (1615 of 2045)
PASS: lldb-shell :: Driver/TestPositionalArgs.test (1616 of 2045)
UNSUPPORTED: lldb-api :: commands/expression/macros/TestMacros.py (1617 of 2045)
PASS: lldb-unit :: Utility/./UtilityTests/BinaryStreamTest.PutSLEB128TwoBytes (1618 of 2045)
PASS: lldb-unit :: Utility/./UtilityTests/ScalarTest.LongLongAssigmentOperator (1619 of 2045)
PASS: lldb-api :: python_api/module_section/TestModuleAndSection.py (1620 of 2045)
PASS: lldb-api :: macosx/find-app-in-bundle/TestFindAppInBundle.py (1621 of 2045)
PASS: lldb-unit :: Utility/./UtilityTests/StringExtractorTest.GetHexBytesAvail_Underflow (1622 of 2045)
PASS: lldb-api :: commands/expression/import-std-module/conflicts/TestStdModuleWithConflicts.py (1623 of 2045)
PASS: lldb-api :: functionalities/data-formatter/data-formatter-skip-summary/TestDataFormatterSkipSummary.py (1624 of 2045)
PASS: lldb-unit :: Host/./HostTests/HostInfoTest.GetAugmentedArchSpec (1625 of 2045)
UNSUPPORTED: lldb-api :: functionalities/data-formatter/data-formatter-stl/libstdcpp/list/TestDataFormatterStdList.py (1626 of 2045)
PASS: lldb-api :: functionalities/thread/concurrent_events/TestConcurrentSignalDelayWatch.py (1627 of 2045)
PASS: lldb-unit :: Utility/./UtilityTests/StreamTest.PutSLEB128 (1628 of 2045)
PASS: lldb-unit :: SymbolFile/NativePDB/./SymbolFileNativePDBTests/PDBFPOProgramToDWARFExpressionTests.InvalidAssignmentMultiple (1629 of 2045)
PASS: lldb-unit :: Language/Highlighting/./HighlighterTests/HighlighterTest.ClangEmptyInput (1630 of 2045)
PASS: lldb-unit :: Utility/./UtilityTests/StreamTest.PutRawBytesToMixedEndian (1631 of 2045)
PASS: lldb-unit :: Expression/./ExpressionTests/DiagnosticManagerTest.AppendMessageSubsequentDiags (1632 of 2045)
PASS: lldb-unit :: ScriptInterpreter/Python/./ScriptInterpreterPythonTests/PythonDataObjectsTest.TestPythonIntegerToStr (1633 of 2045)
PASS: lldb-api :: functionalities/breakpoint/source_regexp/TestSourceRegexBreakpoints.py (1634 of 2045)
PASS: lldb-api :: commands/help/TestHelp.py (1635 of 2045)
PASS: lldb-api :: functionalities/data-formatter/pyobjsynthprovider/TestPyObjSynthProvider.py (1636 of 2045)
PASS: lldb-api :: commands/expression/persist_objc_pointeetype/TestPersistObjCPointeeType.py (1637 of 2045)
PASS: lldb-shell :: ObjectFile/ELF/basic-info.yaml (1638 of 2045)
PASS: lldb-api :: commands/expression/namespace_local_var_same_name_cpp_and_c/TestNamespaceLocalVarSameNameCppAndC.py (1639 of 2045)
PASS: lldb-unit :: ObjectFile/ELF/./ObjectFileELFTests/ObjectFileELFTest.GetSymtab_NoSymEntryPointArmAddressClass (1640 of 2045)
PASS: lldb-api :: commands/expression/anonymous-struct/TestCallUserAnonTypedef.py (1641 of 2045)
PASS: lldb-shell :: SymbolFile/Breakpad/unwind-via-stack-win.test (1642 of 2045)
PASS: lldb-api :: functionalities/data-formatter/data-formatter-synthval/TestDataFormatterSynthVal.py (1643 of 2045)
PASS: lldb-shell :: Commands/command-regex-unalias.test (1644 of 2045)
PASS: lldb-api :: python_api/file_handle/TestFileHandle.py (1645 of 2045)
PASS: lldb-unit :: Utility/./UtilityTests/UriParserTest.SchemeHostSeparator2 (1646 of 2045)
PASS: lldb-unit :: Language/CPlusPlus/./LanguageCPlusPlusTests/CPlusPlusLanguage.FindAlternateFunctionManglings (1647 of 2045)
PASS: lldb-unit :: Utility/./UtilityTests/StringListTest.JoinNonSpace (1648 of 2045)
UNSUPPORTED: lldb-shell :: SymbolFile/PDB/enums-layout.test (1649 of 2045)
PASS: lldb-shell :: Reproducer/TestWorkingDir.test (1650 of 2045)
PASS: lldb-unit :: Language/Highlighting/./HighlighterTests/HighlighterTest.ClangStringLiterals (1651 of 2045)
PASS: lldb-api :: macosx/order/TestOrderFile.py (1652 of 2045)
PASS: lldb-unit :: Utility/./UtilityTests/ProcessInstanceInfo.Dump (1653 of 2045)
PASS: lldb-api :: terminal/TestEditline.py (1654 of 2045)
PASS: lldb-api :: functionalities/exec/TestExec.py (1655 of 2045)
PASS: lldb-unit :: Utility/./UtilityTests/StreamTest.AddressRangeSize (1656 of 2045)
PASS: lldb-unit :: Utility/./UtilityTests/ReproducerTest.SetReplay (1657 of 2045)
PASS: lldb-api :: functionalities/data-formatter/ptr_ref_typedef/TestPtrRef2Typedef.py (1658 of 2045)
PASS: lldb-api :: python_api/interpreter/TestRunCommandInterpreterAPI.py (1659 of 2045)
UNSUPPORTED: lldb-shell :: ObjectFile/ELF/minidebuginfo-no-lzma.yaml (1660 of 2045)
PASS: lldb-unit :: Host/./HostTests/Host.WaitStatusFormat (1661 of 2045)
PASS: lldb-unit :: Utility/./UtilityTests/BinaryStreamTest.PutSLEB128One (1662 of 2045)
PASS: lldb-unit :: ScriptInterpreter/Lua/./ScriptInterpreterLuaTests/LuaTest.RunValid (1663 of 2045)
PASS: lldb-api :: functionalities/plugins/python_os_plugin/TestPythonOSPlugin.py (1664 of 2045)
PASS: lldb-shell :: Breakpoint/debug_addrx.test (1665 of 2045)
UNSUPPORTED: lldb-api :: functionalities/darwin_log/filter/regex/activity/TestDarwinLogFilterRegexActivity.py (1666 of 2045)
PASS: lldb-api :: functionalities/data-formatter/type_summary_list_script/TestTypeSummaryListScript.py (1667 of 2045)
PASS: lldb-api :: commands/command/history/TestCommandHistory.py (1668 of 2045)
PASS: lldb-api :: commands/expression/multiline-completion/TestMultilineCompletion.py (1669 of 2045)
PASS: lldb-api :: commands/expression/options/TestExprOptions.py (1670 of 2045)
PASS: lldb-unit :: Utility/./UtilityTests/RegisterValueTest.GetSet8 (1671 of 2045)
PASS: lldb-unit :: Utility/./UtilityTests/StreamTest.PutRawBytesToBigEndian (1672 of 2045)
UNSUPPORTED: lldb-api :: functionalities/process_save_core/TestProcessSaveCore.py (1673 of 2045)
PASS: lldb-unit :: Process/gdb-remote/./ProcessGdbRemoteTests/GDBRemoteCommunicationServerTest.SendErrorResponse_ErrorNumber (1674 of 2045)
PASS: lldb-shell :: ObjectFile/ELF/section-overlap.yaml (1675 of 2045)
PASS: lldb-api :: lang/objc/objc-checker/TestObjCCheckers.py (1676 of 2045)
PASS: lldb-api :: python_api/value/TestValueAPI.py (1677 of 2045)
PASS: lldb-unit :: Symbol/./SymbolTests/TestClangASTImporter.CanImportInvalidType (1678 of 2045)
PASS: lldb-unit :: Host/./HostTests/NativeProcessProtocolTest.ReadCStringFromMemory_MaxSize (1679 of 2045)
PASS: lldb-unit :: Symbol/./SymbolTests/SymbolsTest.TerminateLocateExecutableSymbolFileForUnknownExecutableAndUnknownSymbolFile (1680 of 2045)
UNSUPPORTED: lldb-api :: lang/objc/objc-dynamic-value/TestObjCDynamicValue.py (1681 of 2045)
PASS: lldb-unit :: Utility/./UtilityTests/StreamTest.ChangingByteOrder (1682 of 2045)
PASS: lldb-shell :: ObjectFile/wasm/unified-debug-sections.yaml (1683 of 2045)
PASS: lldb-api :: lang/objc/objc-optimized/TestObjcOptimized.py (1684 of 2045)
PASS: lldb-api :: functionalities/value_md5_crash/TestValueMD5Crash.py (1685 of 2045)
PASS: lldb-unit :: UnwindAssembly/x86/./UnwindAssemblyx86Tests/Testx86AssemblyInspectionEngine.TestSimple64bitFrameFunction (1686 of 2045)
PASS: lldb-unit :: Symbol/./SymbolTests/TestTypeSystemClang.TestIsClangType (1687 of 2045)
UNSUPPORTED: lldb-api :: functionalities/breakpoint/breakpoint_in_delayslot/TestAvoidBreakpointInDelaySlot.py (1688 of 2045)
PASS: lldb-shell :: Process/UnsupportedLanguage.test (1689 of 2045)
PASS: lldb-api :: python_api/watchpoint/watchlocation/TestTargetWatchAddress.py (1690 of 2045)
PASS: lldb-shell :: ObjectFile/ELF/netbsd-core-amd64.test (1691 of 2045)
PASS: lldb-api :: lang/objc/modules-compile-error/TestModulesCompileError.py (1692 of 2045)
PASS: lldb-unit :: Utility/./UtilityTests/StringListTest.ShiftStdString (1693 of 2045)
PASS: lldb-shell :: Breakpoint/jitbp_elf.test (1694 of 2045)
PASS: lldb-unit :: Breakpoint/./LLDBBreakpointTests/BreakpointIDTest.StringIsBreakpointName (1695 of 2045)
UNSUPPORTED: lldb-shell :: SymbolFile/PDB/type-quals.test (1696 of 2045)
PASS: lldb-api :: functionalities/breakpoint/objc/TestObjCBreakpoints.py (1697 of 2045)
PASS: lldb-api :: commands/command/script/TestCommandScript.py (1698 of 2045)
PASS: lldb-shell :: Driver/TestProcessAttach.test (1699 of 2045)
PASS: lldb-unit :: Utility/./UtilityTests/StringExtractorTest.GetHexBytesAvail_FullString (1700 of 2045)
PASS: lldb-unit :: Utility/./UtilityTests/StreamTest.ShiftOperatorStrings (1701 of 2045)
PASS: lldb-api :: commands/expression/scoped_enums/TestScopedEnumType.py (1702 of 2045)
XFAIL: lldb-shell :: Register/x86-mm-xmm-read.test (1703 of 2045)
PASS: lldb-unit :: SymbolFile/NativePDB/./SymbolFileNativePDBTests/PDBFPOProgramToDWARFExpressionTests.UnknownOp (1704 of 2045)
PASS: lldb-unit :: SymbolFile/NativePDB/./SymbolFileNativePDBTests/PDBFPOProgramToDWARFExpressionTests.MultipleDependentAssignments (1705 of 2045)
PASS: lldb-api :: lang/objc/foundation/TestObjectDescriptionAPI.py (1706 of 2045)
PASS: lldb-unit :: Symbol/./SymbolTests/TestTypeSystemClang.TestDeletingImplicitCopyCstrDueToMoveCStr (1707 of 2045)
PASS: lldb-unit :: Host/./HostTests/SocketTest.TCPListen0ConnectAccept (1708 of 2045)
PASS: lldb-unit :: Utility/./UtilityTests/DataExtractorTest.GetCStrAtNullOffset (1709 of 2045)
PASS: lldb-unit :: Utility/./UtilityTests/CompletionRequest.ShiftArguments (1710 of 2045)
PASS: lldb-api :: functionalities/conditional_break/TestConditionalBreak.py (1711 of 2045)
PASS: lldb-api :: functionalities/fat_archives/TestFatArchives.py (1712 of 2045)
PASS: lldb-api :: lang/cpp/static_methods/TestCPPStaticMethods.py (1713 of 2045)
PASS: lldb-unit :: Utility/./UtilityTests/StringExtractorTest.GetHexU8_InvalidHex_NoEof (1714 of 2045)
PASS: lldb-unit :: Utility/./UtilityTests/AnsiTerminal.Unknown (1715 of 2045)
PASS: lldb-api :: python_api/sbtype_typeclass/TestSBTypeTypeClass.py (1716 of 2045)
PASS: lldb-api :: lang/cpp/covariant-return-types/TestCovariantReturnTypes.py (1717 of 2045)
PASS: lldb-unit :: Utility/./UtilityTests/StringListTest.CopyListEmpty (1718 of 2045)
PASS: lldb-unit :: ScriptInterpreter/Python/./ScriptInterpreterPythonTests/PythonDataObjectsTest.TestPythonCallableCheck (1719 of 2045)
PASS: lldb-api :: lang/objc/objc-dyn-sbtype/TestObjCDynamicSBType.py (1720 of 2045)
PASS: lldb-api :: functionalities/postmortem/minidump-new/TestMiniDumpNew.py (1721 of 2045)
PASS: lldb-api :: commands/expression/vector_of_enums/TestVectorOfEnums.py (1722 of 2045)
PASS: lldb-api :: python_api/value/change_values/TestChangeValueAPI.py (1723 of 2045)
PASS: lldb-api :: macosx/add-dsym/TestAddDsymMidExecutionCommand.py (1724 of 2045)
PASS: lldb-unit :: Utility/./UtilityTests/AnsiTerminal.AtEnd (1725 of 2045)
PASS: lldb-unit :: Utility/./UtilityTests/ArchSpecTest.MergeFromMachOUnknown (1726 of 2045)
PASS: lldb-unit :: Utility/./UtilityTests/StringListTest.JoinSingle (1727 of 2045)
PASS: lldb-api :: functionalities/data-formatter/data-formatter-ptr-to-array/TestPtrToArrayFormatting.py (1728 of 2045)
UNSUPPORTED: lldb-api :: functionalities/data-formatter/data-formatter-stl/libstdcpp/smart_ptr/TestDataFormatterStdSmartPtr.py (1729 of 2045)
PASS: lldb-unit :: Symbol/./SymbolTests/TestTypeSystemClang.TestFunctionTemplateInRecordConstruction (1730 of 2045)
PASS: lldb-api :: python_api/type/TestTypeList.py (1731 of 2045)
UNSUPPORTED: lldb-api :: functionalities/thread/state/TestThreadStates.py (1732 of 2045)
PASS: lldb-unit :: Utility/./UtilityTests/ArgsTest.ReplaceArgumentAtIndexLonger (1733 of 2045)
PASS: lldb-api :: python_api/watchpoint/TestSetWatchpoint.py (1734 of 2045)
PASS: lldb-api :: functionalities/breakpoint/breakpoint_callback_command_source/TestBreakpointCallbackCommandSource.py (1735 of 2045)
PASS: lldb-api :: tools/lldb-server/TestGdbRemoteProcessInfo.py (1736 of 2045)
PASS: lldb-unit :: Target/./TargetTests/MCBasedABI.MapRegisterName (1737 of 2045)
PASS: lldb-unit :: Utility/./UtilityTests/PassiveReplayTest.InstrumentedBar (1738 of 2045)
PASS: lldb-api :: macosx/indirect_symbol/TestIndirectSymbols.py (1739 of 2045)
PASS: lldb-api :: lang/objc/unicode-string/TestUnicodeString.py (1740 of 2045)
PASS: lldb-api :: functionalities/data-formatter/data-formatter-stl/libcxx/multimap/TestDataFormatterLibccMultiMap.py (1741 of 2045)
PASS: lldb-api :: lang/objc/hidden-ivars/TestHiddenIvars.py (1742 of 2045)
PASS: lldb-api :: python_api/default-constructor/TestDefaultConstructorForAPIObjects.py (1743 of 2045)
PASS: lldb-unit :: Expression/./ExpressionTests/CppModuleConfigurationTest.AmbiguousCLib (1744 of 2045)
PASS: lldb-api :: commands/target/basic/TestTargetCommand.py (1745 of 2045)
PASS: lldb-shell :: SymbolFile/DWARF/find-variable-file.cpp (1746 of 2045)
PASS: lldb-unit :: Process/gdb-remote/./ProcessGdbRemoteTests/GDBRemoteClientBaseTest.SendContinueAndLateInterrupt (1747 of 2045)
PASS: lldb-unit :: Utility/./UtilityTests/SerializationRountripTest.SerializeDeserializeCStringNull (1748 of 2045)
PASS: lldb-unit :: Utility/./UtilityTests/StringListTest.AppendStringMove (1749 of 2045)
PASS: lldb-unit :: Utility/./UtilityTests/StringListTest.JoinMultiCharSeparator (1750 of 2045)
PASS: lldb-unit :: UnwindAssembly/x86/./UnwindAssemblyx86Tests/Testx86AssemblyInspectionEngine.TestSpillRegToStackViaMOVx86_64 (1751 of 2045)
PASS: lldb-unit :: Process/gdb-remote/./ProcessGdbRemoteTests/GDBRemoteCommunicationClientTest.SaveRestoreRegistersNoSuffix (1752 of 2045)
PASS: lldb-api :: functionalities/object-file/TestImageListMultiArchitecture.py (1753 of 2045)
PASS: lldb-unit :: debugserver/./debugserverTests/RNBSocket.LoopBackConnectIPv4 (1754 of 2045)
UNSUPPORTED: lldb-shell :: SymbolFile/NativePDB/ast-functions-msvc.cpp (1755 of 2045)
PASS: lldb-unit :: Utility/./UtilityTests/XcodeSDKTest.SDKSupportsModules (1756 of 2045)
PASS: lldb-api :: lang/cpp/typedef/TestCppTypedef.py (1757 of 2045)
PASS: lldb-unit :: ScriptInterpreter/Python/./ScriptInterpreterPythonTests/PythonDataObjectsTest.TestCallable (1758 of 2045)
PASS: lldb-api :: lang/cpp/virtual-functions/TestCppVirtualFunctions.py (1759 of 2045)
PASS: lldb-api :: lang/cpp/class-template-parameter-pack/TestClassTemplateParameterPack.py (1760 of 2045)
PASS: lldb-api :: lang/c/struct_types/TestStructTypes.py (1761 of 2045)
PASS: lldb-api :: types/TestRecursiveTypes.py (1762 of 2045)
PASS: lldb-unit :: Utility/./UtilityTests/StreamTeeTest.SetStreamAtIndexOutOfBounds (1763 of 2045)
PASS: lldb-api :: commands/expression/po_verbosity/TestPoVerbosity.py (1764 of 2045)
PASS: lldb-api :: functionalities/inferior-crashing/TestInferiorCrashingStep.py (1765 of 2045)
PASS: lldb-unit :: Utility/./UtilityTests/StructuredDataTest.StringDump (1766 of 2045)
PASS: lldb-unit :: Utility/./UtilityTests/UUIDTest.Validity (1767 of 2045)
PASS: lldb-api :: functionalities/data-formatter/data-formatter-stl/libcxx/multiset/TestDataFormatterLibcxxMultiSet.py (1768 of 2045)
PASS: lldb-unit :: Process/gdb-remote/./ProcessGdbRemoteTests/GDBRemoteCommunicationClientTest.SendGetDataPacket (1769 of 2045)
UNSUPPORTED: lldb-shell :: SymbolFile/PDB/variables.test (1770 of 2045)
PASS: lldb-unit :: Core/./LLDBCoreTests/MangledTest.NameIndexes_FindFunctionSymbols (1771 of 2045)
PASS: lldb-unit :: Utility/./UtilityTests/StreamTest.ShiftOperatorPtr (1772 of 2045)
PASS: lldb-unit :: ScriptInterpreter/Python/./ScriptInterpreterPythonTests/PythonDataObjectsTest.TestPythonByteArray (1773 of 2045)
PASS: lldb-shell :: SymbolFile/NativePDB/function-types-classes.cpp (1774 of 2045)
PASS: lldb-unit :: UnwindAssembly/x86/./UnwindAssemblyx86Tests/Testx86AssemblyInspectionEngine.TestSpArithx86_64Augmented (1775 of 2045)
PASS: lldb-api :: lang/cpp/auto/TestCPPAuto.py (1776 of 2045)
PASS: lldb-shell :: SymbolFile/DWARF/debug_line-relative_path.s (1777 of 2045)
PASS: lldb-api :: tools/lldb-server/inferior-crash/TestGdbRemoteAbort.py (1778 of 2045)
PASS: lldb-shell :: Reproducer/TestPythonImport.test (1779 of 2045)
PASS: lldb-api :: python_api/class_members/TestSBTypeClassMembers.py (1780 of 2045)
PASS: lldb-api :: functionalities/data-formatter/data-formatter-objc/TestDataFormatterObjCNSData.py (1781 of 2045)
PASS: lldb-unit :: Host/./HostTests/Host.GetEnvironment (1782 of 2045)
PASS: lldb-api :: lang/objc/objc-property/TestObjCProperty.py (1783 of 2045)
PASS: lldb-api :: lang/cpp/template/TestTemplateArgs.py (1784 of 2045)
PASS: lldb-unit :: Process/minidump/./LLDBMinidumpTests/MinidumpParserTest.GetPid (1785 of 2045)
PASS: lldb-unit :: Utility/./UtilityTests/FileSpecTest.IsRelative (1786 of 2045)
PASS: lldb-api :: commands/breakpoint/set/func-regex/TestBreakpointRegexError.py (1787 of 2045)
PASS: lldb-shell :: ObjectFile/ELF/PT_LOAD.yaml (1788 of 2045)
PASS: lldb-shell :: ScriptInterpreter/None/import_module.test (1789 of 2045)
PASS: lldb-unit :: Symbol/./SymbolTests/LineEntryTest.GetSameLineContiguousAddressRangeNestedInline (1790 of 2045)
PASS: lldb-unit :: Utility/./UtilityTests/StreamTeeTest.GetStreamAtIndexOutOfBounds (1791 of 2045)
UNSUPPORTED: lldb-api :: functionalities/darwin_log/filter/regex/message/TestDarwinLogFilterRegexMessage.py (1792 of 2045)
PASS: lldb-api :: lang/c/strings/TestCStrings.py (1793 of 2045)
PASS: lldb-api :: commands/expression/unicode-in-variable/TestUnicodeInVariable.py (1794 of 2045)
PASS: lldb-api :: api/listeners/TestListener.py (1795 of 2045)
UNSUPPORTED: lldb-shell :: Register/x86-64-xmm16-read.test (1796 of 2045)
PASS: lldb-unit :: Platform/./LLDBPlatformTests/PlatformDarwinTest.FindXcodeContentsDirectoryInPath (1797 of 2045)
PASS: lldb-api :: functionalities/thread/concurrent_events/TestConcurrentDelayWatchBreak.py (1798 of 2045)
PASS: lldb-api :: functionalities/process_group/TestChangeProcessGroup.py (1799 of 2045)
UNSUPPORTED: lldb-shell :: Register/x86-ymm-read.test (1800 of 2045)
PASS: lldb-unit :: Utility/./UtilityTests/RangeTest.LessThanInvalid (1801 of 2045)
PASS: lldb-unit :: Utility/./UtilityTests/ArgsTest.TestSingleQuotedArgWithSpace (1802 of 2045)
PASS: lldb-unit :: Utility/./UtilityTests/StatusTest.Formatv (1803 of 2045)
PASS: lldb-unit :: Utility/./UtilityTests/RecordReplayTest.InstrumentedFoo (1804 of 2045)
PASS: lldb-unit :: debugserver/./debugserverTests/RNBSocket.LoopBackConnectIPv6 (1805 of 2045)
PASS: lldb-shell :: ObjectFile/ELF/compressed-sections.yaml (1806 of 2045)
PASS: lldb-api :: lang/objc/modules-hash-mismatch/TestClangModulesHashMismatch.py (1807 of 2045)
PASS: lldb-api :: functionalities/postmortem/wow64_minidump/TestWow64MiniDump.py (1808 of 2045)
PASS: lldb-shell :: ObjectFile/PECOFF/basic-info.yaml (1809 of 2045)
PASS: lldb-api :: functionalities/ubsan/basic/TestUbsanBasic.py (1810 of 2045)
PASS: lldb-api :: lang/cpp/call-function/TestCallCPPFunction.py (1811 of 2045)
PASS: lldb-shell :: Commands/command-regex-delete.test (1812 of 2045)
PASS: lldb-unit :: Utility/./UtilityTests/StreamTest.AddressSuffix (1813 of 2045)
PASS: lldb-api :: lang/cpp/unsigned_types/TestUnsignedTypes.py (1814 of 2045)
PASS: lldb-shell :: ObjectFile/ELF/PT_TLS-overlap-PT_LOAD.yaml (1815 of 2045)
PASS: lldb-unit :: Utility/./UtilityTests/ProcessInstanceInfoMatch.Name (1816 of 2045)
PASS: lldb-unit :: Utility/./UtilityTests/StringExtractorTest.DecodeHexU8_InvalidHex2 (1817 of 2045)
PASS: lldb-api :: commands/command/script_alias/TestCommandScriptAlias.py (1818 of 2045)
PASS: lldb-unit :: Expression/./ExpressionTests/DiagnosticManagerTest.AppendMessageAttachToLastDiag (1819 of 2045)
PASS: lldb-unit :: Utility/./UtilityTests/ArgsTest.GetArgumentArrayRef (1820 of 2045)
PASS: lldb-shell :: Reproducer/TestSynchronous.test (1821 of 2045)
PASS: lldb-unit :: Utility/./UtilityTests/BinaryStreamTest.PutSLEB128Zero (1822 of 2045)
PASS: lldb-unit :: Utility/./UtilityTests/FileSpecTest.FormatFileSpec (1823 of 2045)
UNSUPPORTED: lldb-shell :: SymbolFile/target-symbols-add-unwind.test (1824 of 2045)
PASS: lldb-shell :: SymbolFile/DWARF/DW_AT_loclists_base.s (1825 of 2045)
PASS: lldb-api :: lang/objc/foundation/TestRuntimeTypes.py (1826 of 2045)
PASS: lldb-unit :: Utility/./UtilityTests/ArgsTest.TestQuotedUnknownEscape (1827 of 2045)
PASS: lldb-unit :: Process/minidump/./LLDBMinidumpTests/MinidumpParserTest.FindMemoryRangeWithFullMemoryMinidump (1828 of 2045)
PASS: lldb-api :: tools/lldb-vscode/step/TestVSCode_step.py (1829 of 2045)
PASS: lldb-unit :: ScriptInterpreter/Python/./ScriptInterpreterPythonTests/PythonDataObjectsTest.TestInstanceNameResolutionNoDot (1830 of 2045)
PASS: lldb-unit :: Expression/./ExpressionTests/CppModuleConfigurationTest.IgnoreLibStdCpp (1831 of 2045)
PASS: lldb-unit :: Host/./HostTests/MainLoopTest.ReadObject (1832 of 2045)
PASS: lldb-unit :: Host/./HostTests/NativeProcessProtocolTest.ReadCStringFromMemory (1833 of 2045)
PASS: lldb-api :: lang/objc/foundation/TestObjCMethodsNSArray.py (1834 of 2045)
PASS: lldb-unit :: Process/minidump/./LLDBMinidumpTests/MinidumpParserTest.GetMemoryRegionInfo (1835 of 2045)
PASS: lldb-unit :: Utility/./UtilityTests/StreamTeeTest.DefaultConstructor (1836 of 2045)
PASS: lldb-api :: tools/lldb-vscode/console/TestVSCode_console.py (1837 of 2045)
PASS: lldb-unit :: Process/gdb-remote/./ProcessGdbRemoteTests/GDBRemoteCommunicationClientTest.WriteRegisterNoSuffix (1838 of 2045)
PASS: lldb-unit :: Utility/./UtilityTests/VASprintfTest.BufferResize (1839 of 2045)
PASS: lldb-api :: functionalities/breakpoint/breakpoint_command/TestRegexpBreakCommand.py (1840 of 2045)
PASS: lldb-api :: commands/frame/diagnose/inheritance/TestDiagnoseInheritance.py (1841 of 2045)
PASS: lldb-unit :: Utility/./UtilityTests/BroadcasterTest.EventTypeHasListeners (1842 of 2045)
PASS: lldb-api :: tools/lldb-vscode/variables/TestVSCode_variables.py (1843 of 2045)
PASS: lldb-unit :: Utility/./UtilityTests/StreamTeeTest.CopyConstructor (1844 of 2045)
PASS: lldb-unit :: Utility/./UtilityTests/LogTest.Register (1845 of 2045)
PASS: lldb-shell :: SymbolFile/Breakpad/line-table-missing-file.test (1846 of 2045)
PASS: lldb-api :: functionalities/asan/TestMemoryHistory.py (1847 of 2045)
PASS: lldb-unit :: debugserver/./debugserverTests/RNBSocket.LoopBackListenIPv6 (1848 of 2045)
UNSUPPORTED: lldb-shell :: SymbolFile/PDB/calling-conventions.test (1849 of 2045)
PASS: lldb-unit :: Utility/./UtilityTests/BinaryStreamTest.PutULEB128MaxValue (1850 of 2045)
PASS: lldb-unit :: Process/minidump/./LLDBMinidumpTests/MinidumpParserTest.GetMemoryRegionInfoFromMemory64List (1851 of 2045)
PASS: lldb-unit :: Utility/./UtilityTests/ConstStringTest.YAML (1852 of 2045)
PASS: lldb-api :: commands/watchpoints/multiple_hits/TestMultipleHits.py (1853 of 2045)
PASS: lldb-unit :: Utility/./UtilityTests/StatusTest.ErrorCodeConstructor (1854 of 2045)
UNSUPPORTED: lldb-api :: functionalities/data-formatter/data-formatter-stl/libstdcpp/map/TestDataFormatterStdMap.py (1855 of 2045)
PASS: lldb-api :: lang/cpp/scope/TestCppScope.py (1856 of 2045)
PASS: lldb-api :: lang/c/vla/TestVLA.py (1857 of 2045)
UNSUPPORTED: lldb-api :: tools/lldb-server/libraries-svr4/TestGdbRemoteLibrariesSvr4Support.py (1858 of 2045)
PASS: lldb-unit :: Utility/./UtilityTests/NameMatchesTest.RegularExpression (1859 of 2045)
PASS: lldb-api :: commands/settings/quoting/TestQuoting.py (1860 of 2045)
PASS: lldb-api :: lang/cpp/breakpoint_in_member_func_w_non_primitive_params/TestBreakpointInMemberFuncWNonPrimitiveParams.py (1861 of 2045)
PASS: lldb-api :: commands/expression/result_numbering/TestResultNumbering.py (1862 of 2045)
PASS: lldb-api :: functionalities/float-display/TestFloatDisplay.py (1863 of 2045)
PASS: lldb-api :: lang/c/unions/TestUnionMembers.py (1864 of 2045)
PASS: lldb-unit :: Utility/./UtilityTests/DataExtractorTest.GetCStrUnterminated (1865 of 2045)
PASS: lldb-api :: commands/command/script/import/TestImport.py (1866 of 2045)
PASS: lldb-unit :: UnwindAssembly/x86/./UnwindAssemblyx86Tests/Testx86AssemblyInspectionEngine.TestPushEBP (1867 of 2045)
PASS: lldb-api :: functionalities/rerun/TestRerun.py (1868 of 2045)
PASS: lldb-api :: commands/process/attach-resume/TestAttachResume.py (1869 of 2045)
PASS: lldb-unit :: Symbol/./SymbolTests/TestClangASTImporter.MetadataPropagationAfterCopying (1870 of 2045)
PASS: lldb-shell :: ScriptInterpreter/Python/sb_address_exception.test (1871 of 2045)
PASS: lldb-unit :: Utility/./UtilityTests/DataExtractorTest.UncommonAddressSize (1872 of 2045)
PASS: lldb-unit :: Utility/./UtilityTests/StatusTest.ErrorConversion (1873 of 2045)
PASS: lldb-api :: functionalities/unwind/noreturn/TestNoreturnUnwind.py (1874 of 2045)
PASS: lldb-api :: functionalities/backticks/TestBackticksWithoutATarget.py (1875 of 2045)
PASS: lldb-api :: lang/cpp/lambdas/TestLambdas.py (1876 of 2045)
PASS: lldb-api :: functionalities/thread/concurrent_events/TestConcurrentCrashWithBreak.py (1877 of 2045)
PASS: lldb-unit :: Utility/./UtilityTests/GeneratorTest.GetOrCreate (1878 of 2045)
PASS: lldb-api :: commands/expression/test/TestExprs.py (1879 of 2045)
PASS: lldb-api :: lang/objc/rdar-11355592/TestRdar11355592.py (1880 of 2045)
UNSUPPORTED: lldb-shell :: Register/arm-fp-read.test (1881 of 2045)
PASS: lldb-unit :: Utility/./UtilityTests/StreamTest.PutHex64ByteOrderBig (1882 of 2045)
PASS: lldb-shell :: Reproducer/TestCrash.test (1883 of 2045)
PASS: lldb-api :: lang/c/array_types/TestArrayTypes.py (1884 of 2045)
PASS: lldb-unit :: Utility/./UtilityTests/StringListTest.RemoveBlankLines (1885 of 2045)
PASS: lldb-unit :: Editline/./EditlineTests/EditlineTestFixture.EditlineReceivesMultiLineText (1886 of 2045)
PASS: lldb-api :: python_api/breakpoint/TestBreakpointAPI.py (1887 of 2045)
PASS: lldb-unit :: Expression/./ExpressionTests/DiagnosticManagerTest.AppendMessageNoDiag (1888 of 2045)
PASS: lldb-api :: lang/objc/orderedset/TestOrderedSet.py (1889 of 2045)
PASS: lldb-unit :: Host/./HostTests/SocketTest.DomainGetConnectURI (1890 of 2045)
PASS: lldb-api :: functionalities/gdb_remote_client/TestNestedRegDefinitions.py (1891 of 2045)
PASS: lldb-unit :: Utility/./UtilityTests/SubsystemRAIITest.NormalSubsystem (1892 of 2045)
PASS: lldb-unit :: UnwindAssembly/x86/./UnwindAssemblyx86Tests/Testx86AssemblyInspectionEngine.TestPopEDI (1893 of 2045)
PASS: lldb-unit :: ObjectFile/ELF/./ObjectFileELFTests/ObjectFileELFTest.GetModuleSpecifications_EarlySectionHeaders (1894 of 2045)
PASS: lldb-unit :: Utility/./UtilityTests/PassiveReplayTest.InstrumentedBarRef (1895 of 2045)
PASS: lldb-api :: python_api/watchpoint/condition/TestWatchpointConditionAPI.py (1896 of 2045)
PASS: lldb-api :: functionalities/thread_plan/TestThreadPlanCommands.py (1897 of 2045)
PASS: lldb-unit :: Utility/./UtilityTests/StringListTest.GetMaxStringLengthEmpty (1898 of 2045)
PASS: lldb-api :: functionalities/data-formatter/user-format-vs-summary/TestUserFormatVsSummary.py (1899 of 2045)
PASS: lldb-api :: functionalities/memory-region/TestMemoryRegion.py (1900 of 2045)
PASS: lldb-shell :: Breakpoint/debug_rnglistx_rlex.test (1901 of 2045)
PASS: lldb-api :: tools/lldb-vscode/launch/TestVSCode_launch.py (1902 of 2045)
PASS: lldb-shell :: ObjectFile/Breakpad/breakpad-identification.test (1903 of 2045)
PASS: lldb-shell :: SymbolFile/NativePDB/break-by-function.cpp (1904 of 2045)
PASS: lldb-unit :: Utility/./UtilityTests/FileSpecTest.EqualSeparator (1905 of 2045)
PASS: lldb-unit :: ScriptInterpreter/Python/./ScriptInterpreterPythonTests/PythonDataObjectsTest.TestTypeNameResolutionNoDot (1906 of 2045)
PASS: lldb-api :: functionalities/data-formatter/data-formatter-stl/libcxx/initializerlist/TestInitializerList.py (1907 of 2045)
PASS: lldb-api :: functionalities/show_location/TestShowLocationDwarf5.py (1908 of 2045)
PASS: lldb-unit :: Process/gdb-remote/./ProcessGdbRemoteTests/GDBRemoteCommunicationClientTest.SendGetMetaDataPacket (1909 of 2045)
PASS: lldb-unit :: Utility/./UtilityTests/OptionsWithRawTest.ArgsButNoDelimiter (1910 of 2045)
PASS: lldb-unit :: Utility/./UtilityTests/BinaryStreamTest.PutSLEB128NineBytes (1911 of 2045)
UNSUPPORTED: lldb-shell :: Expr/TestIRMemoryMapWindows.test (1912 of 2045)
PASS: lldb-api :: lang/objc/exceptions/TestObjCExceptions.py (1913 of 2045)
PASS: lldb-unit :: Utility/./UtilityTests/ProcessInfoTest.Constructor (1914 of 2045)
PASS: lldb-unit :: UnwindAssembly/x86/./UnwindAssemblyx86Tests/Testx86AssemblyInspectionEngine.TestLEAVE (1915 of 2045)
PASS: lldb-unit :: Language/Highlighting/./HighlighterTests/HighlighterTest.ClangTrailingBackslashMissingNewLine (1916 of 2045)
UNSUPPORTED: lldb-api :: android/platform/TestDefaultCacheLineSize.py (1917 of 2045)
PASS: lldb-unit :: Utility/./UtilityTests/OptionsWithRawTest.QuotedSuffix (1918 of 2045)
PASS: lldb-api :: tools/lldb-server/commandline/TestStubSetSID.py (1919 of 2045)
PASS: lldb-unit :: UnwindAssembly/x86/./UnwindAssemblyx86Tests/Testx86AssemblyInspectionEngine.TestPopR13 (1920 of 2045)
PASS: lldb-unit :: Utility/./UtilityTests/StringListTest.GetMaxStringLengthEqualSize (1921 of 2045)
PASS: lldb-api :: lang/c/tls_globals/TestTlsGlobals.py (1922 of 2045)
PASS: lldb-api :: lang/cpp/diamond/TestDiamond.py (1923 of 2045)
PASS: lldb-shell :: Reproducer/TestProcessList.test (1924 of 2045)
PASS: lldb-unit :: Utility/./UtilityTests/StringListTest.GetMaxStringLengthIncreasingSize (1925 of 2045)
PASS: lldb-unit :: Target/./TargetTests/ExecutionContextTest.GetByteOrder (1926 of 2045)
PASS: lldb-api :: functionalities/data-formatter/data-formatter-stl/libcxx/list/loop/TestDataFormatterLibcxxListLoop.py (1927 of 2045)
PASS: lldb-api :: lang/cpp/enum_types/TestCPP11EnumTypes.py (1928 of 2045)
PASS: lldb-shell :: Quit/TestQuitExitCode30.test (1929 of 2045)
PASS: lldb-unit :: Expression/./ExpressionTests/CppModuleConfigurationTest.Sysroot (1930 of 2045)
PASS: lldb-unit :: Expression/./ExpressionTests/DWARFExpression.DW_OP_pick (1931 of 2045)
PASS: lldb-api :: macosx/nslog/TestDarwinNSLogOutput.py (1932 of 2045)
PASS: lldb-api :: lang/cpp/gmodules-templates/TestGModules.py (1933 of 2045)
PASS: lldb-shell :: SymbolFile/DWARF/childless-compile-unit.s (1934 of 2045)
PASS: lldb-api :: functionalities/thread/concurrent_events/TestConcurrentManyWatchpoints.py (1935 of 2045)
PASS: lldb-shell :: Expr/TestIRMemoryMap.test (1936 of 2045)
PASS: lldb-api :: functionalities/reproducers/attach/TestReproducerAttach.py (1937 of 2045)
PASS: lldb-unit :: Core/./LLDBCoreTests/RichManglingContextTest.IPDRealloc (1938 of 2045)
PASS: lldb-unit :: Process/minidump/./LLDBMinidumpTests/MinidumpParserTest.GetFilteredModuleList (1939 of 2045)
PASS: lldb-api :: lang/c/shared_lib_stripped_symbols/TestSharedLibStrippedSymbols.py (1940 of 2045)
PASS: lldb-api :: types/TestShortTypeExpr.py (1941 of 2045)
PASS: lldb-api :: functionalities/data-formatter/data-formatter-objc/TestDataFormatterObjCNSDate.py (1942 of 2045)
PASS: lldb-api :: lang/objc/ivar-IMP/TestObjCiVarIMP.py (1943 of 2045)
PASS: lldb-shell :: ObjectFile/PECOFF/basic-info-arm.yaml (1944 of 2045)
PASS: lldb-unit :: SymbolFile/DWARF/./SymbolFileDWARFTests/SymbolFileDWARFTests.TestAbbrevOrder1Start1 (1945 of 2045)
PASS: lldb-unit :: Process/gdb-remote/./ProcessGdbRemoteTests/GDBRemoteCommunicationServerTest.SendErrorResponse_ErrorList (1946 of 2045)
PASS: lldb-api :: lang/objc/forward-decl/TestForwardDecl.py (1947 of 2045)
PASS: lldb-api :: functionalities/thread/concurrent_events/TestConcurrentSignalBreak.py (1948 of 2045)
PASS: lldb-unit :: Utility/./UtilityTests/OptionsWithRawTest.EmptyInput (1949 of 2045)
PASS: lldb-unit :: Symbol/./SymbolTests/DWARFCallFrameInfoTest.Basic_eh (1950 of 2045)
PASS: lldb-api :: functionalities/data-formatter/type_summary_list_arg/TestTypeSummaryListArg.py (1951 of 2045)
PASS: lldb-shell :: BuildScript/script-args.test (1952 of 2045)
UNSUPPORTED: lldb-shell :: SymbolFile/NativePDB/stack_unwinding01.cpp (1953 of 2045)
PASS: lldb-api :: tools/lldb-server/TestGdbRemoteSingleStep.py (1954 of 2045)
PASS: lldb-unit :: Utility/./UtilityTests/UriParserTest.MinimalPort (1955 of 2045)
PASS: lldb-unit :: Process/minidump/./LLDBMinidumpTests/MinidumpParserTest.GetThreadsAndGetThreadContext (1956 of 2045)
UNSUPPORTED: lldb-shell :: SymbolFile/PDB/variables-locations.test (1957 of 2045)
PASS: lldb-unit :: SymbolFile/NativePDB/./SymbolFileNativePDBTests/PDBFPOProgramToDWARFExpressionTests.InvalidAssignmentSingle (1958 of 2045)
PASS: lldb-shell :: Minidump/Windows/Sigsegv/sigsegv.test (1959 of 2045)
PASS: lldb-api :: functionalities/set-data/TestSetData.py (1960 of 2045)
PASS: lldb-api :: functionalities/data-formatter/data-formatter-stl/libcxx/vbool/TestDataFormatterLibcxxVBool.py (1961 of 2045)
PASS: lldb-unit :: Utility/./UtilityTests/TimeoutTest.Construction (1962 of 2045)
PASS: lldb-unit :: SymbolFile/DWARF/./SymbolFileDWARFTests/DWARFASTParserClangTests.EnsureAllDIEsInDeclContextHaveBeenParsedParsesOnlyMatchingEntries (1963 of 2045)
PASS: lldb-api :: lang/c/stepping/TestStepAndBreakpoints.py (1964 of 2045)
PASS: lldb-unit :: Utility/./UtilityTests/StringListTest.GetSize (1965 of 2045)
PASS: lldb-shell :: SymbolFile/DWARF/debug_ranges.s (1966 of 2045)
PASS: lldb-api :: functionalities/data-formatter/setvaluefromcstring/TestSetValueFromCString.py (1967 of 2045)
PASS: lldb-api :: types/TestCharTypeExpr.py (1968 of 2045)
PASS: lldb-unit :: Utility/./UtilityTests/StringListTest.DefaultConstructor (1969 of 2045)
PASS: lldb-shell :: SymbolFile/DWARF/array-sizes.s (1970 of 2045)
PASS: lldb-unit :: Utility/./UtilityTests/ArgsTest.AppendArguments (1971 of 2045)
PASS: lldb-unit :: Utility/./UtilityTests/ArchSpecTest.TestSetTriple (1972 of 2045)
PASS: lldb-shell :: SymbolFile/dissassemble-entry-point.s (1973 of 2045)
PASS: lldb-unit :: Host/./HostTests/File.GetWaitableHandleFileno (1974 of 2045)
PASS: lldb-api :: functionalities/stats_api/TestStatisticsAPI.py (1975 of 2045)
PASS: lldb-api :: functionalities/postmortem/minidump-new/TestMiniDumpUUID.py (1976 of 2045)
PASS: lldb-shell :: Driver/TestFile.test (1977 of 2045)
PASS: lldb-unit :: Utility/./UtilityTests/FileSpecTest.EqualDotsPosix (1978 of 2045)
PASS: lldb-unit :: Utility/./UtilityTests/StreamTeeTest.Flush (1979 of 2045)
PASS: lldb-shell :: SymbolFile/DWARF/inline-function-address.ll (1980 of 2045)
PASS: lldb-shell :: ScriptInterpreter/Lua/persistent_state.test (1981 of 2045)
PASS: lldb-unit :: Utility/./UtilityTests/XcodeSDKTest.GetSDKTypeForTriple (1982 of 2045)
PASS: lldb-unit :: Utility/./UtilityTests/StringListTest.LongestCommonPrefix (1983 of 2045)
PASS: lldb-unit :: Process/minidump/./LLDBMinidumpTests/MinidumpParserTest.InvalidMinidump (1984 of 2045)
PASS: lldb-api :: functionalities/ptr_refs/TestPtrRefs.py (1985 of 2045)
PASS: lldb-api :: functionalities/data-formatter/data-formatter-stl/libcxx/list/TestDataFormatterLibcxxList.py (1986 of 2045)
PASS: lldb-unit :: Utility/./UtilityTests/StreamTest.PutHex64ByteOrderLittle (1987 of 2045)
PASS: lldb-unit :: Expression/./ExpressionTests/ClangExpressionDeclMapTest.TestPersistentDeclLookup (1988 of 2045)
PASS: lldb-api :: functionalities/completion/TestCompletion.py (1989 of 2045)
PASS: lldb-shell :: ScriptInterpreter/Lua/independent_state.test (1990 of 2045)
PASS: lldb-unit :: Utility/./UtilityTests/StringExtractorTest.GetHexBytesAvail_OddPair2 (1991 of 2045)
PASS: lldb-unit :: Expression/./ExpressionTests/DiagnosticManagerTest.FixedExpression (1992 of 2045)
PASS: lldb-unit :: UnwindAssembly/x86/./UnwindAssemblyx86Tests/Testx86AssemblyInspectionEngine.TestStackRealign32BitDisp_x86_64 (1993 of 2045)
PASS: lldb-unit :: Utility/./UtilityTests/TimerTest.CategoryTimesStats (1994 of 2045)
PASS: lldb-unit :: Utility/./UtilityTests/FileSpecTest.PrependPathComponent (1995 of 2045)
PASS: lldb-unit :: Host/./HostTests/FileSystemTest.Readable (1996 of 2045)
PASS: lldb-shell :: ObjectFile/PECOFF/section-types.yaml (1997 of 2045)
PASS: lldb-unit :: Utility/./UtilityTests/ProcessInstanceInfo.DumpTable (1998 of 2045)
UNSUPPORTED: lldb-api :: linux/mix-dwo-and-regular-objects/TestMixedDwarfBinary.py (1999 of 2045)
PASS: lldb-shell :: SymbolFile/NativePDB/globals-fundamental.cpp (2000 of 2045)
PASS: lldb-unit :: Utility/./UtilityTests/ArchSpecTest.TestParseMachCPUDashSubtypeTripleExtra (2001 of 2045)
PASS: lldb-shell :: Reproducer/Modules/TestModuleCXX.test (2002 of 2045)
PASS: lldb-api :: functionalities/thread/concurrent_events/TestConcurrentTwoBreakpointsOneSignal.py (2003 of 2045)
PASS: lldb-unit :: Process/minidump/./LLDBMinidumpTests/MinidumpParserTest.GetPidWow64 (2004 of 2045)
PASS: lldb-api :: functionalities/thread/create_after_attach/TestCreateAfterAttach.py (2005 of 2045)
PASS: lldb-unit :: Host/./HostTests/FileActionTest.Open (2006 of 2045)
PASS: lldb-api :: functionalities/breakpoint/move_nearest/TestMoveNearest.py (2007 of 2045)
PASS: lldb-api :: functionalities/data-formatter/typedef_array/TestTypedefArray.py (2008 of 2045)
PASS: lldb-shell :: ObjectFile/ELF/aarch64-relocations.yaml (2009 of 2045)
PASS: lldb-unit :: Utility/./UtilityTests/SubsystemRAIITest.SubsystemWithErrorSuccess (2010 of 2045)
PASS: lldb-unit :: ScriptInterpreter/Python/./ScriptInterpreterPythonTests/PythonDataObjectsTest.TestPythonDictionaryManipulation (2011 of 2045)
PASS: lldb-api :: commands/expression/import-std-module/weak_ptr/TestWeakPtrFromStdModule.py (2012 of 2045)
PASS: lldb-api :: tools/lldb-vscode/coreFile/TestVSCode_coreFile.py (2013 of 2045)
UNSUPPORTED: lldb-api :: functionalities/darwin_log/filter/exact_match/activity-chain/TestDarwinLogFilterMatchActivityChain.py (2014 of 2045)
PASS: lldb-unit :: Utility/./UtilityTests/ListenerTest.GetEventWait (2015 of 2045)
PASS: lldb-api :: lang/c/bitfields/TestBitfields.py (2016 of 2045)
UNSUPPORTED: lldb-shell :: Register/x86-gp-read.test (2017 of 2045)
PASS: lldb-unit :: Utility/./UtilityTests/AnsiTerminal.Incomplete (2018 of 2045)
PASS: lldb-unit :: Utility/./UtilityTests/StringListTest.ShiftCString (2019 of 2045)
PASS: lldb-api :: lang/objc/objc_direct-methods/TestObjCDirectMethods.py (2020 of 2045)
PASS: lldb-api :: functionalities/optimized_code/TestNoASanExceptionAfterEvalOP_piece.py (2021 of 2045)
PASS: lldb-api :: functionalities/data-formatter/data-formatter-objc/TestDataFormatterObjCKVO.py (2022 of 2045)
PASS: lldb-api :: commands/expression/ir-interpreter/TestIRInterpreter.py (2023 of 2045)
PASS: lldb-api :: functionalities/data-formatter/data-formatter-stl/libcxx/forward_list/TestDataFormatterLibcxxForwardList.py (2024 of 2045)
PASS: lldb-api :: functionalities/non-overlapping-index-variable-i/TestIndexVariable.py (2025 of 2045)
UNSUPPORTED: lldb-api :: lang/objc/bitfield_ivars/TestBitfieldIvars.py (2026 of 2045)
PASS: lldb-api :: lang/cpp/class_static/TestStaticVariables.py (2027 of 2045)
PASS: lldb-api :: commands/expression/ir-interpreter-phi-nodes/TestIRInterpreterPHINodes.py (2028 of 2045)
PASS: lldb-api :: commands/watchpoints/watchpoint_set_command/TestWatchLocationWithWatchSet.py (2029 of 2045)
PASS: lldb-api :: functionalities/thread/concurrent_events/TestConcurrentDelayedCrashWithBreakpointWatchpoint.py (2030 of 2045)
PASS: lldb-api :: lang/objc/objc-class-method/TestObjCClassMethod.py (2031 of 2045)
PASS: lldb-api :: lang/objc/objc-ivar-protocols/TestIvarProtocols.py (2032 of 2045)
PASS: lldb-api :: tools/lldb-vscode/breakpoint/TestVSCode_setBreakpoints.py (2033 of 2045)
PASS: lldb-api :: functionalities/tsan/multiple/TestTsanMultiple.py (2034 of 2045)
PASS: lldb-api :: functionalities/thread/exit_during_expression/TestExitDuringExpression.py (2035 of 2045)
PASS: lldb-api :: lang/objc/foundation/TestConstStrings.py (2036 of 2045)
PASS: lldb-api :: functionalities/data-formatter/synthupdate/TestSyntheticFilterRecompute.py (2037 of 2045)
PASS: lldb-api :: functionalities/data-formatter/data-formatter-stl/libcxx/variant/TestDataFormatterLibcxxVariant.py (2038 of 2045)
PASS: lldb-api :: functionalities/data-formatter/data-formatter-objc/TestDataFormatterObjCNSBundle.py (2039 of 2045)
PASS: lldb-api :: functionalities/data-formatter/data-formatter-proper-plurals/TestFormattersOneIsSingular.py (2040 of 2045)
PASS: lldb-api :: commands/expression/two-files/TestObjCTypeQueryFromOtherCompileUnit.py (2041 of 2045)
PASS: lldb-api :: functionalities/load_unload/TestLoadUnload.py (2042 of 2045)
PASS: lldb-api :: tools/lldb-server/TestAppleSimulatorOSType.py (2043 of 2045)
PASS: lldb-api :: lang/objc/foundation/TestObjCMethods.py (2044 of 2045)
PASS: lldb-api :: lang/objc/foundation/TestFoundationDisassembly.py (2045 of 2045)
Slowest Tests:
--------------------------------------------------------------------------
134.65s: lldb-api :: lang/objc/foundation/TestFoundationDisassembly.py
97.23s: lldb-api :: tools/lldb-server/TestLldbGdbServer.py
87.24s: lldb-api :: lang/objc/hidden-ivars/TestHiddenIvars.py
86.60s: lldb-api :: lang/cpp/enum_types/TestCPP11EnumTypes.py
74.61s: lldb-api :: lang/objc/exceptions/TestObjCExceptions.py
73.27s: lldb-api :: api/multithreaded/TestMultithreaded.py
64.96s: lldb-api :: lang/objc/foundation/TestObjCMethods.py
64.38s: lldb-api :: lang/objc/objc-new-syntax/TestObjCNewSyntaxLiteral.py
57.86s: lldb-api :: lang/cpp/namespace/TestNamespaceLookup.py
54.81s: lldb-api :: lang/objc/objc-new-syntax/TestObjCNewSyntaxDictionary.py
54.37s: lldb-api :: types/TestLongTypesExpr.py
53.73s: lldb-api :: lang/objc/real-definition/TestRealDefinition.py
50.05s: lldb-api :: lang/objc/objc-new-syntax/TestObjCNewSyntaxArray.py
46.28s: lldb-api :: lang/objc/foundation/TestObjCMethodsNSError.py
43.72s: lldb-api :: lang/objc/foundation/TestObjCMethodsString.py
39.87s: lldb-api :: types/TestLongTypes.py
37.82s: lldb-api :: functionalities/recursion/TestValueObjectRecursion.py
34.41s: lldb-api :: types/TestIntegerTypeExpr.py
34.29s: lldb-api :: tools/lldb-server/TestGdbRemoteThreadsInStopReply.py
32.35s: lldb-api :: python_api/lldbutil/iter/TestLLDBIterator.py

Hide Details

Tests Times: -------------------------------------------------------------------------- [ Range ] :: [ Percentage ] :: [ Count ] -------------------------------------------------------------------------- [130s,140s) :: [ ] :: [ 1/2045] [120s,130s) :: [ ] :: [ 0/2045] [110s,120s) :: [ ] :: [ 0/2045] [100s,110s) :: [ ] :: [ 1/2045] [ 90s,100s) :: [ ] :: [ 2/2045] [ 80s, 90s) :: [ ] :: [ 0/2045] [ 70s, 80s) :: [ ] :: [ 2/2045] [ 60s, 70s) :: [ ] :: [ 3/2045] [ 50s, 60s) :: [ ] :: [ 4/2045] [ 40s, 50s) :: [ ] :: [ 3/2045] [ 30s, 40s) :: [ ] :: [ 9/2045] [ 20s, 30s) :: [ ] :: [ 48/2045] [ 10s, 20s) :: [** ] :: [ 148/2045] [ 0s, 10s) :: [*********************************** ] :: [1824/2045] -------------------------------------------------------------------------- ******************** Failing Tests (1): lldb-api :: tools/lldb-server/register-reading/TestGdbRemoteGPacket.py

Hide Details

Hide Details

Testing Time: 349.48s Unsupported Tests : 132 Expected Passes : 1906 Expected Failures : 6 Unexpected Failures: 1 FAILED: tools/lldb/test/CMakeFiles/check-lldb-lit cd /Users/buildslave/jenkins/workspace/lldb-cmake/lldb-build/tools/lldb/test && /usr/local/Frameworks/Python.framework/Versions/3.7/bin/python3.7 /Users/buildslave/jenkins/workspace/lldb-cmake/lldb-build/./bin/llvm-lit -v --time-tests --shuffle --xunit-xml-output=/Users/buildslave/jenkins/workspace/lldb-cmake/test/results.xml -v /Users/buildslave/jenkins/workspace/lldb-cmake/lldb-build/tools/lldb/test ninja: build stopped: subcommand failed. Command failed: Command '['/usr/bin/env', 'TERM=vt100', '/usr/local/bin/ninja', '-v', 'check-lldb']' returned non-zero exit status 1. Command: ['/usr/bin/env', 'TERM=vt100', '/usr/local/bin/ninja', '-v', 'check-lldb'] [Pipeline] } [Pipeline] // timeout [Pipeline] } [Pipeline] // stage [Pipeline] stage [Pipeline] { (Trigger Downstream Jobs) Stage "Trigger Downstream Jobs" skipped due to earlier failure(s) [Pipeline] } [Pipeline] // stage [Pipeline] stage [Pipeline] { (Declarative: Post Actions) [Pipeline] scanForIssues [Clang (LLVM based)] Sleeping for 5 seconds due to JENKINS-32191... [Clang (LLVM based)] Parsing console log (workspace: '/Users/buildslave/jenkins/workspace/lldb-cmake') [Clang (LLVM based)] Successfully parsed console log [Clang (LLVM based)] -> found 6 issues (skipped 26 duplicates) [Clang (LLVM based)] Post processing issues on 'green-dragon-24' with source code encoding 'UTF-8' [Clang (LLVM based)] Creating SCM blamer to obtain author and commit information for affected files [Clang (LLVM based)] Creating SCM miner to obtain statistics for affected repository files [Clang (LLVM based)] Resolving file names for all issues in source directory '/Users/buildslave/jenkins/workspace/lldb-cmake' [Clang (LLVM based)] -> resolved paths in source directory (6 found, 0 not found) [Clang (LLVM based)] Resolving module names from module definitions (build.xml, pom.xml, or Manifest.mf files) [Clang (LLVM based)] -> resolved module names for 6 issues [Clang (LLVM based)] Resolving package names (or namespaces) by parsing the affected files [Clang (LLVM based)] -> resolved package names of 6 affected files [Clang (LLVM based)] No filter has been set, publishing all 6 issues [Clang (LLVM based)] Creating fingerprints for all affected code blocks to track issues over different builds [Clang (LLVM based)] -> created fingerprints for 6 issues (skipped 0 issues) [Clang (LLVM based)] Copying affected files to Jenkins' build folder '/Users/Shared/Jenkins/Home/jobs/lldb-cmake/builds/20382/files-with-issues' [Clang (LLVM based)] -> 4 copied, 2 not in workspace, 0 not-found, 0 with I/O error [Pipeline] junit Recording test results [Pipeline] emailext Not sending mail to unregistered user Matthew.Arsenault@amd.com because your SCM claimed this was associated with a user ID ‘Matthew.Arsenault' which your security realm does not recognize; you may need changes in your SCM plugin Not sending mail to unregistered user n.james93@hotmail.co.uk because your SCM claimed this was associated with a user ID ‘n.james93' which your security realm does not recognize; you may need changes in your SCM plugin Not sending mail to unregistered user llvm-dev@redking.me.uk because your SCM claimed this was associated with a user ID ‘llvm-dev' which your security realm does not recognize; you may need changes in your SCM plugin Not sending mail to unregistered user Matthew.Arsenault@amd.com because your SCM claimed this was associated with a user ID ‘Matthew.Arsenault' which your security realm does not recognize; you may need changes in your SCM plugin Not sending mail to unregistered user n.james93@hotmail.co.uk because your SCM claimed this was associated with a user ID ‘n.james93' which your security realm does not recognize; you may need changes in your SCM plugin Not sending mail to unregistered user llvm-dev@redking.me.uk because your SCM claimed this was associated with a user ID ‘llvm-dev' which your security realm does not recognize; you may need changes in your SCM plugin org.codehaus.groovy.control.MultipleCompilationErrorsException: startup failed: Script1.groovy: 6: unexpected token: < @ line 6, column 30. def build_czar = Bruno Lopes<blopes@apple.com>"; ^

Hide Details

1 error

Hide Details

at org.codehaus.groovy.control.ErrorCollector.failIfErrors(ErrorCollector.java:310) at org.codehaus.groovy.control.ErrorCollector.addFatalError(ErrorCollector.java:150) at org.codehaus.groovy.control.ErrorCollector.addError(ErrorCollector.java:120) at org.codehaus.groovy.control.ErrorCollector.addError(ErrorCollector.java:132) at org.codehaus.groovy.control.SourceUnit.addError(SourceUnit.java:350) at org.codehaus.groovy.antlr.AntlrParserPlugin.transformCSTIntoAST(AntlrParserPlugin.java:144) at org.codehaus.groovy.antlr.AntlrParserPlugin.parseCST(AntlrParserPlugin.java:110) at org.codehaus.groovy.control.SourceUnit.parse(SourceUnit.java:234) at org.codehaus.groovy.control.CompilationUnit$1.call(CompilationUnit.java:168) at org.codehaus.groovy.control.CompilationUnit.applyToSourceUnits(CompilationUnit.java:943) at org.codehaus.groovy.control.CompilationUnit.doPhaseOperation(CompilationUnit.java:605) at org.codehaus.groovy.control.CompilationUnit.processPhaseOperations(CompilationUnit.java:581) at org.codehaus.groovy.control.CompilationUnit.compile(CompilationUnit.java:558) at groovy.lang.GroovyClassLoader.doParseClass(GroovyClassLoader.java:298) at groovy.lang.GroovyClassLoader.parseClass(GroovyClassLoader.java:268) at groovy.lang.GroovyShell.parseClass(GroovyShell.java:688) at groovy.lang.GroovyShell.parse(GroovyShell.java:700) at groovy.lang.GroovyShell.parse(GroovyShell.java:736) at groovy.lang.GroovyShell.parse(GroovyShell.java:727) at hudson.plugins.emailext.ExtendedEmailPublisher.executeScript(ExtendedEmailPublisher.java:623) at hudson.plugins.emailext.ExtendedEmailPublisher.executePresendScript(ExtendedEmailPublisher.java:573) at hudson.plugins.emailext.ExtendedEmailPublisher.sendMail(ExtendedEmailPublisher.java:456) at hudson.plugins.emailext.EmailExtStep$EmailExtStepExecution.run(EmailExtStep.java:236) at hudson.plugins.emailext.EmailExtStep$EmailExtStepExecution.run(EmailExtStep.java:174) at org.jenkinsci.plugins.workflow.steps.AbstractSynchronousNonBlockingStepExecution$1$1.call(AbstractSynchronousNonBlockingStepExecution.java:47) at hudson.security.ACL.impersonate(ACL.java:290) at org.jenkinsci.plugins.workflow.steps.AbstractSynchronousNonBlockingStepExecution$1.run(AbstractSynchronousNonBlockingStepExecution.java:44) at java.util.concurrent.Executors$RunnableAdapter.call(Executors.java:511) at java.util.concurrent.FutureTask.run(FutureTask.java:266) at java.util.concurrent.ThreadPoolExecutor.runWorker(ThreadPoolExecutor.java:1149) at java.util.concurrent.ThreadPoolExecutor$Worker.run(ThreadPoolExecutor.java:624) at java.lang.Thread.run(Thread.java:748)

Hide Details

Sending email to: mschifer@apple.com ldionne@apple.com dave@dave
[Pipeline] } [Pipeline] // stage [Pipeline] } [Pipeline] // withEnv [Pipeline] } [Pipeline] // node [Pipeline] End of Pipeline ERROR: script returned exit code 1 Finished: FAILURE