FailedConsole Output

Skipping 65,964 KB.. Full Log
        Summary: Foundation`_NS_os_log_callback

Hide Details

Hide Details

runCmd: disassemble --force -n "_NS_os_log_callback" output: Foundation`_NS_os_log_callback: 0x7fff3a5d2ee1 <+0>: pushq %rbp 0x7fff3a5d2ee2 <+1>: movq %rsp, %rbp 0x7fff3a5d2ee5 <+4>: pushq %r15 0x7fff3a5d2ee7 <+6>: pushq %r14 0x7fff3a5d2ee9 <+8>: pushq %r13 0x7fff3a5d2eeb <+10>: pushq %r12 0x7fff3a5d2eed <+12>: pushq %rbx 0x7fff3a5d2eee <+13>: subq $0x78, %rsp 0x7fff3a5d2ef2 <+17>: movq 0x5570f72f(%rip), %rax ; (void *)0x00007fff98662d40: __stack_chk_guard 0x7fff3a5d2ef9 <+24>: movq (%rax), %rax 0x7fff3a5d2efc <+27>: movq %rax, -0x30(%rbp) 0x7fff3a5d2f00 <+31>: testq %rdi, %rdi 0x7fff3a5d2f03 <+34>: je 0x7fff2f840fd5 ; <+244> 0x7fff3a5d2f09 <+40>: movq %rcx, %r13 0x7fff3a5d2f0c <+43>: movq %rdx, %r12 0x7fff3a5d2f0f <+46>: movq %rsi, %r15 0x7fff3a5d2f12 <+49>: movq %rdi, %rbx 0x7fff3a5d2f15 <+52>: callq 0x7fff2fb279fc ; symbol stub for: objc_autoreleasePoolPush 0x7fff3a5d2f1a <+57>: movq %rax, -0x68(%rbp) 0x7fff3a5d2f1e <+61>: movq 0x557ebc9b(%rip), %rsi ; "isProxy" 0x7fff3a5d2f25 <+68>: movq %rbx, %rdi 0x7fff3a5d2f28 <+71>: callq *0x5570fd0a(%rip) ; (void *)0x00007fff70e59e40: objc_msgSend 0x7fff3a5d2f2e <+77>: testb %al, %al 0x7fff3a5d2f30 <+79>: jne 0x7fff2f840f3e ; <+93> 0x7fff3a5d2f32 <+81>: movq %rbx, %rdi 0x7fff3a5d2f35 <+84>: callq 0x7fff2fb27b22 ; symbol stub for: object_isClass 0x7fff3a5d2f3a <+89>: testb %al, %al 0x7fff3a5d2f3c <+91>: je 0x7fff2f840f51 ; <+112> 0x7fff3a5d2f3e <+93>: movq 0x557e72c3(%rip), %rsi ; "description" 0x7fff3a5d2f45 <+100>: movq %rbx, %rdi 0x7fff3a5d2f48 <+103>: callq *0x5570fcea(%rip) ; (void *)0x00007fff70e59e40: objc_msgSend 0x7fff3a5d2f4e <+109>: movq %rax, %rbx 0x7fff3a5d2f51 <+112>: movq %rbx, %rdi 0x7fff3a5d2f54 <+115>: callq 0x7fff2fb27150 ; symbol stub for: _NSIsNSObject 0x7fff3a5d2f59 <+120>: testb %al, %al 0x7fff3a5d2f5b <+122>: je 0x7fff2f840fcc ; <+235> 0x7fff3a5d2f5d <+124>: testq %r13, %r13 0x7fff3a5d2f60 <+127>: je 0x7fff2f840f69 ; <+136> 0x7fff3a5d2f62 <+129>: cmpb $0x0, (%r13) 0x7fff3a5d2f67 <+134>: je 0x7fff2f840fe5 ; <+260> 0x7fff3a5d2f69 <+136>: movq %rbx, %rdi 0x7fff3a5d2f6c <+139>: callq 0x7fff2fb2714a ; symbol stub for: _NSIsNSNumber 0x7fff3a5d2f71 <+144>: testb %al, %al 0x7fff3a5d2f73 <+146>: je 0x7fff2f840f7a ; <+153> 0x7fff3a5d2f75 <+148>: movb $0x0, (%r13) 0x7fff3a5d2f7a <+153>: movq %rbx, %rdi 0x7fff3a5d2f7d <+156>: callq 0x7fff2fb27132 ; symbol stub for: _NSIsNSCFConstantString 0x7fff3a5d2f82 <+161>: testb %al, %al 0x7fff3a5d2f84 <+163>: je 0x7fff2f840f8b ; <+170> 0x7fff3a5d2f86 <+165>: movb $0x0, (%r13) 0x7fff3a5d2f8b <+170>: movq 0x557e7166(%rip), %rsi ; "class" 0x7fff3a5d2f92 <+177>: movq %rbx, %rdi 0x7fff3a5d2f95 <+180>: callq *0x5570fc9d(%rip) ; (void *)0x00007fff70e59e40: objc_msgSend 0x7fff3a5d2f9b <+186>: movq 0x557ebc26(%rip), %r14 ; "redactedDescription" 0x7fff3a5d2fa2 <+193>: movq %rax, %rdi 0x7fff3a5d2fa5 <+196>: movq %r14, %rsi 0x7fff3a5d2fa8 <+199>: callq 0x7fff2fb2746e ; symbol stub for: class_respondsToSelector 0x7fff3a5d2fad <+204>: testb %al, %al 0x7fff3a5d2faf <+206>: je 0x7fff2f840fdc ; <+251> 0x7fff3a5d2fb1 <+208>: movq %rbx, %rdi 0x7fff3a5d2fb4 <+211>: movq %r14, %rsi 0x7fff3a5d2fb7 <+214>: callq *0x5570fc7b(%rip) ; (void *)0x00007fff70e59e40: objc_msgSend 0x7fff3a5d2fbd <+220>: movq %rax, %r14 0x7fff3a5d2fc0 <+223>: testq %r13, %r13 0x7fff3a5d2fc3 <+226>: je 0x7fff2f840ff8 ; <+279> 0x7fff3a5d2fc5 <+228>: movb $0x0, (%r13) 0x7fff3a5d2fca <+233>: jmp 0x7fff2f840ff8 ; <+279> 0x7fff3a5d2fcc <+235>: movq -0x68(%rbp), %rdi 0x7fff3a5d2fd0 <+239>: callq 0x7fff2fb279f6 ; symbol stub for: objc_autoreleasePoolPop 0x7fff3a5d2fd5 <+244>: xorl %ebx, %ebx 0x7fff3a5d2fd7 <+246>: jmp 0x7fff2f841258 ; <+887> 0x7fff3a5d2fdc <+251>: leaq 0x55720f35(%rip), %r14 ; @"" 0x7fff3a5d2fe3 <+258>: jmp 0x7fff2f840ff8 ; <+279> 0x7fff3a5d2fe5 <+260>: movq 0x557e721c(%rip), %rsi ; "description" 0x7fff3a5d2fec <+267>: movq %rbx, %rdi 0x7fff3a5d2fef <+270>: callq *0x5570fc43(%rip) ; (void *)0x00007fff70e59e40: objc_msgSend 0x7fff3a5d2ff5 <+276>: movq %rax, %r14 0x7fff3a5d2ff8 <+279>: movq 0x557e74a9(%rip), %rsi ; "length" 0x7fff3a5d2fff <+286>: movq %r14, %rdi 0x7fff3a5d3002 <+289>: callq *0x5570fc30(%rip) ; (void *)0x00007fff70e59e40: objc_msgSend 0x7fff3a5d3008 <+295>: testq %rax, %rax 0x7fff3a5d300b <+298>: je 0x7fff2f8410cb ; <+490> 0x7fff3a5d3011 <+304>: cmpq $0x2, %r12 0x7fff3a5d3015 <+308>: jb 0x7fff2f84124d ; <+876> 0x7fff3a5d301b <+314>: xorl %ecx, %ecx 0x7fff3a5d301d <+316>: movq %rcx, -0x58(%rbp) 0x7fff3a5d3021 <+320>: movq %rax, -0x50(%rbp) 0x7fff3a5d3025 <+324>: leaq -0x1(%r12), %r13 0x7fff3a5d302a <+329>: leaq -0x60(%rbp), %r8 0x7fff3a5d302e <+333>: movq %rcx, (%r8) 0x7fff3a5d3031 <+336>: movq 0x557e76b0(%rip), %rsi ; "getBytes:maxLength:usedLength:encoding:options:range:remainingRange:" 0x7fff3a5d3038 <+343>: movq -0x58(%rbp), %rax 0x7fff3a5d303c <+347>: movq -0x50(%rbp), %rdx 0x7fff3a5d3040 <+351>: movq %rdx, 0x10(%rsp) 0x7fff3a5d3045 <+356>: movq %rax, 0x8(%rsp) 0x7fff3a5d304a <+361>: movq %rcx, 0x18(%rsp) 0x7fff3a5d304f <+366>: movq $0x2, (%rsp) 0x7fff3a5d3057 <+374>: movl $0x4, %r9d 0x7fff3a5d305d <+380>: movq %r14, %rdi 0x7fff3a5d3060 <+383>: movq %r15, %rdx 0x7fff3a5d3063 <+386>: movq %r13, %rcx 0x7fff3a5d3066 <+389>: callq *0x5570fbcc(%rip) ; (void *)0x00007fff70e59e40: objc_msgSend 0x7fff3a5d306c <+395>: testb %al, %al 0x7fff3a5d306e <+397>: jne 0x7fff2f8410bb ; <+474> 0x7fff3a5d3070 <+399>: movq -0x58(%rbp), %rax 0x7fff3a5d3074 <+403>: movq -0x50(%rbp), %rcx 0x7fff3a5d3078 <+407>: movq %rcx, 0x10(%rsp) 0x7fff3a5d307d <+412>: movq %rax, 0x8(%rsp) 0x7fff3a5d3082 <+417>: movq $0x0, 0x18(%rsp) 0x7fff3a5d308b <+426>: movq $0x2, (%rsp) 0x7fff3a5d3093 <+434>: leaq -0x60(%rbp), %r8 0x7fff3a5d3097 <+438>: movl $0x7, %r9d 0x7fff3a5d309d <+444>: movq %r14, %rdi 0x7fff3a5d30a0 <+447>: movq 0x557e7641(%rip), %rsi ; "getBytes:maxLength:usedLength:encoding:options:range:remainingRange:" 0x7fff3a5d30a7 <+454>: movq %r15, %rdx 0x7fff3a5d30aa <+457>: movq %r13, %rcx 0x7fff3a5d30ad <+460>: callq *0x5570fb85(%rip) ; (void *)0x00007fff70e59e40: objc_msgSend 0x7fff3a5d30b3 <+466>: testb %al, %al 0x7fff3a5d30b5 <+468>: je 0x7fff2f84124d ; <+876> 0x7fff3a5d30bb <+474>: movq -0x60(%rbp), %rax 0x7fff3a5d30bf <+478>: movb $0x0, (%r15,%rax) 0x7fff3a5d30c4 <+483>: movb $0x1, %bl 0x7fff3a5d30c6 <+485>: jmp 0x7fff2f84124f ; <+878> 0x7fff3a5d30cb <+490>: movb $0x1, %bl 0x7fff3a5d30cd <+492>: testq %r15, %r15 0x7fff3a5d30d0 <+495>: je 0x7fff2f84124f ; <+878> 0x7fff3a5d30d6 <+501>: testq %r12, %r12 0x7fff3a5d30d9 <+504>: je 0x7fff2f84124f ; <+878> 0x7fff3a5d30df <+510>: movb $0x0, (%r15) 0x7fff3a5d30e3 <+514>: jmp 0x7fff2f84124f ; <+878> 0x7fff3a5d30e8 <+519>: jmp 0x7fff2f8410ea ; <+521> 0x7fff3a5d30ea <+521>: movq %rdx, %r14 0x7fff3a5d30ed <+524>: movq %rax, %rdi 0x7fff3a5d30f0 <+527>: callq 0x7fff2fb27a02 ; symbol stub for: objc_begin_catch 0x7fff3a5d30f5 <+532>: cmpl $0x2, %r14d 0x7fff3a5d30f9 <+536>: jne 0x7fff2f841248 ; <+871> 0x7fff3a5d30ff <+542>: movq %rax, %r13 0x7fff3a5d3102 <+545>: movq 0x557f23e7(%rip), %rax ; (void *)0x00007fff8fdd6e08: NSString 0x7fff3a5d3109 <+552>: movq %rax, -0x80(%rbp) 0x7fff3a5d310d <+556>: movq 0x557e6fe4(%rip), %rsi ; "class" 0x7fff3a5d3114 <+563>: movq %rbx, %rdi 0x7fff3a5d3117 <+566>: callq *0x5570fb1b(%rip) ; (void *)0x00007fff70e59e40: objc_msgSend 0x7fff3a5d311d <+572>: movq %rax, -0x78(%rbp) 0x7fff3a5d3121 <+576>: movq 0x557e81e0(%rip), %rsi ; "name" 0x7fff3a5d3128 <+583>: movq %r13, %rdi 0x7fff3a5d312b <+586>: callq *0x5570fb07(%rip) ; (void *)0x00007fff70e59e40: objc_msgSend 0x7fff3a5d3131 <+592>: movq %rax, -0x70(%rbp) 0x7fff3a5d3135 <+596>: movq 0x557e865c(%rip), %rsi ; "reason" 0x7fff3a5d313c <+603>: movq %r13, %rdi 0x7fff3a5d313f <+606>: callq *0x5570faf3(%rip) ; (void *)0x00007fff70e59e40: objc_msgSend 0x7fff3a5d3145 <+612>: movq %rax, %r14 0x7fff3a5d3148 <+615>: movq 0x557e95b9(%rip), %rsi ; "callStackSymbols" 0x7fff3a5d314f <+622>: movq %r13, %rdi 0x7fff3a5d3152 <+625>: callq *0x5570fae0(%rip) ; (void *)0x00007fff70e59e40: objc_msgSend 0x7fff3a5d3158 <+631>: movq 0x557e6fa1(%rip), %rsi ; "stringWithFormat:" 0x7fff3a5d315f <+638>: movq %rax, 0x8(%rsp) 0x7fff3a5d3164 <+643>: movq %r14, (%rsp) 0x7fff3a5d3168 <+647>: leaq 0x55731689(%rip), %rdx ; @"-[%@:%p description] raised exception: name:%@ reason:%@ backtrace:%@" 0x7fff3a5d316f <+654>: movq -0x80(%rbp), %rdi 0x7fff3a5d3173 <+658>: movq -0x78(%rbp), %rcx 0x7fff3a5d3177 <+662>: movq %rbx, %r8 0x7fff3a5d317a <+665>: movq -0x70(%rbp), %r9 0x7fff3a5d317e <+669>: xorl %eax, %eax 0x7fff3a5d3180 <+671>: callq *0x5570fab2(%rip) ; (void *)0x00007fff70e59e40: objc_msgSend 0x7fff3a5d3186 <+677>: movq %rax, %rbx 0x7fff3a5d3189 <+680>: testq %rax, %rax 0x7fff3a5d318c <+683>: je 0x7fff2f84128b ; <+938> 0x7fff3a5d3192 <+689>: movq 0x557e730f(%rip), %rsi ; "length" 0x7fff3a5d3199 <+696>: movq %rbx, %rdi 0x7fff3a5d319c <+699>: callq *0x5570fa96(%rip) ; (void *)0x00007fff70e59e40: objc_msgSend 0x7fff3a5d31a2 <+705>: xorl %ecx, %ecx 0x7fff3a5d31a4 <+707>: movq %rcx, -0x40(%rbp) 0x7fff3a5d31a8 <+711>: movq %rax, -0x38(%rbp) 0x7fff3a5d31ac <+715>: decq %r12 0x7fff3a5d31af <+718>: leaq -0x48(%rbp), %r8 0x7fff3a5d31b3 <+722>: movq %rcx, (%r8) 0x7fff3a5d31b6 <+725>: movq 0x557e752b(%rip), %r14 ; "getBytes:maxLength:usedLength:encoding:options:range:remainingRange:" 0x7fff3a5d31bd <+732>: movq -0x40(%rbp), %rax 0x7fff3a5d31c1 <+736>: movq -0x38(%rbp), %rdx 0x7fff3a5d31c5 <+740>: movq %rdx, 0x10(%rsp) 0x7fff3a5d31ca <+745>: movq %rax, 0x8(%rsp) 0x7fff3a5d31cf <+750>: movq %rcx, 0x18(%rsp) 0x7fff3a5d31d4 <+755>: movq $0x2, (%rsp) 0x7fff3a5d31dc <+763>: movl $0x4, %r9d 0x7fff3a5d31e2 <+769>: movq %rbx, %rdi 0x7fff3a5d31e5 <+772>: movq %r14, %rsi 0x7fff3a5d31e8 <+775>: movq %r15, %rdx 0x7fff3a5d31eb <+778>: movq %r12, %rcx 0x7fff3a5d31ee <+781>: callq *0x5570fa44(%rip) ; (void *)0x00007fff70e59e40: objc_msgSend 0x7fff3a5d31f4 <+787>: testb %al, %al 0x7fff3a5d31f6 <+789>: jne 0x7fff2f84123b ; <+858> 0x7fff3a5d31f8 <+791>: movq -0x40(%rbp), %rax 0x7fff3a5d31fc <+795>: movq -0x38(%rbp), %rcx 0x7fff3a5d3200 <+799>: movq %rcx, 0x10(%rsp) 0x7fff3a5d3205 <+804>: movq %rax, 0x8(%rsp) 0x7fff3a5d320a <+809>: movq $0x0, 0x18(%rsp) 0x7fff3a5d3213 <+818>: movq $0x2, (%rsp) 0x7fff3a5d321b <+826>: leaq -0x48(%rbp), %r8 0x7fff3a5d321f <+830>: movl $0x7, %r9d 0x7fff3a5d3225 <+836>: movq %rbx, %rdi 0x7fff3a5d3228 <+839>: movq %r14, %rsi 0x7fff3a5d322b <+842>: movq %r15, %rdx 0x7fff3a5d322e <+845>: movq %r12, %rcx 0x7fff3a5d3231 <+848>: callq *0x5570fa01(%rip) ; (void *)0x00007fff70e59e40: objc_msgSend 0x7fff3a5d3237 <+854>: testb %al, %al 0x7fff3a5d3239 <+856>: je 0x7fff2f84128b ; <+938> 0x7fff3a5d323b <+858>: movq -0x48(%rbp), %rax 0x7fff3a5d323f <+862>: movb $0x0, (%r15,%rax) 0x7fff3a5d3244 <+867>: movb $0x1, %bl 0x7fff3a5d3246 <+869>: jmp 0x7fff2f84128d ; <+940> 0x7fff3a5d3248 <+871>: callq 0x7fff2fb27a38 ; symbol stub for: objc_end_catch 0x7fff3a5d324d <+876>: xorl %ebx, %ebx 0x7fff3a5d324f <+878>: movq -0x68(%rbp), %rdi 0x7fff3a5d3253 <+882>: callq 0x7fff2fb279f6 ; symbol stub for: objc_autoreleasePoolPop 0x7fff3a5d3258 <+887>: movq 0x5570f3c9(%rip), %rax ; (void *)0x00007fff98662d40: __stack_chk_guard 0x7fff3a5d325f <+894>: movq (%rax), %rax 0x7fff3a5d3262 <+897>: cmpq -0x30(%rbp), %rax 0x7fff3a5d3266 <+901>: jne 0x7fff2f841279 ; <+920> 0x7fff3a5d3268 <+903>: movl %ebx, %eax 0x7fff3a5d326a <+905>: addq $0x78, %rsp 0x7fff3a5d326e <+909>: popq %rbx 0x7fff3a5d326f <+910>: popq %r12 0x7fff3a5d3271 <+912>: popq %r13 0x7fff3a5d3273 <+914>: popq %r14 0x7fff3a5d3275 <+916>: popq %r15 0x7fff3a5d3277 <+918>: popq %rbp 0x7fff3a5d3278 <+919>: retq 0x7fff3a5d3279 <+920>: callq 0x7fff2fb2724c ; symbol stub for: __stack_chk_fail 0x7fff3a5d327e <+925>: movq %rax, %rdi 0x7fff3a5d3281 <+928>: callq 0x7fff2fb27a02 ; symbol stub for: objc_begin_catch 0x7fff3a5d3286 <+933>: callq 0x7fff2fb27a38 ; symbol stub for: objc_end_catch 0x7fff3a5d328b <+938>: xorl %ebx, %ebx 0x7fff3a5d328d <+940>: callq 0x7fff2fb27a38 ; symbol stub for: objc_end_catch 0x7fff3a5d3292 <+945>: jmp 0x7fff2f84124f ; <+878> 0x7fff3a5d3294 <+947>: movq %rax, %rbx 0x7fff3a5d3297 <+950>: callq 0x7fff2fb27a38 ; symbol stub for: objc_end_catch 0x7fff3a5d329c <+955>: movq %rbx, %rdi 0x7fff3a5d329f <+958>: callq 0x7fff2fb27180 ; symbol stub for: _Unwind_Resume 0x7fff3a5d32a4 <+963>: ud2

Hide Details

Hide Details

runCmd: image lookup -s "_NXAccessFile" output: 1 symbols match '_NXAccessFile' in /System/Library/Frameworks/Foundation.framework/Versions/C/Foundation: Address: Foundation[0x00007fff2fab4ae8] (Foundation.__TEXT.__text + 2702456) Summary: Foundation`_NXAccessFile

Hide Details

Hide Details

runCmd: disassemble --force -n "_NXAccessFile" output: Foundation`_NXAccessFile: 0x7fff3a846ae8 <+0>: pushq %rbp 0x7fff3a846ae9 <+1>: movq %rsp, %rbp 0x7fff3a846aec <+4>: pushq %r15 0x7fff3a846aee <+6>: pushq %r14 0x7fff3a846af0 <+8>: pushq %rbx 0x7fff3a846af1 <+9>: pushq %rax 0x7fff3a846af2 <+10>: movq %rsi, %rbx 0x7fff3a846af5 <+13>: movq %rdi, %r14 0x7fff3a846af8 <+16>: movq 0x5557ebb9(%rip), %rdi ; (void *)0x00007fff8fdd51c0: NSFileManager 0x7fff3a846aff <+23>: movq 0x5557436a(%rip), %rsi ; "defaultManager" 0x7fff3a846b06 <+30>: callq *0x5549c12c(%rip) ; (void *)0x00007fff70e59e40: objc_msgSend 0x7fff3a846b0c <+36>: movq %rax, %r15 0x7fff3a846b0f <+39>: testq %rbx, %rbx 0x7fff3a846b12 <+42>: je 0x7fff2fab4b5c ; <+116> 0x7fff3a846b14 <+44>: movb $0x1, %al 0x7fff3a846b16 <+46>: testb $0x4, %bl 0x7fff3a846b19 <+49>: je 0x7fff2fab4b2e ; <+70> 0x7fff3a846b1b <+51>: movq 0x5557b926(%rip), %rsi ; "isReadableFileAtPath:" 0x7fff3a846b22 <+58>: movq %r15, %rdi 0x7fff3a846b25 <+61>: movq %r14, %rdx 0x7fff3a846b28 <+64>: callq *0x5549c10a(%rip) ; (void *)0x00007fff70e59e40: objc_msgSend 0x7fff3a846b2e <+70>: testb $0x2, %bl 0x7fff3a846b31 <+73>: je 0x7fff2fab4b4a ; <+98> 0x7fff3a846b33 <+75>: testb %al, %al 0x7fff3a846b35 <+77>: je 0x7fff2fab4b4a ; <+98> 0x7fff3a846b37 <+79>: movq 0x55575ee2(%rip), %rsi ; "isWritableFileAtPath:" 0x7fff3a846b3e <+86>: movq %r15, %rdi 0x7fff3a846b41 <+89>: movq %r14, %rdx 0x7fff3a846b44 <+92>: callq *0x5549c0ee(%rip) ; (void *)0x00007fff70e59e40: objc_msgSend 0x7fff3a846b4a <+98>: testb $0x1, %bl 0x7fff3a846b4d <+101>: je 0x7fff2fab4b72 ; <+138> 0x7fff3a846b4f <+103>: testb %al, %al 0x7fff3a846b51 <+105>: je 0x7fff2fab4b72 ; <+138> 0x7fff3a846b53 <+107>: leaq 0x55579abe(%rip), %rax ; "isExecutableFileAtPath:" 0x7fff3a846b5a <+114>: jmp 0x7fff2fab4b63 ; <+123> 0x7fff3a846b5c <+116>: leaq 0x55575ec5(%rip), %rax ; "fileExistsAtPath:" 0x7fff3a846b63 <+123>: movq (%rax), %rsi 0x7fff3a846b66 <+126>: movq %r15, %rdi 0x7fff3a846b69 <+129>: movq %r14, %rdx 0x7fff3a846b6c <+132>: callq *0x5549c0c6(%rip) ; (void *)0x00007fff70e59e40: objc_msgSend 0x7fff3a846b72 <+138>: cmpb $0x1, %al 0x7fff3a846b74 <+140>: sbbq %rax, %rax 0x7fff3a846b77 <+143>: addq $0x8, %rsp 0x7fff3a846b7b <+147>: popq %rbx 0x7fff3a846b7c <+148>: popq %r14 0x7fff3a846b7e <+150>: popq %r15 0x7fff3a846b80 <+152>: popq %rbp 0x7fff3a846b81 <+153>: retq

Hide Details

Hide Details

runCmd: image lookup -s "_NXCurrentWorkingDir" output: 1 symbols match '_NXCurrentWorkingDir' in /System/Library/Frameworks/Foundation.framework/Versions/C/Foundation: Address: Foundation[0x00007fff2fab4a68] (Foundation.__TEXT.__text + 2702328) Summary: Foundation`_NXCurrentWorkingDir

Hide Details

Hide Details

runCmd: disassemble --force -n "_NXCurrentWorkingDir" output: Foundation`_NXCurrentWorkingDir: 0x7fff3a846a68 <+0>: pushq %rbp 0x7fff3a846a69 <+1>: movq %rsp, %rbp 0x7fff3a846a6c <+4>: pushq %rbx 0x7fff3a846a6d <+5>: pushq %rax 0x7fff3a846a6e <+6>: movq 0x5557ec43(%rip), %rdi ; (void *)0x00007fff8fdd51c0: NSFileManager 0x7fff3a846a75 <+13>: movq 0x555743f4(%rip), %rsi ; "defaultManager" 0x7fff3a846a7c <+20>: movq 0x5549c1b5(%rip), %rbx ; (void *)0x00007fff70e59e40: objc_msgSend 0x7fff3a846a83 <+27>: callq *%rbx 0x7fff3a846a85 <+29>: movq 0x55575f8c(%rip), %rsi ; "currentDirectoryPath" 0x7fff3a846a8c <+36>: movq %rax, %rdi 0x7fff3a846a8f <+39>: movq %rbx, %rax 0x7fff3a846a92 <+42>: addq $0x8, %rsp 0x7fff3a846a96 <+46>: popq %rbx 0x7fff3a846a97 <+47>: popq %rbp 0x7fff3a846a98 <+48>: jmpq *%rax

Hide Details

Hide Details

runCmd: image lookup -s "_NXMakeDirs" output: 1 symbols match '_NXMakeDirs' in /System/Library/Frameworks/Foundation.framework/Versions/C/Foundation: Address: Foundation[0x00007fff2fab553e] (Foundation.__TEXT.__text + 2705102) Summary: Foundation`_NXMakeDirs

Hide Details

Hide Details

runCmd: disassemble --force -n "_NXMakeDirs" output: Foundation`_NXMakeDirs: 0x7fff3a84753e <+0>: pushq %rbp 0x7fff3a84753f <+1>: movq %rsp, %rbp 0x7fff3a847542 <+4>: pushq %r15 0x7fff3a847544 <+6>: pushq %r14 0x7fff3a847546 <+8>: pushq %r13 0x7fff3a847548 <+10>: pushq %r12 0x7fff3a84754a <+12>: pushq %rbx 0x7fff3a84754b <+13>: pushq %rax 0x7fff3a84754c <+14>: movq %rsi, %r15 0x7fff3a84754f <+17>: movq %rdi, %rbx 0x7fff3a847552 <+20>: movq 0x55572c77(%rip), %rsi ; "isEqualToString:" 0x7fff3a847559 <+27>: leaq 0x554ac9b8(%rip), %rdx ; @"" 0x7fff3a847560 <+34>: callq *0x5549b6d2(%rip) ; (void *)0x00007fff70e59e40: objc_msgSend 0x7fff3a847566 <+40>: testb %al, %al 0x7fff3a847568 <+42>: jne 0x7fff2fab5599 ; <+91> 0x7fff3a84756a <+44>: movq 0x5557e147(%rip), %rdi ; (void *)0x00007fff8fdd51c0: NSFileManager 0x7fff3a847571 <+51>: movq 0x555738f8(%rip), %r14 ; "defaultManager" 0x7fff3a847578 <+58>: movq 0x5549b6b9(%rip), %r13 ; (void *)0x00007fff70e59e40: objc_msgSend 0x7fff3a84757f <+65>: movq %r14, %rsi 0x7fff3a847582 <+68>: callq *%r13 0x7fff3a847585 <+71>: movq 0x5557549c(%rip), %rsi ; "fileExistsAtPath:" 0x7fff3a84758c <+78>: movq %rax, %rdi 0x7fff3a84758f <+81>: movq %rbx, %rdx 0x7fff3a847592 <+84>: callq *%r13 0x7fff3a847595 <+87>: testb %al, %al 0x7fff3a847597 <+89>: je 0x7fff2fab55aa ; <+108> 0x7fff3a847599 <+91>: xorl %eax, %eax 0x7fff3a84759b <+93>: addq $0x8, %rsp 0x7fff3a84759f <+97>: popq %rbx 0x7fff3a8475a0 <+98>: popq %r12 0x7fff3a8475a2 <+100>: popq %r13 0x7fff3a8475a4 <+102>: popq %r14 0x7fff3a8475a6 <+104>: popq %r15 0x7fff3a8475a8 <+106>: popq %rbp 0x7fff3a8475a9 <+107>: retq 0x7fff3a8475aa <+108>: movq 0x5557394f(%rip), %rsi ; "stringByDeletingLastPathComponent" 0x7fff3a8475b1 <+115>: movq %rbx, %rdi 0x7fff3a8475b4 <+118>: callq *0x5549b67e(%rip) ; (void *)0x00007fff70e59e40: objc_msgSend 0x7fff3a8475ba <+124>: movq %rax, %rdi 0x7fff3a8475bd <+127>: movq %r15, %rsi 0x7fff3a8475c0 <+130>: callq 0x7fff2fab553e ; <+0> 0x7fff3a8475c5 <+135>: movq %rax, %rcx 0x7fff3a8475c8 <+138>: movq $-0x1, %rax 0x7fff3a8475cf <+145>: testq %rcx, %rcx 0x7fff3a8475d2 <+148>: jne 0x7fff2fab559b ; <+93> 0x7fff3a8475d4 <+150>: movq 0x5557df35(%rip), %rdi ; (void *)0x00007fff8fdd5f08: NSNumber 0x7fff3a8475db <+157>: callq 0x7fff2fb279de ; symbol stub for: objc_allocWithZone 0x7fff3a8475e0 <+162>: movq 0x55574be9(%rip), %rsi ; "initWithInt:" 0x7fff3a8475e7 <+169>: movq %rax, %rdi 0x7fff3a8475ea <+172>: movl %r15d, %edx 0x7fff3a8475ed <+175>: callq *%r13 0x7fff3a8475f0 <+178>: movq %rax, %r15 0x7fff3a8475f3 <+181>: movq 0x5557df8e(%rip), %rdi ; (void *)0x00007fff8f85f288: NSDictionary 0x7fff3a8475fa <+188>: callq 0x7fff2fb279de ; symbol stub for: objc_allocWithZone 0x7fff3a8475ff <+193>: leaq 0x5549faba(%rip), %rcx ; NSFilePosixPermissions 0x7fff3a847606 <+200>: movq (%rcx), %rcx 0x7fff3a847609 <+203>: movq 0x55574fc8(%rip), %rsi ; "initWithObjectsAndKeys:" 0x7fff3a847610 <+210>: movq %rax, %rdi 0x7fff3a847613 <+213>: movq %r15, %rdx 0x7fff3a847616 <+216>: xorl %r8d, %r8d 0x7fff3a847619 <+219>: xorl %eax, %eax 0x7fff3a84761b <+221>: callq *%r13 0x7fff3a84761e <+224>: movq %rax, %r12 0x7fff3a847621 <+227>: movq 0x5557e090(%rip), %rdi ; (void *)0x00007fff8fdd51c0: NSFileManager 0x7fff3a847628 <+234>: movq %r14, %rsi 0x7fff3a84762b <+237>: callq *%r13 0x7fff3a84762e <+240>: movq 0x5557b043(%rip), %rsi ; "createDirectoryAtPath:attributes:" 0x7fff3a847635 <+247>: movq %rax, %rdi 0x7fff3a847638 <+250>: movq %rbx, %rdx 0x7fff3a84763b <+253>: movq %r12, %rcx 0x7fff3a84763e <+256>: callq *%r13 0x7fff3a847641 <+259>: movl %eax, %ebx 0x7fff3a847643 <+261>: movq 0x5549b5f6(%rip), %r14 ; (void *)0x00007fff70e5bca0: objc_release 0x7fff3a84764a <+268>: movq %r12, %rdi 0x7fff3a84764d <+271>: callq *%r14 0x7fff3a847650 <+274>: movq %r15, %rdi 0x7fff3a847653 <+277>: callq *%r14 0x7fff3a847656 <+280>: cmpb $0x1, %bl 0x7fff3a847659 <+283>: sbbq %rax, %rax 0x7fff3a84765c <+286>: jmp 0x7fff2fab559b ; <+93>

Hide Details

Hide Details

runCmd: image lookup -s "_NXRenameFile" output: 1 symbols match '_NXRenameFile' in /System/Library/Frameworks/Foundation.framework/Versions/C/Foundation: Address: Foundation[0x00007fff2fab4a9a] (Foundation.__TEXT.__text + 2702378) Summary: Foundation`_NXRenameFile

Hide Details

Hide Details

runCmd: disassemble --force -n "_NXRenameFile" output: Foundation`_NXRenameFile: 0x7fff3a846a9a <+0>: pushq %rbp 0x7fff3a846a9b <+1>: movq %rsp, %rbp 0x7fff3a846a9e <+4>: pushq %r15 0x7fff3a846aa0 <+6>: pushq %r14 0x7fff3a846aa2 <+8>: pushq %rbx 0x7fff3a846aa3 <+9>: pushq %rax 0x7fff3a846aa4 <+10>: movq %rsi, %r14 0x7fff3a846aa7 <+13>: movq %rdi, %rbx 0x7fff3a846aaa <+16>: movq 0x5557ec07(%rip), %rdi ; (void *)0x00007fff8fdd51c0: NSFileManager 0x7fff3a846ab1 <+23>: movq 0x555743b8(%rip), %rsi ; "defaultManager" 0x7fff3a846ab8 <+30>: movq 0x5549c179(%rip), %r15 ; (void *)0x00007fff70e59e40: objc_msgSend 0x7fff3a846abf <+37>: callq *%r15 0x7fff3a846ac2 <+40>: movq 0x5557bb47(%rip), %rsi ; "moveItemAtPath:toPath:error:" 0x7fff3a846ac9 <+47>: movq %rax, %rdi 0x7fff3a846acc <+50>: movq %rbx, %rdx 0x7fff3a846acf <+53>: movq %r14, %rcx 0x7fff3a846ad2 <+56>: xorl %r8d, %r8d 0x7fff3a846ad5 <+59>: callq *%r15 0x7fff3a846ad8 <+62>: cmpb $0x1, %al 0x7fff3a846ada <+64>: sbbq %rax, %rax 0x7fff3a846add <+67>: addq $0x8, %rsp 0x7fff3a846ae1 <+71>: popq %rbx 0x7fff3a846ae2 <+72>: popq %r14 0x7fff3a846ae4 <+74>: popq %r15 0x7fff3a846ae6 <+76>: popq %rbp 0x7fff3a846ae7 <+77>: retq

Hide Details

Hide Details

runCmd: image lookup -s "_NXStatFile" output: 1 symbols match '_NXStatFile' in /System/Library/Frameworks/Foundation.framework/Versions/C/Foundation: Address: Foundation[0x00007fff2f96782c] (Foundation.__TEXT.__text + 1337788) Summary: Foundation`_NXStatFile

Hide Details

Hide Details

runCmd: disassemble --force -n "_NXStatFile" output: Foundation`_NXStatFile: 0x7fff3a6f982c <+0>: pushq %rbp 0x7fff3a6f982d <+1>: movq %rsp, %rbp 0x7fff3a6f9830 <+4>: pushq %r15 0x7fff3a6f9832 <+6>: pushq %r14 0x7fff3a6f9834 <+8>: pushq %rbx 0x7fff3a6f9835 <+9>: pushq %rax 0x7fff3a6f9836 <+10>: movq %rsi, %r14 0x7fff3a6f9839 <+13>: movq %rdi, %rbx 0x7fff3a6f983c <+16>: movq 0x556cbe75(%rip), %rdi ; (void *)0x00007fff8fdd51c0: NSFileManager 0x7fff3a6f9843 <+23>: movq 0x556c1626(%rip), %rsi ; "defaultManager" 0x7fff3a6f984a <+30>: movq 0x555e93e7(%rip), %r15 ; (void *)0x00007fff70e59e40: objc_msgSend 0x7fff3a6f9851 <+37>: callq *%r15 0x7fff3a6f9854 <+40>: movq 0x556c31ed(%rip), %rsi ; "fileSystemRepresentationWithPath:" 0x7fff3a6f985b <+47>: movq %rax, %rdi 0x7fff3a6f985e <+50>: movq %rbx, %rdx 0x7fff3a6f9861 <+53>: callq *%r15 0x7fff3a6f9864 <+56>: movq %rax, %rdi 0x7fff3a6f9867 <+59>: movq %r14, %rsi 0x7fff3a6f986a <+62>: callq 0x7fff2fb27e58 ; symbol stub for: stat$INODE64 0x7fff3a6f986f <+67>: cltq 0x7fff3a6f9871 <+69>: addq $0x8, %rsp 0x7fff3a6f9875 <+73>: popq %rbx 0x7fff3a6f9876 <+74>: popq %r14 0x7fff3a6f9878 <+76>: popq %r15 0x7fff3a6f987a <+78>: popq %rbp 0x7fff3a6f987b <+79>: retq

Hide Details

Hide Details

runCmd: image lookup -s "__NSCoderInvalidState" output: 1 symbols match '__NSCoderInvalidState' in /System/Library/Frameworks/Foundation.framework/Versions/C/Foundation: Address: Foundation[0x00007fff2f9a0f57] (Foundation.__TEXT.__text + 1573095) Summary: Foundation`__NSCoderInvalidState

Hide Details

Hide Details

runCmd: disassemble --force -n "__NSCoderInvalidState" output: Foundation`__NSCoderInvalidState: 0x7fff3a732f57 <+0>: pushq %rbp 0x7fff3a732f58 <+1>: movq %rsp, %rbp 0x7fff3a732f5b <+4>: pushq %r14 0x7fff3a732f5d <+6>: pushq %rbx 0x7fff3a732f5e <+7>: subq $0xd0, %rsp 0x7fff3a732f65 <+14>: movq %rdi, %rbx 0x7fff3a732f68 <+17>: testb %al, %al 0x7fff3a732f6a <+19>: je 0x7fff2f9a0f8f ; <+56> 0x7fff3a732f6c <+21>: movaps %xmm0, -0x90(%rbp) 0x7fff3a732f73 <+28>: movaps %xmm1, -0x80(%rbp) 0x7fff3a732f77 <+32>: movaps %xmm2, -0x70(%rbp) 0x7fff3a732f7b <+36>: movaps %xmm3, -0x60(%rbp) 0x7fff3a732f7f <+40>: movaps %xmm4, -0x50(%rbp) 0x7fff3a732f83 <+44>: movaps %xmm5, -0x40(%rbp) 0x7fff3a732f87 <+48>: movaps %xmm6, -0x30(%rbp) 0x7fff3a732f8b <+52>: movaps %xmm7, -0x20(%rbp) 0x7fff3a732f8f <+56>: movq %rsi, -0xb8(%rbp) 0x7fff3a732f96 <+63>: movq %rdx, -0xb0(%rbp) 0x7fff3a732f9d <+70>: movq %rcx, -0xa8(%rbp) 0x7fff3a732fa4 <+77>: movq %r8, -0xa0(%rbp) 0x7fff3a732fab <+84>: movq %r9, -0x98(%rbp) 0x7fff3a732fb2 <+91>: testq %rbx, %rbx 0x7fff3a732fb5 <+94>: jne 0x7fff2f9a0fc0 ; <+105> 0x7fff3a732fb7 <+96>: leaq 0x555c0f5a(%rip), %rcx ; @"" 0x7fff3a732fbe <+103>: jmp 0x7fff2f9a1014 ; <+189> 0x7fff3a732fc0 <+105>: leaq -0xc0(%rbp), %rax 0x7fff3a732fc7 <+112>: leaq -0xe0(%rbp), %r14 0x7fff3a732fce <+119>: movq %rax, 0x10(%r14) 0x7fff3a732fd2 <+123>: leaq 0x10(%rbp), %rax 0x7fff3a732fd6 <+127>: movq %rax, 0x8(%r14) 0x7fff3a732fda <+131>: movabsq $0x3000000008, %rax ; imm = 0x3000000008 0x7fff3a732fe4 <+141>: movq %rax, (%r14) 0x7fff3a732fe7 <+144>: movq 0x55692502(%rip), %rdi ; (void *)0x00007fff8fdd6e08: NSString 0x7fff3a732fee <+151>: callq 0x7fff2fb279d8 ; symbol stub for: objc_alloc 0x7fff3a732ff3 <+156>: movq 0x55688756(%rip), %rsi ; "initWithFormat:arguments:" 0x7fff3a732ffa <+163>: movq %rax, %rdi 0x7fff3a732ffd <+166>: movq %rbx, %rdx 0x7fff3a733000 <+169>: movq %r14, %rcx 0x7fff3a733003 <+172>: callq *0x555afc2f(%rip) ; (void *)0x00007fff70e59e40: objc_msgSend 0x7fff3a733009 <+178>: movq %rax, %rdi 0x7fff3a73300c <+181>: callq 0x7fff2fb279f0 ; symbol stub for: objc_autorelease 0x7fff3a733011 <+186>: movq %rax, %rcx 0x7fff3a733014 <+189>: movq 0x55692575(%rip), %rdi ; (void *)0x00007fff8f85f2d8: NSException 0x7fff3a73301b <+196>: movq 0x555af146(%rip), %rax ; (void *)0x00007fff8f7634e8: NSInternalInconsistencyException 0x7fff3a733022 <+203>: movq (%rax), %rdx 0x7fff3a733025 <+206>: movq 0x556873a4(%rip), %rsi ; "exceptionWithName:reason:userInfo:" 0x7fff3a73302c <+213>: xorl %r8d, %r8d 0x7fff3a73302f <+216>: callq *0x555afc03(%rip) ; (void *)0x00007fff70e59e40: objc_msgSend 0x7fff3a733035 <+222>: movq %rax, %rdi 0x7fff3a733038 <+225>: callq 0x7fff2fb27a4a ; symbol stub for: objc_exception_throw

Hide Details

Hide Details

runCmd: image lookup -s "__NSDescribeDelayedPerformCallout" output: 1 symbols match '__NSDescribeDelayedPerformCallout' in /System/Library/Frameworks/Foundation.framework/Versions/C/Foundation: Address: Foundation[0x00007fff2fa2409a] (Foundation.__TEXT.__text + 2109994) Summary: Foundation`__NSDescribeDelayedPerformCallout

Hide Details

Hide Details

runCmd: disassemble --force -n "__NSDescribeDelayedPerformCallout" output: Foundation`__NSDescribeDelayedPerformCallout: 0x7fff3a7b609a <+0>: pushq %rbp 0x7fff3a7b609b <+1>: movq %rsp, %rbp 0x7fff3a7b609e <+4>: pushq %r15 0x7fff3a7b60a0 <+6>: pushq %r14 0x7fff3a7b60a2 <+8>: pushq %r13 0x7fff3a7b60a4 <+10>: pushq %r12 0x7fff3a7b60a6 <+12>: pushq %rbx 0x7fff3a7b60a7 <+13>: subq $0x48, %rsp 0x7fff3a7b60ab <+17>: movq %r9, %r12 0x7fff3a7b60ae <+20>: movq %r8, %r13 0x7fff3a7b60b1 <+23>: movq %rcx, -0x60(%rbp) 0x7fff3a7b60b5 <+27>: movq %rdx, -0x58(%rbp) 0x7fff3a7b60b9 <+31>: movq %rsi, %rbx 0x7fff3a7b60bc <+34>: movq 0x5552c565(%rip), %rax ; (void *)0x00007fff98662d40: __stack_chk_guard 0x7fff3a7b60c3 <+41>: movq (%rax), %rax 0x7fff3a7b60c6 <+44>: movq %rax, -0x30(%rbp) 0x7fff3a7b60ca <+48>: movq (%rsi), %rdi 0x7fff3a7b60cd <+51>: callq 0x7fff2fb27b0a ; symbol stub for: object_getClassName 0x7fff3a7b60d2 <+56>: movq %rax, %r14 0x7fff3a7b60d5 <+59>: movq 0x8(%rbx), %rdi 0x7fff3a7b60d9 <+63>: callq 0x7fff2fb27e04 ; symbol stub for: sel_getName 0x7fff3a7b60de <+68>: movq %rax, %r15 0x7fff3a7b60e1 <+71>: cmpq $0x0, 0x10(%rbp) 0x7fff3a7b60e6 <+76>: je 0x7fff2fa240fb ; <+97> 0x7fff3a7b60e8 <+78>: movq (%rbx), %rdi 0x7fff3a7b60eb <+81>: movq 0x8(%rbx), %rsi 0x7fff3a7b60ef <+85>: callq 0x7fff2fb27b1c ; symbol stub for: object_getMethodImplementation 0x7fff3a7b60f4 <+90>: movq 0x10(%rbp), %rcx 0x7fff3a7b60f8 <+94>: movq %rax, (%rcx) 0x7fff3a7b60fb <+97>: testq %r14, %r14 0x7fff3a7b60fe <+100>: leaq 0x12c403(%rip), %r9 ; "<unknown name>" 0x7fff3a7b6105 <+107>: cmovneq %r14, %r9 0x7fff3a7b6109 <+111>: testq %r15, %r15 0x7fff3a7b610c <+114>: leaq 0x12f398(%rip), %rax ; "<unknown selector>" 0x7fff3a7b6113 <+121>: cmovneq %r15, %rax 0x7fff3a7b6117 <+125>: movq %rax, (%rsp) 0x7fff3a7b611b <+129>: leaq 0x12f371(%rip), %r8 ; "(Delayed Perform) %s %s" 0x7fff3a7b6122 <+136>: movq %r13, %rdi 0x7fff3a7b6125 <+139>: movq %r12, %rsi 0x7fff3a7b6128 <+142>: movl $0x0, %edx 0x7fff3a7b612d <+147>: movq $-0x1, %rcx 0x7fff3a7b6134 <+154>: xorl %eax, %eax 0x7fff3a7b6136 <+156>: callq 0x7fff2fb27246 ; symbol stub for: __snprintf_chk 0x7fff3a7b613b <+161>: movq (%rbx), %rdi 0x7fff3a7b613e <+164>: callq 0x7fff2fb27b04 ; symbol stub for: object_getClass 0x7fff3a7b6143 <+169>: leaq -0x50(%rbp), %rsi 0x7fff3a7b6147 <+173>: movq %rax, %rdi 0x7fff3a7b614a <+176>: callq 0x7fff2fb2763c ; symbol stub for: dladdr 0x7fff3a7b614f <+181>: testl %eax, %eax 0x7fff3a7b6151 <+183>: je 0x7fff2fa24187 ; <+237> 0x7fff3a7b6153 <+185>: movq -0x50(%rbp), %rax 0x7fff3a7b6157 <+189>: testq %rax, %rax 0x7fff3a7b615a <+192>: leaq 0x12c3b6(%rip), %r9 ; "<unknown library>" 0x7fff3a7b6161 <+199>: cmovneq %rax, %r9 0x7fff3a7b6165 <+203>: leaq 0x121b27(%rip), %r8 ; "%s" 0x7fff3a7b616c <+210>: movq -0x58(%rbp), %rdi 0x7fff3a7b6170 <+214>: movq -0x60(%rbp), %rsi 0x7fff3a7b6174 <+218>: movl $0x0, %edx 0x7fff3a7b6179 <+223>: movq $-0x1, %rcx 0x7fff3a7b6180 <+230>: xorl %eax, %eax 0x7fff3a7b6182 <+232>: callq 0x7fff2fb27246 ; symbol stub for: __snprintf_chk 0x7fff3a7b6187 <+237>: movq 0x5552c49a(%rip), %rax ; (void *)0x00007fff98662d40: __stack_chk_guard 0x7fff3a7b618e <+244>: movq (%rax), %rax 0x7fff3a7b6191 <+247>: cmpq -0x30(%rbp), %rax 0x7fff3a7b6195 <+251>: jne 0x7fff2fa241a6 ; <+268> 0x7fff3a7b6197 <+253>: addq $0x48, %rsp 0x7fff3a7b619b <+257>: popq %rbx 0x7fff3a7b619c <+258>: popq %r12 0x7fff3a7b619e <+260>: popq %r13 0x7fff3a7b61a0 <+262>: popq %r14 0x7fff3a7b61a2 <+264>: popq %r15 0x7fff3a7b61a4 <+266>: popq %rbp 0x7fff3a7b61a5 <+267>: retq 0x7fff3a7b61a6 <+268>: callq 0x7fff2fb2724c ; symbol stub for: __stack_chk_fail

Hide Details

Hide Details

runCmd: image lookup -s "__NSDescribeNSMachPortCallout" output: 1 symbols match '__NSDescribeNSMachPortCallout' in /System/Library/Frameworks/Foundation.framework/Versions/C/Foundation: Address: Foundation[0x00007fff2fa0d99d] (Foundation.__TEXT.__text + 2018093) Summary: Foundation`__NSDescribeNSMachPortCallout

Hide Details

Hide Details

runCmd: disassemble --force -n "__NSDescribeNSMachPortCallout" output: Foundation`__NSDescribeNSMachPortCallout: 0x7fff3a79f99d <+0>: pushq %rbp 0x7fff3a79f99e <+1>: movq %rsp, %rbp 0x7fff3a79f9a1 <+4>: pushq %r15 0x7fff3a79f9a3 <+6>: pushq %r14 0x7fff3a79f9a5 <+8>: pushq %r13 0x7fff3a79f9a7 <+10>: pushq %r12 0x7fff3a79f9a9 <+12>: pushq %rbx 0x7fff3a79f9aa <+13>: subq $0x38, %rsp 0x7fff3a79f9ae <+17>: movq %r9, %r12 0x7fff3a79f9b1 <+20>: movq %r8, %r13 0x7fff3a79f9b4 <+23>: movq %rcx, -0x58(%rbp) 0x7fff3a79f9b8 <+27>: movq %rdx, %r15 0x7fff3a79f9bb <+30>: movq %rsi, %rbx 0x7fff3a79f9be <+33>: movq 0x55542c63(%rip), %rax ; (void *)0x00007fff98662d40: __stack_chk_guard 0x7fff3a79f9c5 <+40>: movq (%rax), %rax 0x7fff3a79f9c8 <+43>: movq %rax, -0x30(%rbp) 0x7fff3a79f9cc <+47>: movq 0x8(%rsi), %rdi 0x7fff3a79f9d0 <+51>: callq 0x7fff2fb27b0a ; symbol stub for: object_getClassName 0x7fff3a79f9d5 <+56>: movq %rax, %r14 0x7fff3a79f9d8 <+59>: movq 0x8(%rbx), %rdi 0x7fff3a79f9dc <+63>: callq 0x7fff2fb27b04 ; symbol stub for: object_getClass 0x7fff3a79f9e1 <+68>: movq %rax, %rbx 0x7fff3a79f9e4 <+71>: testq %r14, %r14 0x7fff3a79f9e7 <+74>: leaq 0x142b1a(%rip), %r9 ; "<unknown name>" 0x7fff3a79f9ee <+81>: cmovneq %r14, %r9 0x7fff3a79f9f2 <+85>: leaq 0x142aff(%rip), %r8 ; "(NSMachPort) %s" 0x7fff3a79f9f9 <+92>: movq %r13, %rdi 0x7fff3a79f9fc <+95>: movq %r12, %rsi 0x7fff3a79f9ff <+98>: movl $0x0, %edx 0x7fff3a79fa04 <+103>: movq $-0x1, %rcx 0x7fff3a79fa0b <+110>: xorl %eax, %eax 0x7fff3a79fa0d <+112>: callq 0x7fff2fb27246 ; symbol stub for: __snprintf_chk 0x7fff3a79fa12 <+117>: leaq -0x50(%rbp), %rsi 0x7fff3a79fa16 <+121>: movq %rbx, %rdi 0x7fff3a79fa19 <+124>: callq 0x7fff2fb2763c ; symbol stub for: dladdr 0x7fff3a79fa1e <+129>: testl %eax, %eax 0x7fff3a79fa20 <+131>: je 0x7fff2fa0da55 ; <+184> 0x7fff3a79fa22 <+133>: movq -0x50(%rbp), %rax 0x7fff3a79fa26 <+137>: testq %rax, %rax 0x7fff3a79fa29 <+140>: leaq 0x142ae7(%rip), %r9 ; "<unknown library>" 0x7fff3a79fa30 <+147>: cmovneq %rax, %r9 0x7fff3a79fa34 <+151>: leaq 0x138258(%rip), %r8 ; "%s" 0x7fff3a79fa3b <+158>: movq %r15, %rdi 0x7fff3a79fa3e <+161>: movq -0x58(%rbp), %rsi 0x7fff3a79fa42 <+165>: movl $0x0, %edx 0x7fff3a79fa47 <+170>: movq $-0x1, %rcx 0x7fff3a79fa4e <+177>: xorl %eax, %eax 0x7fff3a79fa50 <+179>: callq 0x7fff2fb27246 ; symbol stub for: __snprintf_chk 0x7fff3a79fa55 <+184>: movq 0x55542bcc(%rip), %rax ; (void *)0x00007fff98662d40: __stack_chk_guard 0x7fff3a79fa5c <+191>: movq (%rax), %rax 0x7fff3a79fa5f <+194>: cmpq -0x30(%rbp), %rax 0x7fff3a79fa63 <+198>: jne 0x7fff2fa0da74 ; <+215> 0x7fff3a79fa65 <+200>: addq $0x38, %rsp 0x7fff3a79fa69 <+204>: popq %rbx 0x7fff3a79fa6a <+205>: popq %r12 0x7fff3a79fa6c <+207>: popq %r13 0x7fff3a79fa6e <+209>: popq %r14 0x7fff3a79fa70 <+211>: popq %r15 0x7fff3a79fa72 <+213>: popq %rbp 0x7fff3a79fa73 <+214>: retq 0x7fff3a79fa74 <+215>: callq 0x7fff2fb2724c ; symbol stub for: __stack_chk_fail

Hide Details

Hide Details

runCmd: image lookup -s "__NSDescribeTimerCallout" output: 1 symbols match '__NSDescribeTimerCallout' in /System/Library/Frameworks/Foundation.framework/Versions/C/Foundation: Address: Foundation[0x00007fff2fa5ef92] (Foundation.__TEXT.__text + 2351394) Summary: Foundation`__NSDescribeTimerCallout

Hide Details

Hide Details

runCmd: disassemble --force -n "__NSDescribeTimerCallout" output: Foundation`__NSDescribeTimerCallout: 0x7fff3a7f0f92 <+0>: pushq %rbp 0x7fff3a7f0f93 <+1>: movq %rsp, %rbp 0x7fff3a7f0f96 <+4>: pushq %r15 0x7fff3a7f0f98 <+6>: pushq %r14 0x7fff3a7f0f9a <+8>: pushq %r13 0x7fff3a7f0f9c <+10>: pushq %r12 0x7fff3a7f0f9e <+12>: pushq %rbx 0x7fff3a7f0f9f <+13>: subq $0x48, %rsp 0x7fff3a7f0fa3 <+17>: movq 0x554f167e(%rip), %rax ; (void *)0x00007fff98662d40: __stack_chk_guard 0x7fff3a7f0faa <+24>: movq (%rax), %rax 0x7fff3a7f0fad <+27>: movq %rax, -0x30(%rbp) 0x7fff3a7f0fb1 <+31>: testq %rsi, %rsi 0x7fff3a7f0fb4 <+34>: je 0x7fff2fa5f084 ; <+242> 0x7fff3a7f0fba <+40>: movq %r9, %r12 0x7fff3a7f0fbd <+43>: movq %r8, %r13 0x7fff3a7f0fc0 <+46>: movq %rsi, %rbx 0x7fff3a7f0fc3 <+49>: movq %rdx, -0x58(%rbp) 0x7fff3a7f0fc7 <+53>: movq %rcx, -0x60(%rbp) 0x7fff3a7f0fcb <+57>: movq 0x8(%rsi), %rdi 0x7fff3a7f0fcf <+61>: callq 0x7fff2fb27b0a ; symbol stub for: object_getClassName 0x7fff3a7f0fd4 <+66>: movq %rax, %r14 0x7fff3a7f0fd7 <+69>: movq 0x10(%rbx), %rdi 0x7fff3a7f0fdb <+73>: callq 0x7fff2fb27e04 ; symbol stub for: sel_getName 0x7fff3a7f0fe0 <+78>: movq %rax, %r15 0x7fff3a7f0fe3 <+81>: movq 0x8(%rbx), %rdi 0x7fff3a7f0fe7 <+85>: movq 0x10(%rbx), %rsi 0x7fff3a7f0feb <+89>: callq 0x7fff2fb27b1c ; symbol stub for: object_getMethodImplementation 0x7fff3a7f0ff0 <+94>: movq 0x10(%rbp), %rcx 0x7fff3a7f0ff4 <+98>: movq %rax, (%rcx) 0x7fff3a7f0ff7 <+101>: testq %r14, %r14 0x7fff3a7f0ffa <+104>: leaq 0xfcd3d(%rip), %r9 ; "<unknown class name>" 0x7fff3a7f1001 <+111>: cmovneq %r14, %r9 0x7fff3a7f1005 <+115>: testq %r15, %r15 0x7fff3a7f1008 <+118>: leaq 0xf449c(%rip), %rax ; "<unknown selector>" 0x7fff3a7f100f <+125>: cmovneq %r15, %rax 0x7fff3a7f1013 <+129>: movq %rax, (%rsp) 0x7fff3a7f1017 <+133>: leaq 0xfcd0e(%rip), %r8 ; "(NSTimer) [%s %s]" 0x7fff3a7f101e <+140>: movq %r13, %rdi 0x7fff3a7f1021 <+143>: movq %r12, %rsi 0x7fff3a7f1024 <+146>: movl $0x0, %edx 0x7fff3a7f1029 <+151>: movq $-0x1, %rcx 0x7fff3a7f1030 <+158>: xorl %eax, %eax 0x7fff3a7f1032 <+160>: callq 0x7fff2fb27246 ; symbol stub for: __snprintf_chk 0x7fff3a7f1037 <+165>: movq 0x8(%rbx), %rdi 0x7fff3a7f103b <+169>: callq 0x7fff2fb27b04 ; symbol stub for: object_getClass 0x7fff3a7f1040 <+174>: leaq -0x50(%rbp), %rsi 0x7fff3a7f1044 <+178>: movq %rax, %rdi 0x7fff3a7f1047 <+181>: callq 0x7fff2fb2763c ; symbol stub for: dladdr 0x7fff3a7f104c <+186>: testl %eax, %eax 0x7fff3a7f104e <+188>: je 0x7fff2fa5f084 ; <+242> 0x7fff3a7f1050 <+190>: movq -0x50(%rbp), %rax 0x7fff3a7f1054 <+194>: testq %rax, %rax 0x7fff3a7f1057 <+197>: leaq 0xf14b9(%rip), %r9 ; "<unknown library>" 0x7fff3a7f105e <+204>: cmovneq %rax, %r9 0x7fff3a7f1062 <+208>: leaq 0xe6c2a(%rip), %r8 ; "%s" 0x7fff3a7f1069 <+215>: movq -0x58(%rbp), %rdi 0x7fff3a7f106d <+219>: movq -0x60(%rbp), %rsi 0x7fff3a7f1071 <+223>: movl $0x0, %edx 0x7fff3a7f1076 <+228>: movq $-0x1, %rcx 0x7fff3a7f107d <+235>: xorl %eax, %eax 0x7fff3a7f107f <+237>: callq 0x7fff2fb27246 ; symbol stub for: __snprintf_chk 0x7fff3a7f1084 <+242>: movq 0x554f159d(%rip), %rax ; (void *)0x00007fff98662d40: __stack_chk_guard 0x7fff3a7f108b <+249>: movq (%rax), %rax 0x7fff3a7f108e <+252>: cmpq -0x30(%rbp), %rax 0x7fff3a7f1092 <+256>: jne 0x7fff2fa5f0a3 ; <+273> 0x7fff3a7f1094 <+258>: addq $0x48, %rsp 0x7fff3a7f1098 <+262>: popq %rbx 0x7fff3a7f1099 <+263>: popq %r12 0x7fff3a7f109b <+265>: popq %r13 0x7fff3a7f109d <+267>: popq %r14 0x7fff3a7f109f <+269>: popq %r15 0x7fff3a7f10a1 <+271>: popq %rbp 0x7fff3a7f10a2 <+272>: retq 0x7fff3a7f10a3 <+273>: callq 0x7fff2fb2724c ; symbol stub for: __stack_chk_fail

Hide Details

Hide Details

runCmd: image lookup -s "__NSFireDelayedPerform" output: 1 symbols match '__NSFireDelayedPerform' in /System/Library/Frameworks/Foundation.framework/Versions/C/Foundation: Address: Foundation[0x00007fff2f8ba543] (Foundation.__TEXT.__text + 628435) Summary: Foundation`__NSFireDelayedPerform

Hide Details

Hide Details

runCmd: disassemble --force -n "__NSFireDelayedPerform" output: Foundation`__NSFireDelayedPerform: 0x7fff3a64c543 <+0>: pushq %rbp 0x7fff3a64c544 <+1>: movq %rsp, %rbp 0x7fff3a64c547 <+4>: pushq %r15 0x7fff3a64c549 <+6>: pushq %r14 0x7fff3a64c54b <+8>: pushq %r13 0x7fff3a64c54d <+10>: pushq %r12 0x7fff3a64c54f <+12>: pushq %rbx 0x7fff3a64c550 <+13>: subq $0x58, %rsp 0x7fff3a64c554 <+17>: movq %rdi, -0x38(%rbp) 0x7fff3a64c558 <+21>: movq (%rsi), %rax 0x7fff3a64c55b <+24>: movq %rax, -0x58(%rbp) 0x7fff3a64c55f <+28>: movq 0x8(%rsi), %rax 0x7fff3a64c563 <+32>: movq %rax, -0x50(%rbp) 0x7fff3a64c567 <+36>: movq 0x10(%rsi), %rax 0x7fff3a64c56b <+40>: movq %rax, -0x48(%rbp) 0x7fff3a64c56f <+44>: movq 0x18(%rsi), %rax 0x7fff3a64c573 <+48>: movq %rax, -0x40(%rbp) 0x7fff3a64c577 <+52>: movq 0x20(%rsi), %r15 0x7fff3a64c57b <+56>: movq 0x28(%rsi), %rax 0x7fff3a64c57f <+60>: movq %rax, -0x30(%rbp) 0x7fff3a64c583 <+64>: movq 0x30(%rsi), %rbx 0x7fff3a64c587 <+68>: callq 0x7fff2fb26c3a ; symbol stub for: _CFAutoreleasePoolPush 0x7fff3a64c58c <+73>: movq %rax, -0x68(%rbp) 0x7fff3a64c590 <+77>: testq %rbx, %rbx 0x7fff3a64c593 <+80>: je 0x7fff2f8ba5bd ; <+122> 0x7fff3a64c595 <+82>: movq 0x557794cc(%rip), %rdi ; (void *)0x00007fff8fdd6430: NSProcessInfo 0x7fff3a64c59c <+89>: movq 0x557703b5(%rip), %rsi ; "processInfo" 0x7fff3a64c5a3 <+96>: movq 0x5569668e(%rip), %r14 ; (void *)0x00007fff70e59e40: objc_msgSend 0x7fff3a64c5aa <+103>: callq *%r14 0x7fff3a64c5ad <+106>: movq 0x55773034(%rip), %rsi ; "_reactivateActivity:" 0x7fff3a64c5b4 <+113>: movq %rax, %rdi 0x7fff3a64c5b7 <+116>: movq %rbx, %rdx 0x7fff3a64c5ba <+119>: callq *%r14 0x7fff3a64c5bd <+122>: movq %rbx, -0x60(%rbp) 0x7fff3a64c5c1 <+126>: movq -0x38(%rbp), %rdi 0x7fff3a64c5c5 <+130>: callq 0x7fff2fb264f0 ; symbol stub for: CFRetain 0x7fff3a64c5ca <+135>: movq -0x30(%rbp), %rbx 0x7fff3a64c5ce <+139>: movq %rbx, %rdi 0x7fff3a64c5d1 <+142>: callq 0x7fff2fb27ae6 ; symbol stub for: objc_sync_enter 0x7fff3a64c5d6 <+147>: movq 0x55695eb3(%rip), %r14 ; (void *)0x00007fff8f85c428: NSRunLoop._dperf 0x7fff3a64c5dd <+154>: movq (%r14), %rax 0x7fff3a64c5e0 <+157>: movq (%rbx,%rax), %rbx 0x7fff3a64c5e4 <+161>: movq 0x5576d9bd(%rip), %r12 ; "count" 0x7fff3a64c5eb <+168>: movq %rbx, %rdi 0x7fff3a64c5ee <+171>: movq %r12, %rsi 0x7fff3a64c5f1 <+174>: callq *0x55696641(%rip) ; (void *)0x00007fff70e59e40: objc_msgSend 0x7fff3a64c5f7 <+180>: movq %rbx, %rdi 0x7fff3a64c5fa <+183>: xorl %esi, %esi 0x7fff3a64c5fc <+185>: movq %rax, %rdx 0x7fff3a64c5ff <+188>: movq %r15, %rcx 0x7fff3a64c602 <+191>: callq 0x7fff2fb25fb0 ; symbol stub for: CFArrayGetFirstIndexOfValue 0x7fff3a64c607 <+196>: shlq $0x20, %rax 0x7fff3a64c60b <+200>: movabsq $-0x100000000, %rcx ; imm = 0xFFFFFFFF00000000 0x7fff3a64c615 <+210>: cmpq %rcx, %rax 0x7fff3a64c618 <+213>: je 0x7fff2f8ba631 ; <+238> 0x7fff3a64c61a <+215>: sarq $0x20, %rax 0x7fff3a64c61e <+219>: movq (%r14), %rcx 0x7fff3a64c621 <+222>: movq -0x30(%rbp), %rdx 0x7fff3a64c625 <+226>: movq (%rdx,%rcx), %rdi 0x7fff3a64c629 <+230>: movq %rax, %rsi 0x7fff3a64c62c <+233>: callq 0x7fff2fb25fc2 ; symbol stub for: CFArrayRemoveValueAtIndex 0x7fff3a64c631 <+238>: movq -0x40(%rbp), %rdi 0x7fff3a64c635 <+242>: movq %r12, %rsi 0x7fff3a64c638 <+245>: callq *0x556965fa(%rip) ; (void *)0x00007fff70e59e40: objc_msgSend 0x7fff3a64c63e <+251>: movq 0x5576e54b(%rip), %rcx ; "objectAtIndex:" 0x7fff3a64c645 <+258>: movq %rcx, -0x78(%rbp) 0x7fff3a64c649 <+262>: movq 0x55695b88(%rip), %rcx ; (void *)0x00007fff8f72e348: NSRunLoopCommonModes 0x7fff3a64c650 <+269>: movq (%rcx), %r15 0x7fff3a64c653 <+272>: movq 0x5576dcc6(%rip), %rcx ; "isEqual:" 0x7fff3a64c65a <+279>: movq %rcx, -0x70(%rbp) 0x7fff3a64c65e <+283>: movq 0x5569645b(%rip), %rcx ; (void *)0x00007fff8f72e348: NSRunLoopCommonModes 0x7fff3a64c665 <+290>: movq (%rcx), %r13 0x7fff3a64c668 <+293>: movslq %eax, %r12 0x7fff3a64c66b <+296>: decq %r12 0x7fff3a64c66e <+299>: cmpq $-0x1, %r12 0x7fff3a64c672 <+303>: je 0x7fff2f8ba6c7 ; <+388> 0x7fff3a64c674 <+305>: movq -0x40(%rbp), %rdi 0x7fff3a64c678 <+309>: movq -0x78(%rbp), %rsi 0x7fff3a64c67c <+313>: movq %r12, %rdx 0x7fff3a64c67f <+316>: callq *0x556965b3(%rip) ; (void *)0x00007fff70e59e40: objc_msgSend 0x7fff3a64c685 <+322>: movq %rax, %rbx 0x7fff3a64c688 <+325>: movq %r13, %r14 0x7fff3a64c68b <+328>: cmpq %r15, %rax 0x7fff3a64c68e <+331>: je 0x7fff2f8ba6ae ; <+363> 0x7fff3a64c690 <+333>: movq %rbx, %rdi 0x7fff3a64c693 <+336>: movq -0x70(%rbp), %rsi 0x7fff3a64c697 <+340>: leaq 0x556ba99a(%rip), %rdx ; @"kCFRunLoopCommonModes" 0x7fff3a64c69e <+347>: callq *0x55696594(%rip) ; (void *)0x00007fff70e59e40: objc_msgSend 0x7fff3a64c6a4 <+353>: movq %rbx, %r14 0x7fff3a64c6a7 <+356>: testb %al, %al 0x7fff3a64c6a9 <+358>: je 0x7fff2f8ba6ae ; <+363> 0x7fff3a64c6ab <+360>: movq %r13, %r14 0x7fff3a64c6ae <+363>: callq 0x7fff2fb2651a ; symbol stub for: CFRunLoopGetCurrent 0x7fff3a64c6b3 <+368>: decq %r12 0x7fff3a64c6b6 <+371>: movq %rax, %rdi 0x7fff3a64c6b9 <+374>: movq -0x38(%rbp), %rsi 0x7fff3a64c6bd <+378>: movq %r14, %rdx 0x7fff3a64c6c0 <+381>: callq 0x7fff2fb26550 ; symbol stub for: CFRunLoopRemoveTimer 0x7fff3a64c6c5 <+386>: jmp 0x7fff2f8ba66e ; <+299> 0x7fff3a64c6c7 <+388>: movq -0x30(%rbp), %rdi 0x7fff3a64c6cb <+392>: callq 0x7fff2fb27aec ; symbol stub for: objc_sync_exit 0x7fff3a64c6d0 <+397>: movq -0x58(%rbp), %rdi 0x7fff3a64c6d4 <+401>: movq -0x50(%rbp), %rsi 0x7fff3a64c6d8 <+405>: movq -0x48(%rbp), %rdx 0x7fff3a64c6dc <+409>: callq *0x55696556(%rip) ; (void *)0x00007fff70e59e40: objc_msgSend 0x7fff3a64c6e2 <+415>: movq -0x38(%rbp), %rdi 0x7fff3a64c6e6 <+419>: callq 0x7fff2fb264ea ; symbol stub for: CFRelease 0x7fff3a64c6eb <+424>: movq -0x60(%rbp), %rbx 0x7fff3a64c6ef <+428>: testq %rbx, %rbx 0x7fff3a64c6f2 <+431>: je 0x7fff2f8ba71e ; <+475> 0x7fff3a64c6f4 <+433>: movq 0x5577936d(%rip), %rdi ; (void *)0x00007fff8fdd6430: NSProcessInfo 0x7fff3a64c6fb <+440>: movq 0x55770256(%rip), %rsi ; "processInfo" 0x7fff3a64c702 <+447>: movq 0x5569652f(%rip), %rax ; (void *)0x00007fff70e59e40: objc_msgSend 0x7fff3a64c709 <+454>: movq %rax, %r14 0x7fff3a64c70c <+457>: callq *%rax 0x7fff3a64c70e <+459>: movq 0x55772edb(%rip), %rsi ; "endActivity:" 0x7fff3a64c715 <+466>: movq %rax, %rdi 0x7fff3a64c718 <+469>: movq %rbx, %rdx 0x7fff3a64c71b <+472>: callq *%r14 0x7fff3a64c71e <+475>: movq -0x68(%rbp), %rdi 0x7fff3a64c722 <+479>: addq $0x58, %rsp 0x7fff3a64c726 <+483>: popq %rbx 0x7fff3a64c727 <+484>: popq %r12 0x7fff3a64c729 <+486>: popq %r13 0x7fff3a64c72b <+488>: popq %r14 0x7fff3a64c72d <+490>: popq %r15 0x7fff3a64c72f <+492>: popq %rbp 0x7fff3a64c730 <+493>: jmp 0x7fff2fb26c2e ; symbol stub for: _CFAutoreleasePoolPop 0x7fff3a64c735 <+498>: jmp 0x7fff2f8ba737 ; <+500> 0x7fff3a64c737 <+500>: movq %rax, %rbx 0x7fff3a64c73a <+503>: movq -0x30(%rbp), %rdi 0x7fff3a64c73e <+507>: callq 0x7fff2fb27aec ; symbol stub for: objc_sync_exit 0x7fff3a64c743 <+512>: movq %rbx, %rdi 0x7fff3a64c746 <+515>: callq 0x7fff2fb27180 ; symbol stub for: _Unwind_Resume 0x7fff3a64c74b <+520>: ud2 0x7fff3a64c74d <+522>: nop 0x7fff3a64c74e <+523>: nop 0x7fff3a64c74f <+524>: nop

Hide Details

Hide Details

runCmd: image lookup -s "__NSFireMachPort" output: 1 symbols match '__NSFireMachPort' in /System/Library/Frameworks/Foundation.framework/Versions/C/Foundation: Address: Foundation[0x00007fff2f8ddb44] (Foundation.__TEXT.__text + 773332) Summary: Foundation`__NSFireMachPort

Hide Details

Hide Details

runCmd: disassemble --force -n "__NSFireMachPort" output: Foundation`__NSFireMachPort: 0x7fff3a66fb44 <+0>: pushq %rbp 0x7fff3a66fb45 <+1>: movq %rsp, %rbp 0x7fff3a66fb48 <+4>: pushq %r15 0x7fff3a66fb4a <+6>: pushq %r14 0x7fff3a66fb4c <+8>: pushq %r13 0x7fff3a66fb4e <+10>: pushq %r12 0x7fff3a66fb50 <+12>: pushq %rbx 0x7fff3a66fb51 <+13>: subq $0x38, %rsp 0x7fff3a66fb55 <+17>: movq %rsi, %r12 0x7fff3a66fb58 <+20>: movq 0x55672ac9(%rip), %rax ; (void *)0x00007fff98662d40: __stack_chk_guard 0x7fff3a66fb5f <+27>: movq (%rax), %rax 0x7fff3a66fb62 <+30>: movq %rax, -0x30(%rbp) 0x7fff3a66fb66 <+34>: movq 0x8(%rcx), %r15 0x7fff3a66fb6a <+38>: callq 0x7fff2fb26c3a ; symbol stub for: _CFAutoreleasePoolPush 0x7fff3a66fb6f <+43>: movq %rax, %r14 0x7fff3a66fb72 <+46>: movq 0x5574f39f(%rip), %rbx ; "handleMachMessage:" 0x7fff3a66fb79 <+53>: movq 0x5574a728(%rip), %r13 ; "respondsToSelector:" 0x7fff3a66fb80 <+60>: movq %r15, %rdi 0x7fff3a66fb83 <+63>: movq %r13, %rsi 0x7fff3a66fb86 <+66>: movq %rbx, %rdx 0x7fff3a66fb89 <+69>: callq *0x556730a9(%rip) ; (void *)0x00007fff70e59e40: objc_msgSend 0x7fff3a66fb8f <+75>: testb %al, %al 0x7fff3a66fb91 <+77>: je 0x7fff2f8ddba7 ; <+99> 0x7fff3a66fb93 <+79>: movq %r15, %rdi 0x7fff3a66fb96 <+82>: movq %rbx, %rsi 0x7fff3a66fb99 <+85>: movq %r12, %rdx 0x7fff3a66fb9c <+88>: callq *0x55673096(%rip) ; (void *)0x00007fff70e59e40: objc_msgSend 0x7fff3a66fba2 <+94>: jmp 0x7fff2f8ddc6d ; <+297> 0x7fff3a66fba7 <+99>: movq 0x5574f372(%rip), %rdx ; "handlePortMessage:" 0x7fff3a66fbae <+106>: movq %r15, %rdi 0x7fff3a66fbb1 <+109>: movq %r13, %rsi 0x7fff3a66fbb4 <+112>: callq *0x5567307e(%rip) ; (void *)0x00007fff70e59e40: objc_msgSend 0x7fff3a66fbba <+118>: testb %al, %al 0x7fff3a66fbbc <+120>: je 0x7fff2f8ddc6d ; <+297> 0x7fff3a66fbc2 <+126>: movq 0x55755c1f(%rip), %rdi ; (void *)0x00007fdb52d044e0 0x7fff3a66fbc9 <+133>: movq 0x5574f358(%rip), %rsi ; "parseMachMessage:localPort:remotePort:msgid:components:" 0x7fff3a66fbd0 <+140>: leaq -0x48(%rbp), %rax 0x7fff3a66fbd4 <+144>: movq %rax, (%rsp) 0x7fff3a66fbd8 <+148>: movq 0x55673059(%rip), %r13 ; (void *)0x00007fff70e59e40: objc_msgSend 0x7fff3a66fbdf <+155>: leaq -0x40(%rbp), %rcx 0x7fff3a66fbe3 <+159>: leaq -0x38(%rbp), %rbx 0x7fff3a66fbe7 <+163>: leaq -0x4c(%rbp), %r9 0x7fff3a66fbeb <+167>: movq %r12, %rdx 0x7fff3a66fbee <+170>: movq %rcx, %r12 0x7fff3a66fbf1 <+173>: movq %rbx, %r8 0x7fff3a66fbf4 <+176>: callq *%r13 0x7fff3a66fbf7 <+179>: movq 0x557564d2(%rip), %rdi ; (void *)0x00007fff8fdd6368: NSPortMessage 0x7fff3a66fbfe <+186>: callq 0x7fff2fb279de ; symbol stub for: objc_allocWithZone 0x7fff3a66fc03 <+191>: movq (%rbx), %rdx 0x7fff3a66fc06 <+194>: movq (%r12), %rcx 0x7fff3a66fc0a <+198>: leaq -0x48(%rbp), %r12 0x7fff3a66fc0e <+202>: movq (%r12), %r8 0x7fff3a66fc12 <+206>: movq 0x5574f317(%rip), %rsi ; "initWithSendPort:receivePort:components:" 0x7fff3a66fc19 <+213>: movq %rax, %rdi 0x7fff3a66fc1c <+216>: callq *%r13 0x7fff3a66fc1f <+219>: movq %rax, %rbx 0x7fff3a66fc22 <+222>: leaq -0x4c(%rbp), %rax 0x7fff3a66fc26 <+226>: movl (%rax), %edx 0x7fff3a66fc28 <+228>: movq 0x5574f309(%rip), %rsi ; "setMsgid:" 0x7fff3a66fc2f <+235>: movq %rbx, %rdi 0x7fff3a66fc32 <+238>: callq *%r13 0x7fff3a66fc35 <+241>: movq %r15, %rdi 0x7fff3a66fc38 <+244>: movq 0x5574f2e1(%rip), %rsi ; "handlePortMessage:" 0x7fff3a66fc3f <+251>: movq %rbx, %rdx 0x7fff3a66fc42 <+254>: callq *%r13 0x7fff3a66fc45 <+257>: movq 0x55672ff4(%rip), %r15 ; (void *)0x00007fff70e5bca0: objc_release 0x7fff3a66fc4c <+264>: movq %rbx, %rdi 0x7fff3a66fc4f <+267>: callq *%r15 0x7fff3a66fc52 <+270>: movq (%r12), %rdi 0x7fff3a66fc56 <+274>: callq *%r15 0x7fff3a66fc59 <+277>: leaq -0x40(%rbp), %rax 0x7fff3a66fc5d <+281>: movq (%rax), %rdi 0x7fff3a66fc60 <+284>: callq *%r15 0x7fff3a66fc63 <+287>: leaq -0x38(%rbp), %rax 0x7fff3a66fc67 <+291>: movq (%rax), %rdi 0x7fff3a66fc6a <+294>: callq *%r15 0x7fff3a66fc6d <+297>: movq %r14, %rdi 0x7fff3a66fc70 <+300>: callq 0x7fff2fb26c2e ; symbol stub for: _CFAutoreleasePoolPop 0x7fff3a66fc75 <+305>: movq 0x556729ac(%rip), %rax ; (void *)0x00007fff98662d40: __stack_chk_guard 0x7fff3a66fc7c <+312>: movq (%rax), %rax 0x7fff3a66fc7f <+315>: cmpq -0x30(%rbp), %rax 0x7fff3a66fc83 <+319>: jne 0x7fff2f8ddc94 ; <+336> 0x7fff3a66fc85 <+321>: addq $0x38, %rsp 0x7fff3a66fc89 <+325>: popq %rbx 0x7fff3a66fc8a <+326>: popq %r12 0x7fff3a66fc8c <+328>: popq %r13 0x7fff3a66fc8e <+330>: popq %r14 0x7fff3a66fc90 <+332>: popq %r15 0x7fff3a66fc92 <+334>: popq %rbp 0x7fff3a66fc93 <+335>: retq 0x7fff3a66fc94 <+336>: callq 0x7fff2fb2724c ; symbol stub for: __stack_chk_fail 0x7fff3a66fc99 <+341>: nop 0x7fff3a66fc9a <+342>: nop 0x7fff3a66fc9b <+343>: nop

Hide Details

Hide Details

runCmd: image lookup -s "__NSFireTimer" output: 1 symbols match '__NSFireTimer' in /System/Library/Frameworks/Foundation.framework/Versions/C/Foundation: Address: Foundation[0x00007fff2f8de2a7] (Foundation.__TEXT.__text + 775223) Summary: Foundation`__NSFireTimer

Hide Details

Hide Details

runCmd: disassemble --force -n "__NSFireTimer" output: Foundation`__NSFireTimer: 0x7fff3a6702a7 <+0>: pushq %rbp 0x7fff3a6702a8 <+1>: movq %rsp, %rbp 0x7fff3a6702ab <+4>: pushq %r15 0x7fff3a6702ad <+6>: pushq %r14 0x7fff3a6702af <+8>: pushq %r13 0x7fff3a6702b1 <+10>: pushq %r12 0x7fff3a6702b3 <+12>: pushq %rbx 0x7fff3a6702b4 <+13>: pushq %rax 0x7fff3a6702b5 <+14>: movq %rdi, %r14 0x7fff3a6702b8 <+17>: movq 0x8(%rsi), %rbx 0x7fff3a6702bc <+21>: movq 0x10(%rsi), %r15 0x7fff3a6702c0 <+25>: callq 0x7fff2fb26c3a ; symbol stub for: _CFAutoreleasePoolPush 0x7fff3a6702c5 <+30>: movq %rax, %r12 0x7fff3a6702c8 <+33>: movq 0x55672979(%rip), %r13 ; (void *)0x00007fff70e59d10: objc_retain 0x7fff3a6702cf <+40>: movq %r14, %rdi 0x7fff3a6702d2 <+43>: callq *%r13 0x7fff3a6702d5 <+46>: movq %rbx, %rdi 0x7fff3a6702d8 <+49>: callq *%r13 0x7fff3a6702db <+52>: movq %rbx, %rdi 0x7fff3a6702de <+55>: movq %r15, %rsi 0x7fff3a6702e1 <+58>: movq %r14, %rdx 0x7fff3a6702e4 <+61>: callq *0x5567294e(%rip) ; (void *)0x00007fff70e59e40: objc_msgSend 0x7fff3a6702ea <+67>: movq 0x5567294f(%rip), %r15 ; (void *)0x00007fff70e5bca0: objc_release 0x7fff3a6702f1 <+74>: movq %rbx, %rdi 0x7fff3a6702f4 <+77>: callq *%r15 0x7fff3a6702f7 <+80>: movq %r14, %rdi 0x7fff3a6702fa <+83>: callq *%r15 0x7fff3a6702fd <+86>: movq %r12, %rdi 0x7fff3a670300 <+89>: addq $0x8, %rsp 0x7fff3a670304 <+93>: popq %rbx 0x7fff3a670305 <+94>: popq %r12 0x7fff3a670307 <+96>: popq %r13 0x7fff3a670309 <+98>: popq %r14 0x7fff3a67030b <+100>: popq %r15 0x7fff3a67030d <+102>: popq %rbp 0x7fff3a67030e <+103>: jmp 0x7fff2fb26c2e ; symbol stub for: _CFAutoreleasePoolPop

Hide Details

Hide Details

runCmd: image lookup -s "__NSPropertyListClasses_ForArchival_ErrorAndException" output: 1 symbols match '__NSPropertyListClasses_ForArchival_ErrorAndException' in /System/Library/Frameworks/Foundation.framework/Versions/C/Foundation: Address: Foundation[0x00007fff2f87b58d] (Foundation.__TEXT.__text + 370461) Summary: Foundation`__NSPropertyListClasses_ForArchival_ErrorAndException

Hide Details

Hide Details

runCmd: disassemble --force -n "__NSPropertyListClasses_ForArchival_ErrorAndException" output: Foundation`__NSPropertyListClasses_ForArchival_ErrorAndException: 0x7fff3a60d58d <+0>: pushq %rbp 0x7fff3a60d58e <+1>: movq %rsp, %rbp 0x7fff3a60d591 <+4>: cmpq $-0x1, 0x557d3017(%rip) ; __NSPropertyListClasses_ForArchival_ErrorAndException.plistClasses + 7 0x7fff3a60d599 <+12>: jne 0x7fff2f87b5a4 ; <+23> 0x7fff3a60d59b <+14>: movq 0x557d3006(%rip), %rax ; __NSPropertyListClasses_ForArchival_ErrorAndException.plistClasses 0x7fff3a60d5a2 <+21>: popq %rbp 0x7fff3a60d5a3 <+22>: retq 0x7fff3a60d5a4 <+23>: leaq 0x557d3005(%rip), %rdi ; __NSPropertyListClasses_ForArchival_ErrorAndException.onceToken 0x7fff3a60d5ab <+30>: leaq 0x556ddf96(%rip), %rsi ; __block_literal_global 0x7fff3a60d5b2 <+37>: callq 0x7fff2fb275a0 ; symbol stub for: dispatch_once 0x7fff3a60d5b7 <+42>: jmp 0x7fff2f87b59b ; <+14>

Hide Details

Hide Details

runCmd: image lookup -s "__NSUserScriptTaskServiceStart" output: 1 symbols match '__NSUserScriptTaskServiceStart' in /System/Library/Frameworks/Foundation.framework/Versions/C/Foundation: Address: Foundation[0x00007fff2fb24ceb] (Foundation.__TEXT.__text + 3161723) Summary: Foundation`__NSUserScriptTaskServiceStart

Hide Details

Hide Details

runCmd: disassemble --force -n "__NSUserScriptTaskServiceStart" output: Foundation`__NSUserScriptTaskServiceStart: 0x7fff3a8b6ceb <+0>: pushq %rbp 0x7fff3a8b6cec <+1>: movq %rsp, %rbp 0x7fff3a8b6cef <+4>: pushq %r15 0x7fff3a8b6cf1 <+6>: pushq %r14 0x7fff3a8b6cf3 <+8>: pushq %rbx 0x7fff3a8b6cf4 <+9>: pushq %rax 0x7fff3a8b6cf5 <+10>: movq $0x0, (%rsp) 0x7fff3a8b6cfd <+18>: leaq 0x522d5(%rip), %rdi ; "com.apple.automation.app_launched" 0x7fff3a8b6d04 <+25>: leaq 0x52279(%rip), %rdx ; "com.apple.message.signature" 0x7fff3a8b6d0b <+32>: leaq 0x51f1c(%rip), %rcx ; "com.apple.foundation.UserScriptService" 0x7fff3a8b6d12 <+39>: leaq 0x522a4(%rip), %r8 ; "com.apple.message.summarize" 0x7fff3a8b6d19 <+46>: leaq 0x1ad10(%rip), %r9 ; "YES" 0x7fff3a8b6d20 <+53>: movl $0x5, %esi 0x7fff3a8b6d25 <+58>: xorl %eax, %eax 0x7fff3a8b6d27 <+60>: callq 0x7fff2fb279ae ; symbol stub for: msgtracer_log_with_keys 0x7fff3a8b6d2c <+65>: movq 0x5550fec5(%rip), %rdi ; (void *)0x00007fff8fdd76a0: NSUserScriptTaskServiceDelegate 0x7fff3a8b6d33 <+72>: callq 0x7fff2fb279d8 ; symbol stub for: objc_alloc 0x7fff3a8b6d38 <+77>: movq 0x55503201(%rip), %rsi ; "init" 0x7fff3a8b6d3f <+84>: movq 0x5542bef2(%rip), %r15 ; (void *)0x00007fff70e59e40: objc_msgSend 0x7fff3a8b6d46 <+91>: movq %rax, %rdi 0x7fff3a8b6d49 <+94>: callq *%r15 0x7fff3a8b6d4c <+97>: movq %rax, %r14 0x7fff3a8b6d4f <+100>: movq 0x5550ed5a(%rip), %rdi ; (void *)0x00007fff8fdd7970: NSXPCListener 0x7fff3a8b6d56 <+107>: movq 0x5550e023(%rip), %rsi ; "serviceListener" 0x7fff3a8b6d5d <+114>: callq *%r15 0x7fff3a8b6d60 <+117>: movq %rax, %rbx 0x7fff3a8b6d63 <+120>: movq 0x55504cfe(%rip), %rsi ; "setDelegate:" 0x7fff3a8b6d6a <+127>: movq %rax, %rdi 0x7fff3a8b6d6d <+130>: movq %r14, %rdx 0x7fff3a8b6d70 <+133>: callq *%r15 0x7fff3a8b6d73 <+136>: movq 0x5550335e(%rip), %rsi ; "resume" 0x7fff3a8b6d7a <+143>: movq %rbx, %rdi 0x7fff3a8b6d7d <+146>: callq *%r15 0x7fff3a8b6d80 <+149>: movq %r14, %rdi 0x7fff3a8b6d83 <+152>: addq $0x8, %rsp 0x7fff3a8b6d87 <+156>: popq %rbx 0x7fff3a8b6d88 <+157>: popq %r14 0x7fff3a8b6d8a <+159>: popq %r15 0x7fff3a8b6d8c <+161>: popq %rbp 0x7fff3a8b6d8d <+162>: jmpq *0x5542bead(%rip) ; (void *)0x00007fff70e5bca0: objc_release

Hide Details

Hide Details

runCmd: image lookup -s "getStackObservedValueClassAndBoxSize" output: 1 symbols match 'getStackObservedValueClassAndBoxSize' in /System/Library/Frameworks/Foundation.framework/Versions/C/Foundation: Address: Foundation[0x00007fff2f8a4760] (Foundation.__TEXT.__text + 538864) Summary: Foundation`getStackObservedValueClassAndBoxSize

Hide Details

Hide Details

runCmd: disassemble --force -n "getStackObservedValueClassAndBoxSize" output: Foundation`getStackObservedValueClassAndBoxSize: 0x7fff3a636760 <+0>: pushq %rbp 0x7fff3a636761 <+1>: movq %rsp, %rbp 0x7fff3a636764 <+4>: pushq %rbx 0x7fff3a636765 <+5>: pushq %rax 0x7fff3a636766 <+6>: movq %rdi, %rbx 0x7fff3a636769 <+9>: cmpq $-0x1, 0x557a9bc7(%rip) ; getStackObservedValueClassAndBoxSize.cls + 7 0x7fff3a636771 <+17>: jne 0x7fff2f8a478b ; <+43> 0x7fff3a636773 <+19>: movq 0x557a9bae(%rip), %rax ; getStackObservedValueClassAndBoxSize.boxSize 0x7fff3a63677a <+26>: movq %rax, (%rbx) 0x7fff3a63677d <+29>: movq 0x557a9bac(%rip), %rax ; getStackObservedValueClassAndBoxSize.cls 0x7fff3a636784 <+36>: addq $0x8, %rsp 0x7fff3a636788 <+40>: popq %rbx 0x7fff3a636789 <+41>: popq %rbp 0x7fff3a63678a <+42>: retq 0x7fff3a63678b <+43>: leaq 0x557a9ba6(%rip), %rdi ; getStackObservedValueClassAndBoxSize.onceToken 0x7fff3a636792 <+50>: leaq 0x556b38f7(%rip), %rsi ; __block_literal_global 0x7fff3a636799 <+57>: callq 0x7fff2fb275a0 ; symbol stub for: dispatch_once 0x7fff3a63679e <+62>: jmp 0x7fff2f8a4773 ; <+19>

Hide Details

Hide Details

<bound method SBProcess.Kill of <lldb.SBProcess; proxy of <Swig Object of type 'lldb::SBProcess *' at 0x1179436c0> >>: success

Hide Details

PASS: LLDB (/Users/buildslave/jenkins/workspace/lldb-cmake/lldb-build/bin/clang-x86_64) :: test_foundation_disasm (TestFoundationDisassembly.FoundationDisassembleTestCase) runCmd: settings clear -all output:

Hide Details

runCmd: settings set symbols.enable-external-lookup false output:

Hide Details

runCmd: settings set target.inherit-tcc true output:

Hide Details

runCmd: settings set target.detach-on-error false output:

Hide Details

runCmd: settings set target.auto-apply-fixits false output:

Hide Details

runCmd: settings set plugin.process.gdb-remote.packet-timeout 60 output:

Hide Details

runCmd: settings set symbols.clang-modules-cache-path "/Users/buildslave/jenkins/workspace/lldb-cmake/lldb-build/lldb-test-build.noindex/module-cache-lldb/lldb-api" output:

Hide Details

runCmd: settings set use-color false output:

Hide Details

runCmd: setting set target.prefer-dynamic-value no-dynamic-values output:

Hide Details

runCmd: _regexp-break +[NSString stringWithFormat:] output: Breakpoint 1: where = Foundation`+[NSString stringWithFormat:], address = 0x00007fff2f839d87

Hide Details

Hide Details

Expecting pattern: ^Breakpoint (?P<bpno>[0-9]+): (?P<num_locations>[0-9]+) locations\.$ Not matched

Hide Details

Expecting pattern: ^Breakpoint (?P<bpno>[0-9]+): (?P<num_locations>no) locations \(pending\)\. Not matched

Hide Details

Expecting pattern: ^Breakpoint (?P<bpno>[0-9]+): where = (?P<module>.*)`(?P<symbol>[+\-]{0,1}[^+]+)( \+ (?P<offset>[0-9]+)){0,1}( \[inlined\] (?P<inline_symbol>.*)){0,1} at (?P<file>[^:]+):(?P<line_no>[0-9]+)(?P<column>(:[0-9]+)?), address = (?P<address>0x[0-9a-fA-F]+)$ Not matched

Hide Details

Expecting pattern: ^Breakpoint (?P<bpno>[0-9]+): where = (?P<module>.*)`(?P<symbol>.*)( \+ (?P<offset>[0-9]+)){0,1}, address = (?P<address>0x[0-9a-fA-F]+)$ Matched

Hide Details

runCmd: breakpoint set -n "-[MyString initWithNSString:]" output: Breakpoint 2: where = a.out`-[MyString initWithNSString:] + 20 at main.m:23:16, address = 0x0000000100001584

Hide Details

Hide Details

Expecting pattern: ^Breakpoint (?P<bpno>[0-9]+): (?P<num_locations>[0-9]+) locations\.$ Not matched

Hide Details

Expecting pattern: ^Breakpoint (?P<bpno>[0-9]+): (?P<num_locations>no) locations \(pending\)\. Not matched

Hide Details

Expecting pattern: ^Breakpoint (?P<bpno>[0-9]+): where = (?P<module>.*)`(?P<symbol>[+\-]{0,1}[^+]+)( \+ (?P<offset>[0-9]+)){0,1}( \[inlined\] (?P<inline_symbol>.*)){0,1} at (?P<file>[^:]+):(?P<line_no>[0-9]+)(?P<column>(:[0-9]+)?), address = (?P<address>0x[0-9a-fA-F]+)$ Matched

Hide Details

runCmd: breakpoint set -S "description" --shlib "a.out" output: Breakpoint 3: where = a.out`-[MyString description] + 16 at main.m:43:7, address = 0x00000001000016b0

Hide Details

Hide Details

Expecting pattern: ^Breakpoint (?P<bpno>[0-9]+): (?P<num_locations>[0-9]+) locations\.$ Not matched

Hide Details

Expecting pattern: ^Breakpoint (?P<bpno>[0-9]+): (?P<num_locations>no) locations \(pending\)\. Not matched

Hide Details

Expecting pattern: ^Breakpoint (?P<bpno>[0-9]+): where = (?P<module>.*)`(?P<symbol>[+\-]{0,1}[^+]+)( \+ (?P<offset>[0-9]+)){0,1}( \[inlined\] (?P<inline_symbol>.*)){0,1} at (?P<file>[^:]+):(?P<line_no>[0-9]+)(?P<column>(:[0-9]+)?), address = (?P<address>0x[0-9a-fA-F]+)$ Matched

Hide Details

runCmd: _regexp-break -[NSAutoreleasePool release] output: Breakpoint 4: where = Foundation`-[NSAutoreleasePool release], address = 0x00007fff2f83da40

Hide Details

Hide Details

Expecting pattern: ^Breakpoint (?P<bpno>[0-9]+): (?P<num_locations>[0-9]+) locations\.$ Not matched

Hide Details

Expecting pattern: ^Breakpoint (?P<bpno>[0-9]+): (?P<num_locations>no) locations \(pending\)\. Not matched

Hide Details

Expecting pattern: ^Breakpoint (?P<bpno>[0-9]+): where = (?P<module>.*)`(?P<symbol>[+\-]{0,1}[^+]+)( \+ (?P<offset>[0-9]+)){0,1}( \[inlined\] (?P<inline_symbol>.*)){0,1} at (?P<file>[^:]+):(?P<line_no>[0-9]+)(?P<column>(:[0-9]+)?), address = (?P<address>0x[0-9a-fA-F]+)$ Not matched

Hide Details

Expecting pattern: ^Breakpoint (?P<bpno>[0-9]+): where = (?P<module>.*)`(?P<symbol>.*)( \+ (?P<offset>[0-9]+)){0,1}, address = (?P<address>0x[0-9a-fA-F]+)$ Matched

Hide Details

runCmd: run runCmd failed! error: process exited with status -1 (tried to attach to process already being debugged)

Hide Details

Hide Details

Command 'run' failed!

Hide Details

FAIL: LLDB (/Users/buildslave/jenkins/workspace/lldb-cmake/lldb-build/bin/clang-x86_64) :: test_simple_disasm (TestFoundationDisassembly.FoundationDisassembleTestCase) <bound method SBProcess.Kill of <lldb.SBProcess; proxy of <Swig Object of type 'lldb::SBProcess *' at 0x10f343ae0> >>: success

Hide Details

Restore dir to: /Users/buildslave/jenkins/workspace/lldb-cmake/lldb-build/tools/lldb/test ====================================================================== FAIL: test_simple_disasm (TestFoundationDisassembly.FoundationDisassembleTestCase) Test the lldb 'disassemble' command ---------------------------------------------------------------------- Traceback (most recent call last): File "/Users/buildslave/jenkins/workspace/lldb-cmake/llvm-project/lldb/packages/Python/lldbsuite/test/decorators.py", line 149, in wrapper return func(*args, **kwargs) File "/Users/buildslave/jenkins/workspace/lldb-cmake/llvm-project/lldb/test/API/lang/objc/foundation/TestFoundationDisassembly.py", line 108, in test_simple_disasm self.runCmd("run", RUN_SUCCEEDED) File "/Users/buildslave/jenkins/workspace/lldb-cmake/llvm-project/lldb/packages/Python/lldbsuite/test/lldbtest.py", line 2161, in runCmd msg if (msg) else CMD_MSG(cmd)) AssertionError: False is not True : Process is launched successfully Error output: error: process exited with status -1 (tried to attach to process already being debugged)

Hide Details

Config=x86_64-/Users/buildslave/jenkins/workspace/lldb-cmake/lldb-build/bin/clang ---------------------------------------------------------------------- Ran 2 tests in 95.585s

Hide Details

RESULT: FAILED (1 passes, 1 failures, 0 errors, 0 skipped, 0 expected failures, 0 unexpected successes)

Hide Details

--

Hide Details

******************** PASS: lldb-unit :: UnwindAssembly/x86/./UnwindAssemblyx86Tests/Testx86AssemblyInspectionEngine.TestPushR15 (1915 of 2337) PASS: lldb-unit :: debugserver/./debugserverTests/RNBSocket.LoopBackListenIPv6 (1916 of 2337) FAIL: lldb-api :: commands/expression/persist_objc_pointeetype/TestPersistObjCPointeeType.py (1917 of 2337) ******************** TEST 'lldb-api :: commands/expression/persist_objc_pointeetype/TestPersistObjCPointeeType.py' FAILED ******************** Script: -- /usr/local/Frameworks/Python.framework/Versions/3.7/bin/python3.7 /Users/buildslave/jenkins/workspace/lldb-cmake/llvm-project/lldb/test/API/dotest.py -u CXXFLAGS -u CFLAGS --codesign-identity - --arch x86_64 --build-dir /Users/buildslave/jenkins/workspace/lldb-cmake/lldb-build/lldb-test-build.noindex -t --env TERM=vt100 --env LLVM_LIBS_DIR=/Users/buildslave/jenkins/workspace/lldb-cmake/lldb-build/./lib --arch x86_64 --build-dir /Users/buildslave/jenkins/workspace/lldb-cmake/lldb-build/lldb-test-build.noindex --lldb-module-cache-dir /Users/buildslave/jenkins/workspace/lldb-cmake/lldb-build/lldb-test-build.noindex/module-cache-lldb/lldb-api --clang-module-cache-dir /Users/buildslave/jenkins/workspace/lldb-cmake/lldb-build/lldb-test-build.noindex/module-cache-clang/lldb-api --executable /Users/buildslave/jenkins/workspace/lldb-cmake/lldb-build/./bin/lldb --compiler /Users/buildslave/jenkins/workspace/lldb-cmake/lldb-build/./bin/clang --dsymutil /Users/buildslave/jenkins/workspace/lldb-cmake/lldb-build/./bin/dsymutil --llvm-tools-dir /Users/buildslave/jenkins/workspace/lldb-cmake/lldb-build/./bin --lldb-libs-dir /Users/buildslave/jenkins/workspace/lldb-cmake/lldb-build/./lib /Users/buildslave/jenkins/workspace/lldb-cmake/llvm-project/lldb/test/API/commands/expression/persist_objc_pointeetype -p TestPersistObjCPointeeType.py -- Exit Code: 1

Hide Details

Command Output (stdout): -- lldb version 13.0.99 (http://labmaster3.local/git/llvm-project.git revision 6400905a615282c83a2fc6e49e57ff716aa8b4de) clang revision 6400905a615282c83a2fc6e49e57ff716aa8b4de llvm revision 6400905a615282c83a2fc6e49e57ff716aa8b4de Skipping the following test categories: ['darwin-log', 'libstdcxx', 'dwo', 'llgs', 'fork']

Hide Details

-- Command Output (stderr): -- Change dir to: /Users/buildslave/jenkins/workspace/lldb-cmake/llvm-project/lldb/test/API/commands/expression/persist_objc_pointeetype runCmd: settings clear -all output:

Hide Details

runCmd: settings set symbols.enable-external-lookup false output:

Hide Details

runCmd: settings set target.inherit-tcc true output:

Hide Details

runCmd: settings set target.detach-on-error false output:

Hide Details

runCmd: settings set target.auto-apply-fixits false output:

Hide Details

runCmd: settings set plugin.process.gdb-remote.packet-timeout 60 output:

Hide Details

runCmd: settings set symbols.clang-modules-cache-path "/Users/buildslave/jenkins/workspace/lldb-cmake/lldb-build/lldb-test-build.noindex/module-cache-lldb/lldb-api" output:

Hide Details

runCmd: settings set use-color false output:

Hide Details

runCmd: setting set target.prefer-dynamic-value no-dynamic-values output:

Hide Details

Adding tearDown hook: def cleanup(): pass

Hide Details

Hide Details

runCmd: file /Users/buildslave/jenkins/workspace/lldb-cmake/lldb-build/lldb-test-build.noindex/commands/expression/persist_objc_pointeetype/TestPersistObjCPointeeType.test_with_dsym/a.out output: Current executable set to '/Users/buildslave/jenkins/workspace/lldb-cmake/lldb-build/lldb-test-build.noindex/commands/expression/persist_objc_pointeetype/TestPersistObjCPointeeType.test_with_dsym/a.out' (x86_64).

Hide Details

Hide Details

runCmd: breakpoint set -f "main.m" -l 42 output: Breakpoint 1: where = a.out`-[SubClass initThatDoesNotAssert] + 538 at main.m:42:5, address = 0x000000010000157a

Hide Details

Hide Details

Expecting pattern: ^Breakpoint (?P<bpno>[0-9]+): (?P<num_locations>[0-9]+) locations\.$ Not matched

Hide Details

Expecting pattern: ^Breakpoint (?P<bpno>[0-9]+): (?P<num_locations>no) locations \(pending\)\. Not matched

Hide Details

Expecting pattern: ^Breakpoint (?P<bpno>[0-9]+): where = (?P<module>.*)`(?P<symbol>[+\-]{0,1}[^+]+)( \+ (?P<offset>[0-9]+)){0,1}( \[inlined\] (?P<inline_symbol>.*)){0,1} at (?P<file>[^:]+):(?P<line_no>[0-9]+)(?P<column>(:[0-9]+)?), address = (?P<address>0x[0-9a-fA-F]+)$ Matched

Hide Details

runCmd: run output: Process 81922 stopped * thread #1, queue = 'com.apple.main-thread', stop reason = breakpoint 1.1 frame #0: 0x000000010000157a a.out`-[SubClass initThatDoesNotAssert](self=0x0000000100407d30, _cmd="initThatDoesNotAssert") at main.m:42:5 39 assert(_sc_name5 == nil); 40 assert(_sc_name6 == nil); 41 assert(_sc_name7 == nil); -> 42 assert(_sc_name8 == nil); // break here ^ 43 44 if ((self = [super _initWithContainer:(CKContainer*)@"foo" scope:0xff])) { 45 assert(_sc_name == nil); Process 81922 launched: '/Users/buildslave/jenkins/workspace/lldb-cmake/lldb-build/lldb-test-build.noindex/commands/expression/persist_objc_pointeetype/TestPersistObjCPointeeType.test_with_dsym/a.out' (x86_64)

Hide Details

Hide Details

runCmd: p *self output: (SubClass) $0 = { CKDatabase = { NSObject = { isa = SubClass } } _sc_name = nil _sc_name2 = nil _sc_name3 = nil _sc_name4 = nil _sc_name5 = nil _sc_name6 = nil _sc_name7 = nil _sc_name8 = nil }

Hide Details

Hide Details

Ran command: "p *self"

Hide Details

Got output: (SubClass) $0 = { CKDatabase = { NSObject = { isa = SubClass } } _sc_name = nil _sc_name2 = nil _sc_name3 = nil _sc_name4 = nil _sc_name5 = nil _sc_name6 = nil _sc_name7 = nil _sc_name8 = nil }

Hide Details

Expecting sub string: "_sc_name = nil" (was found) Expecting sub string: "_sc_name2 = nil" (was found) Expecting sub string: "_sc_name3 = nil" (was found) Expecting sub string: "_sc_name4 = nil" (was found) Expecting sub string: "_sc_name5 = nil" (was found) Expecting sub string: "_sc_name6 = nil" (was found) Expecting sub string: "_sc_name7 = nil" (was found) Expecting sub string: "_sc_name8 = nil" (was found)

Hide Details

<bound method SBProcess.Kill of <lldb.SBProcess; proxy of <Swig Object of type 'lldb::SBProcess *' at 0x1049c1870> >>: success

Hide Details

Executing tearDown hook: def cleanup(): pass

Hide Details

Hide Details

PASS: LLDB (/Users/buildslave/jenkins/workspace/lldb-cmake/lldb-build/bin/clang-x86_64) :: test_with_dsym (TestPersistObjCPointeeType.PersistObjCPointeeType) runCmd: settings clear -all output:

Hide Details

runCmd: settings set symbols.enable-external-lookup false output:

Hide Details

runCmd: settings set target.inherit-tcc true output:

Hide Details

runCmd: settings set target.detach-on-error false output:

Hide Details

runCmd: settings set target.auto-apply-fixits false output:

Hide Details

runCmd: settings set plugin.process.gdb-remote.packet-timeout 60 output:

Hide Details

runCmd: settings set symbols.clang-modules-cache-path "/Users/buildslave/jenkins/workspace/lldb-cmake/lldb-build/lldb-test-build.noindex/module-cache-lldb/lldb-api" output:

Hide Details

runCmd: settings set use-color false output:

Hide Details

runCmd: setting set target.prefer-dynamic-value no-dynamic-values output:

Hide Details

Adding tearDown hook: def cleanup(): pass

Hide Details

Hide Details

runCmd: file /Users/buildslave/jenkins/workspace/lldb-cmake/lldb-build/lldb-test-build.noindex/commands/expression/persist_objc_pointeetype/TestPersistObjCPointeeType.test_with_dwarf/a.out output: Current executable set to '/Users/buildslave/jenkins/workspace/lldb-cmake/lldb-build/lldb-test-build.noindex/commands/expression/persist_objc_pointeetype/TestPersistObjCPointeeType.test_with_dwarf/a.out' (x86_64).

Hide Details

Hide Details

runCmd: breakpoint set -f "main.m" -l 42 output: Breakpoint 1: where = a.out`-[SubClass initThatDoesNotAssert] + 538 at main.m:42:5, address = 0x000000010000157a

Hide Details

Hide Details

Expecting pattern: ^Breakpoint (?P<bpno>[0-9]+): (?P<num_locations>[0-9]+) locations\.$ Not matched

Hide Details

Expecting pattern: ^Breakpoint (?P<bpno>[0-9]+): (?P<num_locations>no) locations \(pending\)\. Not matched

Hide Details

Expecting pattern: ^Breakpoint (?P<bpno>[0-9]+): where = (?P<module>.*)`(?P<symbol>[+\-]{0,1}[^+]+)( \+ (?P<offset>[0-9]+)){0,1}( \[inlined\] (?P<inline_symbol>.*)){0,1} at (?P<file>[^:]+):(?P<line_no>[0-9]+)(?P<column>(:[0-9]+)?), address = (?P<address>0x[0-9a-fA-F]+)$ Matched

Hide Details

runCmd: run runCmd failed! error: process exited with status -1 (tried to attach to process already being debugged)

Hide Details

Hide Details

Command 'run' failed!

Hide Details

FAIL: LLDB (/Users/buildslave/jenkins/workspace/lldb-cmake/lldb-build/bin/clang-x86_64) :: test_with_dwarf (TestPersistObjCPointeeType.PersistObjCPointeeType) <bound method SBProcess.Kill of <lldb.SBProcess; proxy of <Swig Object of type 'lldb::SBProcess *' at 0x104206bd0> >>: success

Hide Details

Executing tearDown hook: def cleanup(): pass

Hide Details

Hide Details

UNSUPPORTED: LLDB (/Users/buildslave/jenkins/workspace/lldb-cmake/lldb-build/bin/clang-x86_64) :: test_with_dwo (TestPersistObjCPointeeType.PersistObjCPointeeType) (test case does not fall in any category of interest for this run) runCmd: settings clear -all output:

Hide Details

runCmd: settings set symbols.enable-external-lookup false output:

Hide Details

runCmd: settings set target.inherit-tcc true output:

Hide Details

runCmd: settings set target.detach-on-error false output:

Hide Details

runCmd: settings set target.auto-apply-fixits false output:

Hide Details

runCmd: settings set plugin.process.gdb-remote.packet-timeout 60 output:

Hide Details

runCmd: settings set symbols.clang-modules-cache-path "/Users/buildslave/jenkins/workspace/lldb-cmake/lldb-build/lldb-test-build.noindex/module-cache-lldb/lldb-api" output:

Hide Details

runCmd: settings set use-color false output:

Hide Details

runCmd: setting set target.prefer-dynamic-value no-dynamic-values output:

Hide Details

Adding tearDown hook: def cleanup(): pass

Hide Details

Hide Details

runCmd: file /Users/buildslave/jenkins/workspace/lldb-cmake/lldb-build/lldb-test-build.noindex/commands/expression/persist_objc_pointeetype/TestPersistObjCPointeeType.test_with_gmodules/a.out output: Current executable set to '/Users/buildslave/jenkins/workspace/lldb-cmake/lldb-build/lldb-test-build.noindex/commands/expression/persist_objc_pointeetype/TestPersistObjCPointeeType.test_with_gmodules/a.out' (x86_64).

Hide Details

Hide Details

runCmd: breakpoint set -f "main.m" -l 42 output: Breakpoint 1: where = a.out`-[SubClass initThatDoesNotAssert] + 538 at main.m:42:5, address = 0x000000010000157a

Hide Details

Hide Details

Expecting pattern: ^Breakpoint (?P<bpno>[0-9]+): (?P<num_locations>[0-9]+) locations\.$ Not matched

Hide Details

Expecting pattern: ^Breakpoint (?P<bpno>[0-9]+): (?P<num_locations>no) locations \(pending\)\. Not matched

Hide Details

Expecting pattern: ^Breakpoint (?P<bpno>[0-9]+): where = (?P<module>.*)`(?P<symbol>[+\-]{0,1}[^+]+)( \+ (?P<offset>[0-9]+)){0,1}( \[inlined\] (?P<inline_symbol>.*)){0,1} at (?P<file>[^:]+):(?P<line_no>[0-9]+)(?P<column>(:[0-9]+)?), address = (?P<address>0x[0-9a-fA-F]+)$ Matched

Hide Details

runCmd: run runCmd failed! error: process exited with status -1 (tried to attach to process already being debugged)

Hide Details

Hide Details

Command 'run' failed!

Hide Details

FAIL: LLDB (/Users/buildslave/jenkins/workspace/lldb-cmake/lldb-build/bin/clang-x86_64) :: test_with_gmodules (TestPersistObjCPointeeType.PersistObjCPointeeType) <bound method SBProcess.Kill of <lldb.SBProcess; proxy of <Swig Object of type 'lldb::SBProcess *' at 0x10444b060> >>: success

Hide Details

Executing tearDown hook: def cleanup(): pass

Hide Details

Hide Details

Restore dir to: /Users/buildslave/jenkins/workspace/lldb-cmake/lldb-build/tools/lldb/test ====================================================================== FAIL: test_with_dwarf (TestPersistObjCPointeeType.PersistObjCPointeeType) Test that we can p *objcObject ---------------------------------------------------------------------- Traceback (most recent call last): File "/Users/buildslave/jenkins/workspace/lldb-cmake/llvm-project/lldb/packages/Python/lldbsuite/test/lldbtest.py", line 1830, in test_method return attrvalue(self) File "/Users/buildslave/jenkins/workspace/lldb-cmake/llvm-project/lldb/packages/Python/lldbsuite/test/decorators.py", line 149, in wrapper return func(*args, **kwargs) File "/Users/buildslave/jenkins/workspace/lldb-cmake/llvm-project/lldb/packages/Python/lldbsuite/test/decorators.py", line 149, in wrapper return func(*args, **kwargs) File "/Users/buildslave/jenkins/workspace/lldb-cmake/llvm-project/lldb/test/API/commands/expression/persist_objc_pointeetype/TestPersistObjCPointeeType.py", line 41, in test_with self.runCmd("run", RUN_SUCCEEDED) File "/Users/buildslave/jenkins/workspace/lldb-cmake/llvm-project/lldb/packages/Python/lldbsuite/test/lldbtest.py", line 2161, in runCmd msg if (msg) else CMD_MSG(cmd)) AssertionError: False is not True : Process is launched successfully Error output: error: process exited with status -1 (tried to attach to process already being debugged)

Hide Details

Config=x86_64-/Users/buildslave/jenkins/workspace/lldb-cmake/lldb-build/bin/clang ====================================================================== FAIL: test_with_gmodules (TestPersistObjCPointeeType.PersistObjCPointeeType) Test that we can p *objcObject ---------------------------------------------------------------------- Traceback (most recent call last): File "/Users/buildslave/jenkins/workspace/lldb-cmake/llvm-project/lldb/packages/Python/lldbsuite/test/lldbtest.py", line 1830, in test_method return attrvalue(self) File "/Users/buildslave/jenkins/workspace/lldb-cmake/llvm-project/lldb/packages/Python/lldbsuite/test/decorators.py", line 149, in wrapper return func(*args, **kwargs) File "/Users/buildslave/jenkins/workspace/lldb-cmake/llvm-project/lldb/packages/Python/lldbsuite/test/decorators.py", line 149, in wrapper return func(*args, **kwargs) File "/Users/buildslave/jenkins/workspace/lldb-cmake/llvm-project/lldb/test/API/commands/expression/persist_objc_pointeetype/TestPersistObjCPointeeType.py", line 41, in test_with self.runCmd("run", RUN_SUCCEEDED) File "/Users/buildslave/jenkins/workspace/lldb-cmake/llvm-project/lldb/packages/Python/lldbsuite/test/lldbtest.py", line 2161, in runCmd msg if (msg) else CMD_MSG(cmd)) AssertionError: False is not True : Process is launched successfully Error output: error: process exited with status -1 (tried to attach to process already being debugged)

Hide Details

Config=x86_64-/Users/buildslave/jenkins/workspace/lldb-cmake/lldb-build/bin/clang ---------------------------------------------------------------------- Ran 4 tests in 80.279s

Hide Details

RESULT: FAILED (1 passes, 2 failures, 0 errors, 1 skipped, 0 expected failures, 0 unexpected successes)

Hide Details

--

Hide Details

******************** PASS: lldb-shell :: SymbolFile/DWARF/x86/split-dwarf-multiple-cu.ll (1918 of 2337) PASS: lldb-unit :: Expression/./ExpressionTests/DWARFExpression.DW_OP_unknown (1919 of 2337) PASS: lldb-api :: commands/target/auto-install-main-executable/TestAutoInstallMainExecutable.py (1920 of 2337) FAIL: lldb-api :: functionalities/data-formatter/user-format-vs-summary/TestUserFormatVsSummary.py (1921 of 2337) ******************** TEST 'lldb-api :: functionalities/data-formatter/user-format-vs-summary/TestUserFormatVsSummary.py' FAILED ******************** Script: -- /usr/local/Frameworks/Python.framework/Versions/3.7/bin/python3.7 /Users/buildslave/jenkins/workspace/lldb-cmake/llvm-project/lldb/test/API/dotest.py -u CXXFLAGS -u CFLAGS --codesign-identity - --arch x86_64 --build-dir /Users/buildslave/jenkins/workspace/lldb-cmake/lldb-build/lldb-test-build.noindex -t --env TERM=vt100 --env LLVM_LIBS_DIR=/Users/buildslave/jenkins/workspace/lldb-cmake/lldb-build/./lib --arch x86_64 --build-dir /Users/buildslave/jenkins/workspace/lldb-cmake/lldb-build/lldb-test-build.noindex --lldb-module-cache-dir /Users/buildslave/jenkins/workspace/lldb-cmake/lldb-build/lldb-test-build.noindex/module-cache-lldb/lldb-api --clang-module-cache-dir /Users/buildslave/jenkins/workspace/lldb-cmake/lldb-build/lldb-test-build.noindex/module-cache-clang/lldb-api --executable /Users/buildslave/jenkins/workspace/lldb-cmake/lldb-build/./bin/lldb --compiler /Users/buildslave/jenkins/workspace/lldb-cmake/lldb-build/./bin/clang --dsymutil /Users/buildslave/jenkins/workspace/lldb-cmake/lldb-build/./bin/dsymutil --llvm-tools-dir /Users/buildslave/jenkins/workspace/lldb-cmake/lldb-build/./bin --lldb-libs-dir /Users/buildslave/jenkins/workspace/lldb-cmake/lldb-build/./lib /Users/buildslave/jenkins/workspace/lldb-cmake/llvm-project/lldb/test/API/functionalities/data-formatter/user-format-vs-summary -p TestUserFormatVsSummary.py -- Exit Code: 1

Hide Details

Command Output (stdout): -- lldb version 13.0.99 (http://labmaster3.local/git/llvm-project.git revision 6400905a615282c83a2fc6e49e57ff716aa8b4de) clang revision 6400905a615282c83a2fc6e49e57ff716aa8b4de llvm revision 6400905a615282c83a2fc6e49e57ff716aa8b4de Skipping the following test categories: ['darwin-log', 'libstdcxx', 'dwo', 'llgs', 'fork']

Hide Details

-- Command Output (stderr): -- Change dir to: /Users/buildslave/jenkins/workspace/lldb-cmake/llvm-project/lldb/test/API/functionalities/data-formatter/user-format-vs-summary runCmd: settings clear -all output:

Hide Details

runCmd: settings set symbols.enable-external-lookup false output:

Hide Details

runCmd: settings set target.inherit-tcc true output:

Hide Details

runCmd: settings set target.detach-on-error false output:

Hide Details

runCmd: settings set target.auto-apply-fixits false output:

Hide Details

runCmd: settings set plugin.process.gdb-remote.packet-timeout 60 output:

Hide Details

runCmd: settings set symbols.clang-modules-cache-path "/Users/buildslave/jenkins/workspace/lldb-cmake/lldb-build/lldb-test-build.noindex/module-cache-lldb/lldb-api" output:

Hide Details

runCmd: settings set use-color false output:

Hide Details

runCmd: setting set target.prefer-dynamic-value no-dynamic-values output:

Hide Details

runCmd: file /Users/buildslave/jenkins/workspace/lldb-cmake/lldb-build/lldb-test-build.noindex/functionalities/data-formatter/user-format-vs-summary/TestUserFormatVsSummary.test_with_run_command_dsym/a.out output: Current executable set to '/Users/buildslave/jenkins/workspace/lldb-cmake/lldb-build/lldb-test-build.noindex/functionalities/data-formatter/user-format-vs-summary/TestUserFormatVsSummary.test_with_run_command_dsym/a.out' (x86_64).

Hide Details

Hide Details

runCmd: breakpoint set -f "main.cpp" -l 10 output: Breakpoint 1: where = a.out`main + 34 at main.cpp:10:12, address = 0x0000000100000f52

Hide Details

Hide Details

Expecting pattern: ^Breakpoint (?P<bpno>[0-9]+): (?P<num_locations>[0-9]+) locations\.$ Not matched

Hide Details

Expecting pattern: ^Breakpoint (?P<bpno>[0-9]+): (?P<num_locations>no) locations \(pending\)\. Not matched

Hide Details

Expecting pattern: ^Breakpoint (?P<bpno>[0-9]+): where = (?P<module>.*)`(?P<symbol>[+\-]{0,1}[^+]+)( \+ (?P<offset>[0-9]+)){0,1}( \[inlined\] (?P<inline_symbol>.*)){0,1} at (?P<file>[^:]+):(?P<line_no>[0-9]+)(?P<column>(:[0-9]+)?), address = (?P<address>0x[0-9a-fA-F]+)$ Matched

Hide Details

runCmd: run runCmd failed! error: process exited with status -1 (tried to attach to process already being debugged)

Hide Details

Hide Details

Command 'run' failed!

Hide Details

FAIL: LLDB (/Users/buildslave/jenkins/workspace/lldb-cmake/lldb-build/bin/clang-x86_64) :: test_with_run_command_dsym (TestUserFormatVsSummary.UserFormatVSSummaryTestCase) <bound method SBProcess.Kill of <lldb.SBProcess; proxy of <Swig Object of type 'lldb::SBProcess *' at 0x106663960> >>: success

Hide Details

runCmd: settings clear -all output:

Hide Details

runCmd: settings set symbols.enable-external-lookup false output:

Hide Details

runCmd: settings set target.inherit-tcc true output:

Hide Details

runCmd: settings set target.detach-on-error false output:

Hide Details

runCmd: settings set target.auto-apply-fixits false output:

Hide Details

runCmd: settings set plugin.process.gdb-remote.packet-timeout 60 output:

Hide Details

runCmd: settings set symbols.clang-modules-cache-path "/Users/buildslave/jenkins/workspace/lldb-cmake/lldb-build/lldb-test-build.noindex/module-cache-lldb/lldb-api" output:

Hide Details

runCmd: settings set use-color false output:

Hide Details

runCmd: setting set target.prefer-dynamic-value no-dynamic-values output:

Hide Details

runCmd: file /Users/buildslave/jenkins/workspace/lldb-cmake/lldb-build/lldb-test-build.noindex/functionalities/data-formatter/user-format-vs-summary/TestUserFormatVsSummary.test_with_run_command_dwarf/a.out output: Current executable set to '/Users/buildslave/jenkins/workspace/lldb-cmake/lldb-build/lldb-test-build.noindex/functionalities/data-formatter/user-format-vs-summary/TestUserFormatVsSummary.test_with_run_command_dwarf/a.out' (x86_64).

Hide Details

Hide Details

runCmd: breakpoint set -f "main.cpp" -l 10 output: Breakpoint 1: where = a.out`main + 34 at main.cpp:10:12, address = 0x0000000100000f52

Hide Details

Hide Details

Expecting pattern: ^Breakpoint (?P<bpno>[0-9]+): (?P<num_locations>[0-9]+) locations\.$ Not matched

Hide Details

Expecting pattern: ^Breakpoint (?P<bpno>[0-9]+): (?P<num_locations>no) locations \(pending\)\. Not matched

Hide Details

Expecting pattern: ^Breakpoint (?P<bpno>[0-9]+): where = (?P<module>.*)`(?P<symbol>[+\-]{0,1}[^+]+)( \+ (?P<offset>[0-9]+)){0,1}( \[inlined\] (?P<inline_symbol>.*)){0,1} at (?P<file>[^:]+):(?P<line_no>[0-9]+)(?P<column>(:[0-9]+)?), address = (?P<address>0x[0-9a-fA-F]+)$ Matched

Hide Details

runCmd: run runCmd failed! error: process exited with status -1 (tried to attach to process already being debugged)

Hide Details

Hide Details

Command 'run' failed!

Hide Details

FAIL: LLDB (/Users/buildslave/jenkins/workspace/lldb-cmake/lldb-build/bin/clang-x86_64) :: test_with_run_command_dwarf (TestUserFormatVsSummary.UserFormatVSSummaryTestCase) <bound method SBProcess.Kill of <lldb.SBProcess; proxy of <Swig Object of type 'lldb::SBProcess *' at 0x1064b6bd0> >>: success

Hide Details

UNSUPPORTED: LLDB (/Users/buildslave/jenkins/workspace/lldb-cmake/lldb-build/bin/clang-x86_64) :: test_with_run_command_dwo (TestUserFormatVsSummary.UserFormatVSSummaryTestCase) (test case does not fall in any category of interest for this run) runCmd: settings clear -all output:

Hide Details

runCmd: settings set symbols.enable-external-lookup false output:

Hide Details

runCmd: settings set target.inherit-tcc true output:

Hide Details

runCmd: settings set target.detach-on-error false output:

Hide Details

runCmd: settings set target.auto-apply-fixits false output:

Hide Details

runCmd: settings set plugin.process.gdb-remote.packet-timeout 60 output:

Hide Details

runCmd: settings set symbols.clang-modules-cache-path "/Users/buildslave/jenkins/workspace/lldb-cmake/lldb-build/lldb-test-build.noindex/module-cache-lldb/lldb-api" output:

Hide Details

runCmd: settings set use-color false output:

Hide Details

runCmd: setting set target.prefer-dynamic-value no-dynamic-values output:

Hide Details

runCmd: file /Users/buildslave/jenkins/workspace/lldb-cmake/lldb-build/lldb-test-build.noindex/functionalities/data-formatter/user-format-vs-summary/TestUserFormatVsSummary.test_with_run_command_gmodules/a.out output: Current executable set to '/Users/buildslave/jenkins/workspace/lldb-cmake/lldb-build/lldb-test-build.noindex/functionalities/data-formatter/user-format-vs-summary/TestUserFormatVsSummary.test_with_run_command_gmodules/a.out' (x86_64).

Hide Details

Hide Details

runCmd: breakpoint set -f "main.cpp" -l 10 output: Breakpoint 1: where = a.out`main + 34 at main.cpp:10:12, address = 0x0000000100000f52

Hide Details

Hide Details

Expecting pattern: ^Breakpoint (?P<bpno>[0-9]+): (?P<num_locations>[0-9]+) locations\.$ Not matched

Hide Details

Expecting pattern: ^Breakpoint (?P<bpno>[0-9]+): (?P<num_locations>no) locations \(pending\)\. Not matched

Hide Details

Expecting pattern: ^Breakpoint (?P<bpno>[0-9]+): where = (?P<module>.*)`(?P<symbol>[+\-]{0,1}[^+]+)( \+ (?P<offset>[0-9]+)){0,1}( \[inlined\] (?P<inline_symbol>.*)){0,1} at (?P<file>[^:]+):(?P<line_no>[0-9]+)(?P<column>(:[0-9]+)?), address = (?P<address>0x[0-9a-fA-F]+)$ Matched

Hide Details

runCmd: run output: Process 82234 stopped * thread #1, queue = 'com.apple.main-thread', stop reason = breakpoint 1.1 frame #0: 0x0000000100000f52 a.out`main at main.cpp:10:12 7 8 int main() { 9 Pair p1(3,-3); -> 10 return p1.x + p1.y; // Set break point at this line. ^ 11 } Process 82234 launched: '/Users/buildslave/jenkins/workspace/lldb-cmake/lldb-build/lldb-test-build.noindex/functionalities/data-formatter/user-format-vs-summary/TestUserFormatVsSummary.test_with_run_command_gmodules/a.out' (x86_64)

Hide Details

Hide Details

runCmd: thread list output: Process 82234 stopped * thread #1: tid = 0xbe1bf, 0x0000000100000f52 a.out`main at main.cpp:10:12, queue = 'com.apple.main-thread', stop reason = breakpoint 1.1

Hide Details

Hide Details

Ran command: "thread list"

Hide Details

Got output: Process 82234 stopped * thread #1: tid = 0xbe1bf, 0x0000000100000f52 a.out`main at main.cpp:10:12, queue = 'com.apple.main-thread', stop reason = breakpoint 1.1

Hide Details

Expecting sub string: "stopped" (was found) Expecting sub string: "stop reason = breakpoint" (was found)

Hide Details

runCmd: frame variable p1 output: (Pair) p1 = (x = 3, y = -3)

Hide Details

Hide Details

Ran command: "frame variable p1"

Hide Details

Got output: (Pair) p1 = (x = 3, y = -3)

Hide Details

Expecting sub string: "(Pair) p1 = (x = 3, y = -3)" (was found)

Hide Details

Adding tearDown hook: def cleanup(): self.runCmd('type format clear', check=False) self.runCmd('type summary clear', check=False)

Hide Details

Hide Details

runCmd: type summary add Pair -s "x=${var.x%d},y=${var.y%u}" output:

Hide Details

runCmd: frame variable p1 output: (Pair) p1 = x=3,y=4294967293

Hide Details

Hide Details

Ran command: "frame variable p1"

Hide Details

Got output: (Pair) p1 = x=3,y=4294967293

Hide Details

Expecting sub string: "(Pair) p1 = x=3,y=4294967293" (was found)

Hide Details

runCmd: frame variable -f x p1 output: (Pair) p1 = x=3,y=4294967293

Hide Details

Hide Details

Ran command: "frame variable -f x p1"

Hide Details

Got output: (Pair) p1 = x=3,y=4294967293

Hide Details

Not expecting sub string: "(Pair) p1 = x=0x00000003,y=0xfffffffd" (was not found)

Hide Details

runCmd: frame variable -f d p1 output: (Pair) p1 = x=3,y=4294967293

Hide Details

Hide Details

Ran command: "frame variable -f d p1"

Hide Details

Got output: (Pair) p1 = x=3,y=4294967293

Hide Details

Not expecting sub string: "(Pair) p1 = x=3,y=-3" (was not found)

Hide Details

runCmd: frame variable p1 output: (Pair) p1 = x=3,y=4294967293

Hide Details

Hide Details

Ran command: "frame variable p1"

Hide Details

Got output: (Pair) p1 = x=3,y=4294967293

Hide Details

Expecting sub string: "(Pair) p1 = x=3,y=4294967293" (was found)

Hide Details

runCmd: type summary add Pair -s "x=${var.x%x},y=${var.y%u}" output:

Hide Details

runCmd: frame variable p1 output: (Pair) p1 = x=0x00000003,y=4294967293

Hide Details

Hide Details

Ran command: "frame variable p1"

Hide Details

Got output: (Pair) p1 = x=0x00000003,y=4294967293

Hide Details

Expecting sub string: "(Pair) p1 = x=0x00000003,y=4294967293" (was found)

Hide Details

runCmd: frame variable -f d p1 output: (Pair) p1 = x=0x00000003,y=4294967293

Hide Details

Hide Details

Ran command: "frame variable -f d p1"

Hide Details

Got output: (Pair) p1 = x=0x00000003,y=4294967293

Hide Details

Not expecting sub string: "(Pair) p1 = x=3,y=-3" (was not found)

Hide Details

<bound method SBProcess.Kill of <lldb.SBProcess; proxy of <Swig Object of type 'lldb::SBProcess *' at 0x1064b6ed0> >>: success

Hide Details

Executing tearDown hook: def cleanup(): self.runCmd('type format clear', check=False) self.runCmd('type summary clear', check=False)

Hide Details

Hide Details

runCmd: type format clear check of return status not required output:

Hide Details

runCmd: type summary clear check of return status not required output:

Hide Details

PASS: LLDB (/Users/buildslave/jenkins/workspace/lldb-cmake/lldb-build/bin/clang-x86_64) :: test_with_run_command_gmodules (TestUserFormatVsSummary.UserFormatVSSummaryTestCase) Restore dir to: /Users/buildslave/jenkins/workspace/lldb-cmake/lldb-build/tools/lldb/test ====================================================================== FAIL: test_with_run_command_dsym (TestUserFormatVsSummary.UserFormatVSSummaryTestCase) Test that the user can input a format but it will not prevail over summary format's choices. ---------------------------------------------------------------------- Traceback (most recent call last): File "/Users/buildslave/jenkins/workspace/lldb-cmake/llvm-project/lldb/packages/Python/lldbsuite/test/lldbtest.py", line 1830, in test_method return attrvalue(self) File "/Users/buildslave/jenkins/workspace/lldb-cmake/llvm-project/lldb/test/API/functionalities/data-formatter/user-format-vs-summary/TestUserFormatVsSummary.py", line 30, in test_with_run_command self.runCmd("run", RUN_SUCCEEDED) File "/Users/buildslave/jenkins/workspace/lldb-cmake/llvm-project/lldb/packages/Python/lldbsuite/test/lldbtest.py", line 2161, in runCmd msg if (msg) else CMD_MSG(cmd)) AssertionError: False is not True : Process is launched successfully Error output: error: process exited with status -1 (tried to attach to process already being debugged)

Hide Details

Config=x86_64-/Users/buildslave/jenkins/workspace/lldb-cmake/lldb-build/bin/clang ====================================================================== FAIL: test_with_run_command_dwarf (TestUserFormatVsSummary.UserFormatVSSummaryTestCase) Test that the user can input a format but it will not prevail over summary format's choices. ---------------------------------------------------------------------- Traceback (most recent call last): File "/Users/buildslave/jenkins/workspace/lldb-cmake/llvm-project/lldb/packages/Python/lldbsuite/test/lldbtest.py", line 1830, in test_method return attrvalue(self) File "/Users/buildslave/jenkins/workspace/lldb-cmake/llvm-project/lldb/test/API/functionalities/data-formatter/user-format-vs-summary/TestUserFormatVsSummary.py", line 30, in test_with_run_command self.runCmd("run", RUN_SUCCEEDED) File "/Users/buildslave/jenkins/workspace/lldb-cmake/llvm-project/lldb/packages/Python/lldbsuite/test/lldbtest.py", line 2161, in runCmd msg if (msg) else CMD_MSG(cmd)) AssertionError: False is not True : Process is launched successfully Error output: error: process exited with status -1 (tried to attach to process already being debugged)

Hide Details

Config=x86_64-/Users/buildslave/jenkins/workspace/lldb-cmake/lldb-build/bin/clang ---------------------------------------------------------------------- Ran 4 tests in 88.920s

Hide Details

RESULT: FAILED (1 passes, 2 failures, 0 errors, 1 skipped, 0 expected failures, 0 unexpected successes)

Hide Details

--

Hide Details

******************** PASS: lldb-unit :: Utility/./UtilityTests/DataExtractorTest.GetCStrEmpty (1922 of 2337) PASS: lldb-unit :: Process/Utility/./ProcessUtilityTests/ProcSMapTests/LinuxProcSMapsTestFixture.ParseSMapRegions/0 (1923 of 2337) FAIL: lldb-api :: lang/objc/objc-foundation-dictionary-empty/TestNSDictionary0.py (1924 of 2337) ******************** TEST 'lldb-api :: lang/objc/objc-foundation-dictionary-empty/TestNSDictionary0.py' FAILED ******************** Script: -- /usr/local/Frameworks/Python.framework/Versions/3.7/bin/python3.7 /Users/buildslave/jenkins/workspace/lldb-cmake/llvm-project/lldb/test/API/dotest.py -u CXXFLAGS -u CFLAGS --codesign-identity - --arch x86_64 --build-dir /Users/buildslave/jenkins/workspace/lldb-cmake/lldb-build/lldb-test-build.noindex -t --env TERM=vt100 --env LLVM_LIBS_DIR=/Users/buildslave/jenkins/workspace/lldb-cmake/lldb-build/./lib --arch x86_64 --build-dir /Users/buildslave/jenkins/workspace/lldb-cmake/lldb-build/lldb-test-build.noindex --lldb-module-cache-dir /Users/buildslave/jenkins/workspace/lldb-cmake/lldb-build/lldb-test-build.noindex/module-cache-lldb/lldb-api --clang-module-cache-dir /Users/buildslave/jenkins/workspace/lldb-cmake/lldb-build/lldb-test-build.noindex/module-cache-clang/lldb-api --executable /Users/buildslave/jenkins/workspace/lldb-cmake/lldb-build/./bin/lldb --compiler /Users/buildslave/jenkins/workspace/lldb-cmake/lldb-build/./bin/clang --dsymutil /Users/buildslave/jenkins/workspace/lldb-cmake/lldb-build/./bin/dsymutil --llvm-tools-dir /Users/buildslave/jenkins/workspace/lldb-cmake/lldb-build/./bin --lldb-libs-dir /Users/buildslave/jenkins/workspace/lldb-cmake/lldb-build/./lib /Users/buildslave/jenkins/workspace/lldb-cmake/llvm-project/lldb/test/API/lang/objc/objc-foundation-dictionary-empty -p TestNSDictionary0.py -- Exit Code: 1

Hide Details

Command Output (stdout): -- lldb version 13.0.99 (http://labmaster3.local/git/llvm-project.git revision 6400905a615282c83a2fc6e49e57ff716aa8b4de) clang revision 6400905a615282c83a2fc6e49e57ff716aa8b4de llvm revision 6400905a615282c83a2fc6e49e57ff716aa8b4de Skipping the following test categories: ['darwin-log', 'libstdcxx', 'dwo', 'llgs', 'fork']

Hide Details

-- Command Output (stderr): -- Change dir to: /Users/buildslave/jenkins/workspace/lldb-cmake/llvm-project/lldb/test/API/lang/objc/objc-foundation-dictionary-empty runCmd: settings clear -all output:

Hide Details

runCmd: settings set symbols.enable-external-lookup false output:

Hide Details

runCmd: settings set target.inherit-tcc true output:

Hide Details

runCmd: settings set target.detach-on-error false output:

Hide Details

runCmd: settings set target.auto-apply-fixits false output:

Hide Details

runCmd: settings set plugin.process.gdb-remote.packet-timeout 60 output:

Hide Details

runCmd: settings set symbols.clang-modules-cache-path "/Users/buildslave/jenkins/workspace/lldb-cmake/lldb-build/lldb-test-build.noindex/module-cache-lldb/lldb-api" output:

Hide Details

runCmd: settings set use-color false output:

Hide Details

runCmd: setting set target.prefer-dynamic-value no-dynamic-values output:

Hide Details

FAIL: LLDB (/Users/buildslave/jenkins/workspace/lldb-cmake/lldb-build/bin/clang-x86_64) :: test_dsym (lldbsuite.test.lldbtest.TestNSDictionary0) <bound method SBProcess.Kill of <lldb.SBProcess; proxy of <Swig Object of type 'lldb::SBProcess *' at 0x111a611e0> >>: success

Hide Details

runCmd: settings clear -all output:

Hide Details

runCmd: settings set symbols.enable-external-lookup false output:

Hide Details

runCmd: settings set target.inherit-tcc true output:

Hide Details

runCmd: settings set target.detach-on-error false output:

Hide Details

runCmd: settings set target.auto-apply-fixits false output:

Hide Details

runCmd: settings set plugin.process.gdb-remote.packet-timeout 60 output:

Hide Details

runCmd: settings set symbols.clang-modules-cache-path "/Users/buildslave/jenkins/workspace/lldb-cmake/lldb-build/lldb-test-build.noindex/module-cache-lldb/lldb-api" output:

Hide Details

runCmd: settings set use-color false output:

Hide Details

runCmd: setting set target.prefer-dynamic-value no-dynamic-values output:

Hide Details

FAIL: LLDB (/Users/buildslave/jenkins/workspace/lldb-cmake/lldb-build/bin/clang-x86_64) :: test_dwarf (lldbsuite.test.lldbtest.TestNSDictionary0) <bound method SBProcess.Kill of <lldb.SBProcess; proxy of <Swig Object of type 'lldb::SBProcess *' at 0x109450bd0> >>: success

Hide Details

UNSUPPORTED: LLDB (/Users/buildslave/jenkins/workspace/lldb-cmake/lldb-build/bin/clang-x86_64) :: test_dwo (lldbsuite.test.lldbtest.TestNSDictionary0) (test case does not fall in any category of interest for this run) runCmd: settings clear -all output:

Hide Details

runCmd: settings set symbols.enable-external-lookup false output:

Hide Details

runCmd: settings set target.inherit-tcc true output:

Hide Details

runCmd: settings set target.detach-on-error false output:

Hide Details

runCmd: settings set target.auto-apply-fixits false output:

Hide Details

runCmd: settings set plugin.process.gdb-remote.packet-timeout 60 output:

Hide Details

runCmd: settings set symbols.clang-modules-cache-path "/Users/buildslave/jenkins/workspace/lldb-cmake/lldb-build/lldb-test-build.noindex/module-cache-lldb/lldb-api" output:

Hide Details

runCmd: settings set use-color false output:

Hide Details

runCmd: setting set target.prefer-dynamic-value no-dynamic-values output:

Hide Details

runCmd: frame var emptyDictionary output: (NSDictionary *) emptyDictionary = 0x00007fff8f72e780 0 key/value pairs

Hide Details

Hide Details

Ran command: "frame var emptyDictionary"

Hide Details

Got output: (NSDictionary *) emptyDictionary = 0x00007fff8f72e780 0 key/value pairs

Hide Details

Expecting sub string: "0 key/value pairs" (was found)

Hide Details

<bound method SBProcess.Kill of <lldb.SBProcess; proxy of <Swig Object of type 'lldb::SBProcess *' at 0x111a617b0> >>: success

Hide Details

PASS: LLDB (/Users/buildslave/jenkins/workspace/lldb-cmake/lldb-build/bin/clang-x86_64) :: test_gmodules (lldbsuite.test.lldbtest.TestNSDictionary0) Restore dir to: /Users/buildslave/jenkins/workspace/lldb-cmake/lldb-build/tools/lldb/test ====================================================================== FAIL: test_dsym (lldbsuite.test.lldbtest.TestNSDictionary0) ---------------------------------------------------------------------- Traceback (most recent call last): File "/Users/buildslave/jenkins/workspace/lldb-cmake/llvm-project/lldb/packages/Python/lldbsuite/test/lldbtest.py", line 1830, in test_method return attrvalue(self) File "/Users/buildslave/jenkins/workspace/lldb-cmake/llvm-project/lldb/packages/Python/lldbsuite/test/lldbinline.py", line 121, in _test self.do_test() File "/Users/buildslave/jenkins/workspace/lldb-cmake/llvm-project/lldb/packages/Python/lldbsuite/test/lldbinline.py", line 157, in do_test "inline test did not hit a single breakpoint") AssertionError: False is not True : inline test did not hit a single breakpoint Config=x86_64-/Users/buildslave/jenkins/workspace/lldb-cmake/lldb-build/bin/clang ====================================================================== FAIL: test_dwarf (lldbsuite.test.lldbtest.TestNSDictionary0) ---------------------------------------------------------------------- Traceback (most recent call last): File "/Users/buildslave/jenkins/workspace/lldb-cmake/llvm-project/lldb/packages/Python/lldbsuite/test/lldbtest.py", line 1830, in test_method return attrvalue(self) File "/Users/buildslave/jenkins/workspace/lldb-cmake/llvm-project/lldb/packages/Python/lldbsuite/test/lldbinline.py", line 121, in _test self.do_test() File "/Users/buildslave/jenkins/workspace/lldb-cmake/llvm-project/lldb/packages/Python/lldbsuite/test/lldbinline.py", line 157, in do_test "inline test did not hit a single breakpoint") AssertionError: False is not True : inline test did not hit a single breakpoint Config=x86_64-/Users/buildslave/jenkins/workspace/lldb-cmake/lldb-build/bin/clang ---------------------------------------------------------------------- Ran 4 tests in 90.439s

Hide Details

RESULT: FAILED (1 passes, 2 failures, 0 errors, 1 skipped, 0 expected failures, 0 unexpected successes)

Hide Details

--

Hide Details

******************** PASS: lldb-api :: tools/lldb-vscode/runInTerminal/TestVSCode_runInTerminal.py (1925 of 2337) UNSUPPORTED: lldb-api :: lang/cpp/function-template-parameter-pack/TestFunctionTemplateParameterPack.py (1926 of 2337) PASS: lldb-api :: lang/c/stepping/TestThreadStepping.py (1927 of 2337) PASS: lldb-unit :: Editline/./EditlineTests/EditlineTestFixture.EditlineReceivesSingleLineText (1928 of 2337) PASS: lldb-unit :: Core/./LLDBCoreTests/MangledTest.EmptyForInvalidName (1929 of 2337) PASS: lldb-api :: lang/c/stepping/TestStepAndBreakpoints.py (1930 of 2337) PASS: lldb-shell :: SymbolFile/Breakpad/line-table-discontinuous-file-ids.test (1931 of 2337) PASS: lldb-api :: functionalities/type_completion/TestTypeCompletion.py (1932 of 2337) PASS: lldb-api :: lang/cpp/unique-types/TestUniqueTypes.py (1933 of 2337) PASS: lldb-api :: lang/objc/objc-struct-argument/TestObjCStructArgument.py (1934 of 2337) PASS: lldb-unit :: Utility/./UtilityTests/Flags.Clear (1935 of 2337) PASS: lldb-unit :: Utility/./UtilityTests/StringListTest.AppendStringCString (1936 of 2337) UNSUPPORTED: lldb-shell :: Register/aarch64-gp-read.test (1937 of 2337) PASS: lldb-unit :: Symbol/./SymbolTests/TestTypeSystemClang.TestConvertAccessTypeToAccessSpecifier (1938 of 2337) PASS: lldb-shell :: Commands/command-source.test (1939 of 2337) UNSUPPORTED: lldb-api :: lang/c/typedef/Testtypedef.py (1940 of 2337) PASS: lldb-api :: commands/expression/vector_of_enums/TestVectorOfEnums.py (1941 of 2337) PASS: lldb-shell :: ScriptInterpreter/Python/command_relative_import.test (1942 of 2337) PASS: lldb-api :: assert_messages_test/TestAssertMessages.py (1943 of 2337) PASS: lldb-unit :: ScriptInterpreter/Python/./ScriptInterpreterPythonTests/PythonDataObjectsTest.TestPythonCallableInvoke (1944 of 2337) PASS: lldb-shell :: SymbolFile/NativePDB/break-by-line.cpp (1945 of 2337) PASS: lldb-api :: lang/cpp/chained-calls/TestCppChainedCalls.py (1946 of 2337) UNSUPPORTED: lldb-shell :: ScriptInterpreter/Lua/partial_statements.test (1947 of 2337) PASS: lldb-api :: lang/objc/objc-stepping/TestObjCStepping.py (1948 of 2337) PASS: lldb-unit :: Language/Highlighting/./HighlighterTests/HighlighterTest.ClangPreserveNewLine (1949 of 2337) PASS: lldb-api :: functionalities/gdb_remote_client/TestStopPCs.py (1950 of 2337) PASS: lldb-unit :: Expression/./ExpressionTests/DiagnosticManagerTest.GetStringPreserveOrder (1951 of 2337) PASS: lldb-unit :: Utility/./UtilityTests/LogTest.Register (1952 of 2337) PASS: lldb-unit :: Utility/./UtilityTests/StringListTest.AppendStringStdString (1953 of 2337) PASS: lldb-unit :: Utility/./UtilityTests/StringLexerTest.NextIfList (1954 of 2337) PASS: lldb-api :: functionalities/data-formatter/data-formatter-cpp/TestDataFormatterCpp.py (1955 of 2337) PASS: lldb-unit :: Utility/./UtilityTests/DataExtractorTest.GetFloat (1956 of 2337) PASS: lldb-shell :: SymbolFile/DWARF/x86/debug-types-missing-signature.test (1957 of 2337) PASS: lldb-unit :: Utility/./UtilityTests/XcodeSDKTest.ParseTest (1958 of 2337) PASS: lldb-api :: commands/expression/formatters/TestFormatters.py (1959 of 2337) PASS: lldb-unit :: Expression/./ExpressionTests/CppModuleConfigurationTest.LinuxLocalLibCpp (1960 of 2337) PASS: lldb-shell :: ObjectFile/PECOFF/sections-names.yaml (1961 of 2337) PASS: lldb-api :: functionalities/tail_call_frames/inlining_and_tail_calls/TestInliningAndTailCalls.py (1962 of 2337) PASS: lldb-unit :: ScriptInterpreter/Python/./ScriptInterpreterPythonTests/PythonDataObjectsTest.TestRun (1963 of 2337) PASS: lldb-api :: commands/expression/import-std-module/weak_ptr-dbg-info-content/TestDbgInfoContentWeakPtrFromStdModule.py (1964 of 2337) PASS: lldb-api :: functionalities/data-formatter/data-formatter-stl/libcxx/bitset/TestDataFormatterLibcxxBitset.py (1965 of 2337) PASS: lldb-shell :: Register/Core/x86-64-linux-fp.test (1966 of 2337) UNSUPPORTED: lldb-api :: commands/expression/completion-crash-invalid-iterator/TestInvalidIteratorCompletionCrash.py (1967 of 2337) PASS: lldb-shell :: Reproducer/TestPythonImport.test (1968 of 2337) PASS: lldb-api :: commands/watchpoints/multiple_threads/TestWatchpointMultipleThreads.py (1969 of 2337) PASS: lldb-api :: lang/c/local_types/TestUseClosestType.py (1970 of 2337) PASS: lldb-shell :: SymbolFile/DWARF/x86/DW_TAG_variable-invalid_location.s (1971 of 2337) PASS: lldb-unit :: Host/./HostTests/NativeProcessProtocolTest.SetBreakpointFailRead (1972 of 2337) PASS: lldb-api :: lang/cpp/this_class_type_mixing/TestThisClassTypeMixing.py (1973 of 2337) UNSUPPORTED: lldb-api :: tools/lldb-server/vCont-threads/TestGdbRemote_vContThreads.py (1974 of 2337) PASS: lldb-unit :: Utility/./UtilityTests/ArgsTest.TestMultipleArgs (1975 of 2337) PASS: lldb-unit :: Utility/./UtilityTests/SerializationRountripTest.SerializeDeserializeCString (1976 of 2337) PASS: lldb-unit :: ScriptInterpreter/Python/./ScriptInterpreterPythonTests/PythonDataObjectsTest.TestScript (1977 of 2337) PASS: lldb-unit :: Process/gdb-remote/./ProcessGdbRemoteTests/GDBRemoteCommunicationClientTest.WriteRegisterNoSuffix (1978 of 2337) PASS: lldb-api :: functionalities/data-formatter/hexcaps/TestDataFormatterHexCaps.py (1979 of 2337) PASS: lldb-unit :: Utility/./UtilityTests/FileSpecTest.EqualDotsWindows (1980 of 2337) UNSUPPORTED: lldb-api :: functionalities/darwin_log/source/info/TestDarwinLogSourceInfo.py (1981 of 2337) PASS: lldb-api :: commands/expression/pr35310/TestExprsBug35310.py (1982 of 2337) PASS: lldb-api :: lang/objc/rdar-10967107/TestRdar10967107.py (1983 of 2337) PASS: lldb-shell :: Driver/TestSingleQuote.test (1984 of 2337) PASS: lldb-api :: functionalities/data-formatter/data-formatter-objc/TestDataFormatterObjCExpr.py (1985 of 2337) UNSUPPORTED: lldb-api :: benchmarks/expression/TestExpressionCmd.py (1986 of 2337) PASS: lldb-shell :: SymbolFile/DWARF/x86/debug_ranges_and_rnglists.test (1987 of 2337) PASS: lldb-shell :: ObjectFile/PECOFF/symbol.yaml (1988 of 2337) PASS: lldb-api :: macosx/lc-note/firmware-corefile/TestFirmwareCorefiles.py (1989 of 2337) PASS: lldb-unit :: ObjectFile/ELF/./ObjectFileELFTests/ObjectFileELFTest.GetSymtab_NoSymEntryPointArmThumbAddressClass (1990 of 2337) UNSUPPORTED: lldb-api :: linux/thread/create_during_instruction_step/TestCreateDuringInstructionStep.py (1991 of 2337) PASS: lldb-api :: functionalities/gdb_remote_client/TestRegDefinitionInParts.py (1992 of 2337) PASS: lldb-api :: functionalities/breakpoint/source_regexp/TestSourceRegexBreakpoints.py (1993 of 2337) PASS: lldb-unit :: Utility/./UtilityTests/StreamTest.AddressSize (1994 of 2337) PASS: lldb-api :: functionalities/breakpoint/address_breakpoints/TestBadAddressBreakpoints.py (1995 of 2337) PASS: lldb-unit :: Symbol/./SymbolTests/TestTypeSystemClang.TestRecordHasFields (1996 of 2337) PASS: lldb-api :: lang/objc/single-entry-dictionary/TestObjCSingleEntryDictionary.py (1997 of 2337) PASS: lldb-shell :: Reproducer/Modules/TestModuleCXX.test (1998 of 2337) PASS: lldb-api :: functionalities/thread/concurrent_events/TestConcurrentSignalWatchBreak.py (1999 of 2337) PASS: lldb-shell :: Breakpoint/case-sensitive.test (2000 of 2337) PASS: lldb-api :: functionalities/thread/concurrent_events/TestConcurrentDelayedCrashWithBreakpointSignal.py (2001 of 2337) PASS: lldb-unit :: UnwindAssembly/x86/./UnwindAssemblyx86Tests/Testx86AssemblyInspectionEngine.TestStackRealign32BitDisp_x86_64 (2002 of 2337) PASS: lldb-unit :: Utility/./UtilityTests/BinaryStreamTest.PutSLEB128MaxValue (2003 of 2337) PASS: lldb-unit :: Utility/./UtilityTests/ScalarTest.RightShiftOperator (2004 of 2337) PASS: lldb-unit :: Expression/./ExpressionTests/DiagnosticManagerTest.AppendMessageNoDiag (2005 of 2337) PASS: lldb-api :: lang/cpp/multiple-inheritance/TestCppMultipleInheritance.py (2006 of 2337) PASS: lldb-api :: functionalities/data-formatter/pyobjsynthprovider/TestPyObjSynthProvider.py (2007 of 2337) PASS: lldb-unit :: Utility/./UtilityTests/LogChannelEnabledTest.LogGetLogThread (2008 of 2337) PASS: lldb-api :: commands/expression/timeout/TestCallWithTimeout.py (2009 of 2337) UNSUPPORTED: lldb-api :: functionalities/darwin_log/filter/exact_match/activity/TestDarwinLogFilterMatchActivity.py (2010 of 2337) PASS: lldb-unit :: Process/gdb-remote/./ProcessGdbRemoteTests/GDBRemoteClientBaseTest.SendContinueDelegateStructuredDataReceipt (2011 of 2337) PASS: lldb-unit :: Utility/./UtilityTests/StreamTest.ChangingByteOrder (2012 of 2337) UNSUPPORTED: lldb-api :: commands/watchpoints/variable_out_of_scope/TestWatchedVarHitWhenInScope.py (2013 of 2337) PASS: lldb-shell :: Register/Core/x86-64-linux-addr.test (2014 of 2337) UNSUPPORTED: lldb-api :: functionalities/darwin_log/filter/regex/category/TestDarwinLogFilterRegexCategory.py (2015 of 2337) PASS: lldb-api :: functionalities/data-formatter/stringprinter/TestStringPrinter.py (2016 of 2337) PASS: lldb-unit :: Utility/./UtilityTests/DataExtractorTest.GetCStrUnterminated (2017 of 2337) PASS: lldb-unit :: Utility/./UtilityTests/StatusTest.ErrorConversion (2018 of 2337) PASS: lldb-unit :: Core/./LLDBCoreTests/UniqueCStringMap.NoDefaultConstructor (2019 of 2337) UNSUPPORTED: lldb-api :: functionalities/darwin_log/basic/TestDarwinLogBasic.py (2020 of 2337) PASS: lldb-api :: commands/statistics/basic/TestStats.py (2021 of 2337) UNSUPPORTED: lldb-shell :: Register/x86-64-gp-write.test (2022 of 2337) PASS: lldb-unit :: Utility/./UtilityTests/UriParserTest.SchemeHostSeparator4 (2023 of 2337) PASS: lldb-unit :: Utility/./UtilityTests/StringListTest.AppendStringMove (2024 of 2337) PASS: lldb-unit :: Utility/./UtilityTests/StringListTest.CopyList (2025 of 2337) PASS: lldb-unit :: Host/./HostTests/HostInfoTest.GetHostname (2026 of 2337) PASS: lldb-unit :: Utility/./UtilityTests/StreamTest.PutCStringWithStringRef (2027 of 2337) PASS: lldb-api :: functionalities/thread/concurrent_events/TestConcurrentDelaySignalBreak.py (2028 of 2337) PASS: lldb-unit :: Utility/./UtilityTests/FileSpecTest.RemoveLastPathComponent (2029 of 2337) PASS: lldb-unit :: SymbolFile/NativePDB/./SymbolFileNativePDBTests/PDBFPOProgramToDWARFExpressionTests.InvalidOpUnary (2030 of 2337) PASS: lldb-unit :: Utility/./UtilityTests/AnsiTerminal.Unknown (2031 of 2337) PASS: lldb-unit :: Language/Highlighting/./HighlighterTests/HighlighterTest.ClangSquareBrackets (2032 of 2337) PASS: lldb-api :: macosx/nslog/TestDarwinNSLogOutput.py (2033 of 2337) PASS: lldb-shell :: SymbolFile/DWARF/x86/debug-types-basic.test (2034 of 2337) PASS: lldb-unit :: Target/./TargetTests/PathMappingListTest.RelativeTests (2035 of 2337) PASS: lldb-api :: functionalities/testid/TestTestId.py (2036 of 2337) PASS: lldb-unit :: Utility/./UtilityTests/ArgsTest.TestAppendArg (2037 of 2337) PASS: lldb-unit :: Utility/./UtilityTests/RecordReplayTest.InvalidSequence (2038 of 2337) PASS: lldb-unit :: Process/gdb-remote/./ProcessGdbRemoteTests/GDBRemoteClientBaseTest.SendContinueAndLateInterrupt (2039 of 2337) PASS: lldb-unit :: Core/./LLDBCoreTests/ModuleSpecTest.TestMachOFile (2040 of 2337) PASS: lldb-api :: lang/c/set_values/TestSetValues.py (2041 of 2337) PASS: lldb-unit :: Utility/./UtilityTests/StringExtractorTest.GetU64BigEndian (2042 of 2337) UNSUPPORTED: lldb-api :: commands/register/register/aarch64_sve_registers/rw_access_dynamic_resize/TestSVEThreadedDynamic.py (2043 of 2337) PASS: lldb-unit :: Language/CPlusPlus/./LanguageCPlusPlusTests/CPlusPlusLanguage.CPlusPlusNameParser (2044 of 2337) UNSUPPORTED: lldb-api :: functionalities/thread/state/TestThreadStates.py (2045 of 2337) PASS: lldb-unit :: Utility/./UtilityTests/RangeTest.SlideZero (2046 of 2337) PASS: lldb-unit :: Utility/./UtilityTests/RangeVector.CombineConsecutiveRanges (2047 of 2337) PASS: lldb-api :: lang/cpp/wchar_t/TestCxxWCharT.py (2048 of 2337) PASS: lldb-shell :: ObjectFile/ELF/build-id-case.yaml (2049 of 2337) PASS: lldb-api :: lang/cpp/class-template-type-parameter-pack/TestClassTemplateTypeParameterPack.py (2050 of 2337) PASS: lldb-api :: lang/objc/bitfield_ivars/TestBitfieldIvars.py (2051 of 2337) PASS: lldb-api :: python_api/get-value-32bit-int/TestGetValue32BitInt.py (2052 of 2337) PASS: lldb-api :: functionalities/thread/concurrent_events/TestConcurrentCrashWithWatchpointBreakpointSignal.py (2053 of 2337) PASS: lldb-api :: functionalities/data-formatter/data-formatter-disabling/TestDataFormatterDisabling.py (2054 of 2337) PASS: lldb-unit :: Host/./HostTests/FileActionTest.Open (2055 of 2337) PASS: lldb-api :: python_api/default-constructor/TestDefaultConstructorForAPIObjects.py (2056 of 2337) PASS: lldb-api :: python_api/sberror/TestSBError.py (2057 of 2337) UNSUPPORTED: lldb-shell :: SymbolFile/PDB/enums-layout.test (2058 of 2337) PASS: lldb-unit :: Utility/./UtilityTests/GeneratorTest.Create (2059 of 2337) PASS: lldb-shell :: Quit/TestQuitExitCodeNonInt.test (2060 of 2337) PASS: lldb-api :: commands/expression/completion-crash-incomplete-record/TestCompletionCrashIncompleteRecord.py (2061 of 2337) PASS: lldb-api :: functionalities/breakpoint/objc/TestObjCBreakpoints.py (2062 of 2337) PASS: lldb-unit :: Utility/./UtilityTests/SerializationRountripTest.SerializeDeserializeCStringArray (2063 of 2337) PASS: lldb-api :: lang/c/enum_types/TestEnumTypes.py (2064 of 2337) PASS: lldb-shell :: Driver/TestFile.test (2065 of 2337) PASS: lldb-unit :: Utility/./UtilityTests/ArgsTest.EscapeLLDBCommandArgument (2066 of 2337) PASS: lldb-unit :: Process/Utility/./ProcessUtilityTests/ProcSMapTests/LinuxProcSMapsTestFixture.ParseSMapRegions/6 (2067 of 2337) PASS: lldb-shell :: ObjectFile/ELF/section-permissions.yaml (2068 of 2337) PASS: lldb-shell :: Register/Core/x86-64-freebsd-gp.test (2069 of 2337) PASS: lldb-api :: python_api/value/change_values/TestChangeValueAPI.py (2070 of 2337) PASS: lldb-api :: python_api/symbol-context/TestSymbolContext.py (2071 of 2337) PASS: lldb-unit :: Process/gdb-remote/./ProcessGdbRemoteTests/GDBRemoteCommunicationClientTest.SendTraceSupportedPacket (2072 of 2337) UNSUPPORTED: lldb-shell :: SymbolFile/DWARF/debug-types-expressions.test (2073 of 2337) PASS: lldb-api :: lang/objc/cpp_keyword_identifiers/TestCppKeywordsAsObjCIdentifiers.py (2074 of 2337) PASS: lldb-api :: functionalities/gdb_remote_client/TestJLink6Armv7RegisterDefinition.py (2075 of 2337) PASS: lldb-unit :: ScriptInterpreter/Python/./ScriptInterpreterPythonTests/PythonDataObjectsTest.TestDictionaryResolutionWithDot (2076 of 2337) PASS: lldb-shell :: ScriptInterpreter/Python/python.test (2077 of 2337) PASS: lldb-unit :: Utility/./UtilityTests/StringListTest.Assignment (2078 of 2337) PASS: lldb-unit :: Process/gdb-remote/./ProcessGdbRemoteTests/GDBRemoteCommunicationClientTest.GetQOffsets (2079 of 2337) PASS: lldb-api :: tools/lldb-vscode/stackTrace/TestVSCode_stackTrace.py (2080 of 2337) PASS: lldb-unit :: Utility/./UtilityTests/SharedCluster.ClusterManager (2081 of 2337) PASS: lldb-api :: commands/expression/result_numbering/TestResultNumbering.py (2082 of 2337) PASS: lldb-unit :: Utility/./UtilityTests/RangeTest.NotEqualInvalid (2083 of 2337) PASS: lldb-shell :: SymbolFile/DWARF/x86/dwarf5-atomic.s (2084 of 2337) PASS: lldb-api :: functionalities/data-formatter/refpointer-recursion/TestDataFormatterRefPtrRecursion.py (2085 of 2337) PASS: lldb-unit :: Process/gdb-remote/./ProcessGdbRemoteTests/GDBRemoteClientBaseTest.SendContinueDelegateInterface (2086 of 2337) PASS: lldb-api :: python_api/disassemble-raw-data/TestDisassembleRawData.py (2087 of 2337) PASS: lldb-unit :: Utility/./UtilityTests/AnsiTerminal.AtEnd (2088 of 2337) PASS: lldb-shell :: ObjectFile/MachO/lc_build_version.yaml (2089 of 2337) PASS: lldb-unit :: ObjectFile/MachO/./ObjectFileMachOTests/ObjectFileMachOTest.ModuleFromSharedCacheInfo (2090 of 2337) PASS: lldb-unit :: Utility/./UtilityTests/NameMatchesTest.StartsWith (2091 of 2337) PASS: lldb-shell :: Register/Core/x86-64-freebsd-addr.test (2092 of 2337) PASS: lldb-api :: commands/expression/function_template_specialization_temp_args/TestFunctionTemplateSpecializationTempArgs.py (2093 of 2337) PASS: lldb-unit :: Utility/./UtilityTests/StringExtractorTest.GetNameColonValueSuccess (2094 of 2337) PASS: lldb-unit :: Host/./HostTests/NativeProcessProtocolTest.ReadMemoryWithoutTrap (2095 of 2337) PASS: lldb-api :: tools/lldb-server/register-reading/TestGdbRemoteGPacket.py (2096 of 2337) UNSUPPORTED: lldb-api :: functionalities/darwin_log/format/TestDarwinLogMessageFormat.py (2097 of 2337) PASS: lldb-unit :: Utility/./UtilityTests/ArgsTest.ReplaceArgumentAtIndexFarOutOfRange (2098 of 2337) PASS: lldb-api :: terminal/TestEditline.py (2099 of 2337) PASS: lldb-api :: commands/thread/select/TestThreadSelect.py (2100 of 2337) PASS: lldb-shell :: SymbolFile/DWARF/x86/limit-debug-info.s (2101 of 2337) PASS: lldb-unit :: Utility/./UtilityTests/StreamTest.PutHex32ByteOrderLittle (2102 of 2337) PASS: lldb-unit :: Utility/./UtilityTests/ReproducerTest.SetReplay (2103 of 2337) PASS: lldb-shell :: ObjectFile/PECOFF/uuid.yaml (2104 of 2337) PASS: lldb-shell :: ObjectFile/PECOFF/invalid-export-table.yaml (2105 of 2337) PASS: lldb-api :: lang/c/const_variables/TestConstVariables.py (2106 of 2337) PASS: lldb-unit :: Utility/./UtilityTests/RangeTest.ContainsRange (2107 of 2337) PASS: lldb-unit :: UnwindAssembly/x86/./UnwindAssemblyx86Tests/Testx86AssemblyInspectionEngine.TestPopEBX (2108 of 2337) PASS: lldb-unit :: UnwindAssembly/x86/./UnwindAssemblyx86Tests/Testx86AssemblyInspectionEngine.Test64bitFramelessSmallStackFrame (2109 of 2337) PASS: lldb-unit :: Utility/./UtilityTests/RecordReplayTest.InstrumentedBar (2110 of 2337) PASS: lldb-api :: functionalities/breakpoint/breakpoint_ignore_count/TestBreakpointIgnoreCount.py (2111 of 2337) PASS: lldb-unit :: Target/./TargetTests/ExecutionContextTest.GetByteOrderProcess (2112 of 2337) PASS: lldb-api :: sample_test/TestSampleInlineTest.py (2113 of 2337) PASS: lldb-api :: functionalities/thread/concurrent_events/TestConcurrentManyWatchpoints.py (2114 of 2337) PASS: lldb-unit :: UnwindAssembly/x86/./UnwindAssemblyx86Tests/Testx86AssemblyInspectionEngine.TestPushImm (2115 of 2337) UNSUPPORTED: lldb-shell :: Register/x86-ymm-write.test (2116 of 2337) UNSUPPORTED: lldb-shell :: ObjectFile/ELF/minidebuginfo-set-and-hit-breakpoint.test (2117 of 2337) UNSUPPORTED: lldb-shell :: Unwind/unwind-plan-dwarf-dump.test (2118 of 2337) PASS: lldb-unit :: Utility/./UtilityTests/VASprintfTest.NoBufferResize (2119 of 2337) UNSUPPORTED: lldb-shell :: SymbolFile/PDB/typedefs.test (2120 of 2337) PASS: lldb-unit :: Utility/./UtilityTests/StreamTest.PutULEB128 (2121 of 2337) PASS: lldb-api :: commands/process/launch/TestProcessLaunch.py (2122 of 2337) PASS: lldb-api :: commands/help/TestHelp.py (2123 of 2337) PASS: lldb-unit :: SymbolFile/NativePDB/./SymbolFileNativePDBTests/PDBFPOProgramToDWARFExpressionTests.UnresolvedCyclicRegisterAssignmentReference (2124 of 2337) XFAIL: lldb-shell :: Register/x86-64-fp-write.test (2125 of 2337) PASS: lldb-unit :: ScriptInterpreter/Python/./ScriptInterpreterPythonTests/PythonDataObjectsTest.TestPythonStringToStructuredString (2126 of 2337) PASS: lldb-api :: lang/cpp/global_variables/TestCPPGlobalVariables.py (2127 of 2337) PASS: lldb-unit :: Core/./LLDBCoreTests/MangledTest.NameIndexes_FindFunctionSymbols (2128 of 2337) PASS: lldb-unit :: UnwindAssembly/x86/./UnwindAssemblyx86Tests/Testx86AssemblyInspectionEngine.TestAddESP (2129 of 2337) PASS: lldb-shell :: SymbolFile/NativePDB/disassembly.cpp (2130 of 2337) PASS: lldb-api :: functionalities/breakpoint/debugbreak/TestDebugBreak.py (2131 of 2337) PASS: lldb-unit :: Core/./LLDBCoreTests/RichManglingContextTest.FromCxxMethodName (2132 of 2337) PASS: lldb-unit :: Utility/./UtilityTests/RangeTest.LessThanInvalid (2133 of 2337) PASS: lldb-api :: lang/c/offsetof/TestOffsetof.py (2134 of 2337) PASS: lldb-api :: commands/expression/import-std-module/non-module-type-separation/TestNonModuleTypeSeparation.py (2135 of 2337) PASS: lldb-unit :: Utility/./UtilityTests/OptionsWithRawTest.EmptyArgsOnlySuffix (2136 of 2337) PASS: lldb-unit :: Expression/./ExpressionTests/DiagnosticManagerTest.GetStringSeverityLabels (2137 of 2337) PASS: lldb-unit :: Utility/./UtilityTests/RangeTest.ContainsAddrInvalid (2138 of 2337) PASS: lldb-api :: iohandler/resize/TestIOHandlerResizeNoEditline.py (2139 of 2337) PASS: lldb-shell :: Settings/TestStopCommandSourceOnError.test (2140 of 2337) PASS: lldb-unit :: Utility/./UtilityTests/VMRange.Reset (2141 of 2337) PASS: lldb-shell :: ObjectFile/ELF/netbsd-exec-8.99.30-amd64.yaml (2142 of 2337) PASS: lldb-unit :: Utility/./UtilityTests/SerializationRountripTest.SerializeDeserializeCStringArrayNullptr (2143 of 2337) PASS: lldb-unit :: Utility/./UtilityTests/Predicate.WaitForValueNotEqualTo (2144 of 2337) PASS: lldb-api :: functionalities/source-map/TestTargetSourceMap.py (2145 of 2337) PASS: lldb-api :: functionalities/breakpoint/breakpoint_conditions/TestBreakpointConditions.py (2146 of 2337) PASS: lldb-shell :: Expr/TestMultilineExpr.test (2147 of 2337) PASS: lldb-api :: commands/frame/diagnose/dereference-function-return/TestDiagnoseDereferenceFunctionReturn.py (2148 of 2337) PASS: lldb-api :: lang/objcxx/objcxx-ivar-vector/TestIvarVector.py (2149 of 2337) PASS: lldb-unit :: Utility/./UtilityTests/ProcessInstanceInfo.DumpTable_invalidUID (2150 of 2337) PASS: lldb-unit :: Symbol/./SymbolTests/LineEntryTest.GetSameLineContiguousAddressRangeNestedInline (2151 of 2337) PASS: lldb-api :: lang/cpp/trivial_abi/TestTrivialABI.py (2152 of 2337) PASS: lldb-shell :: SymbolFile/Breakpad/symtab-macho.test (2153 of 2337) PASS: lldb-unit :: Host/./HostTests/MainLoopTest.ReadObject (2154 of 2337) PASS: lldb-unit :: Utility/./UtilityTests/StringExtractorTest.GetHexBytesAvail_Partial (2155 of 2337) PASS: lldb-shell :: Breakpoint/jit-loader_rtdyld_elf.test (2156 of 2337) PASS: lldb-unit :: UnwindAssembly/x86/./UnwindAssemblyx86Tests/Testx86AssemblyInspectionEngine.TestPushEAX (2157 of 2337) PASS: lldb-unit :: UnwindAssembly/x86/./UnwindAssemblyx86Tests/Testx86AssemblyInspectionEngine.TestPushEDX (2158 of 2337) PASS: lldb-api :: python_api/process/TestProcessAPI.py (2159 of 2337) PASS: lldb-unit :: Utility/./UtilityTests/DataExtractorTest.GetDoubleUnaligned (2160 of 2337) PASS: lldb-unit :: Interpreter/./InterpreterTests/CompletionTest.DirCompletionUsername (2161 of 2337) PASS: lldb-shell :: Driver/LocalLLDBInit.test (2162 of 2337) PASS: lldb-unit :: Utility/./UtilityTests/StringListTest.GetMaxStringLengthIncreasingSize (2163 of 2337) PASS: lldb-unit :: Utility/./UtilityTests/CompletionRequest.DuplicateFiltering (2164 of 2337) UNSUPPORTED: lldb-api :: functionalities/darwin_log/filter/exact_match/category/TestDarwinLogFilterMatchCategory.py (2165 of 2337) PASS: lldb-unit :: Core/./LLDBCoreTests/FormatEntityTest.DefinitionConstructionNameTypeChildren (2166 of 2337) PASS: lldb-api :: lang/cpp/nsimport/TestCppNsImport.py (2167 of 2337) PASS: lldb-api :: functionalities/data-formatter/setvaluefromcstring/TestSetValueFromCString.py (2168 of 2337) PASS: lldb-api :: commands/expression/call-function/TestCallStopAndContinue.py (2169 of 2337) PASS: lldb-api :: lang/objc/modules-app-update/TestClangModulesAppUpdate.py (2170 of 2337) PASS: lldb-unit :: Utility/./UtilityTests/BinaryStreamTest.PutULEB128OneByte (2171 of 2337) PASS: lldb-unit :: Core/./LLDBCoreTests/RichManglingContextTest.SwitchProvider (2172 of 2337) PASS: lldb-api :: python_api/frame/TestFrames.py (2173 of 2337) PASS: lldb-unit :: UnwindAssembly/x86/./UnwindAssemblyx86Tests/Testx86AssemblyInspectionEngine.TestPushRBP (2174 of 2337) PASS: lldb-api :: tools/lldb-vscode/console/TestVSCode_redirection_to_console.py (2175 of 2337) PASS: lldb-api :: commands/gui/basicdebug/TestGuiBasicDebug.py (2176 of 2337) PASS: lldb-api :: commands/expression/class_template_specialization_empty_pack/TestClassTemplateSpecializationParametersHandling.py (2177 of 2337) PASS: lldb-unit :: SymbolFile/NativePDB/./SymbolFileNativePDBTests/PDBFPOProgramToDWARFExpressionTests.UnresolvedRegisterAssignmentReference (2178 of 2337) UNSUPPORTED: lldb-api :: functionalities/darwin_log/filter/regex/activity/TestDarwinLogFilterRegexActivity.py (2179 of 2337) PASS: lldb-unit :: Utility/./UtilityTests/ArgsTest.GetArgumentArrayRef (2180 of 2337) UNSUPPORTED: lldb-shell :: Register/x86-fp-read.test (2181 of 2337) PASS: lldb-unit :: Utility/./UtilityTests/StreamTest.AddressRangeInvalidRange (2182 of 2337) PASS: lldb-api :: lang/cpp/accelerator-table/TestCPPAccelerator.py (2183 of 2337) PASS: lldb-shell :: SymbolFile/DWARF/x86/compilercontext.ll (2184 of 2337) PASS: lldb-api :: functionalities/data-formatter/data-formatter-stl/libcxx/tuple/TestDataFormatterLibcxxTuple.py (2185 of 2337) PASS: lldb-api :: functionalities/load_lazy/TestLoadUsingLazyBind.py (2186 of 2337) PASS: lldb-shell :: SymbolFile/DWARF/x86/find-basic-variable.cpp (2187 of 2337) PASS: lldb-api :: commands/expression/persistent_ptr_update/TestPersistentPtrUpdate.py (2188 of 2337) PASS: lldb-api :: functionalities/breakpoint/global_constructor/TestBreakpointInGlobalConstructor.py (2189 of 2337) PASS: lldb-unit :: Language/CPlusPlus/./LanguageCPlusPlusTests/CPlusPlusLanguage.FindAlternateFunctionManglings (2190 of 2337) PASS: lldb-shell :: Reproducer/TestGDBRemoteRepro.test (2191 of 2337) PASS: lldb-api :: commands/process/attach/attach_denied/TestAttachDenied.py (2192 of 2337) PASS: lldb-unit :: Utility/./UtilityTests/StreamTest.PutMaxHex64ByteOrderLittle (2193 of 2337) PASS: lldb-api :: lang/objc/objc-static-method-stripped/TestObjCStaticMethodStripped.py (2194 of 2337) PASS: lldb-unit :: Utility/./UtilityTests/StringExtractorTest.GetHexU8_Exact (2195 of 2337) PASS: lldb-api :: commands/quit/TestQuit.py (2196 of 2337) PASS: lldb-unit :: Expression/./ExpressionTests/DiagnosticManagerTest.HasFixits (2197 of 2337) PASS: lldb-shell :: Driver/TestError.test (2198 of 2337) PASS: lldb-unit :: Utility/./UtilityTests/SerializationRountripTest.SerializeDeserializeObjectPointer (2199 of 2337) PASS: lldb-unit :: Utility/./UtilityTests/ArgsTest.ReplaceArgumentAtIndexEqual (2200 of 2337) PASS: lldb-unit :: Utility/./UtilityTests/FileSpecTest.OperatorBool (2201 of 2337) PASS: lldb-unit :: Symbol/./SymbolTests/TestTypeSystemClang.TestBuiltinTypeForEncodingAndBitSize (2202 of 2337) PASS: lldb-unit :: Utility/./UtilityTests/StringExtractorTest.GetHexU8_InvalidHex_NoEof (2203 of 2337) UNSUPPORTED: lldb-shell :: Reproducer/TestLuaImport.test (2204 of 2337) PASS: lldb-shell :: Reproducer/TestRelativePath.test (2205 of 2337) PASS: lldb-unit :: Utility/./UtilityTests/StringListTest.SetSize (2206 of 2337) PASS: lldb-unit :: Utility/./UtilityTests/ConstStringTest.MangledCounterpart (2207 of 2337) PASS: lldb-api :: commands/target/modules/search-paths/insert/TestTargetModulesSearchpathsInsert.py (2208 of 2337) PASS: lldb-api :: lang/objc/hidden-ivars/TestHiddenIvars.py (2209 of 2337) PASS: lldb-api :: lang/objc/foundation/TestObjCMethodsString.py (2210 of 2337) PASS: lldb-unit :: Symbol/./SymbolTests/TestClangASTImporter.MetadataPropagation (2211 of 2337) PASS: lldb-unit :: Utility/./UtilityTests/FileSpecTest.GetPath (2212 of 2337) PASS: lldb-api :: functionalities/thread/concurrent_events/TestConcurrentBreakpointsDelayedBreakpointOneWatchpoint.py (2213 of 2337) PASS: lldb-api :: lang/objc/orderedset/TestOrderedSet.py (2214 of 2337) PASS: lldb-api :: commands/expression/import-std-module/forward_decl_from_module/TestForwardDeclFromStdModule.py (2215 of 2337) PASS: lldb-unit :: Symbol/./SymbolTests/TestTypeSystemClang.TestDisplayName (2216 of 2337) PASS: lldb-api :: macosx/find-dsym/deep-bundle/TestDeepBundle.py (2217 of 2337) PASS: lldb-unit :: Utility/./UtilityTests/NameMatchesTest.Ignore (2218 of 2337) PASS: lldb-unit :: Utility/./UtilityTests/RangeDataVector.CustomSort (2219 of 2337) PASS: lldb-unit :: Utility/./UtilityTests/BinaryStreamTest.PutULEB128NineBytes (2220 of 2337) PASS: lldb-unit :: Instruction/./EmulatorTests/TestAArch64Emulator.TestOverflow (2221 of 2337) PASS: lldb-shell :: ObjectFile/ELF/base-address.yaml (2222 of 2337) PASS: lldb-api :: functionalities/unwind/noreturn/module-end/TestNoReturnModuleEnd.py (2223 of 2337) PASS: lldb-api :: functionalities/tail_call_frames/unambiguous_sequence/TestUnambiguousTailCalls.py (2224 of 2337) PASS: lldb-unit :: Utility/./UtilityTests/ArgsTest.StringListConstructor (2225 of 2337) PASS: lldb-unit :: tools/lldb-server/tests/./LLDBServerTests/StandardStartupTest.TestStopReplyContainsThreadPcs (2226 of 2337) PASS: lldb-shell :: SymbolFile/DWARF/x86/dwo-type-in-main-file.s (2227 of 2337) PASS: lldb-unit :: Utility/./UtilityTests/StringListTest.GetSize (2228 of 2337) PASS: lldb-api :: lang/cpp/function-qualifiers/TestCppFunctionQualifiers.py (2229 of 2337) PASS: lldb-unit :: Process/./ProcessEventDataTests/ProcessEventDataTest.ShouldStop (2230 of 2337) PASS: lldb-unit :: Symbol/./SymbolTests/TestClangASTImporter.RecordLayout (2231 of 2337) UNSUPPORTED: lldb-api :: lang/objc/rdar-12408181/TestRdar12408181.py (2232 of 2337) PASS: lldb-shell :: Minidump/breakpad-symbols.test (2233 of 2337) PASS: lldb-api :: functionalities/breakpoint/breakpoint_callback_command_source/TestBreakpointCallbackCommandSource.py (2234 of 2337) PASS: lldb-shell :: SymbolFile/NativePDB/load-pdb.cpp (2235 of 2337) PASS: lldb-shell :: SymbolFile/DWARF/x86/find-basic-namespace.cpp (2236 of 2337) PASS: lldb-unit :: Utility/./UtilityTests/AnsiTerminal.AtStart (2237 of 2337) PASS: lldb-unit :: UnwindAssembly/ARM64/./Arm64InstEmulationTests/TestArm64InstEmulation.TestFramelessThreeEpilogueFunction (2238 of 2337) PASS: lldb-shell :: VSCode/TestOptions.test (2239 of 2337) PASS: lldb-unit :: DataFormatter/./LLDBFormatterTests/StringPrinterTests.CxxASCII (2240 of 2337) PASS: lldb-unit :: Symbol/./SymbolTests/DWARFCallFrameInfoTest.Basic_eh (2241 of 2337) PASS: lldb-api :: macosx/safe-to-func-call/TestSafeFuncCalls.py (2242 of 2337) PASS: lldb-shell :: ObjectFile/MachO/lc_version_min.yaml (2243 of 2337) PASS: lldb-unit :: Process/Utility/./ProcessUtilityTests/ProcSMapTests/LinuxProcSMapsTestFixture.ParseSMapRegions/2 (2244 of 2337) UNSUPPORTED: lldb-shell :: Watchpoint/netbsd-nouserdbregs.test (2245 of 2337) PASS: lldb-api :: lang/cpp/class_types/TestClassTypesDisassembly.py (2246 of 2337) PASS: lldb-unit :: Utility/./UtilityTests/OptionsWithRawTest.MultiWordSuffix (2247 of 2337) PASS: lldb-unit :: Utility/./UtilityTests/Flags.AllClear (2248 of 2337) PASS: lldb-unit :: Utility/./UtilityTests/Flags.Reset (2249 of 2337) PASS: lldb-unit :: Core/./LLDBCoreTests/FormatEntity.LookupAllEntriesInTree (2250 of 2337) PASS: lldb-unit :: ScriptInterpreter/Python/./ScriptInterpreterPythonTests/PythonDataObjectsTest.TestPythonDictionaryManipulation (2251 of 2337) PASS: lldb-api :: lang/objc/modules-cache/TestClangModulesCache.py (2252 of 2337) PASS: lldb-api :: functionalities/reproducers/fs-case-sensitivity/TestReproducerFSCaseSensitivity.py (2253 of 2337) PASS: lldb-api :: python_api/class_members/TestSBTypeClassMembers.py (2254 of 2337) PASS: lldb-shell :: SymbolFile/DWARF/x86/DW_TAG_basic_type_DW_ATE_UTF_nonC.ll (2255 of 2337) PASS: lldb-api :: commands/command/script/import/TestImport.py (2256 of 2337) PASS: lldb-api :: commands/expression/import-std-module/deque-basic/TestDequeFromStdModule.py (2257 of 2337) PASS: lldb-api :: functionalities/thread/concurrent_events/TestConcurrentDelaySignalWatch.py (2258 of 2337) PASS: lldb-unit :: Utility/./UtilityTests/StringListTest.GetMaxStringLengthMixed (2259 of 2337) PASS: lldb-unit :: Utility/./UtilityTests/StringExtractorTest.GetHexU8_Underflow_NoEof (2260 of 2337) PASS: lldb-api :: tools/lldb-server/inferior-crash/TestGdbRemoteAbort.py (2261 of 2337) PASS: lldb-api :: functionalities/thread/concurrent_events/TestConcurrentSignalDelayWatch.py (2262 of 2337) PASS: lldb-api :: commands/gui/basic/TestGuiBasic.py (2263 of 2337) PASS: lldb-unit :: Utility/./UtilityTests/UriParserTest.LongPath (2264 of 2337) PASS: lldb-unit :: Symbol/./SymbolTests/Type.CompilerContextPattern (2265 of 2337) PASS: lldb-unit :: Utility/./UtilityTests/RecordReplayTest.ValidSequence (2266 of 2337) PASS: lldb-unit :: UnwindAssembly/x86/./UnwindAssemblyx86Tests/Testx86AssemblyInspectionEngine.TestPopR14 (2267 of 2337) PASS: lldb-unit :: Utility/./UtilityTests/LogTest.Unregister (2268 of 2337) PASS: lldb-unit :: ObjectFile/Breakpad/./ObjectFileBreakpadTests/StackCFIRecord.parse (2269 of 2337) PASS: lldb-unit :: Expression/./ExpressionTests/DWARFExpression.DW_OP_convert (2270 of 2337) PASS: lldb-unit :: Symbol/./SymbolTests/TestTypeSystemClang.TestGetTypeClassDeclType (2271 of 2337) PASS: lldb-api :: lang/c/register_variables/TestRegisterVariables.py (2272 of 2337) PASS: lldb-api :: commands/expression/multiline-completion/TestMultilineCompletion.py (2273 of 2337) PASS: lldb-api :: functionalities/gdb_remote_client/TestGDBRemoteClient.py (2274 of 2337) PASS: lldb-api :: functionalities/gdb_remote_client/TestWriteMemory.py (2275 of 2337) PASS: lldb-api :: functionalities/data-formatter/data-formatter-stl/libcxx/list/loop/TestDataFormatterLibcxxListLoop.py (2276 of 2337) PASS: lldb-unit :: Host/./HostTests/SocketTests/SocketTest.TCPGetConnectURI/ipv4 (2277 of 2337) PASS: lldb-shell :: Register/Core/x86-64-netbsd-gp.test (2278 of 2337) UNSUPPORTED: lldb-api :: functionalities/thread/concurrent_events/TestConcurrentManySignals.py (2279 of 2337) PASS: lldb-api :: commands/watchpoints/watchpoint_commands/command/TestWatchpointCommandLLDB.py (2280 of 2337) PASS: lldb-api :: lang/cpp/inlines/TestInlines.py (2281 of 2337) PASS: lldb-api :: tools/lldb-vscode/console/TestVSCode_console.py (2282 of 2337) PASS: lldb-unit :: Utility/./UtilityTests/StreamTest.PutStringAsRawHex8 (2283 of 2337) PASS: lldb-api :: commands/expression/fixits/TestFixIts.py (2284 of 2337) PASS: lldb-api :: lang/cpp/member-and-local-vars-with-same-name/TestMembersAndLocalsWithSameName.py (2285 of 2337) PASS: lldb-api :: lang/objc/objc-ivar-protocols/TestIvarProtocols.py (2286 of 2337) PASS: lldb-shell :: Error/assert.test (2287 of 2337) PASS: lldb-unit :: Utility/./UtilityTests/StreamTest.AddressSuffix (2288 of 2337) PASS: lldb-unit :: Host/./HostTests/File.GetWaitableHandleFileno (2289 of 2337) PASS: lldb-unit :: Utility/./UtilityTests/SerializationRountripTest.SerializeDeserializeCStringNull (2290 of 2337) PASS: lldb-unit :: Utility/./UtilityTests/ConstStringTest.YAML (2291 of 2337) PASS: lldb-api :: commands/session/save/TestSessionSave.py (2292 of 2337) PASS: lldb-api :: tools/lldb-vscode/breakpoint/TestVSCode_setBreakpoints.py (2293 of 2337) PASS: lldb-api :: commands/frame/diagnose/virtual-method-call/TestDiagnoseDereferenceVirtualMethodCall.py (2294 of 2337) PASS: lldb-api :: lang/cpp/subst_template_type_param/TestSubstTemplateTypeParam.py (2295 of 2337) PASS: lldb-unit :: Language/Highlighting/./HighlighterTests/HighlighterTest.ClangTrailingBackslashMissingNewLine (2296 of 2337) PASS: lldb-api :: functionalities/data-formatter/data-formatter-objc/TestDataFormatterObjCNSURL.py (2297 of 2337) UNSUPPORTED: lldb-api :: tools/lldb-vscode/disconnect/TestVSCode_disconnect.py (2298 of 2337) PASS: lldb-unit :: Utility/./UtilityTests/ScalarTest.GetValue (2299 of 2337) PASS: lldb-shell :: SymbolFile/DWARF/x86/dwarf5-index-is-used.cpp (2300 of 2337) PASS: lldb-api :: commands/process/attach-resume/TestAttachResume.py (2301 of 2337) PASS: lldb-shell :: Breakpoint/debug_rnglist_offset_pair.test (2302 of 2337) PASS: lldb-api :: functionalities/gdb_remote_client/TestGDBRemoteDiskFileCompletion.py (2303 of 2337) PASS: lldb-shell :: Register/Core/x86-64-netbsd-fp.test (2304 of 2337) PASS: lldb-api :: python_api/function_symbol/TestDisasmAPI.py (2305 of 2337) PASS: lldb-unit :: Utility/./UtilityTests/BinaryStreamTest.PutULEB128SevenBytes (2306 of 2337) UNSUPPORTED: lldb-api :: functionalities/breakpoint/breakpoint_in_delayslot/TestAvoidBreakpointInDelaySlot.py (2307 of 2337) PASS: lldb-shell :: Driver/TestCore.test (2308 of 2337) PASS: lldb-api :: functionalities/thread/exit_during_expression/TestExitDuringExpression.py (2309 of 2337) PASS: lldb-api :: tools/lldb-server/TestGdbRemoteAttach.py (2310 of 2337) UNSUPPORTED: lldb-shell :: SymbolFile/PDB/vbases.test (2311 of 2337) PASS: lldb-api :: driver/batch_mode/TestBatchMode.py (2312 of 2337) PASS: lldb-api :: functionalities/avoids-fd-leak/TestFdLeak.py (2313 of 2337) UNSUPPORTED: lldb-api :: commands/register/register/aarch64_sve_registers/rw_access_static_config/TestSVERegisters.py (2314 of 2337) PASS: lldb-unit :: Utility/./UtilityTests/XcodeSDKTest.FindXcodeContentsDirectoryInPath (2315 of 2337) PASS: lldb-api :: functionalities/data-formatter/type_summary_list_script/TestTypeSummaryListScript.py (2316 of 2337) PASS: lldb-unit :: UnwindAssembly/ARM64/./Arm64InstEmulationTests/TestArm64InstEmulation.TestRegisterSavedTwice (2317 of 2337) PASS: lldb-unit :: Symbol/./SymbolTests/TestTypeSystemClang.TestRemoveFastQualifiers (2318 of 2337) PASS: lldb-api :: python_api/value/empty_class/TestValueAPIEmptyClass.py (2319 of 2337) PASS: lldb-unit :: Utility/./UtilityTests/TimerTest.CategoryTimes2 (2320 of 2337) UNSUPPORTED: lldb-api :: linux/mix-dwo-and-regular-objects/TestMixedDwarfBinary.py (2321 of 2337) PASS: lldb-shell :: Reproducer/TestDebugSymbols.test (2322 of 2337) PASS: lldb-api :: lang/objc/real-definition/TestRealDefinition.py (2323 of 2337) PASS: lldb-unit :: Process/minidump/./LLDBMinidumpTests/MinidumpParserTest.MinidumpDuplicateModuleMappedSecond (2324 of 2337) PASS: lldb-unit :: Utility/./UtilityTests/ReproducerTest.SetCapture (2325 of 2337) PASS: lldb-unit :: Utility/./UtilityTests/OptionsWithRawTest.WhitespaceSuffix (2326 of 2337) UNSUPPORTED: lldb-api :: commands/watchpoints/multi_watchpoint_slots/TestWatchpointMultipleSlots.py (2327 of 2337) PASS: lldb-unit :: Language/Highlighting/./HighlighterTests/HighlighterTest.ClangUnterminatedString (2328 of 2337) PASS: lldb-api :: functionalities/memory-region/TestMemoryRegion.py (2329 of 2337) PASS: lldb-unit :: Utility/./UtilityTests/ScalarTest.Scalar_512 (2330 of 2337) PASS: lldb-unit :: ObjectFile/ELF/./ObjectFileELFTests/ObjectFileELFTest.GetModuleSpecifications_EarlySectionHeaders (2331 of 2337) PASS: lldb-unit :: UnwindAssembly/x86/./UnwindAssemblyx86Tests/Testx86AssemblyInspectionEngine.TestPushEDI (2332 of 2337) UNSUPPORTED: lldb-api :: functionalities/darwin_log/filter/regex/activity-chain/TestDarwinLogFilterRegexActivityChain.py (2333 of 2337) PASS: lldb-api :: functionalities/stats_api/TestStatisticsAPI.py (2334 of 2337) PASS: lldb-api :: lang/cpp/stl/TestSTL.py (2335 of 2337) PASS: lldb-api :: tools/lldb-server/TestGdbRemoteThreadsInStopReply.py (2336 of 2337) PASS: lldb-api :: lang/cpp/incomplete-types/TestCppIncompleteTypes.py (2337 of 2337) Slowest Tests: -------------------------------------------------------------------------- 176.37s: lldb-api :: tools/lldb-vscode/runInTerminal/TestVSCode_runInTerminal.py 158.89s: lldb-api :: commands/target/auto-install-main-executable/TestAutoInstallMainExecutable.py 96.22s: lldb-api :: lang/objc/foundation/TestFoundationDisassembly.py 92.01s: lldb-api :: lang/objc/objc-foundation-dictionary-empty/TestNSDictionary0.py 89.37s: lldb-api :: functionalities/data-formatter/user-format-vs-summary/TestUserFormatVsSummary.py 82.37s: lldb-api :: tools/lldb-server/TestLldbGdbServer.py 80.69s: lldb-api :: commands/expression/persist_objc_pointeetype/TestPersistObjCPointeeType.py 65.55s: lldb-api :: api/multithreaded/TestMultithreaded.py 64.56s: lldb-api :: lang/objc/objc-new-syntax/TestObjCNewSyntaxLiteral.py 58.67s: lldb-api :: tools/lldb-server/vCont-threads/TestGdbRemote_vContThreads.py 48.52s: lldb-api :: lang/objc/exceptions/TestObjCExceptions.py 39.63s: lldb-api :: types/TestLongTypesExpr.py 38.18s: lldb-api :: lang/objc/hidden-ivars/TestHiddenIvars.py 36.81s: lldb-api :: lang/objc/foundation/TestObjCMethods.py 33.55s: lldb-api :: python_api/target/TestTargetAPI.py 32.82s: lldb-api :: lang/cpp/namespace/TestNamespaceLookup.py 32.73s: lldb-api :: functionalities/completion/TestCompletion.py 30.14s: lldb-shell :: SymbolFile/NativePDB/locate-pdb.cpp 30.09s: lldb-api :: tools/lldb-server/TestGdbRemoteThreadsInStopReply.py 28.51s: lldb-api :: functionalities/gdb_remote_client/TestHaltFails.py

Hide Details

Tests Times: -------------------------------------------------------------------------- [ Range ] :: [ Percentage ] :: [ Count ] -------------------------------------------------------------------------- [170s,180s) :: [ ] :: [ 1/2337] [160s,170s) :: [ ] :: [ 1/2337] [150s,160s) :: [ ] :: [ 0/2337] [140s,150s) :: [ ] :: [ 0/2337] [130s,140s) :: [ ] :: [ 0/2337] [120s,130s) :: [ ] :: [ 0/2337] [110s,120s) :: [ ] :: [ 0/2337] [100s,110s) :: [ ] :: [ 0/2337] [ 90s,100s) :: [ ] :: [ 3/2337] [ 80s, 90s) :: [ ] :: [ 2/2337] [ 70s, 80s) :: [ ] :: [ 0/2337] [ 60s, 70s) :: [ ] :: [ 2/2337] [ 50s, 60s) :: [ ] :: [ 1/2337] [ 40s, 50s) :: [ ] :: [ 2/2337] [ 30s, 40s) :: [ ] :: [ 7/2337] [ 20s, 30s) :: [ ] :: [ 21/2337] [ 10s, 20s) :: [* ] :: [ 92/2337] [ 0s, 10s) :: [************************************* ] :: [2205/2337] -------------------------------------------------------------------------- ******************** Failed Tests (4): lldb-api :: commands/expression/persist_objc_pointeetype/TestPersistObjCPointeeType.py lldb-api :: functionalities/data-formatter/user-format-vs-summary/TestUserFormatVsSummary.py lldb-api :: lang/objc/foundation/TestFoundationDisassembly.py lldb-api :: lang/objc/objc-foundation-dictionary-empty/TestNSDictionary0.py

Hide Details

Hide Details

Testing Time: 1464.45s Unsupported : 176 Passed : 2147 Expectedly Failed: 10 Failed : 4 FAILED: tools/lldb/test/CMakeFiles/check-lldb cd /Users/buildslave/jenkins/workspace/lldb-cmake/lldb-build/tools/lldb/test && /usr/local/Frameworks/Python.framework/Versions/3.7/bin/python3.7 /Users/buildslave/jenkins/workspace/lldb-cmake/lldb-build/./bin/llvm-lit -v --time-tests --shuffle --xunit-xml-output=/Users/buildslave/jenkins/workspace/lldb-cmake/test/results.xml -v -j 4 /Users/buildslave/jenkins/workspace/lldb-cmake/lldb-build/tools/lldb/test ninja: build stopped: cannot make progress due to previous errors. Command failed: Command '['/usr/bin/env', 'TERM=vt100', '/usr/local/bin/ninja', '-v', 'check-debuginfo', 'check-lldb', '-k2']' returned non-zero exit status 1 Command: ['/usr/bin/env', 'TERM=vt100', '/usr/local/bin/ninja', '-v', 'check-debuginfo', 'check-lldb', '-k2'] [Pipeline] } [Pipeline] // timeout [Pipeline] } [Pipeline] // stage [Pipeline] stage [Pipeline] { (Declarative: Post Actions) [Pipeline] scanForIssues [Clang (LLVM based)] Sleeping for 5 seconds due to JENKINS-32191... [Clang (LLVM based)] Parsing console log (workspace: '/Users/buildslave/jenkins/workspace/lldb-cmake') [Clang (LLVM based)] Successfully parsed console log [Clang (LLVM based)] -> found 0 issues (skipped 0 duplicates) [Clang (LLVM based)] Skipping post processing [Clang (LLVM based)] No filter has been set, publishing all 0 issues [Clang (LLVM based)] Repository miner is not configured, skipping repository mining [Pipeline] junit Recording test results [Checks API] No suitable checks publisher found. [Pipeline] emailext Warning: a-phipps@ti.com is not a recognized user, but sending mail anyway Warning: lebedev.ri@gmail.com is not a recognized user, but sending mail anyway Warning: schmeise@ca.ibm.com is not a recognized user, but sending mail anyway Warning: a-phipps@ti.com is not a recognized user, but sending mail anyway Warning: lebedev.ri@gmail.com is not a recognized user, but sending mail anyway Warning: schmeise@ca.ibm.com is not a recognized user, but sending mail anyway

Hide Details

Begin Pre-Send Script... Sending email to: stevenwu@apple.com a-phipps@ti.com lebedev.ri@gmail.com schmeise@ca.ibm.com Tim Northover <tnorthover@apple.com> Azhar Mohammed <azhar@apple.com>
[Pipeline] } [Pipeline] // stage [Pipeline] } [Pipeline] // withEnv [Pipeline] } [Pipeline] // node [Pipeline] End of Pipeline ERROR: script returned exit code 1 Finished: FAILURE