FailedConsole Output

Skipping 778 KB.. Full Log

Hide Details

{ "api_name": "-[NSView superview]", "class_name": "NSView", "description": "-[NSView superview] must be used from main thread only", "instrumentation_class": "MainThreadChecker", "selector": "superview", "tid": 4, "trace": [ 4294970929, 140734122902869, 140735056257288, 140735056239498 ] }

Hide Details

Hide Details

Ran command: "thread info -s"

Hide Details

Got output: thread #4: tid = 0x167b26, 0x0000000100132873 libMainThreadChecker.dylib`__main_thread_checker_on_report, stop reason = -[NSView superview] must be used from main thread only

Hide Details

{ "api_name": "-[NSView superview]", "class_name": "NSView", "description": "-[NSView superview] must be used from main thread only", "instrumentation_class": "MainThreadChecker", "selector": "superview", "tid": 4, "trace": [ 4294970929, 140734122902869, 140735056257288, 140735056239498 ] }

Hide Details

Expecting sub string: "api_name" (was found) Expecting sub string: "class_name" (was found) Expecting sub string: "description" (was found) Expecting sub string: "instrumentation_class" (was found) Expecting sub string: "selector" (was found)

Hide Details

<bound method SBProcess.Kill of <lldb.SBProcess; proxy of <Swig Object of type 'lldb::SBProcess *' at 0x1158345a0> >>: success

Hide Details

PASS: LLDB (/Users/buildslave/jenkins/workspace/lldb-cmake/lldb-build/bin/clang-x86_64) :: test_dsym (TestMTCSimple.MTCSimpleTestCase) runCmd: settings clear -all output:

Hide Details

runCmd: settings set symbols.enable-external-lookup false output:

Hide Details

runCmd: settings set target.inherit-tcc true output:

Hide Details

runCmd: settings set target.detach-on-error false output:

Hide Details

runCmd: settings set target.auto-apply-fixits false output:

Hide Details

runCmd: settings set plugin.process.gdb-remote.packet-timeout 60 output:

Hide Details

runCmd: settings set symbols.clang-modules-cache-path "/Users/buildslave/jenkins/workspace/lldb-cmake/lldb-build/lldb-test-build.noindex/module-cache-lldb/lldb-api" output:

Hide Details

runCmd: settings set use-color false output:

Hide Details

runCmd: setting set target.prefer-dynamic-value no-dynamic-values output:

Hide Details

runCmd: file /Users/buildslave/jenkins/workspace/lldb-cmake/lldb-build/lldb-test-build.noindex/functionalities/mtc/simple/TestMTCSimple.test_dwarf/a.out output: Current executable set to '/Users/buildslave/jenkins/workspace/lldb-cmake/lldb-build/lldb-test-build.noindex/functionalities/mtc/simple/TestMTCSimple.test_dwarf/a.out' (x86_64).

Hide Details

Hide Details

Ran command: "file /Users/buildslave/jenkins/workspace/lldb-cmake/lldb-build/lldb-test-build.noindex/functionalities/mtc/simple/TestMTCSimple.test_dwarf/a.out"

Hide Details

Got output: Current executable set to '/Users/buildslave/jenkins/workspace/lldb-cmake/lldb-build/lldb-test-build.noindex/functionalities/mtc/simple/TestMTCSimple.test_dwarf/a.out' (x86_64).

Hide Details

Expecting regex pattern: "Current executable set to .*a.out" (was found, matched "Current executable set to '/Users/buildslave/jenkins/workspace/lldb-cmake/lldb-build/lldb-test-build.noindex/functionalities/mtc/simple/TestMTCSimple.test_dwarf/a.out")

Hide Details

runCmd: env DYLD_INSERT_LIBRARIES=/Applications/Xcode.app/Contents/Developer/usr/lib/libMainThreadChecker.dylib output:

Hide Details

runCmd: run output: Process 31695 stopped * thread #4, stop reason = -[NSView superview] must be used from main thread only frame #0: 0x0000000100132873 libMainThreadChecker.dylib`__main_thread_checker_on_report libMainThreadChecker.dylib`__main_thread_checker_on_report: -> 0x100132873 <+0>: pushq %rbp 0x100132874 <+1>: movq %rsp, %rbp 0x100132877 <+4>: popq %rbp 0x100132878 <+5>: retq Process 31695 launched: '/Users/buildslave/jenkins/workspace/lldb-cmake/lldb-build/lldb-test-build.noindex/functionalities/mtc/simple/TestMTCSimple.test_dwarf/a.out' (x86_64)

Hide Details

Hide Details

runCmd: thread info output: thread #4: tid = 0x167d16, 0x0000000100132873 libMainThreadChecker.dylib`__main_thread_checker_on_report, stop reason = -[NSView superview] must be used from main thread only

Hide Details

Hide Details

Hide Details

Ran command: "thread info"

Hide Details

Got output: thread #4: tid = 0x167d16, 0x0000000100132873 libMainThreadChecker.dylib`__main_thread_checker_on_report, stop reason = -[NSView superview] must be used from main thread only

Hide Details

Hide Details

Expecting sub string: "stop reason = -[NSView superview] must be used from main thread only" (was found)

Hide Details

runCmd: thread info -s output: thread #4: tid = 0x167d16, 0x0000000100132873 libMainThreadChecker.dylib`__main_thread_checker_on_report, stop reason = -[NSView superview] must be used from main thread only

Hide Details

{ "api_name": "-[NSView superview]", "class_name": "NSView", "description": "-[NSView superview] must be used from main thread only", "instrumentation_class": "MainThreadChecker", "selector": "superview", "tid": 4, "trace": [ 4294970929, 140734122902869, 140735056257288, 140735056239498 ] }

Hide Details

Hide Details

Ran command: "thread info -s"

Hide Details

Got output: thread #4: tid = 0x167d16, 0x0000000100132873 libMainThreadChecker.dylib`__main_thread_checker_on_report, stop reason = -[NSView superview] must be used from main thread only

Hide Details

{ "api_name": "-[NSView superview]", "class_name": "NSView", "description": "-[NSView superview] must be used from main thread only", "instrumentation_class": "MainThreadChecker", "selector": "superview", "tid": 4, "trace": [ 4294970929, 140734122902869, 140735056257288, 140735056239498 ] }

Hide Details

Expecting sub string: "api_name" (was found) Expecting sub string: "class_name" (was found) Expecting sub string: "description" (was found) Expecting sub string: "instrumentation_class" (was found) Expecting sub string: "selector" (was found)

Hide Details

<bound method SBProcess.Kill of <lldb.SBProcess; proxy of <Swig Object of type 'lldb::SBProcess *' at 0x10d6b4bd0> >>: success

Hide Details

PASS: LLDB (/Users/buildslave/jenkins/workspace/lldb-cmake/lldb-build/bin/clang-x86_64) :: test_dwarf (TestMTCSimple.MTCSimpleTestCase) UNSUPPORTED: LLDB (/Users/buildslave/jenkins/workspace/lldb-cmake/lldb-build/bin/clang-x86_64) :: test_dwo (TestMTCSimple.MTCSimpleTestCase) (test case does not fall in any category of interest for this run) runCmd: settings clear -all output:

Hide Details

runCmd: settings set symbols.enable-external-lookup false output:

Hide Details

runCmd: settings set target.inherit-tcc true output:

Hide Details

runCmd: settings set target.detach-on-error false output:

Hide Details

runCmd: settings set target.auto-apply-fixits false output:

Hide Details

runCmd: settings set plugin.process.gdb-remote.packet-timeout 60 output:

Hide Details

runCmd: settings set symbols.clang-modules-cache-path "/Users/buildslave/jenkins/workspace/lldb-cmake/lldb-build/lldb-test-build.noindex/module-cache-lldb/lldb-api" output:

Hide Details

runCmd: settings set use-color false output:

Hide Details

runCmd: setting set target.prefer-dynamic-value no-dynamic-values output:

Hide Details

runCmd: file /Users/buildslave/jenkins/workspace/lldb-cmake/lldb-build/lldb-test-build.noindex/functionalities/mtc/simple/TestMTCSimple.test_gmodules/a.out output: Current executable set to '/Users/buildslave/jenkins/workspace/lldb-cmake/lldb-build/lldb-test-build.noindex/functionalities/mtc/simple/TestMTCSimple.test_gmodules/a.out' (x86_64).

Hide Details

Hide Details

Ran command: "file /Users/buildslave/jenkins/workspace/lldb-cmake/lldb-build/lldb-test-build.noindex/functionalities/mtc/simple/TestMTCSimple.test_gmodules/a.out"

Hide Details

Got output: Current executable set to '/Users/buildslave/jenkins/workspace/lldb-cmake/lldb-build/lldb-test-build.noindex/functionalities/mtc/simple/TestMTCSimple.test_gmodules/a.out' (x86_64).

Hide Details

Expecting regex pattern: "Current executable set to .*a.out" (was found, matched "Current executable set to '/Users/buildslave/jenkins/workspace/lldb-cmake/lldb-build/lldb-test-build.noindex/functionalities/mtc/simple/TestMTCSimple.test_gmodules/a.out")

Hide Details

runCmd: env DYLD_INSERT_LIBRARIES=/Applications/Xcode.app/Contents/Developer/usr/lib/libMainThreadChecker.dylib output:

Hide Details

runCmd: run runCmd failed! error: process exited with status -1 (tried to attach to process already being debugged)

Hide Details

Hide Details

Command 'run' failed!

Hide Details

FAIL: LLDB (/Users/buildslave/jenkins/workspace/lldb-cmake/lldb-build/bin/clang-x86_64) :: test_gmodules (TestMTCSimple.MTCSimpleTestCase) <bound method SBProcess.Kill of <lldb.SBProcess; proxy of <Swig Object of type 'lldb::SBProcess *' at 0x11571ddb0> >>: success

Hide Details

Restore dir to: /Users/buildslave/jenkins/workspace/lldb-cmake/lldb-build/tools/lldb/test ====================================================================== FAIL: test_gmodules (TestMTCSimple.MTCSimpleTestCase) ---------------------------------------------------------------------- Traceback (most recent call last): File "/Users/buildslave/jenkins/workspace/lldb-cmake/llvm-project/lldb/packages/Python/lldbsuite/test/lldbtest.py", line 1830, in test_method return attrvalue(self) File "/Users/buildslave/jenkins/workspace/lldb-cmake/llvm-project/lldb/test/API/functionalities/mtc/simple/TestMTCSimple.py", line 24, in test self.mtc_tests() File "/Users/buildslave/jenkins/workspace/lldb-cmake/llvm-project/lldb/packages/Python/lldbsuite/test/decorators.py", line 149, in wrapper return func(*args, **kwargs) File "/Users/buildslave/jenkins/workspace/lldb-cmake/llvm-project/lldb/test/API/functionalities/mtc/simple/TestMTCSimple.py", line 35, in mtc_tests self.runCmd("run") File "/Users/buildslave/jenkins/workspace/lldb-cmake/llvm-project/lldb/packages/Python/lldbsuite/test/lldbtest.py", line 2161, in runCmd msg if (msg) else CMD_MSG(cmd)) AssertionError: False is not True : Command 'run Error output: error: process exited with status -1 (tried to attach to process already being debugged) ' did not return successfully Config=x86_64-/Users/buildslave/jenkins/workspace/lldb-cmake/lldb-build/bin/clang ---------------------------------------------------------------------- Ran 4 tests in 46.403s

Hide Details

RESULT: FAILED (2 passes, 1 failures, 0 errors, 1 skipped, 0 expected failures, 0 unexpected successes)

Hide Details

--

Hide Details

******************** PASS: lldb-shell :: SymbolFile/NativePDB/break-by-line.cpp (1791 of 2337) FAIL: lldb-api :: lang/objcxx/objcxx-ivar-vector/TestIvarVector.py (1792 of 2337) ******************** TEST 'lldb-api :: lang/objcxx/objcxx-ivar-vector/TestIvarVector.py' FAILED ******************** Script: -- /usr/local/Frameworks/Python.framework/Versions/3.7/bin/python3.7 /Users/buildslave/jenkins/workspace/lldb-cmake/llvm-project/lldb/test/API/dotest.py -u CXXFLAGS -u CFLAGS --codesign-identity - --arch x86_64 --build-dir /Users/buildslave/jenkins/workspace/lldb-cmake/lldb-build/lldb-test-build.noindex -t --env TERM=vt100 --env LLVM_LIBS_DIR=/Users/buildslave/jenkins/workspace/lldb-cmake/lldb-build/./lib --arch x86_64 --build-dir /Users/buildslave/jenkins/workspace/lldb-cmake/lldb-build/lldb-test-build.noindex --lldb-module-cache-dir /Users/buildslave/jenkins/workspace/lldb-cmake/lldb-build/lldb-test-build.noindex/module-cache-lldb/lldb-api --clang-module-cache-dir /Users/buildslave/jenkins/workspace/lldb-cmake/lldb-build/lldb-test-build.noindex/module-cache-clang/lldb-api --executable /Users/buildslave/jenkins/workspace/lldb-cmake/lldb-build/./bin/lldb --compiler /Users/buildslave/jenkins/workspace/lldb-cmake/lldb-build/./bin/clang --dsymutil /Users/buildslave/jenkins/workspace/lldb-cmake/lldb-build/./bin/dsymutil --llvm-tools-dir /Users/buildslave/jenkins/workspace/lldb-cmake/lldb-build/./bin --lldb-libs-dir /Users/buildslave/jenkins/workspace/lldb-cmake/lldb-build/./lib /Users/buildslave/jenkins/workspace/lldb-cmake/llvm-project/lldb/test/API/lang/objcxx/objcxx-ivar-vector -p TestIvarVector.py -- Exit Code: 1

Hide Details

Command Output (stdout): -- lldb version 13.0.99 (http://labmaster3.local/git/llvm-project.git revision 23596fece043fa04206dcd5b26b4ca832e6741db) clang revision 23596fece043fa04206dcd5b26b4ca832e6741db llvm revision 23596fece043fa04206dcd5b26b4ca832e6741db Skipping the following test categories: ['darwin-log', 'libstdcxx', 'dwo', 'llgs', 'fork']

Hide Details

-- Command Output (stderr): -- Change dir to: /Users/buildslave/jenkins/workspace/lldb-cmake/llvm-project/lldb/test/API/lang/objcxx/objcxx-ivar-vector runCmd: settings clear -all output:

Hide Details

runCmd: settings set symbols.enable-external-lookup false output:

Hide Details

runCmd: settings set target.inherit-tcc true output:

Hide Details

runCmd: settings set target.detach-on-error false output:

Hide Details

runCmd: settings set target.auto-apply-fixits false output:

Hide Details

runCmd: settings set plugin.process.gdb-remote.packet-timeout 60 output:

Hide Details

runCmd: settings set symbols.clang-modules-cache-path "/Users/buildslave/jenkins/workspace/lldb-cmake/lldb-build/lldb-test-build.noindex/module-cache-lldb/lldb-api" output:

Hide Details

runCmd: settings set use-color false output:

Hide Details

runCmd: setting set target.prefer-dynamic-value no-dynamic-values output:

Hide Details

FAIL: LLDB (/Users/buildslave/jenkins/workspace/lldb-cmake/lldb-build/bin/clang-x86_64) :: test_dsym (lldbsuite.test.lldbtest.TestIvarVector) <bound method SBProcess.Kill of <lldb.SBProcess; proxy of <Swig Object of type 'lldb::SBProcess *' at 0x10aac21e0> >>: success

Hide Details

runCmd: settings clear -all output:

Hide Details

runCmd: settings set symbols.enable-external-lookup false output:

Hide Details

runCmd: settings set target.inherit-tcc true output:

Hide Details

runCmd: settings set target.detach-on-error false output:

Hide Details

runCmd: settings set target.auto-apply-fixits false output:

Hide Details

runCmd: settings set plugin.process.gdb-remote.packet-timeout 60 output:

Hide Details

runCmd: settings set symbols.clang-modules-cache-path "/Users/buildslave/jenkins/workspace/lldb-cmake/lldb-build/lldb-test-build.noindex/module-cache-lldb/lldb-api" output:

Hide Details

runCmd: settings set use-color false output:

Hide Details

runCmd: setting set target.prefer-dynamic-value no-dynamic-values output:

Hide Details

FAIL: LLDB (/Users/buildslave/jenkins/workspace/lldb-cmake/lldb-build/bin/clang-x86_64) :: test_dwarf (lldbsuite.test.lldbtest.TestIvarVector) <bound method SBProcess.Kill of <lldb.SBProcess; proxy of <Swig Object of type 'lldb::SBProcess *' at 0x102472bd0> >>: success

Hide Details

UNSUPPORTED: LLDB (/Users/buildslave/jenkins/workspace/lldb-cmake/lldb-build/bin/clang-x86_64) :: test_dwo (lldbsuite.test.lldbtest.TestIvarVector) (test case does not fall in any category of interest for this run) runCmd: settings clear -all output:

Hide Details

runCmd: settings set symbols.enable-external-lookup false output:

Hide Details

runCmd: settings set target.inherit-tcc true output:

Hide Details

runCmd: settings set target.detach-on-error false output:

Hide Details

runCmd: settings set target.auto-apply-fixits false output:

Hide Details

runCmd: settings set plugin.process.gdb-remote.packet-timeout 60 output:

Hide Details

runCmd: settings set symbols.clang-modules-cache-path "/Users/buildslave/jenkins/workspace/lldb-cmake/lldb-build/lldb-test-build.noindex/module-cache-lldb/lldb-api" output:

Hide Details

runCmd: settings set use-color false output:

Hide Details

runCmd: setting set target.prefer-dynamic-value no-dynamic-values output:

Hide Details

FAIL: LLDB (/Users/buildslave/jenkins/workspace/lldb-cmake/lldb-build/bin/clang-x86_64) :: test_gmodules (lldbsuite.test.lldbtest.TestIvarVector) <bound method SBProcess.Kill of <lldb.SBProcess; proxy of <Swig Object of type 'lldb::SBProcess *' at 0x10aac27b0> >>: success

Hide Details

Restore dir to: /Users/buildslave/jenkins/workspace/lldb-cmake/lldb-build/tools/lldb/test ====================================================================== FAIL: test_dsym (lldbsuite.test.lldbtest.TestIvarVector) ---------------------------------------------------------------------- Traceback (most recent call last): File "/Users/buildslave/jenkins/workspace/lldb-cmake/llvm-project/lldb/packages/Python/lldbsuite/test/lldbtest.py", line 1830, in test_method return attrvalue(self) File "/Users/buildslave/jenkins/workspace/lldb-cmake/llvm-project/lldb/packages/Python/lldbsuite/test/lldbinline.py", line 121, in _test self.do_test() File "/Users/buildslave/jenkins/workspace/lldb-cmake/llvm-project/lldb/packages/Python/lldbsuite/test/lldbinline.py", line 157, in do_test "inline test did not hit a single breakpoint") AssertionError: False is not True : inline test did not hit a single breakpoint Config=x86_64-/Users/buildslave/jenkins/workspace/lldb-cmake/lldb-build/bin/clang ====================================================================== FAIL: test_dwarf (lldbsuite.test.lldbtest.TestIvarVector) ---------------------------------------------------------------------- Traceback (most recent call last): File "/Users/buildslave/jenkins/workspace/lldb-cmake/llvm-project/lldb/packages/Python/lldbsuite/test/lldbtest.py", line 1830, in test_method return attrvalue(self) File "/Users/buildslave/jenkins/workspace/lldb-cmake/llvm-project/lldb/packages/Python/lldbsuite/test/lldbinline.py", line 121, in _test self.do_test() File "/Users/buildslave/jenkins/workspace/lldb-cmake/llvm-project/lldb/packages/Python/lldbsuite/test/lldbinline.py", line 157, in do_test "inline test did not hit a single breakpoint") AssertionError: False is not True : inline test did not hit a single breakpoint Config=x86_64-/Users/buildslave/jenkins/workspace/lldb-cmake/lldb-build/bin/clang ====================================================================== FAIL: test_gmodules (lldbsuite.test.lldbtest.TestIvarVector) ---------------------------------------------------------------------- Traceback (most recent call last): File "/Users/buildslave/jenkins/workspace/lldb-cmake/llvm-project/lldb/packages/Python/lldbsuite/test/lldbtest.py", line 1830, in test_method return attrvalue(self) File "/Users/buildslave/jenkins/workspace/lldb-cmake/llvm-project/lldb/packages/Python/lldbsuite/test/lldbinline.py", line 121, in _test self.do_test() File "/Users/buildslave/jenkins/workspace/lldb-cmake/llvm-project/lldb/packages/Python/lldbsuite/test/lldbinline.py", line 157, in do_test "inline test did not hit a single breakpoint") AssertionError: False is not True : inline test did not hit a single breakpoint Config=x86_64-/Users/buildslave/jenkins/workspace/lldb-cmake/lldb-build/bin/clang ---------------------------------------------------------------------- Ran 4 tests in 105.522s

Hide Details

RESULT: FAILED (0 passes, 3 failures, 0 errors, 1 skipped, 0 expected failures, 0 unexpected successes)

Hide Details

--

Hide Details

******************** FAIL: lldb-api :: tools/lldb-vscode/breakpoint/TestVSCode_setBreakpoints.py (1793 of 2337) ******************** TEST 'lldb-api :: tools/lldb-vscode/breakpoint/TestVSCode_setBreakpoints.py' FAILED ******************** Script: -- /usr/local/Frameworks/Python.framework/Versions/3.7/bin/python3.7 /Users/buildslave/jenkins/workspace/lldb-cmake/llvm-project/lldb/test/API/dotest.py -u CXXFLAGS -u CFLAGS --codesign-identity - --arch x86_64 --build-dir /Users/buildslave/jenkins/workspace/lldb-cmake/lldb-build/lldb-test-build.noindex -t --env TERM=vt100 --env LLVM_LIBS_DIR=/Users/buildslave/jenkins/workspace/lldb-cmake/lldb-build/./lib --arch x86_64 --build-dir /Users/buildslave/jenkins/workspace/lldb-cmake/lldb-build/lldb-test-build.noindex --lldb-module-cache-dir /Users/buildslave/jenkins/workspace/lldb-cmake/lldb-build/lldb-test-build.noindex/module-cache-lldb/lldb-api --clang-module-cache-dir /Users/buildslave/jenkins/workspace/lldb-cmake/lldb-build/lldb-test-build.noindex/module-cache-clang/lldb-api --executable /Users/buildslave/jenkins/workspace/lldb-cmake/lldb-build/./bin/lldb --compiler /Users/buildslave/jenkins/workspace/lldb-cmake/lldb-build/./bin/clang --dsymutil /Users/buildslave/jenkins/workspace/lldb-cmake/lldb-build/./bin/dsymutil --llvm-tools-dir /Users/buildslave/jenkins/workspace/lldb-cmake/lldb-build/./bin --lldb-libs-dir /Users/buildslave/jenkins/workspace/lldb-cmake/lldb-build/./lib /Users/buildslave/jenkins/workspace/lldb-cmake/llvm-project/lldb/test/API/tools/lldb-vscode/breakpoint -p TestVSCode_setBreakpoints.py -- Exit Code: 1

Hide Details

Command Output (stdout): -- lldb version 13.0.99 (http://labmaster3.local/git/llvm-project.git revision 23596fece043fa04206dcd5b26b4ca832e6741db) clang revision 23596fece043fa04206dcd5b26b4ca832e6741db llvm revision 23596fece043fa04206dcd5b26b4ca832e6741db Skipping the following test categories: ['darwin-log', 'libstdcxx', 'dwo', 'llgs', 'fork']

Hide Details

-- Command Output (stderr): -- Change dir to: /Users/buildslave/jenkins/workspace/lldb-cmake/llvm-project/lldb/test/API/tools/lldb-vscode/breakpoint runCmd: settings clear -all output:

Hide Details

runCmd: settings set symbols.enable-external-lookup false output:

Hide Details

runCmd: settings set target.inherit-tcc true output:

Hide Details

runCmd: settings set target.detach-on-error false output:

Hide Details

runCmd: settings set target.auto-apply-fixits false output:

Hide Details

runCmd: settings set plugin.process.gdb-remote.packet-timeout 60 output:

Hide Details

runCmd: settings set symbols.clang-modules-cache-path "/Users/buildslave/jenkins/workspace/lldb-cmake/lldb-build/lldb-test-build.noindex/module-cache-lldb/lldb-api" output:

Hide Details

runCmd: settings set use-color false output:

Hide Details

runCmd: setting set target.prefer-dynamic-value no-dynamic-values output:

Hide Details

Adding tearDown hook: def cleanup(): if disconnectAutomatically: self.vscode.request_disconnect(terminateDebuggee=True) self.vscode.terminate()

Hide Details

Hide Details

FAIL: LLDB (/Users/buildslave/jenkins/workspace/lldb-cmake/lldb-build/bin/clang-x86_64) :: test_clear_breakpoints_unset_breakpoints (TestVSCode_setBreakpoints.TestVSCode_setBreakpoints) Executing tearDown hook: def cleanup(): if disconnectAutomatically: self.vscode.request_disconnect(terminateDebuggee=True) self.vscode.terminate()

Hide Details

Hide Details

runCmd: settings clear -all output:

Hide Details

runCmd: settings set symbols.enable-external-lookup false output:

Hide Details

runCmd: settings set target.inherit-tcc true output:

Hide Details

runCmd: settings set target.detach-on-error false output:

Hide Details

runCmd: settings set target.auto-apply-fixits false output:

Hide Details

runCmd: settings set plugin.process.gdb-remote.packet-timeout 60 output:

Hide Details

runCmd: settings set symbols.clang-modules-cache-path "/Users/buildslave/jenkins/workspace/lldb-cmake/lldb-build/lldb-test-build.noindex/module-cache-lldb/lldb-api" output:

Hide Details

runCmd: settings set use-color false output:

Hide Details

runCmd: setting set target.prefer-dynamic-value no-dynamic-values output:

Hide Details

Adding tearDown hook: def cleanup(): if disconnectAutomatically: self.vscode.request_disconnect(terminateDebuggee=True) self.vscode.terminate()

Hide Details

Hide Details

FAIL: LLDB (/Users/buildslave/jenkins/workspace/lldb-cmake/lldb-build/bin/clang-x86_64) :: test_functionality (TestVSCode_setBreakpoints.TestVSCode_setBreakpoints) Executing tearDown hook: def cleanup(): if disconnectAutomatically: self.vscode.request_disconnect(terminateDebuggee=True) self.vscode.terminate()

Hide Details

Hide Details

runCmd: settings clear -all output:

Hide Details

runCmd: settings set symbols.enable-external-lookup false output:

Hide Details

runCmd: settings set target.inherit-tcc true output:

Hide Details

runCmd: settings set target.detach-on-error false output:

Hide Details

runCmd: settings set target.auto-apply-fixits false output:

Hide Details

runCmd: settings set plugin.process.gdb-remote.packet-timeout 60 output:

Hide Details

runCmd: settings set symbols.clang-modules-cache-path "/Users/buildslave/jenkins/workspace/lldb-cmake/lldb-build/lldb-test-build.noindex/module-cache-lldb/lldb-api" output:

Hide Details

runCmd: settings set use-color false output:

Hide Details

runCmd: setting set target.prefer-dynamic-value no-dynamic-values output:

Hide Details

Adding tearDown hook: def cleanup(): if disconnectAutomatically: self.vscode.request_disconnect(terminateDebuggee=True) self.vscode.terminate()

Hide Details

Hide Details

FAIL: LLDB (/Users/buildslave/jenkins/workspace/lldb-cmake/lldb-build/bin/clang-x86_64) :: test_set_and_clear (TestVSCode_setBreakpoints.TestVSCode_setBreakpoints) Executing tearDown hook: def cleanup(): if disconnectAutomatically: self.vscode.request_disconnect(terminateDebuggee=True) self.vscode.terminate()

Hide Details

Hide Details

runCmd: settings clear -all output:

Hide Details

runCmd: settings set symbols.enable-external-lookup false output:

Hide Details

runCmd: settings set target.inherit-tcc true output:

Hide Details

runCmd: settings set target.detach-on-error false output:

Hide Details

runCmd: settings set target.auto-apply-fixits false output:

Hide Details

runCmd: settings set plugin.process.gdb-remote.packet-timeout 60 output:

Hide Details

runCmd: settings set symbols.clang-modules-cache-path "/Users/buildslave/jenkins/workspace/lldb-cmake/lldb-build/lldb-test-build.noindex/module-cache-lldb/lldb-api" output:

Hide Details

runCmd: settings set use-color false output:

Hide Details

runCmd: setting set target.prefer-dynamic-value no-dynamic-values output:

Hide Details

Adding tearDown hook: def cleanup(): if disconnectAutomatically: self.vscode.request_disconnect(terminateDebuggee=True) self.vscode.terminate()

Hide Details

Hide Details

FAIL: LLDB (/Users/buildslave/jenkins/workspace/lldb-cmake/lldb-build/bin/clang-x86_64) :: test_source_map (TestVSCode_setBreakpoints.TestVSCode_setBreakpoints) Executing tearDown hook: def cleanup(): if disconnectAutomatically: self.vscode.request_disconnect(terminateDebuggee=True) self.vscode.terminate()

Hide Details

Hide Details

Restore dir to: /Users/buildslave/jenkins/workspace/lldb-cmake/lldb-build/tools/lldb/test ====================================================================== FAIL: test_clear_breakpoints_unset_breakpoints (TestVSCode_setBreakpoints.TestVSCode_setBreakpoints) Test clearing breakpoints like test_set_and_clear, but clear ---------------------------------------------------------------------- Traceback (most recent call last): File "/Users/buildslave/jenkins/workspace/lldb-cmake/llvm-project/lldb/test/API/tools/lldb-vscode/breakpoint/TestVSCode_setBreakpoints.py", line 235, in test_clear_breakpoints_unset_breakpoints self.build_and_launch(program) File "/Users/buildslave/jenkins/workspace/lldb-cmake/llvm-project/lldb/packages/Python/lldbsuite/test/tools/lldb-vscode/lldbvscode_testcase.py", line 358, in build_and_launch postRunCommands=postRunCommands) File "/Users/buildslave/jenkins/workspace/lldb-cmake/llvm-project/lldb/packages/Python/lldbsuite/test/tools/lldb-vscode/lldbvscode_testcase.py", line 330, in launch 'launch failed (%s)' % (response['message'])) AssertionError: False is not True : launch failed (process exited with status -1 (tried to attach to process already being debugged)) Config=x86_64-/Users/buildslave/jenkins/workspace/lldb-cmake/lldb-build/bin/clang ====================================================================== FAIL: test_functionality (TestVSCode_setBreakpoints.TestVSCode_setBreakpoints) Tests hitting breakpoints and the functionality of a single ---------------------------------------------------------------------- Traceback (most recent call last): File "/Users/buildslave/jenkins/workspace/lldb-cmake/llvm-project/lldb/test/API/tools/lldb-vscode/breakpoint/TestVSCode_setBreakpoints.py", line 272, in test_functionality self.build_and_launch(program) File "/Users/buildslave/jenkins/workspace/lldb-cmake/llvm-project/lldb/packages/Python/lldbsuite/test/tools/lldb-vscode/lldbvscode_testcase.py", line 358, in build_and_launch postRunCommands=postRunCommands) File "/Users/buildslave/jenkins/workspace/lldb-cmake/llvm-project/lldb/packages/Python/lldbsuite/test/tools/lldb-vscode/lldbvscode_testcase.py", line 330, in launch 'launch failed (%s)' % (response['message'])) AssertionError: False is not True : launch failed (process exited with status -1 (tried to attach to process already being debugged)) Config=x86_64-/Users/buildslave/jenkins/workspace/lldb-cmake/lldb-build/bin/clang ====================================================================== FAIL: test_set_and_clear (TestVSCode_setBreakpoints.TestVSCode_setBreakpoints) Tests setting and clearing source file and line breakpoints. ---------------------------------------------------------------------- Traceback (most recent call last): File "/Users/buildslave/jenkins/workspace/lldb-cmake/llvm-project/lldb/test/API/tools/lldb-vscode/breakpoint/TestVSCode_setBreakpoints.py", line 114, in test_set_and_clear self.build_and_launch(program) File "/Users/buildslave/jenkins/workspace/lldb-cmake/llvm-project/lldb/packages/Python/lldbsuite/test/tools/lldb-vscode/lldbvscode_testcase.py", line 358, in build_and_launch postRunCommands=postRunCommands) File "/Users/buildslave/jenkins/workspace/lldb-cmake/llvm-project/lldb/packages/Python/lldbsuite/test/tools/lldb-vscode/lldbvscode_testcase.py", line 330, in launch 'launch failed (%s)' % (response['message'])) AssertionError: False is not True : launch failed (process exited with status -1 (tried to attach to process already being debugged)) Config=x86_64-/Users/buildslave/jenkins/workspace/lldb-cmake/lldb-build/bin/clang ====================================================================== FAIL: test_source_map (TestVSCode_setBreakpoints.TestVSCode_setBreakpoints) ---------------------------------------------------------------------- Traceback (most recent call last): File "/Users/buildslave/jenkins/workspace/lldb-cmake/llvm-project/lldb/test/API/tools/lldb-vscode/breakpoint/TestVSCode_setBreakpoints.py", line 56, in test_source_map self.launch(program, sourceMap=source_map) File "/Users/buildslave/jenkins/workspace/lldb-cmake/llvm-project/lldb/packages/Python/lldbsuite/test/tools/lldb-vscode/lldbvscode_testcase.py", line 330, in launch 'launch failed (%s)' % (response['message'])) AssertionError: False is not True : launch failed (process exited with status -1 (tried to attach to process already being debugged)) Config=x86_64-/Users/buildslave/jenkins/workspace/lldb-cmake/lldb-build/bin/clang ---------------------------------------------------------------------- Ran 4 tests in 130.459s

Hide Details

RESULT: FAILED (0 passes, 4 failures, 0 errors, 0 skipped, 0 expected failures, 0 unexpected successes)

Hide Details

--

Hide Details

******************** PASS: lldb-shell :: Driver/TestSingleQuote.test (1794 of 2337) PASS: lldb-unit :: Target/./TargetTests/ModuleCacheTest.GetAndPutUuidExists (1795 of 2337) FAIL: lldb-api :: lang/cpp/static_methods/TestCPPStaticMethods.py (1796 of 2337) ******************** TEST 'lldb-api :: lang/cpp/static_methods/TestCPPStaticMethods.py' FAILED ******************** Script: -- /usr/local/Frameworks/Python.framework/Versions/3.7/bin/python3.7 /Users/buildslave/jenkins/workspace/lldb-cmake/llvm-project/lldb/test/API/dotest.py -u CXXFLAGS -u CFLAGS --codesign-identity - --arch x86_64 --build-dir /Users/buildslave/jenkins/workspace/lldb-cmake/lldb-build/lldb-test-build.noindex -t --env TERM=vt100 --env LLVM_LIBS_DIR=/Users/buildslave/jenkins/workspace/lldb-cmake/lldb-build/./lib --arch x86_64 --build-dir /Users/buildslave/jenkins/workspace/lldb-cmake/lldb-build/lldb-test-build.noindex --lldb-module-cache-dir /Users/buildslave/jenkins/workspace/lldb-cmake/lldb-build/lldb-test-build.noindex/module-cache-lldb/lldb-api --clang-module-cache-dir /Users/buildslave/jenkins/workspace/lldb-cmake/lldb-build/lldb-test-build.noindex/module-cache-clang/lldb-api --executable /Users/buildslave/jenkins/workspace/lldb-cmake/lldb-build/./bin/lldb --compiler /Users/buildslave/jenkins/workspace/lldb-cmake/lldb-build/./bin/clang --dsymutil /Users/buildslave/jenkins/workspace/lldb-cmake/lldb-build/./bin/dsymutil --llvm-tools-dir /Users/buildslave/jenkins/workspace/lldb-cmake/lldb-build/./bin --lldb-libs-dir /Users/buildslave/jenkins/workspace/lldb-cmake/lldb-build/./lib /Users/buildslave/jenkins/workspace/lldb-cmake/llvm-project/lldb/test/API/lang/cpp/static_methods -p TestCPPStaticMethods.py -- Exit Code: 1

Hide Details

Command Output (stdout): -- lldb version 13.0.99 (http://labmaster3.local/git/llvm-project.git revision 23596fece043fa04206dcd5b26b4ca832e6741db) clang revision 23596fece043fa04206dcd5b26b4ca832e6741db llvm revision 23596fece043fa04206dcd5b26b4ca832e6741db Skipping the following test categories: ['darwin-log', 'libstdcxx', 'dwo', 'llgs', 'fork']

Hide Details

-- Command Output (stderr): -- Change dir to: /Users/buildslave/jenkins/workspace/lldb-cmake/llvm-project/lldb/test/API/lang/cpp/static_methods runCmd: settings clear -all output:

Hide Details

runCmd: settings set symbols.enable-external-lookup false output:

Hide Details

runCmd: settings set target.inherit-tcc true output:

Hide Details

runCmd: settings set target.detach-on-error false output:

Hide Details

runCmd: settings set target.auto-apply-fixits false output:

Hide Details

runCmd: settings set plugin.process.gdb-remote.packet-timeout 60 output:

Hide Details

runCmd: settings set symbols.clang-modules-cache-path "/Users/buildslave/jenkins/workspace/lldb-cmake/lldb-build/lldb-test-build.noindex/module-cache-lldb/lldb-api" output:

Hide Details

runCmd: settings set use-color false output:

Hide Details

runCmd: setting set target.prefer-dynamic-value no-dynamic-values output:

Hide Details

FAIL: LLDB (/Users/buildslave/jenkins/workspace/lldb-cmake/lldb-build/bin/clang-x86_64) :: test_with_run_command_dsym (TestCPPStaticMethods.CPPStaticMethodsTestCase) <bound method SBProcess.Kill of <lldb.SBProcess; proxy of <Swig Object of type 'lldb::SBProcess *' at 0x10ad99150> >>: success

Hide Details

runCmd: settings clear -all output:

Hide Details

runCmd: settings set symbols.enable-external-lookup false output:

Hide Details

runCmd: settings set target.inherit-tcc true output:

Hide Details

runCmd: settings set target.detach-on-error false output:

Hide Details

runCmd: settings set target.auto-apply-fixits false output:

Hide Details

runCmd: settings set plugin.process.gdb-remote.packet-timeout 60 output:

Hide Details

runCmd: settings set symbols.clang-modules-cache-path "/Users/buildslave/jenkins/workspace/lldb-cmake/lldb-build/lldb-test-build.noindex/module-cache-lldb/lldb-api" output:

Hide Details

runCmd: settings set use-color false output:

Hide Details

runCmd: setting set target.prefer-dynamic-value no-dynamic-values output:

Hide Details

FAIL: LLDB (/Users/buildslave/jenkins/workspace/lldb-cmake/lldb-build/bin/clang-x86_64) :: test_with_run_command_dwarf (TestCPPStaticMethods.CPPStaticMethodsTestCase) <bound method SBProcess.Kill of <lldb.SBProcess; proxy of <Swig Object of type 'lldb::SBProcess *' at 0x10a64fbd0> >>: success

Hide Details

UNSUPPORTED: LLDB (/Users/buildslave/jenkins/workspace/lldb-cmake/lldb-build/bin/clang-x86_64) :: test_with_run_command_dwo (TestCPPStaticMethods.CPPStaticMethodsTestCase) (test case does not fall in any category of interest for this run) runCmd: settings clear -all output:

Hide Details

runCmd: settings set symbols.enable-external-lookup false output:

Hide Details

runCmd: settings set target.inherit-tcc true output:

Hide Details

runCmd: settings set target.detach-on-error false output:

Hide Details

runCmd: settings set target.auto-apply-fixits false output:

Hide Details

runCmd: settings set plugin.process.gdb-remote.packet-timeout 60 output:

Hide Details

runCmd: settings set symbols.clang-modules-cache-path "/Users/buildslave/jenkins/workspace/lldb-cmake/lldb-build/lldb-test-build.noindex/module-cache-lldb/lldb-api" output:

Hide Details

runCmd: settings set use-color false output:

Hide Details

runCmd: setting set target.prefer-dynamic-value no-dynamic-values output:

Hide Details

FAIL: LLDB (/Users/buildslave/jenkins/workspace/lldb-cmake/lldb-build/bin/clang-x86_64) :: test_with_run_command_gmodules (TestCPPStaticMethods.CPPStaticMethodsTestCase) <bound method SBProcess.Kill of <lldb.SBProcess; proxy of <Swig Object of type 'lldb::SBProcess *' at 0x10a7f0960> >>: success

Hide Details

Restore dir to: /Users/buildslave/jenkins/workspace/lldb-cmake/lldb-build/tools/lldb/test ====================================================================== FAIL: test_with_run_command_dsym (TestCPPStaticMethods.CPPStaticMethodsTestCase) Test that static methods are properly distinguished from regular methods ---------------------------------------------------------------------- Traceback (most recent call last): File "/Users/buildslave/jenkins/workspace/lldb-cmake/llvm-project/lldb/packages/Python/lldbsuite/test/lldbtest.py", line 1830, in test_method return attrvalue(self) File "/Users/buildslave/jenkins/workspace/lldb-cmake/llvm-project/lldb/test/API/lang/cpp/static_methods/TestCPPStaticMethods.py", line 18, in test_with_run_command lldbutil.run_to_source_breakpoint(self, "// Break here", lldb.SBFileSpec("main.cpp")) File "/Users/buildslave/jenkins/workspace/lldb-cmake/llvm-project/lldb/packages/Python/lldbsuite/test/lldbutil.py", line 971, in run_to_source_breakpoint only_one_thread, extra_images) File "/Users/buildslave/jenkins/workspace/lldb-cmake/llvm-project/lldb/packages/Python/lldbsuite/test/lldbutil.py", line 890, in run_to_breakpoint_do_run "Process launch failed: %s" % (error.GetCString())) AssertionError: True is not False : Process launch failed: process exited with status -1 (tried to attach to process already being debugged) Config=x86_64-/Users/buildslave/jenkins/workspace/lldb-cmake/lldb-build/bin/clang ====================================================================== FAIL: test_with_run_command_dwarf (TestCPPStaticMethods.CPPStaticMethodsTestCase) Test that static methods are properly distinguished from regular methods ---------------------------------------------------------------------- Traceback (most recent call last): File "/Users/buildslave/jenkins/workspace/lldb-cmake/llvm-project/lldb/packages/Python/lldbsuite/test/lldbtest.py", line 1830, in test_method return attrvalue(self) File "/Users/buildslave/jenkins/workspace/lldb-cmake/llvm-project/lldb/test/API/lang/cpp/static_methods/TestCPPStaticMethods.py", line 18, in test_with_run_command lldbutil.run_to_source_breakpoint(self, "// Break here", lldb.SBFileSpec("main.cpp")) File "/Users/buildslave/jenkins/workspace/lldb-cmake/llvm-project/lldb/packages/Python/lldbsuite/test/lldbutil.py", line 971, in run_to_source_breakpoint only_one_thread, extra_images) File "/Users/buildslave/jenkins/workspace/lldb-cmake/llvm-project/lldb/packages/Python/lldbsuite/test/lldbutil.py", line 890, in run_to_breakpoint_do_run "Process launch failed: %s" % (error.GetCString())) AssertionError: True is not False : Process launch failed: process exited with status -1 (tried to attach to process already being debugged) Config=x86_64-/Users/buildslave/jenkins/workspace/lldb-cmake/lldb-build/bin/clang ====================================================================== FAIL: test_with_run_command_gmodules (TestCPPStaticMethods.CPPStaticMethodsTestCase) Test that static methods are properly distinguished from regular methods ---------------------------------------------------------------------- Traceback (most recent call last): File "/Users/buildslave/jenkins/workspace/lldb-cmake/llvm-project/lldb/packages/Python/lldbsuite/test/lldbtest.py", line 1830, in test_method return attrvalue(self) File "/Users/buildslave/jenkins/workspace/lldb-cmake/llvm-project/lldb/test/API/lang/cpp/static_methods/TestCPPStaticMethods.py", line 18, in test_with_run_command lldbutil.run_to_source_breakpoint(self, "// Break here", lldb.SBFileSpec("main.cpp")) File "/Users/buildslave/jenkins/workspace/lldb-cmake/llvm-project/lldb/packages/Python/lldbsuite/test/lldbutil.py", line 971, in run_to_source_breakpoint only_one_thread, extra_images) File "/Users/buildslave/jenkins/workspace/lldb-cmake/llvm-project/lldb/packages/Python/lldbsuite/test/lldbutil.py", line 890, in run_to_breakpoint_do_run "Process launch failed: %s" % (error.GetCString())) AssertionError: True is not False : Process launch failed: process exited with status -1 (tried to attach to process already being debugged) Config=x86_64-/Users/buildslave/jenkins/workspace/lldb-cmake/lldb-build/bin/clang ---------------------------------------------------------------------- Ran 4 tests in 91.838s

Hide Details

RESULT: FAILED (0 passes, 3 failures, 0 errors, 1 skipped, 0 expected failures, 0 unexpected successes)

Hide Details

--

Hide Details

******************** PASS: lldb-unit :: Symbol/./SymbolTests/PostfixExpression.ParseFPOProgram (1797 of 2337) FAIL: lldb-api :: tools/lldb-server/TestGdbRemoteRegisterState.py (1798 of 2337) ******************** TEST 'lldb-api :: tools/lldb-server/TestGdbRemoteRegisterState.py' FAILED ******************** Script: -- /usr/local/Frameworks/Python.framework/Versions/3.7/bin/python3.7 /Users/buildslave/jenkins/workspace/lldb-cmake/llvm-project/lldb/test/API/dotest.py -u CXXFLAGS -u CFLAGS --codesign-identity - --arch x86_64 --build-dir /Users/buildslave/jenkins/workspace/lldb-cmake/lldb-build/lldb-test-build.noindex -t --env TERM=vt100 --env LLVM_LIBS_DIR=/Users/buildslave/jenkins/workspace/lldb-cmake/lldb-build/./lib --arch x86_64 --build-dir /Users/buildslave/jenkins/workspace/lldb-cmake/lldb-build/lldb-test-build.noindex --lldb-module-cache-dir /Users/buildslave/jenkins/workspace/lldb-cmake/lldb-build/lldb-test-build.noindex/module-cache-lldb/lldb-api --clang-module-cache-dir /Users/buildslave/jenkins/workspace/lldb-cmake/lldb-build/lldb-test-build.noindex/module-cache-clang/lldb-api --executable /Users/buildslave/jenkins/workspace/lldb-cmake/lldb-build/./bin/lldb --compiler /Users/buildslave/jenkins/workspace/lldb-cmake/lldb-build/./bin/clang --dsymutil /Users/buildslave/jenkins/workspace/lldb-cmake/lldb-build/./bin/dsymutil --llvm-tools-dir /Users/buildslave/jenkins/workspace/lldb-cmake/lldb-build/./bin --lldb-libs-dir /Users/buildslave/jenkins/workspace/lldb-cmake/lldb-build/./lib /Users/buildslave/jenkins/workspace/lldb-cmake/llvm-project/lldb/test/API/tools/lldb-server -p TestGdbRemoteRegisterState.py -- Exit Code: 1

Hide Details

Command Output (stdout): -- lldb version 13.0.99 (http://labmaster3.local/git/llvm-project.git revision 23596fece043fa04206dcd5b26b4ca832e6741db) clang revision 23596fece043fa04206dcd5b26b4ca832e6741db llvm revision 23596fece043fa04206dcd5b26b4ca832e6741db Skipping the following test categories: ['darwin-log', 'libstdcxx', 'dwo', 'llgs', 'fork']

Hide Details

-- Command Output (stderr): -- Change dir to: /Users/buildslave/jenkins/workspace/lldb-cmake/llvm-project/lldb/test/API/tools/lldb-server FAIL: LLDB (/Users/buildslave/jenkins/workspace/lldb-cmake/lldb-build/bin/clang-x86_64) :: test_grp_register_save_restore_works_no_suffix_debugserver (TestGdbRemoteRegisterState.TestGdbRemoteRegisterState) UNSUPPORTED: LLDB (/Users/buildslave/jenkins/workspace/lldb-cmake/lldb-build/bin/clang-x86_64) :: test_grp_register_save_restore_works_no_suffix_llgs (TestGdbRemoteRegisterState.TestGdbRemoteRegisterState) (test case does not fall in any category of interest for this run) Running on thread: 0x168a5e

Hide Details

saved register state id: 1

Hide Details

initial_reg_values: {0: 0, 1: 0, 2: 0, 3: 0, 4: 0, 5: 0, 6: 0, 7: 140732892445872, 8: 0, 9: 0, 10: 0, 11: 0, 12: 0, 13: 0, 14: 0, 15: 0, 16: 4360765440, 17: 512}

Hide Details

successful writes: 7, failed writes: 11

Hide Details

flipped_reg_values: {0: 18446744073709551615, 1: 18446744073709551615, 2: 18446744073709551615, 3: 18446744073709551615, 4: 18446744073709551615, 5: 18446744073709551615, 6: 18446744073709551615, 7: 18446603340817105743, 8: 18446744073709551615, 9: 18446744073709551615, 10: 18446744073709551615, 11: 18446744073709551615, 12: 18446744073709551615, 13: 18446744073709551615, 14: 18446744073709551615, 15: 18446744073709551615, 16: 18446744069348786175, 17: 18446744073709551103}

Hide Details

final_reg_values: {0: 0, 1: 0, 2: 0, 3: 0, 4: 0, 5: 0, 6: 0, 7: 140732892445872, 8: 0, 9: 0, 10: 0, 11: 0, 12: 0, 13: 0, 14: 0, 15: 0, 16: 4360765440, 17: 512}

Hide Details

PASS: LLDB (/Users/buildslave/jenkins/workspace/lldb-cmake/lldb-build/bin/clang-x86_64) :: test_grp_register_save_restore_works_with_suffix_debugserver (TestGdbRemoteRegisterState.TestGdbRemoteRegisterState) UNSUPPORTED: LLDB (/Users/buildslave/jenkins/workspace/lldb-cmake/lldb-build/bin/clang-x86_64) :: test_grp_register_save_restore_works_with_suffix_llgs (TestGdbRemoteRegisterState.TestGdbRemoteRegisterState) (test case does not fall in any category of interest for this run) Restore dir to: /Users/buildslave/jenkins/workspace/lldb-cmake/lldb-build/tools/lldb/test ====================================================================== FAIL: test_grp_register_save_restore_works_no_suffix_debugserver (TestGdbRemoteRegisterState.TestGdbRemoteRegisterState) ---------------------------------------------------------------------- Traceback (most recent call last): File "/Users/buildslave/jenkins/workspace/lldb-cmake/llvm-project/lldb/packages/Python/lldbsuite/test/tools/lldb-server/lldbgdbserverutils.py", line 188, in expect_lldb_gdbserver_replay content = server.get_raw_normal_packet() File "/Users/buildslave/jenkins/workspace/lldb-cmake/llvm-project/lldb/packages/Python/lldbsuite/test/tools/lldb-server/lldbgdbserverutils.py", line 946, in get_raw_normal_packet return self._read(self._normal_queue) File "/Users/buildslave/jenkins/workspace/lldb-cmake/llvm-project/lldb/packages/Python/lldbsuite/test/tools/lldb-server/lldbgdbserverutils.py", line 900, in _read new_bytes = self._sock.recv(4096) socket.timeout: timed out

Hide Details

During handling of the above exception, another exception occurred:

Hide Details

Traceback (most recent call last): File "/Users/buildslave/jenkins/workspace/lldb-cmake/llvm-project/lldb/packages/Python/lldbsuite/test/tools/lldb-server/gdbremote_testcase.py", line 52, in test_method return attrvalue(self) File "/Users/buildslave/jenkins/workspace/lldb-cmake/llvm-project/lldb/test/API/tools/lldb-server/TestGdbRemoteRegisterState.py", line 104, in test_grp_register_save_restore_works_no_suffix self.grp_register_save_restore_works(USE_THREAD_SUFFIX) File "/Users/buildslave/jenkins/workspace/lldb-cmake/llvm-project/lldb/test/API/tools/lldb-server/TestGdbRemoteRegisterState.py", line 24, in grp_register_save_restore_works context = self.expect_gdbremote_sequence() File "/Users/buildslave/jenkins/workspace/lldb-cmake/llvm-project/lldb/packages/Python/lldbsuite/test/tools/lldb-server/gdbremote_testcase.py", line 626, in expect_gdbremote_sequence self.logger) File "/Users/buildslave/jenkins/workspace/lldb-cmake/llvm-project/lldb/packages/Python/lldbsuite/test/tools/lldb-server/lldbgdbserverutils.py", line 192, in expect_lldb_gdbserver_replay "timed out while waiting for '{}':\n{}".format(sequence_entry, server)) AssertionError: timed out while waiting for '<lldbgdbserverutils.GdbRemoteEntry object at 0x10dbeeb00>': server '<lldbsuite.test.lldbtest._LocalProcess object at 0x10dbd66d8>' on '<socket.socket fd=7, family=AddressFamily.AF_INET6, type=SocketKind.SOCK_STREAM, proto=0, laddr=('::1', 51870, 0, 0), raddr=('::1', 51871, 0, 0)>' _receive_buffer: b'' _normal_queue: [] _output_queue: [] _accumulated_output: b''

Hide Details

Config=x86_64-/Users/buildslave/jenkins/workspace/lldb-cmake/lldb-build/bin/clang ---------------------------------------------------------------------- Ran 4 tests in 30.015s

Hide Details

RESULT: FAILED (1 passes, 1 failures, 0 errors, 2 skipped, 0 expected failures, 0 unexpected successes)

Hide Details

--

Hide Details

******************** FAIL: lldb-api :: python_api/lldbutil/iter/TestLLDBIterator.py (1799 of 2337) ******************** TEST 'lldb-api :: python_api/lldbutil/iter/TestLLDBIterator.py' FAILED ******************** Script: -- /usr/local/Frameworks/Python.framework/Versions/3.7/bin/python3.7 /Users/buildslave/jenkins/workspace/lldb-cmake/llvm-project/lldb/test/API/dotest.py -u CXXFLAGS -u CFLAGS --codesign-identity - --arch x86_64 --build-dir /Users/buildslave/jenkins/workspace/lldb-cmake/lldb-build/lldb-test-build.noindex -t --env TERM=vt100 --env LLVM_LIBS_DIR=/Users/buildslave/jenkins/workspace/lldb-cmake/lldb-build/./lib --arch x86_64 --build-dir /Users/buildslave/jenkins/workspace/lldb-cmake/lldb-build/lldb-test-build.noindex --lldb-module-cache-dir /Users/buildslave/jenkins/workspace/lldb-cmake/lldb-build/lldb-test-build.noindex/module-cache-lldb/lldb-api --clang-module-cache-dir /Users/buildslave/jenkins/workspace/lldb-cmake/lldb-build/lldb-test-build.noindex/module-cache-clang/lldb-api --executable /Users/buildslave/jenkins/workspace/lldb-cmake/lldb-build/./bin/lldb --compiler /Users/buildslave/jenkins/workspace/lldb-cmake/lldb-build/./bin/clang --dsymutil /Users/buildslave/jenkins/workspace/lldb-cmake/lldb-build/./bin/dsymutil --llvm-tools-dir /Users/buildslave/jenkins/workspace/lldb-cmake/lldb-build/./bin --lldb-libs-dir /Users/buildslave/jenkins/workspace/lldb-cmake/lldb-build/./lib /Users/buildslave/jenkins/workspace/lldb-cmake/llvm-project/lldb/test/API/python_api/lldbutil/iter -p TestLLDBIterator.py -- Exit Code: 1

Hide Details

Command Output (stdout): -- lldb version 13.0.99 (http://labmaster3.local/git/llvm-project.git revision 23596fece043fa04206dcd5b26b4ca832e6741db) clang revision 23596fece043fa04206dcd5b26b4ca832e6741db llvm revision 23596fece043fa04206dcd5b26b4ca832e6741db Skipping the following test categories: ['darwin-log', 'libstdcxx', 'dwo', 'llgs', 'fork'] yours[0]='SBBreakpoint: id = 1, file = 'main.cpp', line = 65, exact_match = 0, locations = 1' mine[0]='SBBreakpoint: id = 1, file = 'main.cpp', line = 65, exact_match = 0, locations = 1' yours[1]='SBBreakpoint: id = 2, file = 'main.cpp', line = 82, exact_match = 0, locations = 1' mine[1]='SBBreakpoint: id = 2, file = 'main.cpp', line = 82, exact_match = 0, locations = 1' yours[0]='SBBreakpoint: id = 1, file = 'main.cpp', line = 65, exact_match = 0, locations = 1' mine[0]='SBBreakpoint: id = 1, file = 'main.cpp', line = 65, exact_match = 0, locations = 1' yours[1]='SBBreakpoint: id = 2, file = 'main.cpp', line = 82, exact_match = 0, locations = 1' mine[1]='SBBreakpoint: id = 2, file = 'main.cpp', line = 82, exact_match = 0, locations = 1' yours[0]='SBBreakpoint: id = 1, file = 'main.cpp', line = 65, exact_match = 0, locations = 1' mine[0]='SBBreakpoint: id = 1, file = 'main.cpp', line = 65, exact_match = 0, locations = 1' yours[1]='SBBreakpoint: id = 2, file = 'main.cpp', line = 82, exact_match = 0, locations = 1' mine[1]='SBBreakpoint: id = 2, file = 'main.cpp', line = 82, exact_match = 0, locations = 1' yours[0]='(x86_64) /Users/buildslave/jenkins/workspace/lldb-cmake/lldb-build/lldb-test-build.noindex/python_api/lldbutil/iter/TestLLDBIterator.test_lldb_iter_module_dsym/a.out' mine[0]='(x86_64) /Users/buildslave/jenkins/workspace/lldb-cmake/lldb-build/lldb-test-build.noindex/python_api/lldbutil/iter/TestLLDBIterator.test_lldb_iter_module_dsym/a.out' yours[1]='(x86_64) /usr/lib/dyld' mine[1]='(x86_64) /usr/lib/dyld' yours[2]='(x86_64) /usr/lib/libc++.1.dylib' mine[2]='(x86_64) /usr/lib/libc++.1.dylib' yours[3]='(x86_64) /usr/lib/libSystem.B.dylib' mine[3]='(x86_64) /usr/lib/libSystem.B.dylib' yours[4]='(x86_64) /usr/lib/libc++abi.dylib' mine[4]='(x86_64) /usr/lib/libc++abi.dylib' yours[5]='(x86_64) /usr/lib/system/libcache.dylib' mine[5]='(x86_64) /usr/lib/system/libcache.dylib' yours[6]='(x86_64) /usr/lib/system/libcommonCrypto.dylib' mine[6]='(x86_64) /usr/lib/system/libcommonCrypto.dylib' yours[7]='(x86_64) /usr/lib/system/libcompiler_rt.dylib' mine[7]='(x86_64) /usr/lib/system/libcompiler_rt.dylib' yours[8]='(x86_64) /usr/lib/system/libcopyfile.dylib' mine[8]='(x86_64) /usr/lib/system/libcopyfile.dylib' yours[9]='(x86_64) /usr/lib/system/libcorecrypto.dylib' mine[9]='(x86_64) /usr/lib/system/libcorecrypto.dylib' yours[10]='(x86_64) /usr/lib/system/libdispatch.dylib' mine[10]='(x86_64) /usr/lib/system/libdispatch.dylib' yours[11]='(x86_64) /usr/lib/system/libdyld.dylib' mine[11]='(x86_64) /usr/lib/system/libdyld.dylib' yours[12]='(x86_64) /usr/lib/system/libkeymgr.dylib' mine[12]='(x86_64) /usr/lib/system/libkeymgr.dylib' yours[13]='(x86_64) /usr/lib/system/liblaunch.dylib' mine[13]='(x86_64) /usr/lib/system/liblaunch.dylib' yours[14]='(x86_64) /usr/lib/system/libmacho.dylib' mine[14]='(x86_64) /usr/lib/system/libmacho.dylib' yours[15]='(x86_64) /usr/lib/system/libquarantine.dylib' mine[15]='(x86_64) /usr/lib/system/libquarantine.dylib' yours[16]='(x86_64) /usr/lib/system/libremovefile.dylib' mine[16]='(x86_64) /usr/lib/system/libremovefile.dylib' yours[17]='(x86_64) /usr/lib/system/libsystem_asl.dylib' mine[17]='(x86_64) /usr/lib/system/libsystem_asl.dylib' yours[18]='(x86_64) /usr/lib/system/libsystem_blocks.dylib' mine[18]='(x86_64) /usr/lib/system/libsystem_blocks.dylib' yours[19]='(x86_64) /usr/lib/system/libsystem_c.dylib' mine[19]='(x86_64) /usr/lib/system/libsystem_c.dylib' yours[20]='(x86_64) /usr/lib/system/libsystem_configuration.dylib' mine[20]='(x86_64) /usr/lib/system/libsystem_configuration.dylib' yours[21]='(x86_64) /usr/lib/system/libsystem_coreservices.dylib' mine[21]='(x86_64) /usr/lib/system/libsystem_coreservices.dylib' yours[22]='(x86_64) /usr/lib/system/libsystem_darwin.dylib' mine[22]='(x86_64) /usr/lib/system/libsystem_darwin.dylib' yours[23]='(x86_64) /usr/lib/system/libsystem_dnssd.dylib' mine[23]='(x86_64) /usr/lib/system/libsystem_dnssd.dylib' yours[24]='(x86_64) /usr/lib/system/libsystem_featureflags.dylib' mine[24]='(x86_64) /usr/lib/system/libsystem_featureflags.dylib' yours[25]='(x86_64) /usr/lib/system/libsystem_info.dylib' mine[25]='(x86_64) /usr/lib/system/libsystem_info.dylib' yours[26]='(x86_64) /usr/lib/system/libsystem_m.dylib' mine[26]='(x86_64) /usr/lib/system/libsystem_m.dylib' yours[27]='(x86_64) /usr/lib/system/libsystem_malloc.dylib' mine[27]='(x86_64) /usr/lib/system/libsystem_malloc.dylib' yours[28]='(x86_64) /usr/lib/system/libsystem_networkextension.dylib' mine[28]='(x86_64) /usr/lib/system/libsystem_networkextension.dylib' yours[29]='(x86_64) /usr/lib/system/libsystem_notify.dylib' mine[29]='(x86_64) /usr/lib/system/libsystem_notify.dylib' yours[30]='(x86_64) /usr/lib/system/libsystem_sandbox.dylib' mine[30]='(x86_64) /usr/lib/system/libsystem_sandbox.dylib' yours[31]='(x86_64) /usr/lib/system/libsystem_secinit.dylib' mine[31]='(x86_64) /usr/lib/system/libsystem_secinit.dylib' yours[32]='(x86_64) /usr/lib/system/libsystem_kernel.dylib' mine[32]='(x86_64) /usr/lib/system/libsystem_kernel.dylib' yours[33]='(x86_64) /usr/lib/system/libsystem_platform.dylib' mine[33]='(x86_64) /usr/lib/system/libsystem_platform.dylib' yours[34]='(x86_64) /usr/lib/system/libsystem_pthread.dylib' mine[34]='(x86_64) /usr/lib/system/libsystem_pthread.dylib' yours[35]='(x86_64) /usr/lib/system/libsystem_symptoms.dylib' mine[35]='(x86_64) /usr/lib/system/libsystem_symptoms.dylib' yours[36]='(x86_64) /usr/lib/system/libsystem_trace.dylib' mine[36]='(x86_64) /usr/lib/system/libsystem_trace.dylib' yours[37]='(x86_64) /usr/lib/system/libunwind.dylib' mine[37]='(x86_64) /usr/lib/system/libunwind.dylib' yours[38]='(x86_64) /usr/lib/system/libxpc.dylib' mine[38]='(x86_64) /usr/lib/system/libxpc.dylib' yours[39]='(x86_64) /usr/lib/libobjc.A.dylib' mine[39]='(x86_64) /usr/lib/libobjc.A.dylib' yours[0]='(x86_64) /Users/buildslave/jenkins/workspace/lldb-cmake/lldb-build/lldb-test-build.noindex/python_api/lldbutil/iter/TestLLDBIterator.test_lldb_iter_module_dwarf/a.out' mine[0]='(x86_64) /Users/buildslave/jenkins/workspace/lldb-cmake/lldb-build/lldb-test-build.noindex/python_api/lldbutil/iter/TestLLDBIterator.test_lldb_iter_module_dwarf/a.out' yours[1]='(x86_64) /usr/lib/dyld' mine[1]='(x86_64) /usr/lib/dyld' yours[2]='(x86_64) /usr/lib/libc++.1.dylib' mine[2]='(x86_64) /usr/lib/libc++.1.dylib' yours[3]='(x86_64) /usr/lib/libSystem.B.dylib' mine[3]='(x86_64) /usr/lib/libSystem.B.dylib' yours[4]='(x86_64) /usr/lib/libc++abi.dylib' mine[4]='(x86_64) /usr/lib/libc++abi.dylib' yours[5]='(x86_64) /usr/lib/system/libcache.dylib' mine[5]='(x86_64) /usr/lib/system/libcache.dylib' yours[6]='(x86_64) /usr/lib/system/libcommonCrypto.dylib' mine[6]='(x86_64) /usr/lib/system/libcommonCrypto.dylib' yours[7]='(x86_64) /usr/lib/system/libcompiler_rt.dylib' mine[7]='(x86_64) /usr/lib/system/libcompiler_rt.dylib' yours[8]='(x86_64) /usr/lib/system/libcopyfile.dylib' mine[8]='(x86_64) /usr/lib/system/libcopyfile.dylib' yours[9]='(x86_64) /usr/lib/system/libcorecrypto.dylib' mine[9]='(x86_64) /usr/lib/system/libcorecrypto.dylib' yours[10]='(x86_64) /usr/lib/system/libdispatch.dylib' mine[10]='(x86_64) /usr/lib/system/libdispatch.dylib' yours[11]='(x86_64) /usr/lib/system/libdyld.dylib' mine[11]='(x86_64) /usr/lib/system/libdyld.dylib' yours[12]='(x86_64) /usr/lib/system/libkeymgr.dylib' mine[12]='(x86_64) /usr/lib/system/libkeymgr.dylib' yours[13]='(x86_64) /usr/lib/system/liblaunch.dylib' mine[13]='(x86_64) /usr/lib/system/liblaunch.dylib' yours[14]='(x86_64) /usr/lib/system/libmacho.dylib' mine[14]='(x86_64) /usr/lib/system/libmacho.dylib' yours[15]='(x86_64) /usr/lib/system/libquarantine.dylib' mine[15]='(x86_64) /usr/lib/system/libquarantine.dylib' yours[16]='(x86_64) /usr/lib/system/libremovefile.dylib' mine[16]='(x86_64) /usr/lib/system/libremovefile.dylib' yours[17]='(x86_64) /usr/lib/system/libsystem_asl.dylib' mine[17]='(x86_64) /usr/lib/system/libsystem_asl.dylib' yours[18]='(x86_64) /usr/lib/system/libsystem_blocks.dylib' mine[18]='(x86_64) /usr/lib/system/libsystem_blocks.dylib' yours[19]='(x86_64) /usr/lib/system/libsystem_c.dylib' mine[19]='(x86_64) /usr/lib/system/libsystem_c.dylib' yours[20]='(x86_64) /usr/lib/system/libsystem_configuration.dylib' mine[20]='(x86_64) /usr/lib/system/libsystem_configuration.dylib' yours[21]='(x86_64) /usr/lib/system/libsystem_coreservices.dylib' mine[21]='(x86_64) /usr/lib/system/libsystem_coreservices.dylib' yours[22]='(x86_64) /usr/lib/system/libsystem_darwin.dylib' mine[22]='(x86_64) /usr/lib/system/libsystem_darwin.dylib' yours[23]='(x86_64) /usr/lib/system/libsystem_dnssd.dylib' mine[23]='(x86_64) /usr/lib/system/libsystem_dnssd.dylib' yours[24]='(x86_64) /usr/lib/system/libsystem_featureflags.dylib' mine[24]='(x86_64) /usr/lib/system/libsystem_featureflags.dylib' yours[25]='(x86_64) /usr/lib/system/libsystem_info.dylib' mine[25]='(x86_64) /usr/lib/system/libsystem_info.dylib' yours[26]='(x86_64) /usr/lib/system/libsystem_m.dylib' mine[26]='(x86_64) /usr/lib/system/libsystem_m.dylib' yours[27]='(x86_64) /usr/lib/system/libsystem_malloc.dylib' mine[27]='(x86_64) /usr/lib/system/libsystem_malloc.dylib' yours[28]='(x86_64) /usr/lib/system/libsystem_networkextension.dylib' mine[28]='(x86_64) /usr/lib/system/libsystem_networkextension.dylib' yours[29]='(x86_64) /usr/lib/system/libsystem_notify.dylib' mine[29]='(x86_64) /usr/lib/system/libsystem_notify.dylib' yours[30]='(x86_64) /usr/lib/system/libsystem_sandbox.dylib' mine[30]='(x86_64) /usr/lib/system/libsystem_sandbox.dylib' yours[31]='(x86_64) /usr/lib/system/libsystem_secinit.dylib' mine[31]='(x86_64) /usr/lib/system/libsystem_secinit.dylib' yours[32]='(x86_64) /usr/lib/system/libsystem_kernel.dylib' mine[32]='(x86_64) /usr/lib/system/libsystem_kernel.dylib' yours[33]='(x86_64) /usr/lib/system/libsystem_platform.dylib' mine[33]='(x86_64) /usr/lib/system/libsystem_platform.dylib' yours[34]='(x86_64) /usr/lib/system/libsystem_pthread.dylib' mine[34]='(x86_64) /usr/lib/system/libsystem_pthread.dylib' yours[35]='(x86_64) /usr/lib/system/libsystem_symptoms.dylib' mine[35]='(x86_64) /usr/lib/system/libsystem_symptoms.dylib' yours[36]='(x86_64) /usr/lib/system/libsystem_trace.dylib' mine[36]='(x86_64) /usr/lib/system/libsystem_trace.dylib' yours[37]='(x86_64) /usr/lib/system/libunwind.dylib' mine[37]='(x86_64) /usr/lib/system/libunwind.dylib' yours[38]='(x86_64) /usr/lib/system/libxpc.dylib' mine[38]='(x86_64) /usr/lib/system/libxpc.dylib' yours[39]='(x86_64) /usr/lib/libobjc.A.dylib' mine[39]='(x86_64) /usr/lib/libobjc.A.dylib' yours[0]='(x86_64) /Users/buildslave/jenkins/workspace/lldb-cmake/lldb-build/lldb-test-build.noindex/python_api/lldbutil/iter/TestLLDBIterator.test_lldb_iter_module_gmodules/a.out' mine[0]='(x86_64) /Users/buildslave/jenkins/workspace/lldb-cmake/lldb-build/lldb-test-build.noindex/python_api/lldbutil/iter/TestLLDBIterator.test_lldb_iter_module_gmodules/a.out' yours[1]='(x86_64) /usr/lib/dyld' mine[1]='(x86_64) /usr/lib/dyld' yours[2]='(x86_64) /usr/lib/libc++.1.dylib' mine[2]='(x86_64) /usr/lib/libc++.1.dylib' yours[3]='(x86_64) /usr/lib/libSystem.B.dylib' mine[3]='(x86_64) /usr/lib/libSystem.B.dylib' yours[4]='(x86_64) /usr/lib/libc++abi.dylib' mine[4]='(x86_64) /usr/lib/libc++abi.dylib' yours[5]='(x86_64) /usr/lib/system/libcache.dylib' mine[5]='(x86_64) /usr/lib/system/libcache.dylib' yours[6]='(x86_64) /usr/lib/system/libcommonCrypto.dylib' mine[6]='(x86_64) /usr/lib/system/libcommonCrypto.dylib' yours[7]='(x86_64) /usr/lib/system/libcompiler_rt.dylib' mine[7]='(x86_64) /usr/lib/system/libcompiler_rt.dylib' yours[8]='(x86_64) /usr/lib/system/libcopyfile.dylib' mine[8]='(x86_64) /usr/lib/system/libcopyfile.dylib' yours[9]='(x86_64) /usr/lib/system/libcorecrypto.dylib' mine[9]='(x86_64) /usr/lib/system/libcorecrypto.dylib' yours[10]='(x86_64) /usr/lib/system/libdispatch.dylib' mine[10]='(x86_64) /usr/lib/system/libdispatch.dylib' yours[11]='(x86_64) /usr/lib/system/libdyld.dylib' mine[11]='(x86_64) /usr/lib/system/libdyld.dylib' yours[12]='(x86_64) /usr/lib/system/libkeymgr.dylib' mine[12]='(x86_64) /usr/lib/system/libkeymgr.dylib' yours[13]='(x86_64) /usr/lib/system/liblaunch.dylib' mine[13]='(x86_64) /usr/lib/system/liblaunch.dylib' yours[14]='(x86_64) /usr/lib/system/libmacho.dylib' mine[14]='(x86_64) /usr/lib/system/libmacho.dylib' yours[15]='(x86_64) /usr/lib/system/libquarantine.dylib' mine[15]='(x86_64) /usr/lib/system/libquarantine.dylib' yours[16]='(x86_64) /usr/lib/system/libremovefile.dylib' mine[16]='(x86_64) /usr/lib/system/libremovefile.dylib' yours[17]='(x86_64) /usr/lib/system/libsystem_asl.dylib' mine[17]='(x86_64) /usr/lib/system/libsystem_asl.dylib' yours[18]='(x86_64) /usr/lib/system/libsystem_blocks.dylib' mine[18]='(x86_64) /usr/lib/system/libsystem_blocks.dylib' yours[19]='(x86_64) /usr/lib/system/libsystem_c.dylib' mine[19]='(x86_64) /usr/lib/system/libsystem_c.dylib' yours[20]='(x86_64) /usr/lib/system/libsystem_configuration.dylib' mine[20]='(x86_64) /usr/lib/system/libsystem_configuration.dylib' yours[21]='(x86_64) /usr/lib/system/libsystem_coreservices.dylib' mine[21]='(x86_64) /usr/lib/system/libsystem_coreservices.dylib' yours[22]='(x86_64) /usr/lib/system/libsystem_darwin.dylib' mine[22]='(x86_64) /usr/lib/system/libsystem_darwin.dylib' yours[23]='(x86_64) /usr/lib/system/libsystem_dnssd.dylib' mine[23]='(x86_64) /usr/lib/system/libsystem_dnssd.dylib' yours[24]='(x86_64) /usr/lib/system/libsystem_featureflags.dylib' mine[24]='(x86_64) /usr/lib/system/libsystem_featureflags.dylib' yours[25]='(x86_64) /usr/lib/system/libsystem_info.dylib' mine[25]='(x86_64) /usr/lib/system/libsystem_info.dylib' yours[26]='(x86_64) /usr/lib/system/libsystem_m.dylib' mine[26]='(x86_64) /usr/lib/system/libsystem_m.dylib' yours[27]='(x86_64) /usr/lib/system/libsystem_malloc.dylib' mine[27]='(x86_64) /usr/lib/system/libsystem_malloc.dylib' yours[28]='(x86_64) /usr/lib/system/libsystem_networkextension.dylib' mine[28]='(x86_64) /usr/lib/system/libsystem_networkextension.dylib' yours[29]='(x86_64) /usr/lib/system/libsystem_notify.dylib' mine[29]='(x86_64) /usr/lib/system/libsystem_notify.dylib' yours[30]='(x86_64) /usr/lib/system/libsystem_sandbox.dylib' mine[30]='(x86_64) /usr/lib/system/libsystem_sandbox.dylib' yours[31]='(x86_64) /usr/lib/system/libsystem_secinit.dylib' mine[31]='(x86_64) /usr/lib/system/libsystem_secinit.dylib' yours[32]='(x86_64) /usr/lib/system/libsystem_kernel.dylib' mine[32]='(x86_64) /usr/lib/system/libsystem_kernel.dylib' yours[33]='(x86_64) /usr/lib/system/libsystem_platform.dylib' mine[33]='(x86_64) /usr/lib/system/libsystem_platform.dylib' yours[34]='(x86_64) /usr/lib/system/libsystem_pthread.dylib' mine[34]='(x86_64) /usr/lib/system/libsystem_pthread.dylib' yours[35]='(x86_64) /usr/lib/system/libsystem_symptoms.dylib' mine[35]='(x86_64) /usr/lib/system/libsystem_symptoms.dylib' yours[36]='(x86_64) /usr/lib/system/libsystem_trace.dylib' mine[36]='(x86_64) /usr/lib/system/libsystem_trace.dylib' yours[37]='(x86_64) /usr/lib/system/libunwind.dylib' mine[37]='(x86_64) /usr/lib/system/libunwind.dylib' yours[38]='(x86_64) /usr/lib/system/libxpc.dylib' mine[38]='(x86_64) /usr/lib/system/libxpc.dylib' yours[39]='(x86_64) /usr/lib/libobjc.A.dylib' mine[39]='(x86_64) /usr/lib/libobjc.A.dylib'

Hide Details

-- Command Output (stderr): -- Change dir to: /Users/buildslave/jenkins/workspace/lldb-cmake/llvm-project/lldb/test/API/python_api/lldbutil/iter runCmd: settings clear -all output:

Hide Details

runCmd: settings set symbols.enable-external-lookup false output:

Hide Details

runCmd: settings set target.inherit-tcc true output:

Hide Details

runCmd: settings set target.detach-on-error false output:

Hide Details

runCmd: settings set target.auto-apply-fixits false output:

Hide Details

runCmd: settings set plugin.process.gdb-remote.packet-timeout 60 output:

Hide Details

runCmd: settings set symbols.clang-modules-cache-path "/Users/buildslave/jenkins/workspace/lldb-cmake/lldb-build/lldb-test-build.noindex/module-cache-lldb/lldb-api" output:

Hide Details

runCmd: settings set use-color false output:

Hide Details

runCmd: setting set target.prefer-dynamic-value no-dynamic-values output:

Hide Details

PASS: LLDB (/Users/buildslave/jenkins/workspace/lldb-cmake/lldb-build/bin/clang-x86_64) :: test_lldb_iter_breakpoint_dsym (TestLLDBIterator.LLDBIteratorTestCase) runCmd: settings clear -all output:

Hide Details

runCmd: settings set symbols.enable-external-lookup false output:

Hide Details

runCmd: settings set target.inherit-tcc true output:

Hide Details

runCmd: settings set target.detach-on-error false output:

Hide Details

runCmd: settings set target.auto-apply-fixits false output:

Hide Details

runCmd: settings set plugin.process.gdb-remote.packet-timeout 60 output:

Hide Details

runCmd: settings set symbols.clang-modules-cache-path "/Users/buildslave/jenkins/workspace/lldb-cmake/lldb-build/lldb-test-build.noindex/module-cache-lldb/lldb-api" output:

Hide Details

runCmd: settings set use-color false output:

Hide Details

runCmd: setting set target.prefer-dynamic-value no-dynamic-values output:

Hide Details

PASS: LLDB (/Users/buildslave/jenkins/workspace/lldb-cmake/lldb-build/bin/clang-x86_64) :: test_lldb_iter_breakpoint_dwarf (TestLLDBIterator.LLDBIteratorTestCase) UNSUPPORTED: LLDB (/Users/buildslave/jenkins/workspace/lldb-cmake/lldb-build/bin/clang-x86_64) :: test_lldb_iter_breakpoint_dwo (TestLLDBIterator.LLDBIteratorTestCase) (test case does not fall in any category of interest for this run) runCmd: settings clear -all output:

Hide Details

runCmd: settings set symbols.enable-external-lookup false output:

Hide Details

runCmd: settings set target.inherit-tcc true output:

Hide Details

runCmd: settings set target.detach-on-error false output:

Hide Details

runCmd: settings set target.auto-apply-fixits false output:

Hide Details

runCmd: settings set plugin.process.gdb-remote.packet-timeout 60 output:

Hide Details

runCmd: settings set symbols.clang-modules-cache-path "/Users/buildslave/jenkins/workspace/lldb-cmake/lldb-build/lldb-test-build.noindex/module-cache-lldb/lldb-api" output:

Hide Details

runCmd: settings set use-color false output:

Hide Details

runCmd: setting set target.prefer-dynamic-value no-dynamic-values output:

Hide Details

PASS: LLDB (/Users/buildslave/jenkins/workspace/lldb-cmake/lldb-build/bin/clang-x86_64) :: test_lldb_iter_breakpoint_gmodules (TestLLDBIterator.LLDBIteratorTestCase) runCmd: settings clear -all output:

Hide Details

runCmd: settings set symbols.enable-external-lookup false output:

Hide Details

runCmd: settings set target.inherit-tcc true output:

Hide Details

runCmd: settings set target.detach-on-error false output:

Hide Details

runCmd: settings set target.auto-apply-fixits false output:

Hide Details

runCmd: settings set plugin.process.gdb-remote.packet-timeout 60 output:

Hide Details

runCmd: settings set symbols.clang-modules-cache-path "/Users/buildslave/jenkins/workspace/lldb-cmake/lldb-build/lldb-test-build.noindex/module-cache-lldb/lldb-api" output:

Hide Details

runCmd: settings set use-color false output:

Hide Details

runCmd: setting set target.prefer-dynamic-value no-dynamic-values output:

Hide Details

FAIL: LLDB (/Users/buildslave/jenkins/workspace/lldb-cmake/lldb-build/bin/clang-x86_64) :: test_lldb_iter_frame_dsym (TestLLDBIterator.LLDBIteratorTestCase) <bound method SBProcess.Kill of <lldb.SBProcess; proxy of <Swig Object of type 'lldb::SBProcess *' at 0x10811ebd0> >>: success

Hide Details

runCmd: settings clear -all output:

Hide Details

runCmd: settings set symbols.enable-external-lookup false output:

Hide Details

runCmd: settings set target.inherit-tcc true output:

Hide Details

runCmd: settings set target.detach-on-error false output:

Hide Details

runCmd: settings set target.auto-apply-fixits false output:

Hide Details

runCmd: settings set plugin.process.gdb-remote.packet-timeout 60 output:

Hide Details

runCmd: settings set symbols.clang-modules-cache-path "/Users/buildslave/jenkins/workspace/lldb-cmake/lldb-build/lldb-test-build.noindex/module-cache-lldb/lldb-api" output:

Hide Details

runCmd: settings set use-color false output:

Hide Details

runCmd: setting set target.prefer-dynamic-value no-dynamic-values output:

Hide Details

FAIL: LLDB (/Users/buildslave/jenkins/workspace/lldb-cmake/lldb-build/bin/clang-x86_64) :: test_lldb_iter_frame_dwarf (TestLLDBIterator.LLDBIteratorTestCase) <bound method SBProcess.Kill of <lldb.SBProcess; proxy of <Swig Object of type 'lldb::SBProcess *' at 0x1103de030> >>: success

Hide Details

UNSUPPORTED: LLDB (/Users/buildslave/jenkins/workspace/lldb-cmake/lldb-build/bin/clang-x86_64) :: test_lldb_iter_frame_dwo (TestLLDBIterator.LLDBIteratorTestCase) (test case does not fall in any category of interest for this run) runCmd: settings clear -all output:

Hide Details

runCmd: settings set symbols.enable-external-lookup false output:

Hide Details

runCmd: settings set target.inherit-tcc true output:

Hide Details

runCmd: settings set target.detach-on-error false output:

Hide Details

runCmd: settings set target.auto-apply-fixits false output:

Hide Details

runCmd: settings set plugin.process.gdb-remote.packet-timeout 60 output:

Hide Details

runCmd: settings set symbols.clang-modules-cache-path "/Users/buildslave/jenkins/workspace/lldb-cmake/lldb-build/lldb-test-build.noindex/module-cache-lldb/lldb-api" output:

Hide Details

runCmd: settings set use-color false output:

Hide Details

runCmd: setting set target.prefer-dynamic-value no-dynamic-values output:

Hide Details

FAIL: LLDB (/Users/buildslave/jenkins/workspace/lldb-cmake/lldb-build/bin/clang-x86_64) :: test_lldb_iter_frame_gmodules (TestLLDBIterator.LLDBIteratorTestCase) <bound method SBProcess.Kill of <lldb.SBProcess; proxy of <Swig Object of type 'lldb::SBProcess *' at 0x10811eae0> >>: success

Hide Details

runCmd: settings clear -all output:

Hide Details

runCmd: settings set symbols.enable-external-lookup false output:

Hide Details

runCmd: settings set target.inherit-tcc true output:

Hide Details

runCmd: settings set target.detach-on-error false output:

Hide Details

runCmd: settings set target.auto-apply-fixits false output:

Hide Details

runCmd: settings set plugin.process.gdb-remote.packet-timeout 60 output:

Hide Details

runCmd: settings set symbols.clang-modules-cache-path "/Users/buildslave/jenkins/workspace/lldb-cmake/lldb-build/lldb-test-build.noindex/module-cache-lldb/lldb-api" output:

Hide Details

runCmd: settings set use-color false output:

Hide Details

runCmd: setting set target.prefer-dynamic-value no-dynamic-values output:

Hide Details

<bound method SBProcess.Kill of <lldb.SBProcess; proxy of <Swig Object of type 'lldb::SBProcess *' at 0x1103de120> >>: success

Hide Details

PASS: LLDB (/Users/buildslave/jenkins/workspace/lldb-cmake/lldb-build/bin/clang-x86_64) :: test_lldb_iter_module_dsym (TestLLDBIterator.LLDBIteratorTestCase) runCmd: settings clear -all output:

Hide Details

runCmd: settings set symbols.enable-external-lookup false output:

Hide Details

runCmd: settings set target.inherit-tcc true output:

Hide Details

runCmd: settings set target.detach-on-error false output:

Hide Details

runCmd: settings set target.auto-apply-fixits false output:

Hide Details

runCmd: settings set plugin.process.gdb-remote.packet-timeout 60 output:

Hide Details

runCmd: settings set symbols.clang-modules-cache-path "/Users/buildslave/jenkins/workspace/lldb-cmake/lldb-build/lldb-test-build.noindex/module-cache-lldb/lldb-api" output:

Hide Details

runCmd: settings set use-color false output:

Hide Details

runCmd: setting set target.prefer-dynamic-value no-dynamic-values output:

Hide Details

<bound method SBProcess.Kill of <lldb.SBProcess; proxy of <Swig Object of type 'lldb::SBProcess *' at 0x10811ebd0> >>: success

Hide Details

PASS: LLDB (/Users/buildslave/jenkins/workspace/lldb-cmake/lldb-build/bin/clang-x86_64) :: test_lldb_iter_module_dwarf (TestLLDBIterator.LLDBIteratorTestCase) UNSUPPORTED: LLDB (/Users/buildslave/jenkins/workspace/lldb-cmake/lldb-build/bin/clang-x86_64) :: test_lldb_iter_module_dwo (TestLLDBIterator.LLDBIteratorTestCase) (test case does not fall in any category of interest for this run) runCmd: settings clear -all output:

Hide Details

runCmd: settings set symbols.enable-external-lookup false output:

Hide Details

runCmd: settings set target.inherit-tcc true output:

Hide Details

runCmd: settings set target.detach-on-error false output:

Hide Details

runCmd: settings set target.auto-apply-fixits false output:

Hide Details

runCmd: settings set plugin.process.gdb-remote.packet-timeout 60 output:

Hide Details

runCmd: settings set symbols.clang-modules-cache-path "/Users/buildslave/jenkins/workspace/lldb-cmake/lldb-build/lldb-test-build.noindex/module-cache-lldb/lldb-api" output:

Hide Details

runCmd: settings set use-color false output:

Hide Details

runCmd: setting set target.prefer-dynamic-value no-dynamic-values output:

Hide Details

<bound method SBProcess.Kill of <lldb.SBProcess; proxy of <Swig Object of type 'lldb::SBProcess *' at 0x1103de030> >>: success

Hide Details

PASS: LLDB (/Users/buildslave/jenkins/workspace/lldb-cmake/lldb-build/bin/clang-x86_64) :: test_lldb_iter_module_gmodules (TestLLDBIterator.LLDBIteratorTestCase) Restore dir to: /Users/buildslave/jenkins/workspace/lldb-cmake/lldb-build/tools/lldb/test ====================================================================== FAIL: test_lldb_iter_frame_dsym (TestLLDBIterator.LLDBIteratorTestCase) Test iterator works correctly for SBProcess->SBThread->SBFrame. ---------------------------------------------------------------------- Traceback (most recent call last): File "/Users/buildslave/jenkins/workspace/lldb-cmake/llvm-project/lldb/packages/Python/lldbsuite/test/lldbtest.py", line 1830, in test_method return attrvalue(self) File "/Users/buildslave/jenkins/workspace/lldb-cmake/llvm-project/lldb/test/API/python_api/lldbutil/iter/TestLLDBIterator.py", line 123, in test_lldb_iter_frame self.assertTrue(stopped_due_to_breakpoint) AssertionError: False is not True Config=x86_64-/Users/buildslave/jenkins/workspace/lldb-cmake/lldb-build/bin/clang ====================================================================== FAIL: test_lldb_iter_frame_dwarf (TestLLDBIterator.LLDBIteratorTestCase) Test iterator works correctly for SBProcess->SBThread->SBFrame. ---------------------------------------------------------------------- Traceback (most recent call last): File "/Users/buildslave/jenkins/workspace/lldb-cmake/llvm-project/lldb/packages/Python/lldbsuite/test/lldbtest.py", line 1830, in test_method return attrvalue(self) File "/Users/buildslave/jenkins/workspace/lldb-cmake/llvm-project/lldb/test/API/python_api/lldbutil/iter/TestLLDBIterator.py", line 123, in test_lldb_iter_frame self.assertTrue(stopped_due_to_breakpoint) AssertionError: False is not True Config=x86_64-/Users/buildslave/jenkins/workspace/lldb-cmake/lldb-build/bin/clang ====================================================================== FAIL: test_lldb_iter_frame_gmodules (TestLLDBIterator.LLDBIteratorTestCase) Test iterator works correctly for SBProcess->SBThread->SBFrame. ---------------------------------------------------------------------- Traceback (most recent call last): File "/Users/buildslave/jenkins/workspace/lldb-cmake/llvm-project/lldb/packages/Python/lldbsuite/test/lldbtest.py", line 1830, in test_method return attrvalue(self) File "/Users/buildslave/jenkins/workspace/lldb-cmake/llvm-project/lldb/test/API/python_api/lldbutil/iter/TestLLDBIterator.py", line 123, in test_lldb_iter_frame self.assertTrue(stopped_due_to_breakpoint) AssertionError: False is not True Config=x86_64-/Users/buildslave/jenkins/workspace/lldb-cmake/lldb-build/bin/clang ---------------------------------------------------------------------- Ran 12 tests in 177.465s

Hide Details

RESULT: FAILED (6 passes, 3 failures, 0 errors, 3 skipped, 0 expected failures, 0 unexpected successes)

Hide Details

--

Hide Details

******************** FAIL: lldb-api :: functionalities/data-formatter/synthcapping/TestSyntheticCapping.py (1800 of 2337) ******************** TEST 'lldb-api :: functionalities/data-formatter/synthcapping/TestSyntheticCapping.py' FAILED ******************** Script: -- /usr/local/Frameworks/Python.framework/Versions/3.7/bin/python3.7 /Users/buildslave/jenkins/workspace/lldb-cmake/llvm-project/lldb/test/API/dotest.py -u CXXFLAGS -u CFLAGS --codesign-identity - --arch x86_64 --build-dir /Users/buildslave/jenkins/workspace/lldb-cmake/lldb-build/lldb-test-build.noindex -t --env TERM=vt100 --env LLVM_LIBS_DIR=/Users/buildslave/jenkins/workspace/lldb-cmake/lldb-build/./lib --arch x86_64 --build-dir /Users/buildslave/jenkins/workspace/lldb-cmake/lldb-build/lldb-test-build.noindex --lldb-module-cache-dir /Users/buildslave/jenkins/workspace/lldb-cmake/lldb-build/lldb-test-build.noindex/module-cache-lldb/lldb-api --clang-module-cache-dir /Users/buildslave/jenkins/workspace/lldb-cmake/lldb-build/lldb-test-build.noindex/module-cache-clang/lldb-api --executable /Users/buildslave/jenkins/workspace/lldb-cmake/lldb-build/./bin/lldb --compiler /Users/buildslave/jenkins/workspace/lldb-cmake/lldb-build/./bin/clang --dsymutil /Users/buildslave/jenkins/workspace/lldb-cmake/lldb-build/./bin/dsymutil --llvm-tools-dir /Users/buildslave/jenkins/workspace/lldb-cmake/lldb-build/./bin --lldb-libs-dir /Users/buildslave/jenkins/workspace/lldb-cmake/lldb-build/./lib /Users/buildslave/jenkins/workspace/lldb-cmake/llvm-project/lldb/test/API/functionalities/data-formatter/synthcapping -p TestSyntheticCapping.py -- Exit Code: 1

Hide Details

Command Output (stdout): -- lldb version 13.0.99 (http://labmaster3.local/git/llvm-project.git revision 23596fece043fa04206dcd5b26b4ca832e6741db) clang revision 23596fece043fa04206dcd5b26b4ca832e6741db llvm revision 23596fece043fa04206dcd5b26b4ca832e6741db (foo) f00_1 = (a = 1, fake_a = 33554432, r = 34) (foo) f00_1 = (a = 1, fake_a = 33554432, ...) (foo) f00_1 = (a = 1, fake_a = 33554432, ...) (foo) f00_1 = (a = 1, fake_a = 33554432, r = 34) (foo) f00_1 = (a = 1, fake_a = 33554432, r = 34) (foo) f00_1 = (a = 1, fake_a = 33554432, ...) (foo) f00_1 = (a = 1, fake_a = 33554432, ...) Skipping the following test categories: ['darwin-log', 'libstdcxx', 'dwo', 'llgs', 'fork'] (foo) f00_1 = (a = 1, fake_a = 33554432, r = 34)

Hide Details

-- Command Output (stderr): -- Change dir to: /Users/buildslave/jenkins/workspace/lldb-cmake/llvm-project/lldb/test/API/functionalities/data-formatter/synthcapping runCmd: settings clear -all output:

Hide Details

runCmd: settings set symbols.enable-external-lookup false output:

Hide Details

runCmd: settings set target.inherit-tcc true output:

Hide Details

runCmd: settings set target.detach-on-error false output:

Hide Details

runCmd: settings set target.auto-apply-fixits false output:

Hide Details

runCmd: settings set plugin.process.gdb-remote.packet-timeout 60 output:

Hide Details

runCmd: settings set symbols.clang-modules-cache-path "/Users/buildslave/jenkins/workspace/lldb-cmake/lldb-build/lldb-test-build.noindex/module-cache-lldb/lldb-api" output:

Hide Details

runCmd: settings set use-color false output:

Hide Details

runCmd: setting set target.prefer-dynamic-value no-dynamic-values output:

Hide Details

runCmd: file /Users/buildslave/jenkins/workspace/lldb-cmake/lldb-build/lldb-test-build.noindex/functionalities/data-formatter/synthcapping/TestSyntheticCapping.test_with_run_command_dsym/a.out output: Current executable set to '/Users/buildslave/jenkins/workspace/lldb-cmake/lldb-build/lldb-test-build.noindex/functionalities/data-formatter/synthcapping/TestSyntheticCapping.test_with_run_command_dsym/a.out' (x86_64).

Hide Details

Hide Details

runCmd: breakpoint set -f "main.cpp" -l 54 output: Breakpoint 1: where = a.out`main + 82 at main.cpp:54:12, address = 0x0000000100000df2

Hide Details

Hide Details

Expecting pattern: ^Breakpoint (?P<bpno>[0-9]+): (?P<num_locations>[0-9]+) locations\.$ Not matched

Hide Details

Expecting pattern: ^Breakpoint (?P<bpno>[0-9]+): (?P<num_locations>no) locations \(pending\)\. Not matched

Hide Details

Expecting pattern: ^Breakpoint (?P<bpno>[0-9]+): where = (?P<module>.*)`(?P<symbol>[+\-]{0,1}[^+]+)( \+ (?P<offset>[0-9]+)){0,1}( \[inlined\] (?P<inline_symbol>.*)){0,1} at (?P<file>[^:]+):(?P<line_no>[0-9]+)(?P<column>(:[0-9]+)?), address = (?P<address>0x[0-9a-fA-F]+)$ Matched

Hide Details

runCmd: run runCmd failed! error: process exited with status -1 (tried to attach to process already being debugged)

Hide Details

Hide Details

Command 'run' failed!

Hide Details

FAIL: LLDB (/Users/buildslave/jenkins/workspace/lldb-cmake/lldb-build/bin/clang-x86_64) :: test_with_run_command_dsym (TestSyntheticCapping.SyntheticCappingTestCase) <bound method SBProcess.Kill of <lldb.SBProcess; proxy of <Swig Object of type 'lldb::SBProcess *' at 0x118945990> >>: success

Hide Details

runCmd: settings clear -all output:

Hide Details

runCmd: settings set symbols.enable-external-lookup false output:

Hide Details

runCmd: settings set target.inherit-tcc true output:

Hide Details

runCmd: settings set target.detach-on-error false output:

Hide Details

runCmd: settings set target.auto-apply-fixits false output:

Hide Details

runCmd: settings set plugin.process.gdb-remote.packet-timeout 60 output:

Hide Details

runCmd: settings set symbols.clang-modules-cache-path "/Users/buildslave/jenkins/workspace/lldb-cmake/lldb-build/lldb-test-build.noindex/module-cache-lldb/lldb-api" output:

Hide Details

runCmd: settings set use-color false output:

Hide Details

runCmd: setting set target.prefer-dynamic-value no-dynamic-values output:

Hide Details

runCmd: file /Users/buildslave/jenkins/workspace/lldb-cmake/lldb-build/lldb-test-build.noindex/functionalities/data-formatter/synthcapping/TestSyntheticCapping.test_with_run_command_dwarf/a.out output: Current executable set to '/Users/buildslave/jenkins/workspace/lldb-cmake/lldb-build/lldb-test-build.noindex/functionalities/data-formatter/synthcapping/TestSyntheticCapping.test_with_run_command_dwarf/a.out' (x86_64).

Hide Details

Hide Details

runCmd: breakpoint set -f "main.cpp" -l 54 output: Breakpoint 1: where = a.out`main + 82 at main.cpp:54:12, address = 0x0000000100000df2

Hide Details

Hide Details

Expecting pattern: ^Breakpoint (?P<bpno>[0-9]+): (?P<num_locations>[0-9]+) locations\.$ Not matched

Hide Details

Expecting pattern: ^Breakpoint (?P<bpno>[0-9]+): (?P<num_locations>no) locations \(pending\)\. Not matched

Hide Details

Expecting pattern: ^Breakpoint (?P<bpno>[0-9]+): where = (?P<module>.*)`(?P<symbol>[+\-]{0,1}[^+]+)( \+ (?P<offset>[0-9]+)){0,1}( \[inlined\] (?P<inline_symbol>.*)){0,1} at (?P<file>[^:]+):(?P<line_no>[0-9]+)(?P<column>(:[0-9]+)?), address = (?P<address>0x[0-9a-fA-F]+)$ Matched

Hide Details

runCmd: run output: Process 32362 stopped * thread #1, queue = 'com.apple.main-thread', stop reason = breakpoint 1.1 frame #0: 0x0000000100000df2 a.out`main at main.cpp:54:12 51 foo f00_1(1); 52 foo *f00_ptr = new foo(12); 53 -> 54 f00_1.a++; // Set break point at this line. ^ 55 56 wrapint test_cast('A' + 57 256*'B' + Process 32362 launched: '/Users/buildslave/jenkins/workspace/lldb-cmake/lldb-build/lldb-test-build.noindex/functionalities/data-formatter/synthcapping/TestSyntheticCapping.test_with_run_command_dwarf/a.out' (x86_64)

Hide Details

Hide Details

runCmd: thread list output: Process 32362 stopped * thread #1: tid = 0x168920, 0x0000000100000df2 a.out`main at main.cpp:54:12, queue = 'com.apple.main-thread', stop reason = breakpoint 1.1

Hide Details

Hide Details

Ran command: "thread list"

Hide Details

Got output: Process 32362 stopped * thread #1: tid = 0x168920, 0x0000000100000df2 a.out`main at main.cpp:54:12, queue = 'com.apple.main-thread', stop reason = breakpoint 1.1

Hide Details

Expecting sub string: "stopped" (was found) Expecting sub string: "stop reason = breakpoint" (was found)

Hide Details

Adding tearDown hook: def cleanup(): self.runCmd('type format clear', check=False) self.runCmd('type summary clear', check=False) self.runCmd('type filter clear', check=False) self.runCmd('type synth clear', check=False) self.runCmd( "settings set target.max-children-count 256", check=False)

Hide Details

Hide Details

runCmd: script from fooSynthProvider import * output:

Hide Details

runCmd: type synth add -l fooSynthProvider foo output:

Hide Details

runCmd: frame variable f00_1 output: (foo) f00_1 = (a = 1, fake_a = 33554432, r = 34)

Hide Details

Hide Details

Ran command: "frame variable f00_1"

Hide Details

Got output: (foo) f00_1 = (a = 1, fake_a = 33554432, r = 34)

Hide Details

Expecting sub string: "a = 1" (was found) Expecting sub string: "fake_a = 33554432" (was found) Expecting sub string: "r = 34" (was found)

Hide Details

runCmd: settings set target.max-children-count 2 check of return status not required output:

Hide Details

runCmd: frame variable f00_1 output: (foo) f00_1 = (a = 1, fake_a = 33554432, ...)

Hide Details

Hide Details

Ran command: "frame variable f00_1"

Hide Details

Got output: (foo) f00_1 = (a = 1, fake_a = 33554432, ...)

Hide Details

Expecting sub string: "a = 1" (was found) Expecting sub string: "fake_a = 33554432" (was found) Expecting sub string: "..." (was found)

Hide Details

runCmd: frame variable f00_1 output: (foo) f00_1 = (a = 1, fake_a = 33554432, ...)

Hide Details

Hide Details

Ran command: "frame variable f00_1"

Hide Details

Got output: (foo) f00_1 = (a = 1, fake_a = 33554432, ...)

Hide Details

Not expecting sub string: "r = 34" (was not found)

Hide Details

runCmd: settings set target.max-children-count 256 check of return status not required output:

Hide Details

runCmd: frame variable f00_1 output: (foo) f00_1 = (a = 1, fake_a = 33554432, r = 34)

Hide Details

Hide Details

Ran command: "frame variable f00_1"

Hide Details

Got output: (foo) f00_1 = (a = 1, fake_a = 33554432, r = 34)

Hide Details

Expecting sub string: "r = 34" (was found)

Hide Details

<bound method SBProcess.Kill of <lldb.SBProcess; proxy of <Swig Object of type 'lldb::SBProcess *' at 0x1108e6bd0> >>: success

Hide Details

Executing tearDown hook: def cleanup(): self.runCmd('type format clear', check=False) self.runCmd('type summary clear', check=False) self.runCmd('type filter clear', check=False) self.runCmd('type synth clear', check=False) self.runCmd( "settings set target.max-children-count 256", check=False)

Hide Details

Hide Details

runCmd: type format clear check of return status not required output:

Hide Details

runCmd: type summary clear check of return status not required output:

Hide Details

runCmd: type filter clear check of return status not required output:

Hide Details

runCmd: type synth clear check of return status not required output:

Hide Details

runCmd: settings set target.max-children-count 256 check of return status not required output:

Hide Details

PASS: LLDB (/Users/buildslave/jenkins/workspace/lldb-cmake/lldb-build/bin/clang-x86_64) :: test_with_run_command_dwarf (TestSyntheticCapping.SyntheticCappingTestCase) UNSUPPORTED: LLDB (/Users/buildslave/jenkins/workspace/lldb-cmake/lldb-build/bin/clang-x86_64) :: test_with_run_command_dwo (TestSyntheticCapping.SyntheticCappingTestCase) (test case does not fall in any category of interest for this run) runCmd: settings clear -all output:

Hide Details

runCmd: settings set symbols.enable-external-lookup false output:

Hide Details

runCmd: settings set target.inherit-tcc true output:

Hide Details

runCmd: settings set target.detach-on-error false output:

Hide Details

runCmd: settings set target.auto-apply-fixits false output:

Hide Details

runCmd: settings set plugin.process.gdb-remote.packet-timeout 60 output:

Hide Details

runCmd: settings set symbols.clang-modules-cache-path "/Users/buildslave/jenkins/workspace/lldb-cmake/lldb-build/lldb-test-build.noindex/module-cache-lldb/lldb-api" output:

Hide Details

runCmd: settings set use-color false output:

Hide Details

runCmd: setting set target.prefer-dynamic-value no-dynamic-values output:

Hide Details

runCmd: file /Users/buildslave/jenkins/workspace/lldb-cmake/lldb-build/lldb-test-build.noindex/functionalities/data-formatter/synthcapping/TestSyntheticCapping.test_with_run_command_gmodules/a.out output: Current executable set to '/Users/buildslave/jenkins/workspace/lldb-cmake/lldb-build/lldb-test-build.noindex/functionalities/data-formatter/synthcapping/TestSyntheticCapping.test_with_run_command_gmodules/a.out' (x86_64).

Hide Details

Hide Details

runCmd: breakpoint set -f "main.cpp" -l 54 output: Breakpoint 1: where = a.out`main + 82 at main.cpp:54:12, address = 0x0000000100000df2

Hide Details

Hide Details

Expecting pattern: ^Breakpoint (?P<bpno>[0-9]+): (?P<num_locations>[0-9]+) locations\.$ Not matched

Hide Details

Expecting pattern: ^Breakpoint (?P<bpno>[0-9]+): (?P<num_locations>no) locations \(pending\)\. Not matched

Hide Details

Expecting pattern: ^Breakpoint (?P<bpno>[0-9]+): where = (?P<module>.*)`(?P<symbol>[+\-]{0,1}[^+]+)( \+ (?P<offset>[0-9]+)){0,1}( \[inlined\] (?P<inline_symbol>.*)){0,1} at (?P<file>[^:]+):(?P<line_no>[0-9]+)(?P<column>(:[0-9]+)?), address = (?P<address>0x[0-9a-fA-F]+)$ Matched

Hide Details

runCmd: run output: Process 32454 stopped * thread #1, queue = 'com.apple.main-thread', stop reason = breakpoint 1.1 frame #0: 0x0000000100000df2 a.out`main at main.cpp:54:12 51 foo f00_1(1); 52 foo *f00_ptr = new foo(12); 53 -> 54 f00_1.a++; // Set break point at this line. ^ 55 56 wrapint test_cast('A' + 57 256*'B' + Process 32454 launched: '/Users/buildslave/jenkins/workspace/lldb-cmake/lldb-build/lldb-test-build.noindex/functionalities/data-formatter/synthcapping/TestSyntheticCapping.test_with_run_command_gmodules/a.out' (x86_64)

Hide Details

Hide Details

runCmd: thread list output: Process 32454 stopped * thread #1: tid = 0x168a93, 0x0000000100000df2 a.out`main at main.cpp:54:12, queue = 'com.apple.main-thread', stop reason = breakpoint 1.1

Hide Details

Hide Details

Ran command: "thread list"

Hide Details

Got output: Process 32454 stopped * thread #1: tid = 0x168a93, 0x0000000100000df2 a.out`main at main.cpp:54:12, queue = 'com.apple.main-thread', stop reason = breakpoint 1.1

Hide Details

Expecting sub string: "stopped" (was found) Expecting sub string: "stop reason = breakpoint" (was found)

Hide Details

Adding tearDown hook: def cleanup(): self.runCmd('type format clear', check=False) self.runCmd('type summary clear', check=False) self.runCmd('type filter clear', check=False) self.runCmd('type synth clear', check=False) self.runCmd( "settings set target.max-children-count 256", check=False)

Hide Details

Hide Details

runCmd: script from fooSynthProvider import * output:

Hide Details

runCmd: type synth add -l fooSynthProvider foo output:

Hide Details

runCmd: frame variable f00_1 output: (foo) f00_1 = (a = 1, fake_a = 33554432, r = 34)

Hide Details

Hide Details

Ran command: "frame variable f00_1"

Hide Details

Got output: (foo) f00_1 = (a = 1, fake_a = 33554432, r = 34)

Hide Details

Expecting sub string: "a = 1" (was found) Expecting sub string: "fake_a = 33554432" (was found) Expecting sub string: "r = 34" (was found)

Hide Details

runCmd: settings set target.max-children-count 2 check of return status not required output:

Hide Details

runCmd: frame variable f00_1 output: (foo) f00_1 = (a = 1, fake_a = 33554432, ...)

Hide Details

Hide Details

Ran command: "frame variable f00_1"

Hide Details

Got output: (foo) f00_1 = (a = 1, fake_a = 33554432, ...)

Hide Details

Expecting sub string: "a = 1" (was found) Expecting sub string: "fake_a = 33554432" (was found) Expecting sub string: "..." (was found)

Hide Details

runCmd: frame variable f00_1 output: (foo) f00_1 = (a = 1, fake_a = 33554432, ...)

Hide Details

Hide Details

Ran command: "frame variable f00_1"

Hide Details

Got output: (foo) f00_1 = (a = 1, fake_a = 33554432, ...)

Hide Details

Not expecting sub string: "r = 34" (was not found)

Hide Details

runCmd: settings set target.max-children-count 256 check of return status not required output:

Hide Details

runCmd: frame variable f00_1 output: (foo) f00_1 = (a = 1, fake_a = 33554432, r = 34)

Hide Details

Hide Details

Ran command: "frame variable f00_1"

Hide Details

Got output: (foo) f00_1 = (a = 1, fake_a = 33554432, r = 34)

Hide Details

Expecting sub string: "r = 34" (was found)

Hide Details

<bound method SBProcess.Kill of <lldb.SBProcess; proxy of <Swig Object of type 'lldb::SBProcess *' at 0x1188eb900> >>: success

Hide Details

Executing tearDown hook: def cleanup(): self.runCmd('type format clear', check=False) self.runCmd('type summary clear', check=False) self.runCmd('type filter clear', check=False) self.runCmd('type synth clear', check=False) self.runCmd( "settings set target.max-children-count 256", check=False)

Hide Details

Hide Details

runCmd: type format clear check of return status not required output:

Hide Details

runCmd: type summary clear check of return status not required output:

Hide Details

runCmd: type filter clear check of return status not required output:

Hide Details

runCmd: type synth clear check of return status not required output:

Hide Details

runCmd: settings set target.max-children-count 256 check of return status not required output:

Hide Details

PASS: LLDB (/Users/buildslave/jenkins/workspace/lldb-cmake/lldb-build/bin/clang-x86_64) :: test_with_run_command_gmodules (TestSyntheticCapping.SyntheticCappingTestCase) Restore dir to: /Users/buildslave/jenkins/workspace/lldb-cmake/lldb-build/tools/lldb/test ====================================================================== FAIL: test_with_run_command_dsym (TestSyntheticCapping.SyntheticCappingTestCase) Check for an issue where capping does not work because the Target pointer appears to be changing behind our backs. ---------------------------------------------------------------------- Traceback (most recent call last): File "/Users/buildslave/jenkins/workspace/lldb-cmake/llvm-project/lldb/packages/Python/lldbsuite/test/lldbtest.py", line 1830, in test_method return attrvalue(self) File "/Users/buildslave/jenkins/workspace/lldb-cmake/llvm-project/lldb/test/API/functionalities/data-formatter/synthcapping/TestSyntheticCapping.py", line 31, in test_with_run_command self.runCmd("run", RUN_SUCCEEDED) File "/Users/buildslave/jenkins/workspace/lldb-cmake/llvm-project/lldb/packages/Python/lldbsuite/test/lldbtest.py", line 2161, in runCmd msg if (msg) else CMD_MSG(cmd)) AssertionError: False is not True : Process is launched successfully Error output: error: process exited with status -1 (tried to attach to process already being debugged)

Hide Details

Config=x86_64-/Users/buildslave/jenkins/workspace/lldb-cmake/lldb-build/bin/clang ---------------------------------------------------------------------- Ran 4 tests in 66.079s

Hide Details

RESULT: FAILED (2 passes, 1 failures, 0 errors, 1 skipped, 0 expected failures, 0 unexpected successes)

Hide Details

--

Hide Details

******************** PASS: lldb-unit :: Utility/./UtilityTests/RangeTest.LessThanInvalid (1801 of 2337) PASS: lldb-unit :: DataFormatter/./LLDBFormatterTests/TypeMatcherTests.CreatedBySameMatchStringExactNamePrefixes (1802 of 2337) PASS: lldb-api :: functionalities/data-formatter/data-formatter-python-synth/TestDataFormatterPythonSynth.py (1803 of 2337) UNSUPPORTED: lldb-api :: commands/expression/completion-crash-invalid-iterator/TestInvalidIteratorCompletionCrash.py (1804 of 2337) PASS: lldb-api :: python_api/section/TestSectionAPI.py (1805 of 2337) PASS: lldb-api :: functionalities/load_using_paths/TestLoadUsingPaths.py (1806 of 2337) PASS: lldb-api :: functionalities/dlopen_other_executable/TestDlopenOtherExecutable.py (1807 of 2337) PASS: lldb-unit :: Utility/./UtilityTests/StringExtractorTest.GetHexU8_Exact_NoEof (1808 of 2337) PASS: lldb-api :: commands/expression/completion/TestExprCompletion.py (1809 of 2337) PASS: lldb-api :: commands/log/basic/TestLogging.py (1810 of 2337) PASS: lldb-unit :: Expression/./ExpressionTests/DiagnosticManagerTest.GetStringMultiline (1811 of 2337) PASS: lldb-unit :: UnwindAssembly/x86/./UnwindAssemblyx86Tests/Testx86AssemblyInspectionEngine.TestPopRBPWithREX (1812 of 2337) PASS: lldb-api :: functionalities/thread/concurrent_events/TestConcurrentDelaySignalWatch.py (1813 of 2337) PASS: lldb-unit :: Host/./HostTests/FileSystemTest.EmptyTest (1814 of 2337) PASS: lldb-unit :: Utility/./UtilityTests/StringListTest.ForRange (1815 of 2337) PASS: lldb-shell :: Settings/TestStopCommandSourceOnError.test (1816 of 2337) PASS: lldb-unit :: Utility/./UtilityTests/GeneratorTest.Get (1817 of 2337) PASS: lldb-unit :: ScriptInterpreter/Python/./ScriptInterpreterPythonTests/PythonDataObjectsTest.TestPythonByteArray (1818 of 2337) PASS: lldb-api :: tools/lldb-vscode/attach/TestVSCode_attach.py (1819 of 2337) PASS: lldb-unit :: Utility/./UtilityTests/StringListTest.LongestCommonPrefixEmpty (1820 of 2337) UNSUPPORTED: lldb-api :: commands/watchpoints/variable_out_of_scope/TestWatchedVarHitWhenInScope.py (1821 of 2337) UNSUPPORTED: lldb-shell :: SymbolFile/NativePDB/local-variables.cpp (1822 of 2337) PASS: lldb-api :: functionalities/data-formatter/type_summary_list_arg/TestTypeSummaryListArg.py (1823 of 2337) PASS: lldb-api :: functionalities/recursion/TestValueObjectRecursion.py (1824 of 2337) PASS: lldb-shell :: Quit/TestQuitExitCodeNonInt.test (1825 of 2337) PASS: lldb-unit :: Symbol/./SymbolTests/TestTypeSystemClang.TestNotDeletingUserCopyCstrDueToMoveCStr (1826 of 2337) PASS: lldb-api :: commands/frame/diagnose/dereference-function-return/TestDiagnoseDereferenceFunctionReturn.py (1827 of 2337) PASS: lldb-shell :: Reproducer/Functionalities/TestImageList.test (1828 of 2337) PASS: lldb-shell :: SymbolFile/DWARF/x86/DW_AT_const_value-bitfields.s (1829 of 2337) PASS: lldb-api :: lang/cpp/scope/TestCppScope.py (1830 of 2337) PASS: lldb-api :: commands/expression/cast_int_to_anonymous_enum/TestCastIntToAnonymousEnum.py (1831 of 2337) UNSUPPORTED: lldb-shell :: Register/arm-fp-read.test (1832 of 2337) PASS: lldb-shell :: SymbolFile/NativePDB/globals-fundamental.cpp (1833 of 2337) PASS: lldb-api :: python_api/frame/TestFrames.py (1834 of 2337) PASS: lldb-api :: commands/gui/basicdebug/TestGuiBasicDebug.py (1835 of 2337) PASS: lldb-unit :: Host/./HostTests/NativeProcessProtocolTest.ReadCStringFromMemory_CrossPageBoundary (1836 of 2337) PASS: lldb-api :: python_api/interpreter/TestRunCommandInterpreterAPI.py (1837 of 2337) PASS: lldb-shell :: Minidump/memory-region-from-module.yaml (1838 of 2337) PASS: lldb-unit :: Language/CPlusPlus/./LanguageCPlusPlusTests/CPlusPlusLanguage.MethodNameParsing (1839 of 2337) PASS: lldb-api :: python_api/file_handle/TestFileHandle.py (1840 of 2337) PASS: lldb-api :: lang/objc/objc-dyn-sbtype/TestObjCDynamicSBType.py (1841 of 2337) PASS: lldb-api :: commands/expression/two-files/TestObjCTypeQueryFromOtherCompileUnit.py (1842 of 2337) PASS: lldb-api :: commands/expression/char/TestExprsChar.py (1843 of 2337) PASS: lldb-unit :: Host/./HostTests/SocketTests/SocketTest.TCPGetConnectURI/ipv6 (1844 of 2337) PASS: lldb-unit :: Utility/./UtilityTests/StreamTest.AddressSize (1845 of 2337) PASS: lldb-api :: lang/objc/objc-new-syntax/TestObjCNewSyntaxLiteral.py (1846 of 2337) PASS: lldb-api :: functionalities/testid/TestTestId.py (1847 of 2337) PASS: lldb-shell :: SymbolFile/DWARF/x86/debug_rnglists.s (1848 of 2337) PASS: lldb-unit :: Utility/./UtilityTests/StringListTest.GetMaxStringLengthEmpty (1849 of 2337) PASS: lldb-shell :: SymbolFile/NativePDB/global-classes.cpp (1850 of 2337) PASS: lldb-unit :: Process/Utility/./ProcessUtilityTests/ProcMapTests/LinuxProcMapsTestFixture.ParseMapRegions/0 (1851 of 2337) PASS: lldb-api :: commands/expression/dollar-in-variable/TestDollarInVariable.py (1852 of 2337) UNSUPPORTED: lldb-shell :: ExecControl/StopHook/stop-hook-threads.test (1853 of 2337) PASS: lldb-shell :: SymbolFile/Breakpad/unwind-via-stack-win.test (1854 of 2337) PASS: lldb-api :: tools/lldb-server/commandline/TestGdbRemoteConnection.py (1855 of 2337) PASS: lldb-api :: lang/cpp/inlines/TestInlines.py (1856 of 2337) PASS: lldb-unit :: Utility/./UtilityTests/StringLexerTest.Next (1857 of 2337) PASS: lldb-unit :: Utility/./UtilityTests/StreamTest.ShiftOperatorStrings (1858 of 2337) PASS: lldb-unit :: SymbolFile/NativePDB/./SymbolFileNativePDBTests/PDBFPOProgramToDWARFExpressionTests.DependencyChain (1859 of 2337) PASS: lldb-unit :: Utility/./UtilityTests/UriParserTest.Empty (1860 of 2337) PASS: lldb-unit :: Symbol/./SymbolTests/TestTypeSystemClang.TestBuiltinTypeForEncodingAndBitSize (1861 of 2337) PASS: lldb-unit :: Platform/Android/./AdbClientTests/AdbClientTest.CreateByDeviceId (1862 of 2337) PASS: lldb-shell :: SymbolFile/DWARF/x86/dwp.s (1863 of 2337) PASS: lldb-unit :: Utility/./UtilityTests/ScalarTest.SetValueFromData (1864 of 2337) PASS: lldb-unit :: Utility/./UtilityTests/StreamTest.SetIndentLevel (1865 of 2337) PASS: lldb-unit :: Utility/./UtilityTests/BinaryStreamTest.PutSLEB128SevenBytes (1866 of 2337) PASS: lldb-unit :: Utility/./UtilityTests/StructuredDataTest.ParseJSONFromFile (1867 of 2337) PASS: lldb-api :: functionalities/unwind/noreturn/module-end/TestNoReturnModuleEnd.py (1868 of 2337) PASS: lldb-api :: lang/objc/self/TestObjCSelf.py (1869 of 2337) PASS: lldb-api :: functionalities/breakpoint/dummy_target_breakpoints/TestBreakpointsWithNoTargets.py (1870 of 2337) PASS: lldb-api :: commands/frame/diagnose/inheritance/TestDiagnoseInheritance.py (1871 of 2337) PASS: lldb-api :: commands/expression/import-std-module/weak_ptr/TestWeakPtrFromStdModule.py (1872 of 2337) PASS: lldb-shell :: Breakpoint/debug_addrx.test (1873 of 2337) PASS: lldb-unit :: Utility/./UtilityTests/DataExtractorTest.GetMaxU64 (1874 of 2337) PASS: lldb-api :: lang/cpp/dynamic-value-same-basename/TestDynamicValueSameBase.py (1875 of 2337) PASS: lldb-api :: functionalities/gdb_remote_client/TestAArch64XMLRegOffsets.py (1876 of 2337) PASS: lldb-shell :: Minidump/Windows/broken-unwind.test (1877 of 2337) PASS: lldb-unit :: Host/./HostTests/HostInfoTest.GetXcodeSDK (1878 of 2337) PASS: lldb-api :: lang/c/vla/TestVLA.py (1879 of 2337) PASS: lldb-unit :: Symbol/./SymbolTests/TestTypeSystemClang.TestGetEnumIntegerTypeInvalid (1880 of 2337) PASS: lldb-api :: lang/c/struct_types/TestStructTypes.py (1881 of 2337) PASS: lldb-unit :: Utility/./UtilityTests/RangeTest.ContainsEndInclusiveInvalid (1882 of 2337) PASS: lldb-unit :: DataFormatter/./LLDBFormatterTests/TypeMatcherTests.RegexName (1883 of 2337) UNSUPPORTED: lldb-shell :: ScriptInterpreter/Lua/watchpoint_callback.test (1884 of 2337) PASS: lldb-shell :: SymbolFile/DWARF/x86/DW_AT_data_bit_offset-DW_OP_stack_value.s (1885 of 2337) PASS: lldb-unit :: ScriptInterpreter/Python/./ScriptInterpreterPythonTests/PythonDataObjectsTest.TestGlobalNameResolutionNoDot (1886 of 2337) PASS: lldb-unit :: Host/./HostTests/SocketTests/SocketTest.UDPConnect/ipv4 (1887 of 2337) PASS: lldb-unit :: Utility/./UtilityTests/UriParserTest.Minimal (1888 of 2337) PASS: lldb-api :: test_utils/TestPExpectTest.py (1889 of 2337) PASS: lldb-unit :: Language/Highlighting/./HighlighterTests/HighlighterTest.ClangCursorPos (1890 of 2337) PASS: lldb-unit :: Host/./HostTests/MainLoopTest.TerminatesImmediately (1891 of 2337) PASS: lldb-unit :: Symbol/./SymbolTests/TestTypeSystemClang.TestGetBasicTypeFromName (1892 of 2337) PASS: lldb-unit :: Platform/Android/./AdbClientTests/AdbClientTest.CreateByDeviceId_ByEnvVar (1893 of 2337) PASS: lldb-api :: commands/expression/codegen-crash-import-def-arraytype-element/TestImportDefinitionArrayType.py (1894 of 2337) PASS: lldb-unit :: Process/Utility/./ProcessUtilityTests/ProcSMapTests/LinuxProcSMapsTestFixture.ParseSMapRegions/8 (1895 of 2337) PASS: lldb-api :: terminal/TestSTTYBeforeAndAfter.py (1896 of 2337) PASS: lldb-shell :: Commands/command-regex-delete.test (1897 of 2337) PASS: lldb-unit :: Utility/./UtilityTests/ArchSpecTest.YAML (1898 of 2337) PASS: lldb-unit :: ObjectFile/Breakpad/./ObjectFileBreakpadTests/InfoRecord.parse (1899 of 2337) PASS: lldb-api :: functionalities/breakpoint/breakpoint_by_line_and_column/TestBreakpointByLineAndColumn.py (1900 of 2337) PASS: lldb-unit :: Process/gdb-remote/./ProcessGdbRemoteTests/GDBRemoteCommunicationTest.ReadPacket_checksum (1901 of 2337) PASS: lldb-unit :: Language/Highlighting/./HighlighterTests/HighlighterTest.ClangTrailingBackslashBeforeNewline (1902 of 2337) PASS: lldb-unit :: Expression/./ExpressionTests/DiagnosticManagerTest.GetStringPreserveOrder (1903 of 2337) PASS: lldb-api :: functionalities/thread/concurrent_events/TestConcurrentCrashWithSignal.py (1904 of 2337) PASS: lldb-unit :: Utility/./UtilityTests/StringExtractorTest.GetHexBytesAvail_OddPair (1905 of 2337) PASS: lldb-api :: functionalities/data-formatter/data-formatter-named-summaries/TestDataFormatterNamedSummaries.py (1906 of 2337) PASS: lldb-unit :: Utility/./UtilityTests/AnsiTerminal.WhiteSpace (1907 of 2337) PASS: lldb-shell :: SymbolFile/DWARF/x86/dwarf5-index-is-used.cpp (1908 of 2337) PASS: lldb-unit :: ScriptInterpreter/Python/./ScriptInterpreterPythonTests/PythonDataObjectsTest.TestPythonTupleValues (1909 of 2337) PASS: lldb-unit :: Language/CPlusPlus/./LanguageCPlusPlusTests/CPlusPlusLanguage.CPlusPlusNameParser (1910 of 2337) PASS: lldb-api :: functionalities/data-formatter/format-propagation/TestFormatPropagation.py (1911 of 2337) PASS: lldb-api :: commands/frame/select/TestFrameSelect.py (1912 of 2337) PASS: lldb-unit :: ObjectFile/Breakpad/./ObjectFileBreakpadTests/Record.classify (1913 of 2337) PASS: lldb-shell :: Register/Core/x86-32-freebsd-gp.test (1914 of 2337) PASS: lldb-unit :: Utility/./UtilityTests/RecordReplayTest.InstrumentedFoo (1915 of 2337) PASS: lldb-api :: commands/watchpoints/hello_watchpoint/TestMyFirstWatchpoint.py (1916 of 2337) PASS: lldb-unit :: Process/minidump/./LLDBMinidumpTests/MinidumpParserTest.GetThreadContext_x86_32 (1917 of 2337) PASS: lldb-unit :: Process/Utility/./ProcessUtilityTests/ProcMapTests/LinuxProcMapsTestFixture.ParseMapRegions/3 (1918 of 2337) PASS: lldb-api :: commands/expression/radar_9673664/TestExprHelpExamples.py (1919 of 2337) PASS: lldb-api :: lang/cpp/constructors/TestCppConstructors.py (1920 of 2337) PASS: lldb-shell :: SymbolFile/DWARF/x86/DW_OP_piece-struct.s (1921 of 2337) PASS: lldb-api :: macosx/nslog/TestDarwinNSLogOutput.py (1922 of 2337) PASS: lldb-api :: functionalities/data-formatter/builtin-formats/TestBuiltinFormats.py (1923 of 2337) PASS: lldb-unit :: Utility/./UtilityTests/StreamTeeTest.Constructor2Streams (1924 of 2337) PASS: lldb-api :: functionalities/gdb_remote_client/TestMultiprocess.py (1925 of 2337) PASS: lldb-unit :: Utility/./UtilityTests/ArgsTest.TestOverwriteArgs (1926 of 2337) PASS: lldb-api :: python_api/lldbutil/iter/TestRegistersIterator.py (1927 of 2337) PASS: lldb-api :: functionalities/thread/concurrent_events/TestConcurrentManyCrash.py (1928 of 2337) PASS: lldb-unit :: Utility/./UtilityTests/RangeTest.NotEqual (1929 of 2337) PASS: lldb-api :: lang/objc/modules-app-update/TestClangModulesAppUpdate.py (1930 of 2337) PASS: lldb-api :: tools/lldb-vscode/console/TestVSCode_redirection_to_console.py (1931 of 2337) PASS: lldb-unit :: Process/minidump/./LLDBMinidumpTests/MinidumpParserTest.FindMemoryRangeWithFullMemoryMinidump (1932 of 2337) PASS: lldb-api :: functionalities/thread/concurrent_events/TestConcurrentNWatchNBreak.py (1933 of 2337) PASS: lldb-shell :: SymbolFile/DWARF/x86/dwo-type-in-main-file.s (1934 of 2337) PASS: lldb-unit :: Expression/./ExpressionTests/DiagnosticManagerTest.GetStringMultipleDiags (1935 of 2337) PASS: lldb-api :: functionalities/thread/concurrent_events/TestConcurrentTwoBreakpointsOneSignal.py (1936 of 2337) PASS: lldb-api :: lang/objc/single-entry-dictionary/TestObjCSingleEntryDictionary.py (1937 of 2337) PASS: lldb-unit :: Utility/./UtilityTests/Flags.Test (1938 of 2337) PASS: lldb-shell :: Settings/TestFrameFormatColor.test (1939 of 2337) PASS: lldb-api :: macosx/dyld-trie-symbols/TestDyldTrieSymbols.py (1940 of 2337) UNSUPPORTED: lldb-shell :: Register/x86-64-zmm-read.test (1941 of 2337) PASS: lldb-unit :: Utility/./UtilityTests/SharedCluster.ClusterManager (1942 of 2337) PASS: lldb-unit :: Utility/./UtilityTests/BinaryStreamTest.PutULEB128SixBytes (1943 of 2337) PASS: lldb-unit :: Symbol/./SymbolTests/PostfixExpression.ToDWARF (1944 of 2337) PASS: lldb-api :: functionalities/stats_api/TestStatisticsAPI.py (1945 of 2337) PASS: lldb-api :: lang/c/unicode/TestUnicodeSymbols.py (1946 of 2337) PASS: lldb-api :: lang/cpp/lambdas/TestLambdas.py (1947 of 2337) PASS: lldb-api :: functionalities/data-formatter/data-formatter-stl/libstdcpp/unique_ptr/invalid/TestDataFormatterInvalidStdUniquePtr.py (1948 of 2337) PASS: lldb-shell :: SymbolFile/NativePDB/tag-types.cpp (1949 of 2337) PASS: lldb-api :: functionalities/data-formatter/data-formatter-objc/nsindexpath/TestDataFormatterNSIndexPath.py (1950 of 2337) PASS: lldb-api :: lang/objc/radar-9691614/TestObjCMethodReturningBOOL.py (1951 of 2337) PASS: lldb-api :: lang/objc/objc-optimized/TestObjcOptimized.py (1952 of 2337) XFAIL: lldb-shell :: Register/x86-64-fp-write.test (1953 of 2337) PASS: lldb-unit :: Host/./HostTests/SocketTests/SocketTest.TCPListen0ConnectAccept/ipv4 (1954 of 2337) PASS: lldb-unit :: Utility/./UtilityTests/ConstStringTest.MangledCounterpart (1955 of 2337) PASS: lldb-unit :: Utility/./UtilityTests/ArgsTest.ReplaceArgumentAtIndexLonger (1956 of 2337) PASS: lldb-unit :: Utility/./UtilityTests/StringExtractorTest.DecodeHexU8_InvalidHex (1957 of 2337) XFAIL: lldb-shell :: Register/x86-mm-xmm-read.test (1958 of 2337) PASS: lldb-unit :: Utility/./UtilityTests/StringListTest.InsertStringAtIndexStart (1959 of 2337) PASS: lldb-unit :: Utility/./UtilityTests/StringExtractorTest.GetHexBytesAvail (1960 of 2337) PASS: lldb-unit :: Process/minidump/./LLDBMinidumpTests/MinidumpParserTest.InvalidMinidump (1961 of 2337) PASS: lldb-api :: python_api/sbplatform/TestSBPlatform.py (1962 of 2337) PASS: lldb-api :: functionalities/thread/concurrent_events/TestConcurrentWatchpointDelayWatchpointOneBreakpoint.py (1963 of 2337) UNSUPPORTED: lldb-shell :: SymbolFile/PDB/variables-locations.test (1964 of 2337) PASS: lldb-unit :: Utility/./UtilityTests/ConstStringTest.UpdateMangledCounterpart (1965 of 2337) PASS: lldb-unit :: Utility/./UtilityTests/AnsiTerminal.AtStart (1966 of 2337) PASS: lldb-unit :: Utility/./UtilityTests/StringExtractorTest.GetHexU8_InvalidHex (1967 of 2337) PASS: lldb-api :: lang/cpp/keywords_enabled/TestCppKeywordsEnabled.py (1968 of 2337) PASS: lldb-api :: functionalities/data-formatter/data-formatter-script/TestDataFormatterScript.py (1969 of 2337) PASS: lldb-unit :: Utility/./UtilityTests/StreamTest.PutNHex8 (1970 of 2337) PASS: lldb-api :: commands/expression/persistent_variables/TestPersistentVariables.py (1971 of 2337) PASS: lldb-unit :: Utility/./UtilityTests/UriParserTest.BracketedHostname (1972 of 2337) PASS: lldb-api :: functionalities/data-formatter/data-formatter-stl/libcxx/iterator/TestDataFormatterLibccIterator.py (1973 of 2337) PASS: lldb-unit :: ObjectFile/ELF/./ObjectFileELFTests/ObjectFileELFTest.SectionsResolveConsistently (1974 of 2337) PASS: lldb-unit :: Core/./LLDBCoreTests/MangledTest.ResultForValidName (1975 of 2337) PASS: lldb-unit :: Utility/./UtilityTests/UserIDResolver.GetGroupName (1976 of 2337) PASS: lldb-api :: commands/expression/import-std-module/conflicts/TestStdModuleWithConflicts.py (1977 of 2337) PASS: lldb-shell :: SymbolFile/Breakpad/unwind-via-stack-win-no-memory-info.yaml (1978 of 2337) PASS: lldb-api :: lang/cpp/struct_with_keyword_name/TestStructWithKeywordName.py (1979 of 2337) PASS: lldb-api :: functionalities/breakpoint/breakpoint_ids/TestBreakpointIDs.py (1980 of 2337) UNSUPPORTED: lldb-api :: commands/platform/connect/TestPlatformConnect.py (1981 of 2337) PASS: lldb-shell :: SymbolFile/DWARF/x86/find-variable-file.cpp (1982 of 2337) PASS: lldb-shell :: Expr/TestIRMemoryMap.test (1983 of 2337) PASS: lldb-api :: macosx/find-dsym/deep-bundle/TestDeepBundle.py (1984 of 2337) PASS: lldb-api :: functionalities/avoids-fd-leak/TestFdLeak.py (1985 of 2337) PASS: lldb-shell :: ObjectFile/MachO/symtab.yaml (1986 of 2337) PASS: lldb-shell :: ObjectFile/ELF/PT_LOAD-overlap-PT_TLS.yaml (1987 of 2337) PASS: lldb-api :: types/TestCharTypeExpr.py (1988 of 2337) PASS: lldb-unit :: Process/Utility/./ProcessUtilityTests/ProcSMapTests/LinuxProcSMapsTestFixture.ParseSMapRegions/3 (1989 of 2337) PASS: lldb-unit :: Utility/./UtilityTests/RangeTest.LessThan (1990 of 2337) UNSUPPORTED: lldb-api :: functionalities/breakpoint/hardware_breakpoints/hardware_breakpoint_on_multiple_threads/TestHWBreakMultiThread.py (1991 of 2337) PASS: lldb-unit :: Host/./HostTests/SocketTests/SocketTest.DecodeHostAndPort/ipv6 (1992 of 2337) PASS: lldb-unit :: Host/./HostTests/NativeProcessProtocolTest.ReadCStringFromMemory_MaxSize (1993 of 2337) XFAIL: lldb-shell :: Register/x86-64-write.test (1994 of 2337) PASS: lldb-unit :: SymbolFile/DWARF/./SymbolFileDWARFTests/SymbolFileDWARFTests.TestAbbrevMissingTerminator (1995 of 2337) XFAIL: lldb-shell :: Unwind/prefer-debug-over-eh-frame.test (1996 of 2337) PASS: lldb-unit :: Utility/./UtilityTests/ScalarTest.ComparisonFloat (1997 of 2337) PASS: lldb-unit :: Utility/./UtilityTests/StringListTest.JoinNonSpace (1998 of 2337) PASS: lldb-unit :: Utility/./UtilityTests/ArchSpecTest.OperatorBool (1999 of 2337) PASS: lldb-unit :: Utility/./UtilityTests/ArgsTest.TestAppendArg (2000 of 2337) PASS: lldb-api :: commands/target/modules/search-paths/insert/TestTargetModulesSearchpathsInsert.py (2001 of 2337) PASS: lldb-unit :: Core/./LLDBCoreTests/ModuleSpecTest.TestELFFile (2002 of 2337) PASS: lldb-unit :: Expression/./ExpressionTests/CppModuleConfigurationTest.Xcode (2003 of 2337) PASS: lldb-shell :: ObjectFile/ELF/short-build-id.yaml (2004 of 2337) PASS: lldb-shell :: Driver/TestProcessAttach.test (2005 of 2337) PASS: lldb-api :: lang/objc/objc-class-method/TestObjCClassMethod.py (2006 of 2337) PASS: lldb-unit :: Core/./LLDBCoreTests/SourceFileCache.FindSourceFileNotFound (2007 of 2337) PASS: lldb-shell :: ObjectFile/ELF/netbsd-exec-8.99.30-amd64.yaml (2008 of 2337) PASS: lldb-shell :: lldb-server/TestGdbserverPort.test (2009 of 2337) PASS: lldb-shell :: SymbolFile/DWARF/x86/debug-types-basic.test (2010 of 2337) PASS: lldb-api :: functionalities/thread/num_threads/TestNumThreads.py (2011 of 2337) PASS: lldb-unit :: Language/Highlighting/./HighlighterTests/HighlighterTest.Keywords (2012 of 2337) PASS: lldb-unit :: SymbolFile/DWARF/./SymbolFileDWARFTests/SymbolFileDWARFTests.ParseArangesWithMultipleTerminators (2013 of 2337) PASS: lldb-unit :: Interpreter/./InterpreterTests/OptionArgParserTest.toScriptLanguage (2014 of 2337) PASS: lldb-shell :: ScriptInterpreter/Python/command_relative_import.test (2015 of 2337) PASS: lldb-shell :: SymbolFile/DWARF/x86/dwp-separate-debug-file.cpp (2016 of 2337) PASS: lldb-api :: commands/settings/quoting/TestQuoting.py (2017 of 2337) PASS: lldb-shell :: SymbolFile/DWARF/x86/DW_AT_declaration-with-children.s (2018 of 2337) PASS: lldb-api :: sample_test/TestSampleTest.py (2019 of 2337) PASS: lldb-unit :: Utility/./UtilityTests/GeneratorTest.YamlMultiProvider (2020 of 2337) PASS: lldb-unit :: Host/./HostTests/SocketTests/SocketTest.UDPGetConnectURI/ipv4 (2021 of 2337) PASS: lldb-api :: functionalities/ptr_refs/TestPtrRefs.py (2022 of 2337) PASS: lldb-api :: commands/expression/scoped_enums/TestScopedEnumType.py (2023 of 2337) PASS: lldb-unit :: Core/./LLDBCoreTests/DumpDataExtractorTest.BaseAddress (2024 of 2337) UNSUPPORTED: lldb-api :: commands/trace/multiple-threads/TestTraceStartStopMultipleThreads.py (2025 of 2337) PASS: lldb-api :: functionalities/breakpoint/breakpoint_options/TestBreakpointOptions.py (2026 of 2337) PASS: lldb-api :: commands/expression/import-std-module/stack/TestStackFromStdModule.py (2027 of 2337) PASS: lldb-api :: functionalities/optimized_code/TestNoASanExceptionAfterEvalOP_piece.py (2028 of 2337) PASS: lldb-shell :: SymbolFile/DWARF/x86/DW_AT_location-DW_AT_const_value.s (2029 of 2337) PASS: lldb-api :: lang/cpp/class-template-parameter-pack/TestClassTemplateParameterPack.py (2030 of 2337) PASS: lldb-unit :: Utility/./UtilityTests/RegisterValueTest.GetScalarValue (2031 of 2337) PASS: lldb-shell :: Quit/TestQuitExitCodeHex0.test (2032 of 2337) PASS: lldb-shell :: ObjectFile/Breakpad/breakpad-identification.test (2033 of 2337) PASS: lldb-api :: commands/expression/fixits/TestFixIts.py (2034 of 2337) PASS: lldb-api :: tools/lldb-vscode/module/TestVSCode_module.py (2035 of 2337) PASS: lldb-api :: lang/objc/foundation/TestObjCMethodsNSArray.py (2036 of 2337) PASS: lldb-api :: functionalities/data-formatter/data-formatter-stl/libcxx/function/TestLibCxxFunction.py (2037 of 2337) PASS: lldb-api :: functionalities/gdb_remote_client/TestRegDefinitionInParts.py (2038 of 2337) PASS: lldb-unit :: Host/./HostTests/ConnectionFileDescriptorTest.TCPGetURIv4 (2039 of 2337) PASS: lldb-unit :: Utility/./UtilityTests/StreamTest.PutBytesAsRawHex8ToLittleEndian (2040 of 2337) UNSUPPORTED: lldb-api :: android/platform/TestDefaultCacheLineSize.py (2041 of 2337) PASS: lldb-unit :: Symbol/./SymbolTests/TestTypeSystemClang.OnlyPackName (2042 of 2337) PASS: lldb-unit :: Host/./HostTests/NativeProcessProtocolTest.ReadMemoryWithoutTrap (2043 of 2337) PASS: lldb-unit :: SymbolFile/DWARF/./SymbolFileDWARFTests/SymbolFileDWARFTests.TestAbbrevOutOfOrder (2044 of 2337) PASS: lldb-shell :: ObjectFile/MachO/lc_build_version.yaml (2045 of 2337) PASS: lldb-api :: lang/cpp/covariant-return-types/TestCovariantReturnTypes.py (2046 of 2337) PASS: lldb-api :: functionalities/breakpoint/breakpoint_set_restart/TestBreakpointSetRestart.py (2047 of 2337) PASS: lldb-shell :: BuildScript/compiler-full-path.test (2048 of 2337) PASS: lldb-api :: commands/expression/import-std-module/iterator/TestIteratorFromStdModule.py (2049 of 2337) PASS: lldb-unit :: Utility/./UtilityTests/VASprintfTest.EncodingError (2050 of 2337) PASS: lldb-api :: functionalities/breakpoint/serialize/TestBreakpointSerialization.py (2051 of 2337) PASS: lldb-unit :: Utility/./UtilityTests/StringListTest.InsertStringAtIndexOutOfBounds (2052 of 2337) PASS: lldb-api :: types/TestCharType.py (2053 of 2337) PASS: lldb-shell :: Quit/TestQuitExitCode0.test (2054 of 2337) PASS: lldb-unit :: Symbol/./SymbolTests/TestTypeSystemClang.TestRecordHasFields (2055 of 2337) PASS: lldb-api :: commands/expression/options/TestExprOptions.py (2056 of 2337) PASS: lldb-unit :: Utility/./UtilityTests/BinaryStreamTest.PutSLEB128EightBytes (2057 of 2337) PASS: lldb-api :: tools/lldb-vscode/runInTerminal/TestVSCode_runInTerminal.py (2058 of 2337) PASS: lldb-unit :: Host/./HostTests/SocketTests/SocketTest.UDPConnect/ipv6 (2059 of 2337) PASS: lldb-unit :: UnwindAssembly/x86/./UnwindAssemblyx86Tests/Testx86AssemblyInspectionEngine.TestPopRBP (2060 of 2337) PASS: lldb-api :: commands/expression/import-std-module/shared_ptr-dbg-info-content/TestSharedPtrDbgInfoContentFromStdModule.py (2061 of 2337) UNSUPPORTED: lldb-shell :: Register/x86-zmm-read.test (2062 of 2337) PASS: lldb-api :: functionalities/postmortem/elf-core/TestLinuxCore.py (2063 of 2337) PASS: lldb-shell :: Reproducer/TestDiscard.test (2064 of 2337) PASS: lldb-api :: commands/register/register/register_command/TestRegisters.py (2065 of 2337) PASS: lldb-unit :: SymbolFile/NativePDB/./SymbolFileNativePDBTests/PDBFPOProgramToDWARFExpressionTests.UnknownOp (2066 of 2337) PASS: lldb-unit :: Utility/./UtilityTests/SerializationRountripTest.SerializeDeserializePodReferences (2067 of 2337) PASS: lldb-api :: functionalities/data-formatter/stringprinter/TestStringPrinter.py (2068 of 2337) PASS: lldb-api :: lang/objc/rdar-10967107/TestRdar10967107.py (2069 of 2337) PASS: lldb-shell :: Settings/TestFrameFormatNoColor.test (2070 of 2337) PASS: lldb-api :: lang/objc/objc-struct-argument/TestObjCStructArgument.py (2071 of 2337) PASS: lldb-api :: functionalities/inferior-crashing/recursive-inferior/TestRecursiveInferior.py (2072 of 2337) PASS: lldb-api :: functionalities/breakpoint/breakpoint_command/TestBreakpointCommandsFromPython.py (2073 of 2337) PASS: lldb-unit :: UnwindAssembly/x86/./UnwindAssemblyx86Tests/Testx86AssemblyInspectionEngine.TestSpillRegToStackViaMOVi386 (2074 of 2337) UNSUPPORTED: lldb-api :: commands/trace/TestTraceStartStop.py (2075 of 2337) PASS: lldb-api :: lang/objc/objc-ivar-offsets/TestObjCIvarOffsets.py (2076 of 2337) PASS: lldb-unit :: Utility/./UtilityTests/OptionsWithRawTest.ArgsButNoDelimiter (2077 of 2337) PASS: lldb-api :: commands/expression/persist_objc_pointeetype/TestPersistObjCPointeeType.py (2078 of 2337) PASS: lldb-api :: functionalities/stop-on-sharedlibrary-load/TestStopOnSharedlibraryEvents.py (2079 of 2337) PASS: lldb-shell :: Minidump/breakpad-symbols.test (2080 of 2337) PASS: lldb-unit :: Utility/./UtilityTests/DataExtractorTest.GetCStrEmpty (2081 of 2337) PASS: lldb-unit :: Utility/./UtilityTests/StringExtractorTest.DecodeHexU8_Extra (2082 of 2337) PASS: lldb-unit :: Utility/./UtilityTests/BinaryStreamTest.PutULEB128FourBytes (2083 of 2337) PASS: lldb-api :: functionalities/set-data/TestSetData.py (2084 of 2337) PASS: lldb-shell :: SymbolFile/DWARF/x86/debug_line-tombstone.s (2085 of 2337) PASS: lldb-api :: functionalities/data-formatter/data-formatter-stl/libcxx/atomic/TestLibCxxAtomic.py (2086 of 2337) PASS: lldb-api :: functionalities/thread/thread_specific_break/TestThreadSpecificBreakpoint.py (2087 of 2337) PASS: lldb-shell :: SymbolFile/DWARF/x86/debug-types-dwarf5.s (2088 of 2337) PASS: lldb-unit :: Process/gdb-remote/./ProcessGdbRemoteTests/GDBRemoteCommunicationClientTest.SaveRestoreRegistersNoSuffix (2089 of 2337) PASS: lldb-unit :: Language/Highlighting/./HighlighterTests/HighlighterTest.Colons (2090 of 2337) PASS: lldb-api :: commands/frame/var/TestFrameVar.py (2091 of 2337) PASS: lldb-api :: commands/reproducer/invalid-args/TestInvalidArgsReproducer.py (2092 of 2337) PASS: lldb-shell :: SymbolFile/DWARF/x86/debug_ranges_and_rnglists.test (2093 of 2337) PASS: lldb-api :: python_api/thread/TestThreadAPI.py (2094 of 2337) PASS: lldb-unit :: UnwindAssembly/x86/./UnwindAssemblyx86Tests/Testx86AssemblyInspectionEngine.TestPopRBX (2095 of 2337) PASS: lldb-api :: functionalities/breakpoint/breakpoint_command/TestRegexpBreakCommand.py (2096 of 2337) PASS: lldb-shell :: SymbolFile/DWARF/x86/dir-separator-no-comp-dir-relative-name.s (2097 of 2337) PASS: lldb-shell :: Register/Core/x86-32-linux-fp.test (2098 of 2337) PASS: lldb-api :: functionalities/data-formatter/data-formatter-objc/TestDataFormatterObjCNSData.py (2099 of 2337) PASS: lldb-api :: functionalities/conditional_break/TestConditionalBreak.py (2100 of 2337) PASS: lldb-unit :: Utility/./UtilityTests/StreamTest.PutCharWhitespace (2101 of 2337) PASS: lldb-shell :: Settings/TestModuleCacheSanity.test (2102 of 2337) PASS: lldb-api :: macosx/add-dsym/TestAddDsymMidExecutionCommand.py (2103 of 2337) PASS: lldb-unit :: Utility/./UtilityTests/UriParserTest.BracketedHostnamePort (2104 of 2337) PASS: lldb-unit :: Utility/./UtilityTests/FileSpecTest.GuessPathStyle (2105 of 2337) PASS: lldb-unit :: Utility/./UtilityTests/StatusTest.ErrorConstructor (2106 of 2337) PASS: lldb-unit :: Utility/./UtilityTests/IndexToObjectTest.ObjectForIndex (2107 of 2337) PASS: lldb-shell :: Minidump/dump-all.test (2108 of 2337) PASS: lldb-api :: lang/cpp/overloaded-functions/TestOverloadedFunctions.py (2109 of 2337) XFAIL: lldb-shell :: Register/x86-64-ymm-write.test (2110 of 2337) PASS: lldb-api :: types/TestFloatTypesExpr.py (2111 of 2337) PASS: lldb-api :: functionalities/breakpoint/breakpoint_ignore_count/TestBreakpointIgnoreCount.py (2112 of 2337) PASS: lldb-api :: functionalities/jitloader_gdb/TestJITLoaderGDB.py (2113 of 2337) PASS: lldb-unit :: UnwindAssembly/x86/./UnwindAssemblyx86Tests/Testx86AssemblyInspectionEngine.TestSpillRegToStackViaMOVx86_64 (2114 of 2337) PASS: lldb-unit :: Core/./LLDBCoreTests/CommunicationTest.SynchronizeWhileClosing (2115 of 2337) PASS: lldb-api :: commands/expression/import-std-module/sysroot/TestStdModuleSysroot.py (2116 of 2337) PASS: lldb-unit :: Process/gdb-remote/./ProcessGdbRemoteTests/GDBRemoteCommunicationClientTest.GetModulesInfo_UUID20 (2117 of 2337) PASS: lldb-api :: commands/target/basic/TestTargetCommand.py (2118 of 2337) PASS: lldb-unit :: Utility/./UtilityTests/RecordReplayTest.ValidSequence (2119 of 2337) PASS: lldb-unit :: Process/minidump/./LLDBMinidumpTests/MinidumpParserTest.GetPidWow64 (2120 of 2337) PASS: lldb-unit :: SymbolFile/NativePDB/./SymbolFileNativePDBTests/PDBFPOProgramToDWARFExpressionTests.UnresolvedCyclicRegisterAssignmentReference (2121 of 2337) PASS: lldb-api :: lang/objc/objc-static-method/TestObjCStaticMethod.py (2122 of 2337) PASS: lldb-api :: lang/c/enum_types/TestEnumTypes.py (2123 of 2337) PASS: lldb-unit :: Utility/./UtilityTests/BinaryStreamTest.PutULEB128OneByte (2124 of 2337) PASS: lldb-unit :: DataFormatter/./LLDBFormatterTests/TypeMatcherTests.GetMatchStringRegex (2125 of 2337) PASS: lldb-api :: lang/c/anonymous/TestAnonymous.py (2126 of 2337) PASS: lldb-unit :: UnwindAssembly/x86/./UnwindAssemblyx86Tests/Testx86AssemblyInspectionEngine.TestLEAVE (2127 of 2337) PASS: lldb-unit :: Utility/./UtilityTests/XcodeSDKTest.MergeTest (2128 of 2337) PASS: lldb-api :: commands/command/delete/TestCommandDelete.py (2129 of 2337) PASS: lldb-shell :: SymbolFile/NativePDB/globals-bss.cpp (2130 of 2337) PASS: lldb-api :: lang/objc/objc-ivar-protocols/TestIvarProtocols.py (2131 of 2337) UNSUPPORTED: lldb-api :: commands/register/register/aarch64_dynamic_regset/TestArm64DynamicRegsets.py (2132 of 2337) UNSUPPORTED: lldb-shell :: SymbolFile/PDB/function-level-linking.test (2133 of 2337) PASS: lldb-api :: functionalities/data-formatter/data-formatter-objc/nsstring/TestDataFormatterNSString.py (2134 of 2337) UNSUPPORTED: lldb-shell :: SymbolFile/NativePDB/ast-functions-msvc.cpp (2135 of 2337) PASS: lldb-unit :: Platform/./LLDBPlatformTests/PlatformAppleSimulatorTest.TestHostPlatformToSim (2136 of 2337) PASS: lldb-unit :: Utility/./UtilityTests/CompletionRequest.TestCompletionOwnership (2137 of 2337) PASS: lldb-unit :: SymbolFile/NativePDB/./SymbolFileNativePDBTests/PDBFPOProgramToDWARFExpressionTests.MissingTargetRegister (2138 of 2337) PASS: lldb-unit :: Process/Utility/./ProcessUtilityTests/ProcSMapTests/LinuxProcSMapsTestFixture.ParseSMapRegions/2 (2139 of 2337) PASS: lldb-unit :: Utility/./UtilityTests/StreamTest.PutCStringWithStringRef (2140 of 2337) PASS: lldb-api :: functionalities/reproducers/fs-case-sensitivity/TestReproducerFSCaseSensitivity.py (2141 of 2337) UNSUPPORTED: lldb-shell :: ScriptInterpreter/Lua/persistent_state.test (2142 of 2337) PASS: lldb-unit :: Utility/./UtilityTests/StringListTest.AppendListCStringArray (2143 of 2337) PASS: lldb-api :: commands/watchpoints/watchpoint_set_command/TestWatchLocationWithWatchSet.py (2144 of 2337) PASS: lldb-api :: api/check_public_api_headers/TestPublicAPIHeaders.py (2145 of 2337) PASS: lldb-api :: lang/c/record_decl_in_expr/TestRecordDeclInExpr.py (2146 of 2337) PASS: lldb-unit :: ScriptInterpreter/Python/./ScriptInterpreterPythonTests/PythonDataObjectsTest.TestModuleNameResolutionNoDot (2147 of 2337) UNSUPPORTED: lldb-shell :: Register/x86-64-ymm16-write.test (2148 of 2337) PASS: lldb-unit :: UnwindAssembly/x86/./UnwindAssemblyx86Tests/Testx86AssemblyInspectionEngine.Test32BitOnlyInstruction (2149 of 2337) PASS: lldb-shell :: Reproducer/Functionalities/TestStepping.test (2150 of 2337) PASS: lldb-unit :: Utility/./UtilityTests/StreamTest.PutBytesAsRawHex8ToBigEndian (2151 of 2337) PASS: lldb-unit :: Utility/./UtilityTests/TimerTest.CategoryTimesStats (2152 of 2337) PASS: lldb-unit :: Utility/./UtilityTests/ScalarTest.TruncOrExtendTo (2153 of 2337) PASS: lldb-api :: functionalities/gdb_remote_client/TestIOSSimulator.py (2154 of 2337) PASS: lldb-api :: lang/cpp/function-qualifiers/TestCppFunctionQualifiers.py (2155 of 2337) PASS: lldb-shell :: SymbolFile/Breakpad/stack-cfi-arm.yaml (2156 of 2337) PASS: lldb-shell :: SymbolFile/NativePDB/s_constant.cpp (2157 of 2337) PASS: lldb-shell :: ObjectFile/ELF/build-id-case.yaml (2158 of 2337) PASS: lldb-shell :: Subprocess/fork-follow-parent.test (2159 of 2337) UNSUPPORTED: lldb-api :: benchmarks/startup/TestStartupDelays.py (2160 of 2337) PASS: lldb-unit :: ScriptInterpreter/Python/./ScriptInterpreterPythonTests/PythonDataObjectsTest.TestPythonStringToStructuredString (2161 of 2337) PASS: lldb-api :: lang/objc/modules-objc-property/TestModulesObjCProperty.py (2162 of 2337) UNSUPPORTED: lldb-api :: functionalities/data-formatter/data-formatter-stl/libstdcpp/vector/TestDataFormatterStdVector.py (2163 of 2337) PASS: lldb-unit :: Symbol/./SymbolTests/TestTypeSystemClang.TestGetTypeClassDeclType (2164 of 2337) PASS: lldb-unit :: Utility/./UtilityTests/RangeTest.ContainsAddr (2165 of 2337) PASS: lldb-unit :: Utility/./UtilityTests/AnsiTerminal.Incomplete (2166 of 2337) PASS: lldb-api :: commands/command/source/TestCommandSource.py (2167 of 2337) PASS: lldb-api :: functionalities/load_unload/TestLoadUnload.py (2168 of 2337) PASS: lldb-shell :: Expr/TestMultilineExpr.test (2169 of 2337) PASS: lldb-api :: lang/cpp/namespace/TestNamespaceLookup.py (2170 of 2337) PASS: lldb-unit :: Utility/./UtilityTests/DataExtractorTest.GetMaxS64 (2171 of 2337) PASS: lldb-api :: lang/objc/foundation/TestObjectDescriptionAPI.py (2172 of 2337) PASS: lldb-api :: python_api/get-value-32bit-int/TestGetValue32BitInt.py (2173 of 2337) PASS: lldb-unit :: Utility/./UtilityTests/StringExtractorTest.GetU64LittleEndian (2174 of 2337) PASS: lldb-unit :: Symbol/./SymbolTests/TestClangASTImporter.RecordLayout (2175 of 2337) UNSUPPORTED: lldb-api :: benchmarks/expression/TestRepeatedExprs.py (2176 of 2337) PASS: lldb-api :: functionalities/non-overlapping-index-variable-i/TestIndexVariable.py (2177 of 2337) PASS: lldb-unit :: SymbolFile/DWARF/./SymbolFileDWARFTests/SymbolFileDWARFTests.ParseArangesIgnoreEmpty (2178 of 2337) PASS: lldb-unit :: Utility/./UtilityTests/RegularExpression.Empty (2179 of 2337) PASS: lldb-unit :: Utility/./UtilityTests/StringExtractorTest.GetU32BigEndian (2180 of 2337) PASS: lldb-api :: commands/expression/unicode-in-variable/TestUnicodeInVariable.py (2181 of 2337) PASS: lldb-unit :: Utility/./UtilityTests/StringListTest.ShiftCString (2182 of 2337) UNSUPPORTED: lldb-shell :: Register/x86-64-zmm-write.test (2183 of 2337) PASS: lldb-api :: functionalities/gdb_remote_client/TestqOffsets.py (2184 of 2337) PASS: lldb-unit :: Utility/./UtilityTests/StreamTest.AddressEmptyPrefix (2185 of 2337) PASS: lldb-api :: commands/expression/call-function/TestCallStdStringFunction.py (2186 of 2337) PASS: lldb-unit :: Utility/./UtilityTests/StringListTest.LongestCommonPrefixNoPrefix (2187 of 2337) PASS: lldb-shell :: SymbolFile/DWARF/x86/split-dwarf-multiple-cu.ll (2188 of 2337) PASS: lldb-unit :: Core/./LLDBCoreTests/RichManglingContextTest.SwitchProvider (2189 of 2337) PASS: lldb-unit :: Process/gdb-remote/./ProcessGdbRemoteTests/GDBRemoteCommunicationServerTest.SendErrorResponse_ErrorList (2190 of 2337) PASS: lldb-unit :: debugserver/./debugserverTests/RNBSocket.LoopBackListenIPv6 (2191 of 2337) PASS: lldb-unit :: Process/minidump/./LLDBMinidumpTests/MinidumpParserTest.GetArchitectureWindows (2192 of 2337) PASS: lldb-api :: commands/expression/persistent_ptr_update/TestPersistentPtrUpdate.py (2193 of 2337) PASS: lldb-unit :: tools/lldb-server/tests/./LLDBServerTests/TestBase.LaunchModePreservesEnvironment (2194 of 2337) PASS: lldb-shell :: Driver/TestCore.test (2195 of 2337) PASS: lldb-api :: lang/c/stepping/TestThreadStepping.py (2196 of 2337) PASS: lldb-api :: lang/cpp/multiple-inheritance/TestCppMultipleInheritance.py (2197 of 2337) PASS: lldb-api :: lang/c/complex_int/TestComplexInt.py (2198 of 2337) UNSUPPORTED: lldb-shell :: SymbolFile/PDB/func-symbols.test (2199 of 2337) PASS: lldb-api :: commands/command/script/import/TestImport.py (2200 of 2337) PASS: lldb-unit :: Utility/./UtilityTests/VMRange.IsValid (2201 of 2337) PASS: lldb-api :: functionalities/thread/concurrent_events/TestConcurrentDelayedCrashWithBreakpointWatchpoint.py (2202 of 2337) PASS: lldb-unit :: Core/./LLDBCoreTests/SourceLocationSpecTest.FileLineColumnComponents (2203 of 2337) PASS: lldb-unit :: Utility/./UtilityTests/VASprintfTest.NoBufferResize (2204 of 2337) PASS: lldb-api :: lang/cpp/trivial_abi/TestTrivialABI.py (2205 of 2337) PASS: lldb-api :: lang/objc/blocks/TestObjCIvarsInBlocks.py (2206 of 2337) PASS: lldb-api :: functionalities/gdb_remote_client/TestQemuAArch64TargetXml.py (2207 of 2337) PASS: lldb-api :: python_api/process/io/TestProcessIO.py (2208 of 2337) PASS: lldb-api :: commands/watchpoints/watchpoint_commands/command/TestWatchpointCommandPython.py (2209 of 2337) PASS: lldb-shell :: SymbolFile/DWARF/x86/array-sizes.s (2210 of 2337) UNSUPPORTED: lldb-api :: lang/objc/modules-update/TestClangModulesUpdate.py (2211 of 2337) PASS: lldb-api :: functionalities/pre_run_dylibs/TestPreRunDylibs.py (2212 of 2337) UNSUPPORTED: lldb-api :: functionalities/darwin_log/filter/regex/message/TestDarwinLogFilterRegexMessage.py (2213 of 2337) PASS: lldb-unit :: Utility/./UtilityTests/RegularExpression.Valid (2214 of 2337) UNSUPPORTED: lldb-api :: functionalities/darwin_log/filter/exact_match/subsystem/TestDarwinLogFilterMatchSubsystem.py (2215 of 2337) PASS: lldb-unit :: Instruction/./EmulatorTests/TestAArch64Emulator.TestOverflow (2216 of 2337) UNSUPPORTED: lldb-api :: functionalities/darwin_log/source/debug/TestDarwinLogSourceDebug.py (2217 of 2337) PASS: lldb-api :: commands/expression/po_verbosity/TestPoVerbosity.py (2218 of 2337) PASS: lldb-api :: functionalities/thread/concurrent_events/TestConcurrentTwoWatchpointsOneSignal.py (2219 of 2337) PASS: lldb-unit :: Utility/./UtilityTests/StringExtractorTest.GetHexU8_Underflow_NoEof (2220 of 2337) PASS: lldb-unit :: Utility/./UtilityTests/RangeTest.Slide (2221 of 2337) PASS: lldb-unit :: Utility/./UtilityTests/StreamTest.PutPtr (2222 of 2337) PASS: lldb-api :: functionalities/breakpoint/breakpoint_callback_command_source/TestBreakpointCallbackCommandSource.py (2223 of 2337) PASS: lldb-unit :: Utility/./UtilityTests/UriParserTest.PortOverflow (2224 of 2337) PASS: lldb-api :: lang/cpp/operator-overload/TestOperatorOverload.py (2225 of 2337) PASS: lldb-unit :: Expression/./ExpressionTests/CppModuleConfigurationTest.MissingLibCpp (2226 of 2337) PASS: lldb-api :: functionalities/thread/state_after_expression/TestStateAfterExpression.py (2227 of 2337) PASS: lldb-unit :: Expression/./ExpressionTests/DiagnosticManagerTest.HasFixits (2228 of 2337) PASS: lldb-unit :: Utility/./UtilityTests/OptionsWithRawTest.EmptySuffix (2229 of 2337) UNSUPPORTED: lldb-shell :: ScriptInterpreter/Lua/nested_sessions.test (2230 of 2337) PASS: lldb-api :: lang/cpp/nsimport/TestCppNsImport.py (2231 of 2337) PASS: lldb-api :: functionalities/gdb_remote_client/TestPartialGPacket.py (2232 of 2337) PASS: lldb-api :: functionalities/breakpoint/breakpoint_by_file_colon_line/TestBreakpointByFileColonLine.py (2233 of 2337) PASS: lldb-unit :: Utility/./UtilityTests/Flags.Reset (2234 of 2337) PASS: lldb-unit :: Process/gdb-remote/./ProcessGdbRemoteTests/GDBRemoteClientBaseTest.SendContinueAndAsyncPacket (2235 of 2337) PASS: lldb-unit :: Utility/./UtilityTests/FileSpecTest.FileAndDirectoryComponents (2236 of 2337) PASS: lldb-unit :: Utility/./UtilityTests/StreamTest.PutBytesAsRawHex8ToMixedEndian (2237 of 2337) PASS: lldb-unit :: UnwindAssembly/x86/./UnwindAssemblyx86Tests/Testx86AssemblyInspectionEngine.TestPushExtended (2238 of 2337) PASS: lldb-unit :: Host/./HostTests/FileSystemTest.Readable (2239 of 2337) PASS: lldb-unit :: Utility/./UtilityTests/StringExtractorTest.DecodeHexU8_Exact (2240 of 2337) PASS: lldb-api :: lang/cpp/class_static/TestStaticVariables.py (2241 of 2337) PASS: lldb-unit :: Editline/./EditlineTests/EditlineTestFixture.EditlineReceivesSingleLineText (2242 of 2337) PASS: lldb-shell :: SymbolFile/Breakpad/line-table-mixed-path-styles.test (2243 of 2337) PASS: lldb-api :: functionalities/gdb_remote_client/TestProcessConnect.py (2244 of 2337) PASS: lldb-api :: lang/c/step-target/TestStepTarget.py (2245 of 2337) UNSUPPORTED: lldb-shell :: Register/x86-ymm-write.test (2246 of 2337) PASS: lldb-shell :: SymbolFile/Breakpad/line-table.test (2247 of 2337) PASS: lldb-unit :: Interpreter/./InterpreterTests/OptionValueString.DeepCopy (2248 of 2337) PASS: lldb-unit :: Expression/./ExpressionTests/DiagnosticManagerTest.GetStringNoDiags (2249 of 2337) PASS: lldb-unit :: Utility/./UtilityTests/ArgsTest.TestSingleArg (2250 of 2337) PASS: lldb-unit :: Utility/./UtilityTests/StringExtractorTest.GetU64BigEndian (2251 of 2337) PASS: lldb-unit :: Host/./HostTests/MainLoopTest.Signal (2252 of 2337) PASS: lldb-unit :: Utility/./UtilityTests/StreamTeeTest.GetStreamAtIndexOutOfBounds (2253 of 2337) PASS: lldb-api :: commands/statistics/basic/TestStats.py (2254 of 2337) PASS: lldb-unit :: Symbol/./SymbolTests/TestClangASTImporter.CompleteFwdDeclWithOtherOrigin (2255 of 2337) PASS: lldb-unit :: Utility/./UtilityTests/FileSpecTest.EqualDotsPosixRoot (2256 of 2337) PASS: lldb-unit :: Process/gdb-remote/./ProcessGdbRemoteTests/PortMapTest.Constructors (2257 of 2337) UNSUPPORTED: lldb-api :: functionalities/signal/handle-segv/TestHandleSegv.py (2258 of 2337) PASS: lldb-unit :: Language/Highlighting/./HighlighterTests/HighlighterTest.DefaultHighlighter (2259 of 2337) PASS: lldb-shell :: ObjectFile/ELF/minidebuginfo-corrupt-xz.yaml (2260 of 2337) PASS: lldb-api :: commands/watchpoints/watchpoint_on_vectors/TestValueOfVectorVariable.py (2261 of 2337) PASS: lldb-api :: functionalities/breakpoint/consecutive_breakpoints/TestConsecutiveBreakpoints.py (2262 of 2337) PASS: lldb-unit :: Expression/./ExpressionTests/DiagnosticManagerTest.PutStringSeverities (2263 of 2337) UNSUPPORTED: lldb-shell :: Register/x86-64-ymm16-read.test (2264 of 2337) PASS: lldb-api :: commands/expression/ignore-artificial-constructors/TestIgnoreArtificialConstructors.py (2265 of 2337) PASS: lldb-unit :: Utility/./UtilityTests/DataExtractorTest.GetDoubleUnaligned (2266 of 2337) PASS: lldb-unit :: Utility/./UtilityTests/RegisterValueTest.GetSet8 (2267 of 2337) PASS: lldb-shell :: SymbolFile/DWARF/dwo-relative-path.s (2268 of 2337) PASS: lldb-unit :: debugserver/./debugserverTests/RNBSocket.AnyListen (2269 of 2337) PASS: lldb-api :: commands/watchpoints/watchpoint_count/TestWatchpointCount.py (2270 of 2337) PASS: lldb-api :: tools/lldb-server/TestGdbRemoteAttach.py (2271 of 2337) PASS: lldb-unit :: Utility/./UtilityTests/VMRange.ContainsAddr (2272 of 2337) PASS: lldb-unit :: Host/./HostTests/SocketTests/SocketTest.TCPGetConnectURI/ipv4 (2273 of 2337) PASS: lldb-api :: python_api/process/TestProcessAPI.py (2274 of 2337) PASS: lldb-unit :: SymbolFile/NativePDB/./SymbolFileNativePDBTests/PDBFPOProgramToDWARFExpressionTests.SingleAssignmentRegisterRef (2275 of 2337) PASS: lldb-api :: commands/expression/rdar42038760/TestScalarURem.py (2276 of 2337) PASS: lldb-unit :: Utility/./UtilityTests/RangeTest.ContainsEndInclusive (2277 of 2337) PASS: lldb-api :: functionalities/asan/TestReportData.py (2278 of 2337) PASS: lldb-shell :: ObjectFile/Breakpad/sections-trailing-func.test (2279 of 2337) PASS: lldb-unit :: Expression/./ExpressionTests/CppModuleConfigurationTest.UnknownLibCppFile (2280 of 2337) PASS: lldb-unit :: SymbolFile/DWARF/./SymbolFileDWARFTests/SymbolFileDWARFTests.TestAbbrevOrder1Start5 (2281 of 2337) PASS: lldb-shell :: ObjectFile/Breakpad/discontiguous-sections.test (2282 of 2337) PASS: lldb-unit :: Expression/./ExpressionTests/DiagnosticManagerTest.GetStringSeverityLabels (2283 of 2337) PASS: lldb-unit :: DataFormatter/./LLDBFormatterTests/TypeMatcherTests.GetMatchStringExactName (2284 of 2337) PASS: lldb-shell :: SymbolFile/NativePDB/function-types-calling-conv.cpp (2285 of 2337) PASS: lldb-api :: lang/cpp/operators/TestCppOperators.py (2286 of 2337) PASS: lldb-api :: python_api/class_members/TestSBTypeClassMembers.py (2287 of 2337) PASS: lldb-api :: tools/lldb-vscode/coreFile/TestVSCode_coreFile.py (2288 of 2337) PASS: lldb-unit :: Utility/./UtilityTests/StringExtractorTest.InitMisc (2289 of 2337) PASS: lldb-unit :: Utility/./UtilityTests/BinaryStreamTest.PutSLEB128OneByte (2290 of 2337) PASS: lldb-unit :: Host/./HostTests/NativeProcessProtocolTest.ReadCStringFromMemory (2291 of 2337) PASS: lldb-api :: types/TestIntegerType.py (2292 of 2337) PASS: lldb-unit :: Utility/./UtilityTests/OptionsWithRawTest.QuotedSuffix (2293 of 2337) PASS: lldb-unit :: Utility/./UtilityTests/ArchSpecTest.MergeFrom (2294 of 2337) PASS: lldb-unit :: Utility/./UtilityTests/Flags.GetBitSize (2295 of 2337) PASS: lldb-api :: lang/c/tls_globals/TestTlsGlobals.py (2296 of 2337) PASS: lldb-unit :: Interpreter/./InterpreterTests/OptionValueArgs.DeepCopy (2297 of 2337) PASS: lldb-unit :: UnwindAssembly/x86/./UnwindAssemblyx86Tests/Testx86AssemblyInspectionEngine.TestPushR12 (2298 of 2337) PASS: lldb-unit :: Utility/./UtilityTests/FileSpecTest.IsRelative (2299 of 2337) PASS: lldb-api :: commands/expression/import-std-module/list-dbg-info-content/TestDbgInfoContentListFromStdModule.py (2300 of 2337) PASS: lldb-unit :: ScriptInterpreter/Python/./ScriptInterpreterPythonTests/PythonDataObjectsTest.TestObjectAttributes (2301 of 2337) PASS: lldb-api :: functionalities/data-formatter/refpointer-recursion/TestDataFormatterRefPtrRecursion.py (2302 of 2337) PASS: lldb-shell :: ObjectFile/PECOFF/basic-info-arm64.yaml (2303 of 2337) PASS: lldb-unit :: Utility/./UtilityTests/FileSpecTest.CopyByAppendingPathComponent (2304 of 2337) PASS: lldb-unit :: Utility/./UtilityTests/XcodeSDKTest.SDKSupportsModules (2305 of 2337) PASS: lldb-unit :: Utility/./UtilityTests/LogChannelEnabledTest.log_options (2306 of 2337) PASS: lldb-unit :: Process/minidump/./LLDBMinidumpTests/MinidumpParserTest.GetMemoryRegionInfoLinuxMapsError (2307 of 2337) PASS: lldb-api :: lang/objc/rdar-11355592/TestRdar11355592.py (2308 of 2337) PASS: lldb-api :: lang/objc/objc_direct-methods/TestObjCDirectMethods.py (2309 of 2337) PASS: lldb-unit :: Utility/./UtilityTests/StatusTest.Formatv (2310 of 2337) PASS: lldb-unit :: Utility/./UtilityTests/BinaryStreamTest.PutULEB128EightBytes (2311 of 2337) PASS: lldb-api :: lang/c/modules/TestCModules.py (2312 of 2337) PASS: lldb-api :: functionalities/pointer_num_children/TestPointerNumChildren.py (2313 of 2337) PASS: lldb-api :: commands/expression/import-std-module/basic/TestImportStdModule.py (2314 of 2337) PASS: lldb-unit :: Utility/./UtilityTests/OptionsWithRawTest.UnterminatedQuote (2315 of 2337) PASS: lldb-unit :: Host/./HostTests/FileSystemTest.GetPermissions (2316 of 2337) PASS: lldb-unit :: ObjectFile/ELF/./ObjectFileELFTests/ObjectFileELFTest.GetSymtab_NoSymEntryPointArmThumbAddressClass (2317 of 2337) PASS: lldb-unit :: Process/minidump/./LLDBMinidumpTests/MinidumpParserTest.GetThreadContext_x86_64 (2318 of 2337) PASS: lldb-shell :: SymbolFile/Breakpad/line-table-missing-file.test (2319 of 2337) UNSUPPORTED: lldb-api :: functionalities/darwin_log/filter/regex/subsystem/TestDarwinLogFilterRegexSubsystem.py (2320 of 2337) PASS: lldb-unit :: Symbol/./SymbolTests/TestTypeSystemClang.TestRemoveFastQualifiers (2321 of 2337) PASS: lldb-unit :: Utility/./UtilityTests/StreamTest.AddressRangeSize (2322 of 2337) PASS: lldb-unit :: Utility/./UtilityTests/BinaryStreamTest.PutSLEB128FourBytes (2323 of 2337) PASS: lldb-api :: lang/cpp/break-on-initializers/TestBreakOnCPP11Initializers.py (2324 of 2337) UNSUPPORTED: lldb-shell :: SymbolFile/PDB/compilands.test (2325 of 2337) PASS: lldb-shell :: SymbolFile/DWARF/clang-ast-from-dwarf-objc-property.m (2326 of 2337) PASS: lldb-shell :: Settings/TestSettingsWrite.test (2327 of 2337) PASS: lldb-unit :: Utility/./UtilityTests/ScalarTest.GetValue (2328 of 2337) PASS: lldb-api :: commands/expression/multiline-completion/TestMultilineCompletion.py (2329 of 2337) PASS: lldb-unit :: Process/minidump/./LLDBMinidumpTests/RegisterContextMinidump.ConvertMinidumpContext_x86_64 (2330 of 2337) PASS: lldb-shell :: Register/Core/x86-64-linux-gp.test (2331 of 2337) PASS: lldb-unit :: ScriptInterpreter/Python/./ScriptInterpreterPythonTests/PythonDataObjectsTest.TestPythonCallableCheck (2332 of 2337) PASS: lldb-api :: python_api/formatters/TestFormattersSBAPI.py (2333 of 2337) PASS: lldb-unit :: Utility/./UtilityTests/RangeTest.EqualInvalid (2334 of 2337) PASS: lldb-api :: python_api/value/TestValueAPI.py (2335 of 2337) PASS: lldb-api :: commands/disassemble/basic/TestFrameDisassemble.py (2336 of 2337) PASS: lldb-api :: functionalities/data-formatter/data-formatter-stl/libcxx/unordered/TestDataFormatterUnordered.py (2337 of 2337) Slowest Tests: -------------------------------------------------------------------------- 177.94s: lldb-api :: python_api/lldbutil/iter/TestLLDBIterator.py 130.95s: lldb-api :: tools/lldb-vscode/breakpoint/TestVSCode_setBreakpoints.py 106.11s: lldb-api :: lang/objcxx/objcxx-ivar-vector/TestIvarVector.py 95.08s: lldb-api :: lang/cpp/static_methods/TestCPPStaticMethods.py 83.30s: lldb-api :: tools/lldb-server/TestLldbGdbServer.py 74.59s: lldb-api :: api/multithreaded/TestMultithreaded.py 72.22s: lldb-api :: functionalities/data-formatter/synthcapping/TestSyntheticCapping.py 66.15s: lldb-api :: lang/objc/foundation/TestFoundationDisassembly.py 48.05s: lldb-api :: functionalities/data-formatter/data-formatter-python-synth/TestDataFormatterPythonSynth.py 46.82s: lldb-api :: functionalities/mtc/simple/TestMTCSimple.py 46.77s: lldb-api :: lang/objc/exceptions/TestObjCExceptions.py 44.07s: lldb-api :: tools/lldb-server/vCont-threads/TestGdbRemote_vContThreads.py 42.70s: lldb-shell :: SymbolFile/NativePDB/break-by-line.cpp 41.91s: lldb-api :: lang/objc/hidden-ivars/TestHiddenIvars.py 40.54s: lldb-api :: lang/objc/objc-new-syntax/TestObjCNewSyntaxLiteral.py 39.30s: lldb-api :: types/TestLongTypesExpr.py 38.85s: lldb-api :: functionalities/completion/TestCompletion.py 38.81s: lldb-api :: lang/objc/objc-new-syntax/TestObjCNewSyntaxArray.py 38.33s: lldb-api :: lang/objcxx/hide-runtime-values/TestObjCXXHideRuntimeValues.py 37.49s: lldb-api :: commands/expression/test/TestExprs2.py

Hide Details

Tests Times: -------------------------------------------------------------------------- [ Range ] :: [ Percentage ] :: [ Count ] -------------------------------------------------------------------------- [170s,180s) :: [ ] :: [ 1/2337] [160s,170s) :: [ ] :: [ 0/2337] [150s,160s) :: [ ] :: [ 0/2337] [140s,150s) :: [ ] :: [ 0/2337] [130s,140s) :: [ ] :: [ 1/2337] [120s,130s) :: [ ] :: [ 0/2337] [110s,120s) :: [ ] :: [ 0/2337] [100s,110s) :: [ ] :: [ 1/2337] [ 90s,100s) :: [ ] :: [ 1/2337] [ 80s, 90s) :: [ ] :: [ 1/2337] [ 70s, 80s) :: [ ] :: [ 2/2337] [ 60s, 70s) :: [ ] :: [ 1/2337] [ 50s, 60s) :: [ ] :: [ 0/2337] [ 40s, 50s) :: [ ] :: [ 7/2337] [ 30s, 40s) :: [ ] :: [ 11/2337] [ 20s, 30s) :: [ ] :: [ 19/2337] [ 10s, 20s) :: [* ] :: [ 90/2337] [ 0s, 10s) :: [************************************* ] :: [2202/2337] -------------------------------------------------------------------------- ******************** Failed Tests (10): lldb-api :: commands/expression/test/TestExprs2.py lldb-api :: functionalities/data-formatter/synthcapping/TestSyntheticCapping.py lldb-api :: functionalities/mtc/simple/TestMTCSimple.py lldb-api :: lang/cpp/static_methods/TestCPPStaticMethods.py lldb-api :: lang/objcxx/hide-runtime-values/TestObjCXXHideRuntimeValues.py lldb-api :: lang/objcxx/objcxx-ivar-vector/TestIvarVector.py lldb-api :: python_api/frame/inlines/TestInlinedFrame.py lldb-api :: python_api/lldbutil/iter/TestLLDBIterator.py lldb-api :: tools/lldb-server/TestGdbRemoteRegisterState.py lldb-api :: tools/lldb-vscode/breakpoint/TestVSCode_setBreakpoints.py

Hide Details

Hide Details

Testing Time: 1529.87s Unsupported : 176 Passed : 2141 Expectedly Failed: 10 Failed : 10 FAILED: tools/lldb/test/CMakeFiles/check-lldb cd /Users/buildslave/jenkins/workspace/lldb-cmake/lldb-build/tools/lldb/test && /usr/local/Frameworks/Python.framework/Versions/3.7/bin/python3.7 /Users/buildslave/jenkins/workspace/lldb-cmake/lldb-build/./bin/llvm-lit -v --time-tests --shuffle --xunit-xml-output=/Users/buildslave/jenkins/workspace/lldb-cmake/test/results.xml -v -j 4 /Users/buildslave/jenkins/workspace/lldb-cmake/lldb-build/tools/lldb/test ninja: build stopped: cannot make progress due to previous errors. Command failed: Command '['/usr/bin/env', 'TERM=vt100', '/usr/local/bin/ninja', '-v', 'check-debuginfo', 'check-lldb', '-k2']' returned non-zero exit status 1 Command: ['/usr/bin/env', 'TERM=vt100', '/usr/local/bin/ninja', '-v', 'check-debuginfo', 'check-lldb', '-k2'] [Pipeline] } [Pipeline] // timeout [Pipeline] } [Pipeline] // stage [Pipeline] stage [Pipeline] { (Declarative: Post Actions) [Pipeline] scanForIssues [Clang (LLVM based)] Sleeping for 5 seconds due to JENKINS-32191... [Clang (LLVM based)] Parsing console log (workspace: '/Users/buildslave/jenkins/workspace/lldb-cmake') [Clang (LLVM based)] Successfully parsed console log [Clang (LLVM based)] -> found 0 issues (skipped 0 duplicates) [Clang (LLVM based)] Skipping post processing [Clang (LLVM based)] No filter has been set, publishing all 0 issues [Clang (LLVM based)] Repository miner is not configured, skipping repository mining [Pipeline] junit Recording test results [Checks API] No suitable checks publisher found. [Pipeline] emailext Warning: dvyukov@google.com is not a recognized user, but sending mail anyway Warning: dvyukov@google.com is not a recognized user, but sending mail anyway

Hide Details

Begin Pre-Send Script... Sending email to: dvyukov@google.com vitalybuka@google.com Tim Northover <tnorthover@apple.com> Azhar Mohammed <azhar@apple.com>
[Pipeline] } [Pipeline] // stage [Pipeline] } [Pipeline] // withEnv [Pipeline] } [Pipeline] // node [Pipeline] End of Pipeline ERROR: script returned exit code 1 Finished: FAILURE