FailedConsole Output

Skipping 11,261 KB.. Full Log
bin/dsymutil --filecheck /Users/buildslave/jenkins/workspace/lldb-cmake/lldb-build/./bin/FileCheck --yaml2obj /Users/buildslave/jenkins/workspace/lldb-cmake/lldb-build/./bin/yaml2obj --server /Users/buildslave/jenkins/workspace/lldb-cmake/lldb-build/./bin/debugserver --lldb-libs-dir /Users/buildslave/jenkins/workspace/lldb-cmake/lldb-build/./lib /Users/buildslave/jenkins/workspace/lldb-cmake/llvm-project/lldb/test/API/functionalities/multidebugger_commands -p TestMultipleDebuggersCommands.py
--
Exit Code: 2

Hide Details

Command Output (stderr): -- usage: dotest.py [-h] [-A arch] [-C compiler] [--apple-sdk apple_sdk] [-E extra-flags] [--dsymutil dsymutil] [--yaml2obj yaml2obj] [--filecheck filecheck] [-f filterspec] [-p pattern] [--excluded exclusion-file] [-G category] [--skip-category category] [--xfail-category category] [--framework framework-path] [--executable executable-path] [--server server-path] [--out-of-tree-debugserver] [--dwarf-version dwarf_version] [--setting SETTING=VALUE] [-y count] [-# sharp] [--channel channel] [--log-success] [--codesign-identity Codesigning identity] [--build-dir Test build directory] [--lldb-module-cache-dir The clang module cache directory used by LLDB] [--clang-module-cache-dir The clang module cache directory used by Clang] [--lldb-libs-dir path] [--enable-plugin A plugin whose tests will be enabled] [--platform-name platform-name] [--platform-url platform-url] [--platform-working-dir platform-working-dir] [--capture-path reproducer path] [--replay-path reproducer path] [-d] [-t] [-u variable] [--env variable] [--inferior-env variable] [-v] [--enable-crash-dialog] [test-dir [test-dir ...]] dotest.py: error: unrecognized arguments: -s=/Users/buildslave/jenkins/workspace/lldb-cmake/test/logs

Hide Details

--

Hide Details

******************** FAIL: lldb-api :: functionalities/data-formatter/data-formatter-objc/TestDataFormatterObjCNSBundle.py (2192 of 2240) ******************** TEST 'lldb-api :: functionalities/data-formatter/data-formatter-objc/TestDataFormatterObjCNSBundle.py' FAILED ******************** Script: -- /usr/local/Frameworks/Python.framework/Versions/3.7/bin/python3.7 /Users/buildslave/jenkins/workspace/lldb-cmake/llvm-project/lldb/test/API/dotest.py -u CXXFLAGS -u CFLAGS --codesign-identity - --arch x86_64 --build-dir /Users/buildslave/jenkins/workspace/lldb-cmake/lldb-build/lldb-test-build.noindex -s=/Users/buildslave/jenkins/workspace/lldb-cmake/test/logs -t --env TERM=vt100 --env LLVM_LIBS_DIR=/Users/buildslave/jenkins/workspace/lldb-cmake/lldb-build/./lib --arch x86_64 --build-dir /Users/buildslave/jenkins/workspace/lldb-cmake/lldb-build/lldb-test-build.noindex --lldb-module-cache-dir /Users/buildslave/jenkins/workspace/lldb-cmake/lldb-build/lldb-test-build.noindex/module-cache-lldb/lldb-api --clang-module-cache-dir /Users/buildslave/jenkins/workspace/lldb-cmake/lldb-build/lldb-test-build.noindex/module-cache-clang/lldb-api --executable /Users/buildslave/jenkins/workspace/lldb-cmake/lldb-build/./bin/lldb --compiler /Users/buildslave/jenkins/workspace/lldb-cmake/lldb-build/./bin/clang --dsymutil /Users/buildslave/jenkins/workspace/lldb-cmake/lldb-build/./bin/dsymutil --filecheck /Users/buildslave/jenkins/workspace/lldb-cmake/lldb-build/./bin/FileCheck --yaml2obj /Users/buildslave/jenkins/workspace/lldb-cmake/lldb-build/./bin/yaml2obj --server /Users/buildslave/jenkins/workspace/lldb-cmake/lldb-build/./bin/debugserver --lldb-libs-dir /Users/buildslave/jenkins/workspace/lldb-cmake/lldb-build/./lib /Users/buildslave/jenkins/workspace/lldb-cmake/llvm-project/lldb/test/API/functionalities/data-formatter/data-formatter-objc -p TestDataFormatterObjCNSBundle.py -- Exit Code: 2

Hide Details

Command Output (stderr): -- usage: dotest.py [-h] [-A arch] [-C compiler] [--apple-sdk apple_sdk] [-E extra-flags] [--dsymutil dsymutil] [--yaml2obj yaml2obj] [--filecheck filecheck] [-f filterspec] [-p pattern] [--excluded exclusion-file] [-G category] [--skip-category category] [--xfail-category category] [--framework framework-path] [--executable executable-path] [--server server-path] [--out-of-tree-debugserver] [--dwarf-version dwarf_version] [--setting SETTING=VALUE] [-y count] [-# sharp] [--channel channel] [--log-success] [--codesign-identity Codesigning identity] [--build-dir Test build directory] [--lldb-module-cache-dir The clang module cache directory used by LLDB] [--clang-module-cache-dir The clang module cache directory used by Clang] [--lldb-libs-dir path] [--enable-plugin A plugin whose tests will be enabled] [--platform-name platform-name] [--platform-url platform-url] [--platform-working-dir platform-working-dir] [--capture-path reproducer path] [--replay-path reproducer path] [-d] [-t] [-u variable] [--env variable] [--inferior-env variable] [-v] [--enable-crash-dialog] [test-dir [test-dir ...]] dotest.py: error: unrecognized arguments: -s=/Users/buildslave/jenkins/workspace/lldb-cmake/test/logs

Hide Details

--

Hide Details

******************** FAIL: lldb-api :: functionalities/thread/concurrent_events/TestConcurrentDelayedCrashWithBreakpointWatchpoint.py (2193 of 2240) ******************** TEST 'lldb-api :: functionalities/thread/concurrent_events/TestConcurrentDelayedCrashWithBreakpointWatchpoint.py' FAILED ******************** Script: -- /usr/local/Frameworks/Python.framework/Versions/3.7/bin/python3.7 /Users/buildslave/jenkins/workspace/lldb-cmake/llvm-project/lldb/test/API/dotest.py -u CXXFLAGS -u CFLAGS --codesign-identity - --arch x86_64 --build-dir /Users/buildslave/jenkins/workspace/lldb-cmake/lldb-build/lldb-test-build.noindex -s=/Users/buildslave/jenkins/workspace/lldb-cmake/test/logs -t --env TERM=vt100 --env LLVM_LIBS_DIR=/Users/buildslave/jenkins/workspace/lldb-cmake/lldb-build/./lib --arch x86_64 --build-dir /Users/buildslave/jenkins/workspace/lldb-cmake/lldb-build/lldb-test-build.noindex --lldb-module-cache-dir /Users/buildslave/jenkins/workspace/lldb-cmake/lldb-build/lldb-test-build.noindex/module-cache-lldb/lldb-api --clang-module-cache-dir /Users/buildslave/jenkins/workspace/lldb-cmake/lldb-build/lldb-test-build.noindex/module-cache-clang/lldb-api --executable /Users/buildslave/jenkins/workspace/lldb-cmake/lldb-build/./bin/lldb --compiler /Users/buildslave/jenkins/workspace/lldb-cmake/lldb-build/./bin/clang --dsymutil /Users/buildslave/jenkins/workspace/lldb-cmake/lldb-build/./bin/dsymutil --filecheck /Users/buildslave/jenkins/workspace/lldb-cmake/lldb-build/./bin/FileCheck --yaml2obj /Users/buildslave/jenkins/workspace/lldb-cmake/lldb-build/./bin/yaml2obj --server /Users/buildslave/jenkins/workspace/lldb-cmake/lldb-build/./bin/debugserver --lldb-libs-dir /Users/buildslave/jenkins/workspace/lldb-cmake/lldb-build/./lib /Users/buildslave/jenkins/workspace/lldb-cmake/llvm-project/lldb/test/API/functionalities/thread/concurrent_events -p TestConcurrentDelayedCrashWithBreakpointWatchpoint.py -- Exit Code: 2

Hide Details

Command Output (stderr): -- usage: dotest.py [-h] [-A arch] [-C compiler] [--apple-sdk apple_sdk] [-E extra-flags] [--dsymutil dsymutil] [--yaml2obj yaml2obj] [--filecheck filecheck] [-f filterspec] [-p pattern] [--excluded exclusion-file] [-G category] [--skip-category category] [--xfail-category category] [--framework framework-path] [--executable executable-path] [--server server-path] [--out-of-tree-debugserver] [--dwarf-version dwarf_version] [--setting SETTING=VALUE] [-y count] [-# sharp] [--channel channel] [--log-success] [--codesign-identity Codesigning identity] [--build-dir Test build directory] [--lldb-module-cache-dir The clang module cache directory used by LLDB] [--clang-module-cache-dir The clang module cache directory used by Clang] [--lldb-libs-dir path] [--enable-plugin A plugin whose tests will be enabled] [--platform-name platform-name] [--platform-url platform-url] [--platform-working-dir platform-working-dir] [--capture-path reproducer path] [--replay-path reproducer path] [-d] [-t] [-u variable] [--env variable] [--inferior-env variable] [-v] [--enable-crash-dialog] [test-dir [test-dir ...]] dotest.py: error: unrecognized arguments: -s=/Users/buildslave/jenkins/workspace/lldb-cmake/test/logs

Hide Details

--

Hide Details

******************** PASS: lldb-unit :: UnwindAssembly/x86/./UnwindAssemblyx86Tests/Testx86AssemblyInspectionEngine.TestSpArithx86_64Augmented (2194 of 2240) FAIL: lldb-api :: functionalities/breakpoint/breakpoint_names/TestBreakpointNames.py (2195 of 2240) ******************** TEST 'lldb-api :: functionalities/breakpoint/breakpoint_names/TestBreakpointNames.py' FAILED ******************** Script: -- /usr/local/Frameworks/Python.framework/Versions/3.7/bin/python3.7 /Users/buildslave/jenkins/workspace/lldb-cmake/llvm-project/lldb/test/API/dotest.py -u CXXFLAGS -u CFLAGS --codesign-identity - --arch x86_64 --build-dir /Users/buildslave/jenkins/workspace/lldb-cmake/lldb-build/lldb-test-build.noindex -s=/Users/buildslave/jenkins/workspace/lldb-cmake/test/logs -t --env TERM=vt100 --env LLVM_LIBS_DIR=/Users/buildslave/jenkins/workspace/lldb-cmake/lldb-build/./lib --arch x86_64 --build-dir /Users/buildslave/jenkins/workspace/lldb-cmake/lldb-build/lldb-test-build.noindex --lldb-module-cache-dir /Users/buildslave/jenkins/workspace/lldb-cmake/lldb-build/lldb-test-build.noindex/module-cache-lldb/lldb-api --clang-module-cache-dir /Users/buildslave/jenkins/workspace/lldb-cmake/lldb-build/lldb-test-build.noindex/module-cache-clang/lldb-api --executable /Users/buildslave/jenkins/workspace/lldb-cmake/lldb-build/./bin/lldb --compiler /Users/buildslave/jenkins/workspace/lldb-cmake/lldb-build/./bin/clang --dsymutil /Users/buildslave/jenkins/workspace/lldb-cmake/lldb-build/./bin/dsymutil --filecheck /Users/buildslave/jenkins/workspace/lldb-cmake/lldb-build/./bin/FileCheck --yaml2obj /Users/buildslave/jenkins/workspace/lldb-cmake/lldb-build/./bin/yaml2obj --server /Users/buildslave/jenkins/workspace/lldb-cmake/lldb-build/./bin/debugserver --lldb-libs-dir /Users/buildslave/jenkins/workspace/lldb-cmake/lldb-build/./lib /Users/buildslave/jenkins/workspace/lldb-cmake/llvm-project/lldb/test/API/functionalities/breakpoint/breakpoint_names -p TestBreakpointNames.py -- Exit Code: 2

Hide Details

Command Output (stderr): -- usage: dotest.py [-h] [-A arch] [-C compiler] [--apple-sdk apple_sdk] [-E extra-flags] [--dsymutil dsymutil] [--yaml2obj yaml2obj] [--filecheck filecheck] [-f filterspec] [-p pattern] [--excluded exclusion-file] [-G category] [--skip-category category] [--xfail-category category] [--framework framework-path] [--executable executable-path] [--server server-path] [--out-of-tree-debugserver] [--dwarf-version dwarf_version] [--setting SETTING=VALUE] [-y count] [-# sharp] [--channel channel] [--log-success] [--codesign-identity Codesigning identity] [--build-dir Test build directory] [--lldb-module-cache-dir The clang module cache directory used by LLDB] [--clang-module-cache-dir The clang module cache directory used by Clang] [--lldb-libs-dir path] [--enable-plugin A plugin whose tests will be enabled] [--platform-name platform-name] [--platform-url platform-url] [--platform-working-dir platform-working-dir] [--capture-path reproducer path] [--replay-path reproducer path] [-d] [-t] [-u variable] [--env variable] [--inferior-env variable] [-v] [--enable-crash-dialog] [test-dir [test-dir ...]] dotest.py: error: unrecognized arguments: -s=/Users/buildslave/jenkins/workspace/lldb-cmake/test/logs

Hide Details

--

Hide Details

******************** PASS: lldb-unit :: Utility/./UtilityTests/UriParserTest.BracketedHostnameWithColon (2196 of 2240) UNSUPPORTED: lldb-shell :: ScriptInterpreter/Lua/breakpoint_callback.test (2197 of 2240) FAIL: lldb-api :: commands/frame/diagnose/dereference-argument/TestDiagnoseDereferenceArgument.py (2198 of 2240) ******************** TEST 'lldb-api :: commands/frame/diagnose/dereference-argument/TestDiagnoseDereferenceArgument.py' FAILED ******************** Script: -- /usr/local/Frameworks/Python.framework/Versions/3.7/bin/python3.7 /Users/buildslave/jenkins/workspace/lldb-cmake/llvm-project/lldb/test/API/dotest.py -u CXXFLAGS -u CFLAGS --codesign-identity - --arch x86_64 --build-dir /Users/buildslave/jenkins/workspace/lldb-cmake/lldb-build/lldb-test-build.noindex -s=/Users/buildslave/jenkins/workspace/lldb-cmake/test/logs -t --env TERM=vt100 --env LLVM_LIBS_DIR=/Users/buildslave/jenkins/workspace/lldb-cmake/lldb-build/./lib --arch x86_64 --build-dir /Users/buildslave/jenkins/workspace/lldb-cmake/lldb-build/lldb-test-build.noindex --lldb-module-cache-dir /Users/buildslave/jenkins/workspace/lldb-cmake/lldb-build/lldb-test-build.noindex/module-cache-lldb/lldb-api --clang-module-cache-dir /Users/buildslave/jenkins/workspace/lldb-cmake/lldb-build/lldb-test-build.noindex/module-cache-clang/lldb-api --executable /Users/buildslave/jenkins/workspace/lldb-cmake/lldb-build/./bin/lldb --compiler /Users/buildslave/jenkins/workspace/lldb-cmake/lldb-build/./bin/clang --dsymutil /Users/buildslave/jenkins/workspace/lldb-cmake/lldb-build/./bin/dsymutil --filecheck /Users/buildslave/jenkins/workspace/lldb-cmake/lldb-build/./bin/FileCheck --yaml2obj /Users/buildslave/jenkins/workspace/lldb-cmake/lldb-build/./bin/yaml2obj --server /Users/buildslave/jenkins/workspace/lldb-cmake/lldb-build/./bin/debugserver --lldb-libs-dir /Users/buildslave/jenkins/workspace/lldb-cmake/lldb-build/./lib /Users/buildslave/jenkins/workspace/lldb-cmake/llvm-project/lldb/test/API/commands/frame/diagnose/dereference-argument -p TestDiagnoseDereferenceArgument.py -- Exit Code: 2

Hide Details

Command Output (stderr): -- usage: dotest.py [-h] [-A arch] [-C compiler] [--apple-sdk apple_sdk] [-E extra-flags] [--dsymutil dsymutil] [--yaml2obj yaml2obj] [--filecheck filecheck] [-f filterspec] [-p pattern] [--excluded exclusion-file] [-G category] [--skip-category category] [--xfail-category category] [--framework framework-path] [--executable executable-path] [--server server-path] [--out-of-tree-debugserver] [--dwarf-version dwarf_version] [--setting SETTING=VALUE] [-y count] [-# sharp] [--channel channel] [--log-success] [--codesign-identity Codesigning identity] [--build-dir Test build directory] [--lldb-module-cache-dir The clang module cache directory used by LLDB] [--clang-module-cache-dir The clang module cache directory used by Clang] [--lldb-libs-dir path] [--enable-plugin A plugin whose tests will be enabled] [--platform-name platform-name] [--platform-url platform-url] [--platform-working-dir platform-working-dir] [--capture-path reproducer path] [--replay-path reproducer path] [-d] [-t] [-u variable] [--env variable] [--inferior-env variable] [-v] [--enable-crash-dialog] [test-dir [test-dir ...]] dotest.py: error: unrecognized arguments: -s=/Users/buildslave/jenkins/workspace/lldb-cmake/test/logs

Hide Details

--

Hide Details

******************** FAIL: lldb-api :: lang/objc/real-definition/TestRealDefinition.py (2199 of 2240) ******************** TEST 'lldb-api :: lang/objc/real-definition/TestRealDefinition.py' FAILED ******************** Script: -- /usr/local/Frameworks/Python.framework/Versions/3.7/bin/python3.7 /Users/buildslave/jenkins/workspace/lldb-cmake/llvm-project/lldb/test/API/dotest.py -u CXXFLAGS -u CFLAGS --codesign-identity - --arch x86_64 --build-dir /Users/buildslave/jenkins/workspace/lldb-cmake/lldb-build/lldb-test-build.noindex -s=/Users/buildslave/jenkins/workspace/lldb-cmake/test/logs -t --env TERM=vt100 --env LLVM_LIBS_DIR=/Users/buildslave/jenkins/workspace/lldb-cmake/lldb-build/./lib --arch x86_64 --build-dir /Users/buildslave/jenkins/workspace/lldb-cmake/lldb-build/lldb-test-build.noindex --lldb-module-cache-dir /Users/buildslave/jenkins/workspace/lldb-cmake/lldb-build/lldb-test-build.noindex/module-cache-lldb/lldb-api --clang-module-cache-dir /Users/buildslave/jenkins/workspace/lldb-cmake/lldb-build/lldb-test-build.noindex/module-cache-clang/lldb-api --executable /Users/buildslave/jenkins/workspace/lldb-cmake/lldb-build/./bin/lldb --compiler /Users/buildslave/jenkins/workspace/lldb-cmake/lldb-build/./bin/clang --dsymutil /Users/buildslave/jenkins/workspace/lldb-cmake/lldb-build/./bin/dsymutil --filecheck /Users/buildslave/jenkins/workspace/lldb-cmake/lldb-build/./bin/FileCheck --yaml2obj /Users/buildslave/jenkins/workspace/lldb-cmake/lldb-build/./bin/yaml2obj --server /Users/buildslave/jenkins/workspace/lldb-cmake/lldb-build/./bin/debugserver --lldb-libs-dir /Users/buildslave/jenkins/workspace/lldb-cmake/lldb-build/./lib /Users/buildslave/jenkins/workspace/lldb-cmake/llvm-project/lldb/test/API/lang/objc/real-definition -p TestRealDefinition.py -- Exit Code: 2

Hide Details

Command Output (stderr): -- usage: dotest.py [-h] [-A arch] [-C compiler] [--apple-sdk apple_sdk] [-E extra-flags] [--dsymutil dsymutil] [--yaml2obj yaml2obj] [--filecheck filecheck] [-f filterspec] [-p pattern] [--excluded exclusion-file] [-G category] [--skip-category category] [--xfail-category category] [--framework framework-path] [--executable executable-path] [--server server-path] [--out-of-tree-debugserver] [--dwarf-version dwarf_version] [--setting SETTING=VALUE] [-y count] [-# sharp] [--channel channel] [--log-success] [--codesign-identity Codesigning identity] [--build-dir Test build directory] [--lldb-module-cache-dir The clang module cache directory used by LLDB] [--clang-module-cache-dir The clang module cache directory used by Clang] [--lldb-libs-dir path] [--enable-plugin A plugin whose tests will be enabled] [--platform-name platform-name] [--platform-url platform-url] [--platform-working-dir platform-working-dir] [--capture-path reproducer path] [--replay-path reproducer path] [-d] [-t] [-u variable] [--env variable] [--inferior-env variable] [-v] [--enable-crash-dialog] [test-dir [test-dir ...]] dotest.py: error: unrecognized arguments: -s=/Users/buildslave/jenkins/workspace/lldb-cmake/test/logs

Hide Details

--

Hide Details

******************** FAIL: lldb-api :: functionalities/data-formatter/nsarraysynth/TestNSArraySynthetic.py (2200 of 2240) ******************** TEST 'lldb-api :: functionalities/data-formatter/nsarraysynth/TestNSArraySynthetic.py' FAILED ******************** Script: -- /usr/local/Frameworks/Python.framework/Versions/3.7/bin/python3.7 /Users/buildslave/jenkins/workspace/lldb-cmake/llvm-project/lldb/test/API/dotest.py -u CXXFLAGS -u CFLAGS --codesign-identity - --arch x86_64 --build-dir /Users/buildslave/jenkins/workspace/lldb-cmake/lldb-build/lldb-test-build.noindex -s=/Users/buildslave/jenkins/workspace/lldb-cmake/test/logs -t --env TERM=vt100 --env LLVM_LIBS_DIR=/Users/buildslave/jenkins/workspace/lldb-cmake/lldb-build/./lib --arch x86_64 --build-dir /Users/buildslave/jenkins/workspace/lldb-cmake/lldb-build/lldb-test-build.noindex --lldb-module-cache-dir /Users/buildslave/jenkins/workspace/lldb-cmake/lldb-build/lldb-test-build.noindex/module-cache-lldb/lldb-api --clang-module-cache-dir /Users/buildslave/jenkins/workspace/lldb-cmake/lldb-build/lldb-test-build.noindex/module-cache-clang/lldb-api --executable /Users/buildslave/jenkins/workspace/lldb-cmake/lldb-build/./bin/lldb --compiler /Users/buildslave/jenkins/workspace/lldb-cmake/lldb-build/./bin/clang --dsymutil /Users/buildslave/jenkins/workspace/lldb-cmake/lldb-build/./bin/dsymutil --filecheck /Users/buildslave/jenkins/workspace/lldb-cmake/lldb-build/./bin/FileCheck --yaml2obj /Users/buildslave/jenkins/workspace/lldb-cmake/lldb-build/./bin/yaml2obj --server /Users/buildslave/jenkins/workspace/lldb-cmake/lldb-build/./bin/debugserver --lldb-libs-dir /Users/buildslave/jenkins/workspace/lldb-cmake/lldb-build/./lib /Users/buildslave/jenkins/workspace/lldb-cmake/llvm-project/lldb/test/API/functionalities/data-formatter/nsarraysynth -p TestNSArraySynthetic.py -- Exit Code: 2

Hide Details

Command Output (stderr): -- usage: dotest.py [-h] [-A arch] [-C compiler] [--apple-sdk apple_sdk] [-E extra-flags] [--dsymutil dsymutil] [--yaml2obj yaml2obj] [--filecheck filecheck] [-f filterspec] [-p pattern] [--excluded exclusion-file] [-G category] [--skip-category category] [--xfail-category category] [--framework framework-path] [--executable executable-path] [--server server-path] [--out-of-tree-debugserver] [--dwarf-version dwarf_version] [--setting SETTING=VALUE] [-y count] [-# sharp] [--channel channel] [--log-success] [--codesign-identity Codesigning identity] [--build-dir Test build directory] [--lldb-module-cache-dir The clang module cache directory used by LLDB] [--clang-module-cache-dir The clang module cache directory used by Clang] [--lldb-libs-dir path] [--enable-plugin A plugin whose tests will be enabled] [--platform-name platform-name] [--platform-url platform-url] [--platform-working-dir platform-working-dir] [--capture-path reproducer path] [--replay-path reproducer path] [-d] [-t] [-u variable] [--env variable] [--inferior-env variable] [-v] [--enable-crash-dialog] [test-dir [test-dir ...]] dotest.py: error: unrecognized arguments: -s=/Users/buildslave/jenkins/workspace/lldb-cmake/test/logs

Hide Details

--

Hide Details

******************** FAIL: lldb-api :: functionalities/gdb_remote_client/TestAArch64XMLRegOffsets.py (2201 of 2240) ******************** TEST 'lldb-api :: functionalities/gdb_remote_client/TestAArch64XMLRegOffsets.py' FAILED ******************** Script: -- /usr/local/Frameworks/Python.framework/Versions/3.7/bin/python3.7 /Users/buildslave/jenkins/workspace/lldb-cmake/llvm-project/lldb/test/API/dotest.py -u CXXFLAGS -u CFLAGS --codesign-identity - --arch x86_64 --build-dir /Users/buildslave/jenkins/workspace/lldb-cmake/lldb-build/lldb-test-build.noindex -s=/Users/buildslave/jenkins/workspace/lldb-cmake/test/logs -t --env TERM=vt100 --env LLVM_LIBS_DIR=/Users/buildslave/jenkins/workspace/lldb-cmake/lldb-build/./lib --arch x86_64 --build-dir /Users/buildslave/jenkins/workspace/lldb-cmake/lldb-build/lldb-test-build.noindex --lldb-module-cache-dir /Users/buildslave/jenkins/workspace/lldb-cmake/lldb-build/lldb-test-build.noindex/module-cache-lldb/lldb-api --clang-module-cache-dir /Users/buildslave/jenkins/workspace/lldb-cmake/lldb-build/lldb-test-build.noindex/module-cache-clang/lldb-api --executable /Users/buildslave/jenkins/workspace/lldb-cmake/lldb-build/./bin/lldb --compiler /Users/buildslave/jenkins/workspace/lldb-cmake/lldb-build/./bin/clang --dsymutil /Users/buildslave/jenkins/workspace/lldb-cmake/lldb-build/./bin/dsymutil --filecheck /Users/buildslave/jenkins/workspace/lldb-cmake/lldb-build/./bin/FileCheck --yaml2obj /Users/buildslave/jenkins/workspace/lldb-cmake/lldb-build/./bin/yaml2obj --server /Users/buildslave/jenkins/workspace/lldb-cmake/lldb-build/./bin/debugserver --lldb-libs-dir /Users/buildslave/jenkins/workspace/lldb-cmake/lldb-build/./lib /Users/buildslave/jenkins/workspace/lldb-cmake/llvm-project/lldb/test/API/functionalities/gdb_remote_client -p TestAArch64XMLRegOffsets.py -- Exit Code: 2

Hide Details

Command Output (stderr): -- usage: dotest.py [-h] [-A arch] [-C compiler] [--apple-sdk apple_sdk] [-E extra-flags] [--dsymutil dsymutil] [--yaml2obj yaml2obj] [--filecheck filecheck] [-f filterspec] [-p pattern] [--excluded exclusion-file] [-G category] [--skip-category category] [--xfail-category category] [--framework framework-path] [--executable executable-path] [--server server-path] [--out-of-tree-debugserver] [--dwarf-version dwarf_version] [--setting SETTING=VALUE] [-y count] [-# sharp] [--channel channel] [--log-success] [--codesign-identity Codesigning identity] [--build-dir Test build directory] [--lldb-module-cache-dir The clang module cache directory used by LLDB] [--clang-module-cache-dir The clang module cache directory used by Clang] [--lldb-libs-dir path] [--enable-plugin A plugin whose tests will be enabled] [--platform-name platform-name] [--platform-url platform-url] [--platform-working-dir platform-working-dir] [--capture-path reproducer path] [--replay-path reproducer path] [-d] [-t] [-u variable] [--env variable] [--inferior-env variable] [-v] [--enable-crash-dialog] [test-dir [test-dir ...]] dotest.py: error: unrecognized arguments: -s=/Users/buildslave/jenkins/workspace/lldb-cmake/test/logs

Hide Details

--

Hide Details

******************** PASS: lldb-unit :: Instruction/./EmulatorTests/TestAArch64Emulator.TestOverflow (2202 of 2240) PASS: lldb-shell :: ObjectFile/PECOFF/section-types.yaml (2203 of 2240) PASS: lldb-unit :: Utility/./UtilityTests/StringExtractorTest.GetHexU8_Underflow2 (2204 of 2240) FAIL: lldb-api :: functionalities/thread/thread_specific_break/TestThreadSpecificBreakpoint.py (2205 of 2240) ******************** TEST 'lldb-api :: functionalities/thread/thread_specific_break/TestThreadSpecificBreakpoint.py' FAILED ******************** Script: -- /usr/local/Frameworks/Python.framework/Versions/3.7/bin/python3.7 /Users/buildslave/jenkins/workspace/lldb-cmake/llvm-project/lldb/test/API/dotest.py -u CXXFLAGS -u CFLAGS --codesign-identity - --arch x86_64 --build-dir /Users/buildslave/jenkins/workspace/lldb-cmake/lldb-build/lldb-test-build.noindex -s=/Users/buildslave/jenkins/workspace/lldb-cmake/test/logs -t --env TERM=vt100 --env LLVM_LIBS_DIR=/Users/buildslave/jenkins/workspace/lldb-cmake/lldb-build/./lib --arch x86_64 --build-dir /Users/buildslave/jenkins/workspace/lldb-cmake/lldb-build/lldb-test-build.noindex --lldb-module-cache-dir /Users/buildslave/jenkins/workspace/lldb-cmake/lldb-build/lldb-test-build.noindex/module-cache-lldb/lldb-api --clang-module-cache-dir /Users/buildslave/jenkins/workspace/lldb-cmake/lldb-build/lldb-test-build.noindex/module-cache-clang/lldb-api --executable /Users/buildslave/jenkins/workspace/lldb-cmake/lldb-build/./bin/lldb --compiler /Users/buildslave/jenkins/workspace/lldb-cmake/lldb-build/./bin/clang --dsymutil /Users/buildslave/jenkins/workspace/lldb-cmake/lldb-build/./bin/dsymutil --filecheck /Users/buildslave/jenkins/workspace/lldb-cmake/lldb-build/./bin/FileCheck --yaml2obj /Users/buildslave/jenkins/workspace/lldb-cmake/lldb-build/./bin/yaml2obj --server /Users/buildslave/jenkins/workspace/lldb-cmake/lldb-build/./bin/debugserver --lldb-libs-dir /Users/buildslave/jenkins/workspace/lldb-cmake/lldb-build/./lib /Users/buildslave/jenkins/workspace/lldb-cmake/llvm-project/lldb/test/API/functionalities/thread/thread_specific_break -p TestThreadSpecificBreakpoint.py -- Exit Code: 2

Hide Details

Command Output (stderr): -- usage: dotest.py [-h] [-A arch] [-C compiler] [--apple-sdk apple_sdk] [-E extra-flags] [--dsymutil dsymutil] [--yaml2obj yaml2obj] [--filecheck filecheck] [-f filterspec] [-p pattern] [--excluded exclusion-file] [-G category] [--skip-category category] [--xfail-category category] [--framework framework-path] [--executable executable-path] [--server server-path] [--out-of-tree-debugserver] [--dwarf-version dwarf_version] [--setting SETTING=VALUE] [-y count] [-# sharp] [--channel channel] [--log-success] [--codesign-identity Codesigning identity] [--build-dir Test build directory] [--lldb-module-cache-dir The clang module cache directory used by LLDB] [--clang-module-cache-dir The clang module cache directory used by Clang] [--lldb-libs-dir path] [--enable-plugin A plugin whose tests will be enabled] [--platform-name platform-name] [--platform-url platform-url] [--platform-working-dir platform-working-dir] [--capture-path reproducer path] [--replay-path reproducer path] [-d] [-t] [-u variable] [--env variable] [--inferior-env variable] [-v] [--enable-crash-dialog] [test-dir [test-dir ...]] dotest.py: error: unrecognized arguments: -s=/Users/buildslave/jenkins/workspace/lldb-cmake/test/logs

Hide Details

--

Hide Details

******************** PASS: lldb-unit :: Symbol/./SymbolTests/TestClangASTImporter.CanImportInvalidType (2206 of 2240) FAIL: lldb-api :: types/TestDoubleTypes.py (2207 of 2240) ******************** TEST 'lldb-api :: types/TestDoubleTypes.py' FAILED ******************** Script: -- /usr/local/Frameworks/Python.framework/Versions/3.7/bin/python3.7 /Users/buildslave/jenkins/workspace/lldb-cmake/llvm-project/lldb/test/API/dotest.py -u CXXFLAGS -u CFLAGS --codesign-identity - --arch x86_64 --build-dir /Users/buildslave/jenkins/workspace/lldb-cmake/lldb-build/lldb-test-build.noindex -s=/Users/buildslave/jenkins/workspace/lldb-cmake/test/logs -t --env TERM=vt100 --env LLVM_LIBS_DIR=/Users/buildslave/jenkins/workspace/lldb-cmake/lldb-build/./lib --arch x86_64 --build-dir /Users/buildslave/jenkins/workspace/lldb-cmake/lldb-build/lldb-test-build.noindex --lldb-module-cache-dir /Users/buildslave/jenkins/workspace/lldb-cmake/lldb-build/lldb-test-build.noindex/module-cache-lldb/lldb-api --clang-module-cache-dir /Users/buildslave/jenkins/workspace/lldb-cmake/lldb-build/lldb-test-build.noindex/module-cache-clang/lldb-api --executable /Users/buildslave/jenkins/workspace/lldb-cmake/lldb-build/./bin/lldb --compiler /Users/buildslave/jenkins/workspace/lldb-cmake/lldb-build/./bin/clang --dsymutil /Users/buildslave/jenkins/workspace/lldb-cmake/lldb-build/./bin/dsymutil --filecheck /Users/buildslave/jenkins/workspace/lldb-cmake/lldb-build/./bin/FileCheck --yaml2obj /Users/buildslave/jenkins/workspace/lldb-cmake/lldb-build/./bin/yaml2obj --server /Users/buildslave/jenkins/workspace/lldb-cmake/lldb-build/./bin/debugserver --lldb-libs-dir /Users/buildslave/jenkins/workspace/lldb-cmake/lldb-build/./lib /Users/buildslave/jenkins/workspace/lldb-cmake/llvm-project/lldb/test/API/types -p TestDoubleTypes.py -- Exit Code: 2

Hide Details

Command Output (stderr): -- usage: dotest.py [-h] [-A arch] [-C compiler] [--apple-sdk apple_sdk] [-E extra-flags] [--dsymutil dsymutil] [--yaml2obj yaml2obj] [--filecheck filecheck] [-f filterspec] [-p pattern] [--excluded exclusion-file] [-G category] [--skip-category category] [--xfail-category category] [--framework framework-path] [--executable executable-path] [--server server-path] [--out-of-tree-debugserver] [--dwarf-version dwarf_version] [--setting SETTING=VALUE] [-y count] [-# sharp] [--channel channel] [--log-success] [--codesign-identity Codesigning identity] [--build-dir Test build directory] [--lldb-module-cache-dir The clang module cache directory used by LLDB] [--clang-module-cache-dir The clang module cache directory used by Clang] [--lldb-libs-dir path] [--enable-plugin A plugin whose tests will be enabled] [--platform-name platform-name] [--platform-url platform-url] [--platform-working-dir platform-working-dir] [--capture-path reproducer path] [--replay-path reproducer path] [-d] [-t] [-u variable] [--env variable] [--inferior-env variable] [-v] [--enable-crash-dialog] [test-dir [test-dir ...]] dotest.py: error: unrecognized arguments: -s=/Users/buildslave/jenkins/workspace/lldb-cmake/test/logs

Hide Details

--

Hide Details

******************** PASS: lldb-shell :: ObjectFile/MachO/lc_build_version_notools.yaml (2208 of 2240) PASS: lldb-unit :: Utility/./UtilityTests/UriParserTest.LongPath (2209 of 2240) FAIL: lldb-api :: functionalities/breakpoint/breakpoint_hit_count/TestBreakpointHitCount.py (2210 of 2240) ******************** TEST 'lldb-api :: functionalities/breakpoint/breakpoint_hit_count/TestBreakpointHitCount.py' FAILED ******************** Script: -- /usr/local/Frameworks/Python.framework/Versions/3.7/bin/python3.7 /Users/buildslave/jenkins/workspace/lldb-cmake/llvm-project/lldb/test/API/dotest.py -u CXXFLAGS -u CFLAGS --codesign-identity - --arch x86_64 --build-dir /Users/buildslave/jenkins/workspace/lldb-cmake/lldb-build/lldb-test-build.noindex -s=/Users/buildslave/jenkins/workspace/lldb-cmake/test/logs -t --env TERM=vt100 --env LLVM_LIBS_DIR=/Users/buildslave/jenkins/workspace/lldb-cmake/lldb-build/./lib --arch x86_64 --build-dir /Users/buildslave/jenkins/workspace/lldb-cmake/lldb-build/lldb-test-build.noindex --lldb-module-cache-dir /Users/buildslave/jenkins/workspace/lldb-cmake/lldb-build/lldb-test-build.noindex/module-cache-lldb/lldb-api --clang-module-cache-dir /Users/buildslave/jenkins/workspace/lldb-cmake/lldb-build/lldb-test-build.noindex/module-cache-clang/lldb-api --executable /Users/buildslave/jenkins/workspace/lldb-cmake/lldb-build/./bin/lldb --compiler /Users/buildslave/jenkins/workspace/lldb-cmake/lldb-build/./bin/clang --dsymutil /Users/buildslave/jenkins/workspace/lldb-cmake/lldb-build/./bin/dsymutil --filecheck /Users/buildslave/jenkins/workspace/lldb-cmake/lldb-build/./bin/FileCheck --yaml2obj /Users/buildslave/jenkins/workspace/lldb-cmake/lldb-build/./bin/yaml2obj --server /Users/buildslave/jenkins/workspace/lldb-cmake/lldb-build/./bin/debugserver --lldb-libs-dir /Users/buildslave/jenkins/workspace/lldb-cmake/lldb-build/./lib /Users/buildslave/jenkins/workspace/lldb-cmake/llvm-project/lldb/test/API/functionalities/breakpoint/breakpoint_hit_count -p TestBreakpointHitCount.py -- Exit Code: 2

Hide Details

Command Output (stderr): -- usage: dotest.py [-h] [-A arch] [-C compiler] [--apple-sdk apple_sdk] [-E extra-flags] [--dsymutil dsymutil] [--yaml2obj yaml2obj] [--filecheck filecheck] [-f filterspec] [-p pattern] [--excluded exclusion-file] [-G category] [--skip-category category] [--xfail-category category] [--framework framework-path] [--executable executable-path] [--server server-path] [--out-of-tree-debugserver] [--dwarf-version dwarf_version] [--setting SETTING=VALUE] [-y count] [-# sharp] [--channel channel] [--log-success] [--codesign-identity Codesigning identity] [--build-dir Test build directory] [--lldb-module-cache-dir The clang module cache directory used by LLDB] [--clang-module-cache-dir The clang module cache directory used by Clang] [--lldb-libs-dir path] [--enable-plugin A plugin whose tests will be enabled] [--platform-name platform-name] [--platform-url platform-url] [--platform-working-dir platform-working-dir] [--capture-path reproducer path] [--replay-path reproducer path] [-d] [-t] [-u variable] [--env variable] [--inferior-env variable] [-v] [--enable-crash-dialog] [test-dir [test-dir ...]] dotest.py: error: unrecognized arguments: -s=/Users/buildslave/jenkins/workspace/lldb-cmake/test/logs

Hide Details

--

Hide Details

******************** PASS: lldb-unit :: Utility/./UtilityTests/ScalarTest.GetBytes (2211 of 2240) FAIL: lldb-api :: macosx/find-dsym/bundle-with-dot-in-filename/TestBundleWithDotInFilename.py (2212 of 2240) ******************** TEST 'lldb-api :: macosx/find-dsym/bundle-with-dot-in-filename/TestBundleWithDotInFilename.py' FAILED ******************** Script: -- /usr/local/Frameworks/Python.framework/Versions/3.7/bin/python3.7 /Users/buildslave/jenkins/workspace/lldb-cmake/llvm-project/lldb/test/API/dotest.py -u CXXFLAGS -u CFLAGS --codesign-identity - --arch x86_64 --build-dir /Users/buildslave/jenkins/workspace/lldb-cmake/lldb-build/lldb-test-build.noindex -s=/Users/buildslave/jenkins/workspace/lldb-cmake/test/logs -t --env TERM=vt100 --env LLVM_LIBS_DIR=/Users/buildslave/jenkins/workspace/lldb-cmake/lldb-build/./lib --arch x86_64 --build-dir /Users/buildslave/jenkins/workspace/lldb-cmake/lldb-build/lldb-test-build.noindex --lldb-module-cache-dir /Users/buildslave/jenkins/workspace/lldb-cmake/lldb-build/lldb-test-build.noindex/module-cache-lldb/lldb-api --clang-module-cache-dir /Users/buildslave/jenkins/workspace/lldb-cmake/lldb-build/lldb-test-build.noindex/module-cache-clang/lldb-api --executable /Users/buildslave/jenkins/workspace/lldb-cmake/lldb-build/./bin/lldb --compiler /Users/buildslave/jenkins/workspace/lldb-cmake/lldb-build/./bin/clang --dsymutil /Users/buildslave/jenkins/workspace/lldb-cmake/lldb-build/./bin/dsymutil --filecheck /Users/buildslave/jenkins/workspace/lldb-cmake/lldb-build/./bin/FileCheck --yaml2obj /Users/buildslave/jenkins/workspace/lldb-cmake/lldb-build/./bin/yaml2obj --server /Users/buildslave/jenkins/workspace/lldb-cmake/lldb-build/./bin/debugserver --lldb-libs-dir /Users/buildslave/jenkins/workspace/lldb-cmake/lldb-build/./lib /Users/buildslave/jenkins/workspace/lldb-cmake/llvm-project/lldb/test/API/macosx/find-dsym/bundle-with-dot-in-filename -p TestBundleWithDotInFilename.py -- Exit Code: 2

Hide Details

Command Output (stderr): -- usage: dotest.py [-h] [-A arch] [-C compiler] [--apple-sdk apple_sdk] [-E extra-flags] [--dsymutil dsymutil] [--yaml2obj yaml2obj] [--filecheck filecheck] [-f filterspec] [-p pattern] [--excluded exclusion-file] [-G category] [--skip-category category] [--xfail-category category] [--framework framework-path] [--executable executable-path] [--server server-path] [--out-of-tree-debugserver] [--dwarf-version dwarf_version] [--setting SETTING=VALUE] [-y count] [-# sharp] [--channel channel] [--log-success] [--codesign-identity Codesigning identity] [--build-dir Test build directory] [--lldb-module-cache-dir The clang module cache directory used by LLDB] [--clang-module-cache-dir The clang module cache directory used by Clang] [--lldb-libs-dir path] [--enable-plugin A plugin whose tests will be enabled] [--platform-name platform-name] [--platform-url platform-url] [--platform-working-dir platform-working-dir] [--capture-path reproducer path] [--replay-path reproducer path] [-d] [-t] [-u variable] [--env variable] [--inferior-env variable] [-v] [--enable-crash-dialog] [test-dir [test-dir ...]] dotest.py: error: unrecognized arguments: -s=/Users/buildslave/jenkins/workspace/lldb-cmake/test/logs

Hide Details

--

Hide Details

******************** PASS: lldb-shell :: SymbolFile/symbol-binding.test (2213 of 2240) PASS: lldb-unit :: UnwindAssembly/x86/./UnwindAssemblyx86Tests/Testx86AssemblyInspectionEngine.TestPopR15 (2214 of 2240) PASS: lldb-unit :: Symbol/./SymbolTests/TestTypeSystemClang.TestRecordHasFields (2215 of 2240) PASS: lldb-unit :: Utility/./UtilityTests/StreamTeeTest.CopyConstructor (2216 of 2240) FAIL: lldb-api :: lang/objc/global_ptrs/TestGlobalObjects.py (2217 of 2240) ******************** TEST 'lldb-api :: lang/objc/global_ptrs/TestGlobalObjects.py' FAILED ******************** Script: -- /usr/local/Frameworks/Python.framework/Versions/3.7/bin/python3.7 /Users/buildslave/jenkins/workspace/lldb-cmake/llvm-project/lldb/test/API/dotest.py -u CXXFLAGS -u CFLAGS --codesign-identity - --arch x86_64 --build-dir /Users/buildslave/jenkins/workspace/lldb-cmake/lldb-build/lldb-test-build.noindex -s=/Users/buildslave/jenkins/workspace/lldb-cmake/test/logs -t --env TERM=vt100 --env LLVM_LIBS_DIR=/Users/buildslave/jenkins/workspace/lldb-cmake/lldb-build/./lib --arch x86_64 --build-dir /Users/buildslave/jenkins/workspace/lldb-cmake/lldb-build/lldb-test-build.noindex --lldb-module-cache-dir /Users/buildslave/jenkins/workspace/lldb-cmake/lldb-build/lldb-test-build.noindex/module-cache-lldb/lldb-api --clang-module-cache-dir /Users/buildslave/jenkins/workspace/lldb-cmake/lldb-build/lldb-test-build.noindex/module-cache-clang/lldb-api --executable /Users/buildslave/jenkins/workspace/lldb-cmake/lldb-build/./bin/lldb --compiler /Users/buildslave/jenkins/workspace/lldb-cmake/lldb-build/./bin/clang --dsymutil /Users/buildslave/jenkins/workspace/lldb-cmake/lldb-build/./bin/dsymutil --filecheck /Users/buildslave/jenkins/workspace/lldb-cmake/lldb-build/./bin/FileCheck --yaml2obj /Users/buildslave/jenkins/workspace/lldb-cmake/lldb-build/./bin/yaml2obj --server /Users/buildslave/jenkins/workspace/lldb-cmake/lldb-build/./bin/debugserver --lldb-libs-dir /Users/buildslave/jenkins/workspace/lldb-cmake/lldb-build/./lib /Users/buildslave/jenkins/workspace/lldb-cmake/llvm-project/lldb/test/API/lang/objc/global_ptrs -p TestGlobalObjects.py -- Exit Code: 2

Hide Details

Command Output (stderr): -- usage: dotest.py [-h] [-A arch] [-C compiler] [--apple-sdk apple_sdk] [-E extra-flags] [--dsymutil dsymutil] [--yaml2obj yaml2obj] [--filecheck filecheck] [-f filterspec] [-p pattern] [--excluded exclusion-file] [-G category] [--skip-category category] [--xfail-category category] [--framework framework-path] [--executable executable-path] [--server server-path] [--out-of-tree-debugserver] [--dwarf-version dwarf_version] [--setting SETTING=VALUE] [-y count] [-# sharp] [--channel channel] [--log-success] [--codesign-identity Codesigning identity] [--build-dir Test build directory] [--lldb-module-cache-dir The clang module cache directory used by LLDB] [--clang-module-cache-dir The clang module cache directory used by Clang] [--lldb-libs-dir path] [--enable-plugin A plugin whose tests will be enabled] [--platform-name platform-name] [--platform-url platform-url] [--platform-working-dir platform-working-dir] [--capture-path reproducer path] [--replay-path reproducer path] [-d] [-t] [-u variable] [--env variable] [--inferior-env variable] [-v] [--enable-crash-dialog] [test-dir [test-dir ...]] dotest.py: error: unrecognized arguments: -s=/Users/buildslave/jenkins/workspace/lldb-cmake/test/logs

Hide Details

--

Hide Details

******************** FAIL: lldb-api :: python_api/sbenvironment/TestSBEnvironment.py (2218 of 2240) ******************** TEST 'lldb-api :: python_api/sbenvironment/TestSBEnvironment.py' FAILED ******************** Script: -- /usr/local/Frameworks/Python.framework/Versions/3.7/bin/python3.7 /Users/buildslave/jenkins/workspace/lldb-cmake/llvm-project/lldb/test/API/dotest.py -u CXXFLAGS -u CFLAGS --codesign-identity - --arch x86_64 --build-dir /Users/buildslave/jenkins/workspace/lldb-cmake/lldb-build/lldb-test-build.noindex -s=/Users/buildslave/jenkins/workspace/lldb-cmake/test/logs -t --env TERM=vt100 --env LLVM_LIBS_DIR=/Users/buildslave/jenkins/workspace/lldb-cmake/lldb-build/./lib --arch x86_64 --build-dir /Users/buildslave/jenkins/workspace/lldb-cmake/lldb-build/lldb-test-build.noindex --lldb-module-cache-dir /Users/buildslave/jenkins/workspace/lldb-cmake/lldb-build/lldb-test-build.noindex/module-cache-lldb/lldb-api --clang-module-cache-dir /Users/buildslave/jenkins/workspace/lldb-cmake/lldb-build/lldb-test-build.noindex/module-cache-clang/lldb-api --executable /Users/buildslave/jenkins/workspace/lldb-cmake/lldb-build/./bin/lldb --compiler /Users/buildslave/jenkins/workspace/lldb-cmake/lldb-build/./bin/clang --dsymutil /Users/buildslave/jenkins/workspace/lldb-cmake/lldb-build/./bin/dsymutil --filecheck /Users/buildslave/jenkins/workspace/lldb-cmake/lldb-build/./bin/FileCheck --yaml2obj /Users/buildslave/jenkins/workspace/lldb-cmake/lldb-build/./bin/yaml2obj --server /Users/buildslave/jenkins/workspace/lldb-cmake/lldb-build/./bin/debugserver --lldb-libs-dir /Users/buildslave/jenkins/workspace/lldb-cmake/lldb-build/./lib /Users/buildslave/jenkins/workspace/lldb-cmake/llvm-project/lldb/test/API/python_api/sbenvironment -p TestSBEnvironment.py -- Exit Code: 2

Hide Details

Command Output (stderr): -- usage: dotest.py [-h] [-A arch] [-C compiler] [--apple-sdk apple_sdk] [-E extra-flags] [--dsymutil dsymutil] [--yaml2obj yaml2obj] [--filecheck filecheck] [-f filterspec] [-p pattern] [--excluded exclusion-file] [-G category] [--skip-category category] [--xfail-category category] [--framework framework-path] [--executable executable-path] [--server server-path] [--out-of-tree-debugserver] [--dwarf-version dwarf_version] [--setting SETTING=VALUE] [-y count] [-# sharp] [--channel channel] [--log-success] [--codesign-identity Codesigning identity] [--build-dir Test build directory] [--lldb-module-cache-dir The clang module cache directory used by LLDB] [--clang-module-cache-dir The clang module cache directory used by Clang] [--lldb-libs-dir path] [--enable-plugin A plugin whose tests will be enabled] [--platform-name platform-name] [--platform-url platform-url] [--platform-working-dir platform-working-dir] [--capture-path reproducer path] [--replay-path reproducer path] [-d] [-t] [-u variable] [--env variable] [--inferior-env variable] [-v] [--enable-crash-dialog] [test-dir [test-dir ...]] dotest.py: error: unrecognized arguments: -s=/Users/buildslave/jenkins/workspace/lldb-cmake/test/logs

Hide Details

--

Hide Details

******************** PASS: lldb-unit :: Utility/./UtilityTests/StringExtractorTest.GetNameColonValueSuccess (2219 of 2240) FAIL: lldb-api :: lang/c/bitfields/TestBitfields.py (2220 of 2240) ******************** TEST 'lldb-api :: lang/c/bitfields/TestBitfields.py' FAILED ******************** Script: -- /usr/local/Frameworks/Python.framework/Versions/3.7/bin/python3.7 /Users/buildslave/jenkins/workspace/lldb-cmake/llvm-project/lldb/test/API/dotest.py -u CXXFLAGS -u CFLAGS --codesign-identity - --arch x86_64 --build-dir /Users/buildslave/jenkins/workspace/lldb-cmake/lldb-build/lldb-test-build.noindex -s=/Users/buildslave/jenkins/workspace/lldb-cmake/test/logs -t --env TERM=vt100 --env LLVM_LIBS_DIR=/Users/buildslave/jenkins/workspace/lldb-cmake/lldb-build/./lib --arch x86_64 --build-dir /Users/buildslave/jenkins/workspace/lldb-cmake/lldb-build/lldb-test-build.noindex --lldb-module-cache-dir /Users/buildslave/jenkins/workspace/lldb-cmake/lldb-build/lldb-test-build.noindex/module-cache-lldb/lldb-api --clang-module-cache-dir /Users/buildslave/jenkins/workspace/lldb-cmake/lldb-build/lldb-test-build.noindex/module-cache-clang/lldb-api --executable /Users/buildslave/jenkins/workspace/lldb-cmake/lldb-build/./bin/lldb --compiler /Users/buildslave/jenkins/workspace/lldb-cmake/lldb-build/./bin/clang --dsymutil /Users/buildslave/jenkins/workspace/lldb-cmake/lldb-build/./bin/dsymutil --filecheck /Users/buildslave/jenkins/workspace/lldb-cmake/lldb-build/./bin/FileCheck --yaml2obj /Users/buildslave/jenkins/workspace/lldb-cmake/lldb-build/./bin/yaml2obj --server /Users/buildslave/jenkins/workspace/lldb-cmake/lldb-build/./bin/debugserver --lldb-libs-dir /Users/buildslave/jenkins/workspace/lldb-cmake/lldb-build/./lib /Users/buildslave/jenkins/workspace/lldb-cmake/llvm-project/lldb/test/API/lang/c/bitfields -p TestBitfields.py -- Exit Code: 2

Hide Details

Command Output (stderr): -- usage: dotest.py [-h] [-A arch] [-C compiler] [--apple-sdk apple_sdk] [-E extra-flags] [--dsymutil dsymutil] [--yaml2obj yaml2obj] [--filecheck filecheck] [-f filterspec] [-p pattern] [--excluded exclusion-file] [-G category] [--skip-category category] [--xfail-category category] [--framework framework-path] [--executable executable-path] [--server server-path] [--out-of-tree-debugserver] [--dwarf-version dwarf_version] [--setting SETTING=VALUE] [-y count] [-# sharp] [--channel channel] [--log-success] [--codesign-identity Codesigning identity] [--build-dir Test build directory] [--lldb-module-cache-dir The clang module cache directory used by LLDB] [--clang-module-cache-dir The clang module cache directory used by Clang] [--lldb-libs-dir path] [--enable-plugin A plugin whose tests will be enabled] [--platform-name platform-name] [--platform-url platform-url] [--platform-working-dir platform-working-dir] [--capture-path reproducer path] [--replay-path reproducer path] [-d] [-t] [-u variable] [--env variable] [--inferior-env variable] [-v] [--enable-crash-dialog] [test-dir [test-dir ...]] dotest.py: error: unrecognized arguments: -s=/Users/buildslave/jenkins/workspace/lldb-cmake/test/logs

Hide Details

--

Hide Details

******************** PASS: lldb-unit :: ObjectFile/PECOFF/./ObjectFilePECOFFTests/PECallFrameInfoTest.Frame_reg_eh (2221 of 2240) PASS: lldb-unit :: Utility/./UtilityTests/StringExtractorTest.GetNameColonValueNoColon (2222 of 2240) FAIL: lldb-api :: functionalities/breakpoint/auto_continue/TestBreakpointAutoContinue.py (2223 of 2240) ******************** TEST 'lldb-api :: functionalities/breakpoint/auto_continue/TestBreakpointAutoContinue.py' FAILED ******************** Script: -- /usr/local/Frameworks/Python.framework/Versions/3.7/bin/python3.7 /Users/buildslave/jenkins/workspace/lldb-cmake/llvm-project/lldb/test/API/dotest.py -u CXXFLAGS -u CFLAGS --codesign-identity - --arch x86_64 --build-dir /Users/buildslave/jenkins/workspace/lldb-cmake/lldb-build/lldb-test-build.noindex -s=/Users/buildslave/jenkins/workspace/lldb-cmake/test/logs -t --env TERM=vt100 --env LLVM_LIBS_DIR=/Users/buildslave/jenkins/workspace/lldb-cmake/lldb-build/./lib --arch x86_64 --build-dir /Users/buildslave/jenkins/workspace/lldb-cmake/lldb-build/lldb-test-build.noindex --lldb-module-cache-dir /Users/buildslave/jenkins/workspace/lldb-cmake/lldb-build/lldb-test-build.noindex/module-cache-lldb/lldb-api --clang-module-cache-dir /Users/buildslave/jenkins/workspace/lldb-cmake/lldb-build/lldb-test-build.noindex/module-cache-clang/lldb-api --executable /Users/buildslave/jenkins/workspace/lldb-cmake/lldb-build/./bin/lldb --compiler /Users/buildslave/jenkins/workspace/lldb-cmake/lldb-build/./bin/clang --dsymutil /Users/buildslave/jenkins/workspace/lldb-cmake/lldb-build/./bin/dsymutil --filecheck /Users/buildslave/jenkins/workspace/lldb-cmake/lldb-build/./bin/FileCheck --yaml2obj /Users/buildslave/jenkins/workspace/lldb-cmake/lldb-build/./bin/yaml2obj --server /Users/buildslave/jenkins/workspace/lldb-cmake/lldb-build/./bin/debugserver --lldb-libs-dir /Users/buildslave/jenkins/workspace/lldb-cmake/lldb-build/./lib /Users/buildslave/jenkins/workspace/lldb-cmake/llvm-project/lldb/test/API/functionalities/breakpoint/auto_continue -p TestBreakpointAutoContinue.py -- Exit Code: 2

Hide Details

Command Output (stderr): -- usage: dotest.py [-h] [-A arch] [-C compiler] [--apple-sdk apple_sdk] [-E extra-flags] [--dsymutil dsymutil] [--yaml2obj yaml2obj] [--filecheck filecheck] [-f filterspec] [-p pattern] [--excluded exclusion-file] [-G category] [--skip-category category] [--xfail-category category] [--framework framework-path] [--executable executable-path] [--server server-path] [--out-of-tree-debugserver] [--dwarf-version dwarf_version] [--setting SETTING=VALUE] [-y count] [-# sharp] [--channel channel] [--log-success] [--codesign-identity Codesigning identity] [--build-dir Test build directory] [--lldb-module-cache-dir The clang module cache directory used by LLDB] [--clang-module-cache-dir The clang module cache directory used by Clang] [--lldb-libs-dir path] [--enable-plugin A plugin whose tests will be enabled] [--platform-name platform-name] [--platform-url platform-url] [--platform-working-dir platform-working-dir] [--capture-path reproducer path] [--replay-path reproducer path] [-d] [-t] [-u variable] [--env variable] [--inferior-env variable] [-v] [--enable-crash-dialog] [test-dir [test-dir ...]] dotest.py: error: unrecognized arguments: -s=/Users/buildslave/jenkins/workspace/lldb-cmake/test/logs

Hide Details

--

Hide Details

******************** PASS: lldb-unit :: Utility/./UtilityTests/DataExtractorTest.GetMaxU64 (2224 of 2240) PASS: lldb-unit :: Utility/./UtilityTests/RecordReplayTest.InstrumentedFoo (2225 of 2240) FAIL: lldb-api :: linux/thread/create_during_instruction_step/TestCreateDuringInstructionStep.py (2226 of 2240) ******************** TEST 'lldb-api :: linux/thread/create_during_instruction_step/TestCreateDuringInstructionStep.py' FAILED ******************** Script: -- /usr/local/Frameworks/Python.framework/Versions/3.7/bin/python3.7 /Users/buildslave/jenkins/workspace/lldb-cmake/llvm-project/lldb/test/API/dotest.py -u CXXFLAGS -u CFLAGS --codesign-identity - --arch x86_64 --build-dir /Users/buildslave/jenkins/workspace/lldb-cmake/lldb-build/lldb-test-build.noindex -s=/Users/buildslave/jenkins/workspace/lldb-cmake/test/logs -t --env TERM=vt100 --env LLVM_LIBS_DIR=/Users/buildslave/jenkins/workspace/lldb-cmake/lldb-build/./lib --arch x86_64 --build-dir /Users/buildslave/jenkins/workspace/lldb-cmake/lldb-build/lldb-test-build.noindex --lldb-module-cache-dir /Users/buildslave/jenkins/workspace/lldb-cmake/lldb-build/lldb-test-build.noindex/module-cache-lldb/lldb-api --clang-module-cache-dir /Users/buildslave/jenkins/workspace/lldb-cmake/lldb-build/lldb-test-build.noindex/module-cache-clang/lldb-api --executable /Users/buildslave/jenkins/workspace/lldb-cmake/lldb-build/./bin/lldb --compiler /Users/buildslave/jenkins/workspace/lldb-cmake/lldb-build/./bin/clang --dsymutil /Users/buildslave/jenkins/workspace/lldb-cmake/lldb-build/./bin/dsymutil --filecheck /Users/buildslave/jenkins/workspace/lldb-cmake/lldb-build/./bin/FileCheck --yaml2obj /Users/buildslave/jenkins/workspace/lldb-cmake/lldb-build/./bin/yaml2obj --server /Users/buildslave/jenkins/workspace/lldb-cmake/lldb-build/./bin/debugserver --lldb-libs-dir /Users/buildslave/jenkins/workspace/lldb-cmake/lldb-build/./lib /Users/buildslave/jenkins/workspace/lldb-cmake/llvm-project/lldb/test/API/linux/thread/create_during_instruction_step -p TestCreateDuringInstructionStep.py -- Exit Code: 2

Hide Details

Command Output (stderr): -- usage: dotest.py [-h] [-A arch] [-C compiler] [--apple-sdk apple_sdk] [-E extra-flags] [--dsymutil dsymutil] [--yaml2obj yaml2obj] [--filecheck filecheck] [-f filterspec] [-p pattern] [--excluded exclusion-file] [-G category] [--skip-category category] [--xfail-category category] [--framework framework-path] [--executable executable-path] [--server server-path] [--out-of-tree-debugserver] [--dwarf-version dwarf_version] [--setting SETTING=VALUE] [-y count] [-# sharp] [--channel channel] [--log-success] [--codesign-identity Codesigning identity] [--build-dir Test build directory] [--lldb-module-cache-dir The clang module cache directory used by LLDB] [--clang-module-cache-dir The clang module cache directory used by Clang] [--lldb-libs-dir path] [--enable-plugin A plugin whose tests will be enabled] [--platform-name platform-name] [--platform-url platform-url] [--platform-working-dir platform-working-dir] [--capture-path reproducer path] [--replay-path reproducer path] [-d] [-t] [-u variable] [--env variable] [--inferior-env variable] [-v] [--enable-crash-dialog] [test-dir [test-dir ...]] dotest.py: error: unrecognized arguments: -s=/Users/buildslave/jenkins/workspace/lldb-cmake/test/logs

Hide Details

--

Hide Details

******************** PASS: lldb-shell :: Commands/command-regex-delete.test (2227 of 2240) PASS: lldb-shell :: SymbolFile/DWARF/debug_ranges-missing-section.s (2228 of 2240) FAIL: lldb-api :: commands/expression/import-std-module/vector/TestVectorFromStdModule.py (2229 of 2240) ******************** TEST 'lldb-api :: commands/expression/import-std-module/vector/TestVectorFromStdModule.py' FAILED ******************** Script: -- /usr/local/Frameworks/Python.framework/Versions/3.7/bin/python3.7 /Users/buildslave/jenkins/workspace/lldb-cmake/llvm-project/lldb/test/API/dotest.py -u CXXFLAGS -u CFLAGS --codesign-identity - --arch x86_64 --build-dir /Users/buildslave/jenkins/workspace/lldb-cmake/lldb-build/lldb-test-build.noindex -s=/Users/buildslave/jenkins/workspace/lldb-cmake/test/logs -t --env TERM=vt100 --env LLVM_LIBS_DIR=/Users/buildslave/jenkins/workspace/lldb-cmake/lldb-build/./lib --arch x86_64 --build-dir /Users/buildslave/jenkins/workspace/lldb-cmake/lldb-build/lldb-test-build.noindex --lldb-module-cache-dir /Users/buildslave/jenkins/workspace/lldb-cmake/lldb-build/lldb-test-build.noindex/module-cache-lldb/lldb-api --clang-module-cache-dir /Users/buildslave/jenkins/workspace/lldb-cmake/lldb-build/lldb-test-build.noindex/module-cache-clang/lldb-api --executable /Users/buildslave/jenkins/workspace/lldb-cmake/lldb-build/./bin/lldb --compiler /Users/buildslave/jenkins/workspace/lldb-cmake/lldb-build/./bin/clang --dsymutil /Users/buildslave/jenkins/workspace/lldb-cmake/lldb-build/./bin/dsymutil --filecheck /Users/buildslave/jenkins/workspace/lldb-cmake/lldb-build/./bin/FileCheck --yaml2obj /Users/buildslave/jenkins/workspace/lldb-cmake/lldb-build/./bin/yaml2obj --server /Users/buildslave/jenkins/workspace/lldb-cmake/lldb-build/./bin/debugserver --lldb-libs-dir /Users/buildslave/jenkins/workspace/lldb-cmake/lldb-build/./lib /Users/buildslave/jenkins/workspace/lldb-cmake/llvm-project/lldb/test/API/commands/expression/import-std-module/vector -p TestVectorFromStdModule.py -- Exit Code: 2

Hide Details

Command Output (stderr): -- usage: dotest.py [-h] [-A arch] [-C compiler] [--apple-sdk apple_sdk] [-E extra-flags] [--dsymutil dsymutil] [--yaml2obj yaml2obj] [--filecheck filecheck] [-f filterspec] [-p pattern] [--excluded exclusion-file] [-G category] [--skip-category category] [--xfail-category category] [--framework framework-path] [--executable executable-path] [--server server-path] [--out-of-tree-debugserver] [--dwarf-version dwarf_version] [--setting SETTING=VALUE] [-y count] [-# sharp] [--channel channel] [--log-success] [--codesign-identity Codesigning identity] [--build-dir Test build directory] [--lldb-module-cache-dir The clang module cache directory used by LLDB] [--clang-module-cache-dir The clang module cache directory used by Clang] [--lldb-libs-dir path] [--enable-plugin A plugin whose tests will be enabled] [--platform-name platform-name] [--platform-url platform-url] [--platform-working-dir platform-working-dir] [--capture-path reproducer path] [--replay-path reproducer path] [-d] [-t] [-u variable] [--env variable] [--inferior-env variable] [-v] [--enable-crash-dialog] [test-dir [test-dir ...]] dotest.py: error: unrecognized arguments: -s=/Users/buildslave/jenkins/workspace/lldb-cmake/test/logs

Hide Details

--

Hide Details

******************** FAIL: lldb-api :: lang/c/record_decl_in_expr/TestRecordDeclInExpr.py (2230 of 2240) ******************** TEST 'lldb-api :: lang/c/record_decl_in_expr/TestRecordDeclInExpr.py' FAILED ******************** Script: -- /usr/local/Frameworks/Python.framework/Versions/3.7/bin/python3.7 /Users/buildslave/jenkins/workspace/lldb-cmake/llvm-project/lldb/test/API/dotest.py -u CXXFLAGS -u CFLAGS --codesign-identity - --arch x86_64 --build-dir /Users/buildslave/jenkins/workspace/lldb-cmake/lldb-build/lldb-test-build.noindex -s=/Users/buildslave/jenkins/workspace/lldb-cmake/test/logs -t --env TERM=vt100 --env LLVM_LIBS_DIR=/Users/buildslave/jenkins/workspace/lldb-cmake/lldb-build/./lib --arch x86_64 --build-dir /Users/buildslave/jenkins/workspace/lldb-cmake/lldb-build/lldb-test-build.noindex --lldb-module-cache-dir /Users/buildslave/jenkins/workspace/lldb-cmake/lldb-build/lldb-test-build.noindex/module-cache-lldb/lldb-api --clang-module-cache-dir /Users/buildslave/jenkins/workspace/lldb-cmake/lldb-build/lldb-test-build.noindex/module-cache-clang/lldb-api --executable /Users/buildslave/jenkins/workspace/lldb-cmake/lldb-build/./bin/lldb --compiler /Users/buildslave/jenkins/workspace/lldb-cmake/lldb-build/./bin/clang --dsymutil /Users/buildslave/jenkins/workspace/lldb-cmake/lldb-build/./bin/dsymutil --filecheck /Users/buildslave/jenkins/workspace/lldb-cmake/lldb-build/./bin/FileCheck --yaml2obj /Users/buildslave/jenkins/workspace/lldb-cmake/lldb-build/./bin/yaml2obj --server /Users/buildslave/jenkins/workspace/lldb-cmake/lldb-build/./bin/debugserver --lldb-libs-dir /Users/buildslave/jenkins/workspace/lldb-cmake/lldb-build/./lib /Users/buildslave/jenkins/workspace/lldb-cmake/llvm-project/lldb/test/API/lang/c/record_decl_in_expr -p TestRecordDeclInExpr.py -- Exit Code: 2

Hide Details

Command Output (stderr): -- usage: dotest.py [-h] [-A arch] [-C compiler] [--apple-sdk apple_sdk] [-E extra-flags] [--dsymutil dsymutil] [--yaml2obj yaml2obj] [--filecheck filecheck] [-f filterspec] [-p pattern] [--excluded exclusion-file] [-G category] [--skip-category category] [--xfail-category category] [--framework framework-path] [--executable executable-path] [--server server-path] [--out-of-tree-debugserver] [--dwarf-version dwarf_version] [--setting SETTING=VALUE] [-y count] [-# sharp] [--channel channel] [--log-success] [--codesign-identity Codesigning identity] [--build-dir Test build directory] [--lldb-module-cache-dir The clang module cache directory used by LLDB] [--clang-module-cache-dir The clang module cache directory used by Clang] [--lldb-libs-dir path] [--enable-plugin A plugin whose tests will be enabled] [--platform-name platform-name] [--platform-url platform-url] [--platform-working-dir platform-working-dir] [--capture-path reproducer path] [--replay-path reproducer path] [-d] [-t] [-u variable] [--env variable] [--inferior-env variable] [-v] [--enable-crash-dialog] [test-dir [test-dir ...]] dotest.py: error: unrecognized arguments: -s=/Users/buildslave/jenkins/workspace/lldb-cmake/test/logs

Hide Details

--

Hide Details

******************** PASS: lldb-unit :: Utility/./UtilityTests/SerializationRountripTest.SerializeDeserializePodReferences (2231 of 2240) PASS: lldb-unit :: Utility/./UtilityTests/ProcessInstanceInfo.Yaml (2232 of 2240) PASS: lldb-unit :: Utility/./UtilityTests/StringExtractorTest.DecodeHexU8_Extra (2233 of 2240) FAIL: lldb-api :: functionalities/tail_call_frames/disambiguate_tail_call_seq/TestDisambiguateTailCallSeq.py (2234 of 2240) ******************** TEST 'lldb-api :: functionalities/tail_call_frames/disambiguate_tail_call_seq/TestDisambiguateTailCallSeq.py' FAILED ******************** Script: -- /usr/local/Frameworks/Python.framework/Versions/3.7/bin/python3.7 /Users/buildslave/jenkins/workspace/lldb-cmake/llvm-project/lldb/test/API/dotest.py -u CXXFLAGS -u CFLAGS --codesign-identity - --arch x86_64 --build-dir /Users/buildslave/jenkins/workspace/lldb-cmake/lldb-build/lldb-test-build.noindex -s=/Users/buildslave/jenkins/workspace/lldb-cmake/test/logs -t --env TERM=vt100 --env LLVM_LIBS_DIR=/Users/buildslave/jenkins/workspace/lldb-cmake/lldb-build/./lib --arch x86_64 --build-dir /Users/buildslave/jenkins/workspace/lldb-cmake/lldb-build/lldb-test-build.noindex --lldb-module-cache-dir /Users/buildslave/jenkins/workspace/lldb-cmake/lldb-build/lldb-test-build.noindex/module-cache-lldb/lldb-api --clang-module-cache-dir /Users/buildslave/jenkins/workspace/lldb-cmake/lldb-build/lldb-test-build.noindex/module-cache-clang/lldb-api --executable /Users/buildslave/jenkins/workspace/lldb-cmake/lldb-build/./bin/lldb --compiler /Users/buildslave/jenkins/workspace/lldb-cmake/lldb-build/./bin/clang --dsymutil /Users/buildslave/jenkins/workspace/lldb-cmake/lldb-build/./bin/dsymutil --filecheck /Users/buildslave/jenkins/workspace/lldb-cmake/lldb-build/./bin/FileCheck --yaml2obj /Users/buildslave/jenkins/workspace/lldb-cmake/lldb-build/./bin/yaml2obj --server /Users/buildslave/jenkins/workspace/lldb-cmake/lldb-build/./bin/debugserver --lldb-libs-dir /Users/buildslave/jenkins/workspace/lldb-cmake/lldb-build/./lib /Users/buildslave/jenkins/workspace/lldb-cmake/llvm-project/lldb/test/API/functionalities/tail_call_frames/disambiguate_tail_call_seq -p TestDisambiguateTailCallSeq.py -- Exit Code: 2

Hide Details

Command Output (stderr): -- usage: dotest.py [-h] [-A arch] [-C compiler] [--apple-sdk apple_sdk] [-E extra-flags] [--dsymutil dsymutil] [--yaml2obj yaml2obj] [--filecheck filecheck] [-f filterspec] [-p pattern] [--excluded exclusion-file] [-G category] [--skip-category category] [--xfail-category category] [--framework framework-path] [--executable executable-path] [--server server-path] [--out-of-tree-debugserver] [--dwarf-version dwarf_version] [--setting SETTING=VALUE] [-y count] [-# sharp] [--channel channel] [--log-success] [--codesign-identity Codesigning identity] [--build-dir Test build directory] [--lldb-module-cache-dir The clang module cache directory used by LLDB] [--clang-module-cache-dir The clang module cache directory used by Clang] [--lldb-libs-dir path] [--enable-plugin A plugin whose tests will be enabled] [--platform-name platform-name] [--platform-url platform-url] [--platform-working-dir platform-working-dir] [--capture-path reproducer path] [--replay-path reproducer path] [-d] [-t] [-u variable] [--env variable] [--inferior-env variable] [-v] [--enable-crash-dialog] [test-dir [test-dir ...]] dotest.py: error: unrecognized arguments: -s=/Users/buildslave/jenkins/workspace/lldb-cmake/test/logs

Hide Details

--

Hide Details

******************** FAIL: lldb-api :: lang/cpp/typeof/TestTypeOfDeclTypeExpr.py (2235 of 2240) ******************** TEST 'lldb-api :: lang/cpp/typeof/TestTypeOfDeclTypeExpr.py' FAILED ******************** Script: -- /usr/local/Frameworks/Python.framework/Versions/3.7/bin/python3.7 /Users/buildslave/jenkins/workspace/lldb-cmake/llvm-project/lldb/test/API/dotest.py -u CXXFLAGS -u CFLAGS --codesign-identity - --arch x86_64 --build-dir /Users/buildslave/jenkins/workspace/lldb-cmake/lldb-build/lldb-test-build.noindex -s=/Users/buildslave/jenkins/workspace/lldb-cmake/test/logs -t --env TERM=vt100 --env LLVM_LIBS_DIR=/Users/buildslave/jenkins/workspace/lldb-cmake/lldb-build/./lib --arch x86_64 --build-dir /Users/buildslave/jenkins/workspace/lldb-cmake/lldb-build/lldb-test-build.noindex --lldb-module-cache-dir /Users/buildslave/jenkins/workspace/lldb-cmake/lldb-build/lldb-test-build.noindex/module-cache-lldb/lldb-api --clang-module-cache-dir /Users/buildslave/jenkins/workspace/lldb-cmake/lldb-build/lldb-test-build.noindex/module-cache-clang/lldb-api --executable /Users/buildslave/jenkins/workspace/lldb-cmake/lldb-build/./bin/lldb --compiler /Users/buildslave/jenkins/workspace/lldb-cmake/lldb-build/./bin/clang --dsymutil /Users/buildslave/jenkins/workspace/lldb-cmake/lldb-build/./bin/dsymutil --filecheck /Users/buildslave/jenkins/workspace/lldb-cmake/lldb-build/./bin/FileCheck --yaml2obj /Users/buildslave/jenkins/workspace/lldb-cmake/lldb-build/./bin/yaml2obj --server /Users/buildslave/jenkins/workspace/lldb-cmake/lldb-build/./bin/debugserver --lldb-libs-dir /Users/buildslave/jenkins/workspace/lldb-cmake/lldb-build/./lib /Users/buildslave/jenkins/workspace/lldb-cmake/llvm-project/lldb/test/API/lang/cpp/typeof -p TestTypeOfDeclTypeExpr.py -- Exit Code: 2

Hide Details

Command Output (stderr): -- usage: dotest.py [-h] [-A arch] [-C compiler] [--apple-sdk apple_sdk] [-E extra-flags] [--dsymutil dsymutil] [--yaml2obj yaml2obj] [--filecheck filecheck] [-f filterspec] [-p pattern] [--excluded exclusion-file] [-G category] [--skip-category category] [--xfail-category category] [--framework framework-path] [--executable executable-path] [--server server-path] [--out-of-tree-debugserver] [--dwarf-version dwarf_version] [--setting SETTING=VALUE] [-y count] [-# sharp] [--channel channel] [--log-success] [--codesign-identity Codesigning identity] [--build-dir Test build directory] [--lldb-module-cache-dir The clang module cache directory used by LLDB] [--clang-module-cache-dir The clang module cache directory used by Clang] [--lldb-libs-dir path] [--enable-plugin A plugin whose tests will be enabled] [--platform-name platform-name] [--platform-url platform-url] [--platform-working-dir platform-working-dir] [--capture-path reproducer path] [--replay-path reproducer path] [-d] [-t] [-u variable] [--env variable] [--inferior-env variable] [-v] [--enable-crash-dialog] [test-dir [test-dir ...]] dotest.py: error: unrecognized arguments: -s=/Users/buildslave/jenkins/workspace/lldb-cmake/test/logs

Hide Details

--

Hide Details

******************** PASS: lldb-unit :: Utility/./UtilityTests/StringExtractorTest.DecodeHexU8_InvalidHex2 (2236 of 2240) PASS: lldb-unit :: UnwindAssembly/x86/./UnwindAssemblyx86Tests/Testx86AssemblyInspectionEngine.TestPushEBP (2237 of 2240) FAIL: lldb-api :: commands/gui/viewlarge/TestGuiViewLarge.py (2238 of 2240) ******************** TEST 'lldb-api :: commands/gui/viewlarge/TestGuiViewLarge.py' FAILED ******************** Script: -- /usr/local/Frameworks/Python.framework/Versions/3.7/bin/python3.7 /Users/buildslave/jenkins/workspace/lldb-cmake/llvm-project/lldb/test/API/dotest.py -u CXXFLAGS -u CFLAGS --codesign-identity - --arch x86_64 --build-dir /Users/buildslave/jenkins/workspace/lldb-cmake/lldb-build/lldb-test-build.noindex -s=/Users/buildslave/jenkins/workspace/lldb-cmake/test/logs -t --env TERM=vt100 --env LLVM_LIBS_DIR=/Users/buildslave/jenkins/workspace/lldb-cmake/lldb-build/./lib --arch x86_64 --build-dir /Users/buildslave/jenkins/workspace/lldb-cmake/lldb-build/lldb-test-build.noindex --lldb-module-cache-dir /Users/buildslave/jenkins/workspace/lldb-cmake/lldb-build/lldb-test-build.noindex/module-cache-lldb/lldb-api --clang-module-cache-dir /Users/buildslave/jenkins/workspace/lldb-cmake/lldb-build/lldb-test-build.noindex/module-cache-clang/lldb-api --executable /Users/buildslave/jenkins/workspace/lldb-cmake/lldb-build/./bin/lldb --compiler /Users/buildslave/jenkins/workspace/lldb-cmake/lldb-build/./bin/clang --dsymutil /Users/buildslave/jenkins/workspace/lldb-cmake/lldb-build/./bin/dsymutil --filecheck /Users/buildslave/jenkins/workspace/lldb-cmake/lldb-build/./bin/FileCheck --yaml2obj /Users/buildslave/jenkins/workspace/lldb-cmake/lldb-build/./bin/yaml2obj --server /Users/buildslave/jenkins/workspace/lldb-cmake/lldb-build/./bin/debugserver --lldb-libs-dir /Users/buildslave/jenkins/workspace/lldb-cmake/lldb-build/./lib /Users/buildslave/jenkins/workspace/lldb-cmake/llvm-project/lldb/test/API/commands/gui/viewlarge -p TestGuiViewLarge.py -- Exit Code: 2

Hide Details

Command Output (stderr): -- usage: dotest.py [-h] [-A arch] [-C compiler] [--apple-sdk apple_sdk] [-E extra-flags] [--dsymutil dsymutil] [--yaml2obj yaml2obj] [--filecheck filecheck] [-f filterspec] [-p pattern] [--excluded exclusion-file] [-G category] [--skip-category category] [--xfail-category category] [--framework framework-path] [--executable executable-path] [--server server-path] [--out-of-tree-debugserver] [--dwarf-version dwarf_version] [--setting SETTING=VALUE] [-y count] [-# sharp] [--channel channel] [--log-success] [--codesign-identity Codesigning identity] [--build-dir Test build directory] [--lldb-module-cache-dir The clang module cache directory used by LLDB] [--clang-module-cache-dir The clang module cache directory used by Clang] [--lldb-libs-dir path] [--enable-plugin A plugin whose tests will be enabled] [--platform-name platform-name] [--platform-url platform-url] [--platform-working-dir platform-working-dir] [--capture-path reproducer path] [--replay-path reproducer path] [-d] [-t] [-u variable] [--env variable] [--inferior-env variable] [-v] [--enable-crash-dialog] [test-dir [test-dir ...]] dotest.py: error: unrecognized arguments: -s=/Users/buildslave/jenkins/workspace/lldb-cmake/test/logs

Hide Details

--

Hide Details

******************** PASS: lldb-unit :: Process/gdb-remote/./ProcessGdbRemoteTests/GDBRemoteClientBaseTest.InterruptNoResponse (2239 of 2240) PASS: lldb-shell :: Reproducer/TestVersionCheck.test (2240 of 2240) Slowest Tests: -------------------------------------------------------------------------- 33.25s: lldb-shell :: SymbolFile/NativePDB/function-types-classes.cpp 27.35s: lldb-shell :: SymbolFile/NativePDB/function-types-builtins.cpp 22.07s: lldb-shell :: SymbolFile/NativePDB/function-types-calling-conv.cpp 13.47s: lldb-shell :: Reproducer/TestVerify.test 13.34s: lldb-shell :: Reproducer/TestGDBRemoteRepro.test 13.15s: lldb-shell :: Reproducer/TestReuseDirectory.test 12.19s: lldb-shell :: Reproducer/TestVersionCheck.test 12.03s: lldb-shell :: Reproducer/TestMultipleTargets.test 10.95s: lldb-shell :: SymbolFile/NativePDB/locate-pdb.cpp 8.37s: lldb-shell :: Reproducer/Functionalities/TestDataFormatter.test 8.20s: lldb-shell :: SymbolFile/NativePDB/nested-types.cpp 8.18s: lldb-shell :: SymbolFile/NativePDB/ast-functions.cpp 7.96s: lldb-shell :: SymbolFile/NativePDB/globals-fundamental.cpp 7.90s: lldb-shell :: SymbolFile/Breakpad/unwind-via-raSearch.test 7.88s: lldb-shell :: Reproducer/Functionalities/TestExpressionEvaluation.test 7.46s: lldb-shell :: SymbolFile/Breakpad/unwind-via-stack-win-no-memory-info.yaml 7.21s: lldb-shell :: Reproducer/TestRelativePath.test 7.21s: lldb-api :: python_api/sbvalue_persist/TestSBValuePersist.py 7.18s: lldb-api :: python_api/watchpoint/TestSetWatchpoint.py 6.94s: lldb-shell :: Reproducer/TestWorkingDir.test

Hide Details

Tests Times: -------------------------------------------------------------------------- [ Range ] :: [ Percentage ] :: [ Count ] -------------------------------------------------------------------------- [32.0s,34.0s) :: [ ] :: [ 1/2240] [30.0s,32.0s) :: [ ] :: [ 0/2240] [28.0s,30.0s) :: [ ] :: [ 0/2240] [26.0s,28.0s) :: [ ] :: [ 1/2240] [24.0s,26.0s) :: [ ] :: [ 0/2240] [22.0s,24.0s) :: [ ] :: [ 1/2240] [20.0s,22.0s) :: [ ] :: [ 0/2240] [18.0s,20.0s) :: [ ] :: [ 0/2240] [16.0s,18.0s) :: [ ] :: [ 0/2240] [14.0s,16.0s) :: [ ] :: [ 0/2240] [12.0s,14.0s) :: [ ] :: [ 5/2240] [10.0s,12.0s) :: [ ] :: [ 1/2240] [ 8.0s,10.0s) :: [ ] :: [ 6/2240] [ 6.0s, 8.0s) :: [ ] :: [ 14/2240] [ 4.0s, 6.0s) :: [ ] :: [ 25/2240] [ 2.0s, 4.0s) :: [ ] :: [ 12/2240] [ 0.0s, 2.0s) :: [************************************** ] :: [2174/2240] -------------------------------------------------------------------------- ******************** Failed Tests (905): lldb-api :: python_api/sbvalue_persist/TestSBValuePersist.py lldb-api :: python_api/watchpoint/TestSetWatchpoint.py lldb-api :: functionalities/postmortem/netbsd-core/TestNetBSDCore.py lldb-api :: functionalities/thread/concurrent_events/TestConcurrentSignalWatch.py lldb-api :: commands/expression/macros/TestMacros.py lldb-api :: functionalities/archives/TestBSDArchives.py lldb-api :: lang/cpp/struct_with_keyword_name/TestStructWithKeywordName.py lldb-api :: functionalities/data-formatter/data-formatter-stl/libcxx/vector/TestDataFormatterLibcxxVector.py lldb-api :: lang/c/register_variables/TestRegisterVariables.py lldb-api :: commands/expression/import-std-module/unique_ptr/TestUniquePtrFromStdModule.py lldb-api :: functionalities/data-formatter/data-formatter-stl/libstdcpp/unique_ptr/TestDataFormatterStdUniquePtr.py lldb-api :: linux/mix-dwo-and-regular-objects/TestMixedDwarfBinary.py lldb-api :: benchmarks/frame_variable/TestFrameVariableResponse.py lldb-api :: functionalities/data-formatter/data-formatter-stl/libstdcpp/iterator/TestDataFormatterStdIterator.py lldb-api :: lang/cpp/covariant-return-types/TestCovariantReturnTypes.py lldb-api :: commands/expression/regression-access-function-template-in-record/TestRegressionAccessFunctionTemplateInRecord.py lldb-api :: functionalities/breakpoint/consecutive_breakpoints/TestConsecutiveBreakpoints.py lldb-api :: tools/lldb-vscode/attach/TestVSCode_attach.py lldb-api :: lang/cpp/class-template-type-parameter-pack/TestClassTemplateTypeParameterPack.py lldb-api :: tools/intel-features/intel-pt/test/TestIntelPTSimpleBinary.py lldb-api :: commands/reproducer/invalid-args/TestInvalidArgsReproducer.py lldb-api :: commands/expression/import-std-module/forward_decl_from_module/TestForwardDeclFromStdModule.py lldb-api :: functionalities/data-formatter/var-in-aggregate-misuse/TestVarInAggregateMisuse.py lldb-api :: functionalities/breakpoint/breakpoint_set_restart/TestBreakpointSetRestart.py lldb-api :: commands/frame/diagnose/inheritance/TestDiagnoseInheritance.py lldb-api :: functionalities/data-formatter/hexcaps/TestDataFormatterHexCaps.py lldb-api :: lang/c/forward/TestForwardDeclaration.py lldb-api :: python_api/value_var_update/TestValueVarUpdate.py lldb-api :: functionalities/thread/step_out/TestThreadStepOut.py lldb-api :: lang/objc/single-entry-dictionary/TestObjCSingleEntryDictionary.py lldb-api :: lang/objc/direct-dispatch-step/TestObjCDirectDispatchStepping.py lldb-api :: functionalities/breakpoint/address_breakpoints/TestAddressBreakpoints.py lldb-api :: macosx/queues/TestQueues.py lldb-api :: python_api/exprpath_synthetic/TestExprPathSynthetic.py lldb-api :: tools/lldb-vscode/breakpoint/TestVSCode_setExceptionBreakpoints.py lldb-api :: lang/cpp/breakpoint_in_member_func_w_non_primitive_params/TestBreakpointInMemberFuncWNonPrimitiveParams.py lldb-api :: commands/disassemble/basic/TestDisassembleBreakpoint.py lldb-api :: types/TestFloatTypesExpr.py lldb-api :: commands/expression/import-std-module/deque-basic/TestDequeFromStdModule.py lldb-api :: functionalities/data-formatter/data-formatter-stl/libcxx/set/TestDataFormatterLibcxxSet.py lldb-api :: lang/cpp/virtual-overload/TestVirtualOverload.py lldb-api :: functionalities/thread/thread_specific_break_plus_condition/TestThreadSpecificBpPlusCondition.py lldb-api :: lang/cpp/char1632_t/TestChar1632T.py lldb-api :: python_api/class_members/TestSBTypeClassMembers.py lldb-api :: functionalities/data-formatter/compactvectors/TestCompactVectors.py lldb-api :: commands/expression/import-std-module/conflicts/TestStdModuleWithConflicts.py lldb-api :: functionalities/tail_call_frames/cross_dso/TestCrossDSOTailCalls.py lldb-api :: commands/expression/cast_int_to_anonymous_enum/TestCastIntToAnonymousEnum.py lldb-api :: lang/cpp/class_types/TestClassTypesDisassembly.py lldb-api :: commands/expression/test/TestExprs.py lldb-api :: macosx/order/TestOrderFile.py lldb-api :: macosx/add-dsym/TestAddDsymMidExecutionCommand.py lldb-api :: functionalities/memory/read/TestMemoryRead.py lldb-api :: python_api/frame/inlines/TestInlinedFrame.py lldb-api :: functionalities/data-formatter/data-formatter-stl/libcxx/queue/TestDataFormatterLibcxxQueue.py lldb-api :: functionalities/recursion/TestValueObjectRecursion.py lldb-api :: tools/lldb-vscode/breakpoint/TestVSCode_setFunctionBreakpoints.py lldb-api :: functionalities/darwin_log/filter/exact_match/activity-chain/TestDarwinLogFilterMatchActivityChain.py lldb-api :: benchmarks/stepping/TestSteppingSpeed.py lldb-api :: lang/cpp/this_class_type_mixing/TestThisClassTypeMixing.py lldb-api :: commands/frame/var/TestFrameVar.py lldb-api :: functionalities/dlopen_other_executable/TestDlopenOtherExecutable.py lldb-api :: functionalities/gdb_remote_client/TestNoWatchpointSupportInfo.py lldb-api :: commands/settings/quoting/TestQuoting.py lldb-api :: commands/disassemble/basic/TestFrameDisassemble.py lldb-api :: lang/cpp/operators/TestCppOperators.py lldb-api :: commands/expression/import-std-module/vector-bool/TestVectorBoolFromStdModule.py lldb-api :: functionalities/non-overlapping-index-variable-i/TestIndexVariable.py lldb-api :: terminal/TestSTTYBeforeAndAfter.py lldb-api :: lang/objc/objc-property/TestObjCProperty.py lldb-api :: lang/cpp/member-and-local-vars-with-same-name/TestMembersAndLocalsWithSameName.py lldb-api :: functionalities/breakpoint/debugbreak/TestDebugBreak.py lldb-api :: functionalities/darwin_log/format/TestDarwinLogMessageFormat.py lldb-api :: functionalities/gdb_remote_client/TestqOffsets.py lldb-api :: macosx/indirect_symbol/TestIndirectSymbols.py lldb-api :: python_api/process/read-mem-cstring/TestReadMemCString.py lldb-api :: functionalities/target_var/no_vars/TestTargetVarNoVars.py lldb-api :: commands/settings/TestSettings.py lldb-api :: commands/expression/persistent_types/TestNestedPersistentTypes.py lldb-api :: lang/objc/foundation/TestSymbolTable.py lldb-api :: functionalities/gdb_remote_client/TestGDBRemoteDiskFileCompletion.py lldb-api :: python_api/watchpoint/TestWatchpointIter.py lldb-api :: lang/cpp/offsetof/TestOffsetofCpp.py lldb-api :: python_api/watchpoint/TestWatchpointIgnoreCount.py lldb-api :: functionalities/postmortem/mach-core/TestMachCore.py lldb-api :: macosx/dyld-trie-symbols/TestDyldTrieSymbols.py lldb-api :: tools/lldb-server/register-reading/TestGdbRemoteGPacket.py lldb-api :: lang/cpp/dynamic-value-same-basename/TestDynamicValueSameBase.py lldb-api :: functionalities/gdb_remote_client/TestWriteMemory.py lldb-api :: functionalities/breakpoint/objc/TestObjCBreakpoints.py lldb-api :: functionalities/thread/crash_during_step/TestCrashDuringStep.py lldb-api :: functionalities/data-formatter/data-formatter-disabling/TestDataFormatterDisabling.py lldb-api :: functionalities/thread/concurrent_events/TestConcurrentDelaySignalBreak.py lldb-api :: lang/objc/modules-auto-import/TestModulesAutoImport.py lldb-api :: functionalities/target_var/TestTargetVar.py lldb-api :: functionalities/load_unload/TestLoadUnload.py lldb-api :: lang/cpp/call-function/TestCallCPPFunction.py lldb-api :: macosx/duplicate-archive-members/TestDuplicateMembers.py lldb-api :: tools/lldb-server/commandline/TestGdbRemoteConnection.py lldb-api :: api/listeners/TestListener.py lldb-api :: lang/cpp/nested-class-other-compilation-unit/TestNestedClassWithParentInAnotherCU.py lldb-api :: functionalities/thread/concurrent_events/TestConcurrentSignalDelayBreak.py lldb-api :: functionalities/thread/concurrent_events/TestConcurrentBreakpointsDelayedBreakpointOneWatchpoint.py lldb-api :: commands/expression/unwind_expression/TestUnwindExpression.py lldb-api :: tools/lldb-vscode/stackTrace/TestVSCode_stackTrace.py lldb-api :: lang/cpp/overloaded-functions/TestOverloadedFunctions.py lldb-api :: commands/expression/pr35310/TestExprsBug35310.py lldb-api :: lang/cpp/nsimport/TestCppNsImport.py lldb-api :: lang/objc/objc-new-syntax/TestObjCNewSyntaxArray.py lldb-api :: lang/objc/objc-ivar-protocols/TestIvarProtocols.py lldb-api :: lang/objc/modules-inline-functions/TestModulesInlineFunctions.py lldb-api :: functionalities/unwind/zeroth_frame/TestZerothFrame.py lldb-api :: commands/platform/file/read/TestPlatformFileRead.py lldb-api :: lang/c/complex/TestComplexC99.py lldb-api :: functionalities/data-formatter/data-formatter-synthval/TestDataFormatterSynthVal.py lldb-api :: functionalities/thread/concurrent_events/TestConcurrentManyBreakpoints.py lldb-api :: lang/c/offsetof/TestOffsetof.py lldb-api :: functionalities/longjmp/TestLongjmp.py lldb-api :: tools/lldb-vscode/module/TestVSCode_module.py lldb-api :: functionalities/tail_call_frames/inlining_and_tail_calls/TestInliningAndTailCalls.py lldb-api :: functionalities/pre_run_dylibs/TestPreRunDylibs.py lldb-api :: python_api/function_symbol/TestDisasmAPI.py lldb-api :: functionalities/data-formatter/data-formatter-objc/TestDataFormatterObjCExpr.py lldb-api :: functionalities/data-formatter/language_category_updates/TestDataFormatterLanguageCategoryUpdates.py lldb-api :: lang/cpp/auto/TestCPPAuto.py lldb-api :: python_api/interpreter/TestRunCommandInterpreterAPI.py lldb-api :: python_api/frame/get-variables/TestGetVariables.py lldb-api :: functionalities/lazy-loading/TestLazyLoading.py lldb-api :: functionalities/data-formatter/data-formatter-named-summaries/TestDataFormatterNamedSummaries.py lldb-api :: functionalities/abbreviation/TestCommonShortSpellings.py lldb-api :: lang/objc/forward-decl/TestForwardDecl.py lldb-api :: commands/expression/error-limit/TestExprErrorLimit.py lldb-api :: lang/objc/objc-checker/TestObjCCheckers.py lldb-api :: lang/cpp/limit-debug-info/TestWithLimitDebugInfo.py lldb-api :: functionalities/gdb_remote_client/TestProcessConnect.py lldb-api :: commands/register/register/intel_xtended_registers/TestMPXRegisters.py lldb-api :: python_api/target/TestTargetAPI.py lldb-api :: lang/cpp/template-arguments/TestCppTemplateArguments.py lldb-api :: lang/cpp/diamond/TestDiamond.py lldb-api :: functionalities/data-formatter/ptr_ref_typedef/TestPtrRef2Typedef.py lldb-api :: python_api/value/change_values/TestChangeValueAPI.py lldb-api :: tools/lldb-vscode/completions/TestVSCode_completions.py lldb-api :: functionalities/thread/concurrent_events/TestConcurrentWatchpointWithDelayWatchpointThreads.py lldb-api :: android/platform/TestDefaultCacheLineSize.py lldb-api :: functionalities/gdb_remote_client/TestTargetXMLArch.py lldb-api :: lang/objc/modules-update/TestClangModulesUpdate.py lldb-api :: functionalities/data-formatter/data-formatter-smart-array/TestDataFormatterSmartArray.py lldb-api :: functionalities/thread/concurrent_events/TestConcurrentSignalDelayWatch.py lldb-api :: functionalities/thread/concurrent_events/TestConcurrentWatchBreak.py lldb-api :: benchmarks/libcxxlist/TestBenchmarkLibcxxList.py lldb-api :: lang/cpp/symbols/TestSymbols.py lldb-api :: lang/cpp/virtual-functions/TestCppVirtualFunctions.py lldb-api :: functionalities/data-formatter/data-formatter-stl/libstdcpp/vbool/TestDataFormatterStdVBool.py lldb-api :: python_api/findvalue_duplist/TestSBFrameFindValue.py lldb-api :: functionalities/breakpoint/breakpoint_by_file_colon_line/TestBreakpointByFileColonLine.py lldb-api :: functionalities/data-formatter/stringprinter/TestStringPrinter.py lldb-api :: functionalities/data-formatter/data-formatter-stl/libcxx/unique_ptr/TestDataFormatterLibcxxUniquePtr.py lldb-api :: python_api/file_handle/TestFileHandle.py lldb-api :: functionalities/thread/create_during_step/TestCreateDuringStep.py lldb-api :: commands/frame/language/TestGuessLanguage.py lldb-api :: commands/platform/basic/TestPlatformPython.py lldb-api :: functionalities/breakpoint/global_constructor/TestBreakpointInGlobalConstructor.py lldb-api :: functionalities/breakpoint/breakpoint_callback_command_source/TestBreakpointCallbackCommandSource.py lldb-api :: functionalities/type_completion/TestTypeCompletion.py lldb-api :: lang/objc/objc-class-method/TestObjCClassMethod.py lldb-api :: functionalities/fat_archives/TestFatArchives.py lldb-api :: functionalities/breakpoint/breakpoint_command/TestBreakpointCommand.py lldb-api :: functionalities/data-formatter/typedef_array/TestTypedefArray.py lldb-api :: commands/platform/file/close/TestPlatformFileClose.py lldb-api :: functionalities/memory-region/TestMemoryRegion.py lldb-api :: lang/cpp/unsigned_types/TestUnsignedTypes.py lldb-api :: lang/c/strings/TestCStrings.py lldb-api :: commands/platform/process/list/TestProcessList.py lldb-api :: functionalities/data-formatter/data-formatter-objc/cmtime/TestDataFormatterCMTime.py lldb-api :: functionalities/multiword-commands/TestMultiWordCommands.py lldb-api :: types/TestFloatTypes.py lldb-api :: python_api/name_lookup/TestNameLookup.py lldb-api :: commands/trace/TestTraceDumpInstructions.py lldb-api :: commands/expression/anonymous-struct/TestCallUserAnonTypedef.py lldb-api :: commands/expression/completion-crash-incomplete-record/TestCompletionCrashIncompleteRecord.py lldb-api :: commands/expression/import-std-module/forward_list/TestForwardListFromStdModule.py lldb-api :: commands/frame/diagnose/complicated-expression/TestComplicatedExpression.py lldb-api :: functionalities/breakpoint/breakpoint_by_line_and_column/TestBreakpointByLineAndColumn.py lldb-api :: lang/objc/ivar-IMP/TestObjCiVarIMP.py lldb-api :: lang/c/inlines/TestRedefinitionsInInlines.py lldb-api :: commands/expression/invalid-args/TestInvalidArgsExpression.py lldb-api :: commands/frame/diagnose/dereference-function-return/TestDiagnoseDereferenceFunctionReturn.py lldb-api :: commands/target/dump-symtab-demangle/TestDumpSymtabDemangle.py lldb-api :: functionalities/deleted-executable/TestDeletedExecutable.py lldb-api :: functionalities/inferior-changed/TestInferiorChanged.py lldb-api :: macosx/safe-to-func-call/TestSafeFuncCalls.py lldb-api :: lang/cpp/keywords_enabled/TestCppKeywordsEnabled.py lldb-api :: macosx/lc-note/firmware-corefile/TestFirmwareCorefiles.py lldb-api :: functionalities/thread/multi_break/TestMultipleBreakpoints.py lldb-api :: functionalities/thread/concurrent_events/TestConcurrentManyWatchpoints.py lldb-api :: commands/gui/basic/TestGuiBasic.py lldb-api :: functionalities/plugins/command_plugin/TestPluginCommands.py lldb-api :: functionalities/breakpoint/dummy_target_breakpoints/TestBreakpointsWithNoTargets.py lldb-api :: api/multithreaded/TestMultithreaded.py lldb-api :: functionalities/asan/TestReportData.py lldb-api :: commands/expression/top-level/TestTopLevelExprs.py lldb-api :: lang/cpp/const_this/TestConstThis.py lldb-api :: python_api/watchpoint/watchlocation/TestSetWatchlocation.py lldb-api :: python_api/debugger/TestDebuggerAPI.py lldb-api :: arm/breakpoint-it/TestBreakpointIt.py lldb-api :: tools/lldb-server/TestGdbRemoteAttach.py lldb-api :: functionalities/data-formatter/data-formatter-stl/libcxx/tuple/TestDataFormatterLibcxxTuple.py lldb-api :: lang/objc/self/TestObjCSelf.py lldb-api :: functionalities/value_md5_crash/TestValueMD5Crash.py lldb-api :: macosx/thread-names/TestInterruptThreadNames.py lldb-api :: python_api/frame/TestFrames.py lldb-api :: iohandler/completion/TestIOHandlerCompletion.py lldb-api :: commands/expression/ir-interpreter-phi-nodes/TestIRInterpreterPHINodes.py lldb-api :: commands/target/stop-hook/delete/TestTargetStopHookDelete.py lldb-api :: macosx/macCatalyst/TestMacCatalyst.py lldb-api :: functionalities/data-formatter/data-formatter-stl/libcxx/unordered/TestDataFormatterUnordered.py lldb-api :: commands/gui/invalid-args/TestInvalidArgsGui.py lldb-api :: functionalities/thread/concurrent_events/TestConcurrentDelaySignalWatch.py lldb-api :: sample_test/TestSampleInlineTest.py lldb-api :: python_api/process/TestProcessAPI.py lldb-api :: lang/cpp/global_variables/TestCPPGlobalVariables.py lldb-api :: lang/objc/modules-incomplete/TestIncompleteModules.py lldb-api :: commands/watchpoints/watchpoint_commands/condition/TestWatchpointConditionCmd.py lldb-api :: functionalities/data-formatter/data-formatter-objc/TestDataFormatterObjCPlain.py lldb-api :: commands/thread/select/TestThreadSelect.py lldb-api :: functionalities/signal/handle-segv/TestHandleSegv.py lldb-api :: commands/frame/diagnose/bad-reference/TestBadReference.py lldb-api :: lang/cpp/lambdas/TestLambdas.py lldb-api :: lang/objc/modules-compile-error/TestModulesCompileError.py lldb-api :: functionalities/data-formatter/nssetsynth/TestNSSetSynthetic.py lldb-api :: functionalities/mtc/simple/TestMTCSimple.py lldb-api :: functionalities/breakpoint/breakpoint_conditions/TestBreakpointConditions.py lldb-api :: commands/process/launch-with-shellexpand/TestLaunchWithShellExpand.py lldb-api :: lang/objc/objc-new-syntax/TestObjCNewSyntaxDictionary.py lldb-api :: lang/cpp/class-template-parameter-pack/TestClassTemplateParameterPack.py lldb-api :: functionalities/thread/state_after_expression/TestStateAfterExpression.py lldb-api :: lang/objc/radar-9691614/TestObjCMethodReturningBOOL.py lldb-api :: functionalities/asan/TestMemoryHistory.py lldb-api :: commands/expression/import-std-module/deque-dbg-info-content/TestDbgInfoContentDequeFromStdModule.py lldb-api :: lang/objcxx/objcxx-ivar-vector/TestIvarVector.py lldb-api :: lang/c/stepping/TestStepAndBreakpoints.py lldb-api :: commands/expression/two-files/TestObjCTypeQueryFromOtherCompileUnit.py lldb-api :: lang/objc/modules-app-update/TestClangModulesAppUpdate.py lldb-api :: tools/lldb-server/TestGdbRemote_vCont.py lldb-api :: lang/objc/objc-stepping/TestObjCStepping.py lldb-api :: commands/expression/unicode-in-variable/TestUnicodeInVariable.py lldb-api :: commands/target/stop-hook/disable/TestTargetStopHookDisable.py lldb-api :: lang/cpp/thread_local/TestThreadLocal.py lldb-api :: functionalities/breakpoint/serialize/TestBreakpointSerialization.py lldb-api :: tools/lldb-vscode/variables/TestVSCode_variables.py lldb-api :: lang/objc/objc-static-method/TestObjCStaticMethod.py lldb-api :: terminal/TestEditline.py lldb-api :: functionalities/process_save_core/TestProcessSaveCore.py lldb-api :: tools/lldb-server/TestGdbRemoteAuxvSupport.py lldb-api :: tools/lldb-server/TestLldbGdbServer.py lldb-api :: python_api/objc_type/TestObjCType.py lldb-api :: python_api/lldbutil/frame/TestFrameUtils.py lldb-api :: functionalities/thread/num_threads/TestNumThreads.py lldb-api :: lang/cpp/frame-var-anon-unions/TestFrameVariableAnonymousUnions.py lldb-api :: functionalities/ubsan/basic/TestUbsanBasic.py lldb-api :: lang/objc/cpp_keyword_identifiers/TestCppKeywordsAsObjCIdentifiers.py lldb-api :: commands/expression/completion-in-lambda-and-unnamed-class/TestCompletionInLambdaAndUnnamedClass.py lldb-api :: commands/expression/options/TestExprOptions.py lldb-api :: lang/objc/orderedset/TestOrderedSet.py lldb-api :: lang/cpp/signed_types/TestSignedTypes.py lldb-api :: commands/target/create-deps/TestTargetCreateDeps.py lldb-api :: commands/command/nested_alias/TestNestedAlias.py lldb-api :: functionalities/object-file/TestImageListMultiArchitecture.py lldb-api :: lang/objcxx/hide-runtime-values/TestObjCXXHideRuntimeValues.py lldb-api :: functionalities/source-map/TestTargetSourceMap.py lldb-api :: commands/expression/namespace_local_var_same_name_cpp_and_c/TestNamespaceLocalVarSameNameCppAndC.py lldb-api :: functionalities/breakpoint/move_nearest/TestMoveNearest.py lldb-api :: lang/cpp/namespace_definitions/TestNamespaceDefinitions.py lldb-api :: functionalities/plugins/python_os_plugin/stepping_plugin_threads/TestOSPluginStepping.py lldb-api :: functionalities/data-formatter/format-propagation/TestFormatPropagation.py lldb-api :: functionalities/thread/concurrent_events/TestConcurrentSignalNWatchNBreak.py lldb-api :: functionalities/gdb_remote_client/TestGDBRemoteClient.py lldb-api :: commands/command/source/TestCommandSource.py lldb-api :: commands/watchpoints/watchpoint_set_command/TestWatchLocationWithWatchSet.py lldb-api :: commands/frame/var-scope/TestFrameVariableScope.py lldb-api :: lang/objc/foundation/TestFoundationDisassembly.py lldb-api :: functionalities/data-formatter/data-formatter-globals/TestDataFormatterGlobals.py lldb-api :: linux/add-symbols/TestTargetSymbolsAddCommand.py lldb-api :: python_api/process/io/TestProcessIO.py lldb-api :: lang/objcxx/cpp_keywords_enabled/TestObjCppKeywordsEnabled.py lldb-api :: lang/objcxx/cxx-bridged-po/TestObjCXXBridgedPO.py lldb-api :: commands/watchpoints/multiple_hits/TestMultipleHits.py lldb-api :: functionalities/inferior-crashing/recursive-inferior/TestRecursiveInferiorStep.py lldb-api :: functionalities/gdb_remote_client/TestRegDefinitionInParts.py lldb-api :: commands/process/signal/TestProcessSignal.py lldb-api :: functionalities/breakpoint/breakpoint_language/TestBreakpointLanguage.py lldb-api :: functionalities/tsan/thread_numbers/TestTsanThreadNumbers.py lldb-api :: functionalities/darwin_log/filter/exact_match/message/TestDarwinLogFilterMatchMessage.py lldb-api :: lang/cpp/dynamic-value/TestDynamicValue.py lldb-api :: functionalities/data-formatter/data-formatter-stl/libcxx/list/TestDataFormatterLibcxxList.py lldb-api :: macosx/find-app-in-bundle/TestFindAppInBundle.py lldb-api :: commands/add-dsym/uuid/TestAddDsymCommand.py lldb-api :: sample_test/TestSampleTest.py lldb-api :: tools/lldb-vscode/coreFile/TestVSCode_coreFile.py lldb-api :: python_api/disassemble-raw-data/TestDisassembleRawData.py lldb-api :: lang/cpp/function_refs/TestFunctionRefs.py lldb-api :: commands/expression/radar_9531204/TestPrintfAfterUp.py lldb-api :: lang/cpp/bool/TestCPPBool.py lldb-api :: types/TestLongTypes.py lldb-api :: lang/cpp/extern_c/TestExternCSymbols.py lldb-api :: functionalities/data-formatter/data-formatter-stl/libcxx/string/TestDataFormatterLibcxxString.py lldb-api :: functionalities/breakpoint/breakpoint_locations/TestBreakpointLocations.py lldb-api :: functionalities/data-formatter/data-formatter-stl/libcxx/forward_list/TestDataFormatterLibcxxForwardList.py lldb-api :: types/TestCharTypeExpr.py lldb-api :: commands/expression/dollar-in-variable/TestDollarInVariable.py lldb-api :: commands/expression/no-deadlock/TestExprDoesntBlock.py lldb-api :: python_api/formatters/TestFormattersSBAPI.py lldb-api :: functionalities/data-formatter/dump_dynamic/TestDumpDynamic.py lldb-api :: commands/gui/basicdebug/TestGuiBasicDebug.py lldb-api :: commands/expression/import-std-module/basic/TestImportStdModule.py lldb-api :: functionalities/thread/concurrent_events/TestConcurrentDelayedCrashWithBreakpointSignal.py lldb-api :: functionalities/show_location/TestShowLocationDwarf5.py lldb-api :: commands/session/history/TestSessionHistory.py lldb-api :: commands/expression/persist_objc_pointeetype/TestPersistObjCPointeeType.py lldb-api :: commands/target/modules/search-paths/insert/TestTargetModulesSearchpathsInsert.py lldb-api :: lang/cpp/unique-types/TestUniqueTypes.py lldb-api :: functionalities/unwind/noreturn/module-end/TestNoReturnModuleEnd.py lldb-api :: lang/objc/objc_direct-methods/TestObjCDirectMethods.py lldb-api :: commands/expression/fixits/TestFixIts.py lldb-api :: functionalities/data-formatter/poarray/TestPrintObjectArray.py lldb-api :: lang/c/find_struct_type/TestFindStructTypes.py lldb-api :: commands/frame/select/TestFrameSelect.py lldb-api :: functionalities/thread/concurrent_events/TestConcurrentTwoWatchpointThreads.py lldb-api :: commands/watchpoints/watchpoint_count/TestWatchpointCount.py lldb-api :: tools/lldb-vscode/breakpoint/TestVSCode_setBreakpoints.py lldb-api :: functionalities/data-formatter/data-formatter-stl/libstdcpp/vector/TestDataFormatterStdVector.py lldb-api :: functionalities/target-new-solib-notifications/TestModuleLoadedNotifys.py lldb-api :: commands/process/attach-resume/TestAttachResume.py lldb-api :: functionalities/completion/TestCompletion.py lldb-api :: lang/objcxx/objc-builtin-types/TestObjCBuiltinTypes.py lldb-api :: functionalities/process_group/TestChangeProcessGroup.py lldb-api :: macosx/save_crashlog/TestSaveCrashlog.py lldb-api :: functionalities/data-formatter/data-formatter-objc/TestDataFormatterObjCCF.py lldb-api :: lang/cpp/operator-overload/TestOperatorOverload.py lldb-api :: commands/expression/test/TestExprs2.py lldb-api :: functionalities/data-formatter/pyobjsynthprovider/TestPyObjSynthProvider.py lldb-api :: functionalities/tail_call_frames/disambiguate_call_site/TestDisambiguateCallSite.py lldb-api :: functionalities/breakpoint/breakpoint_ignore_count/TestBreakpointIgnoreCount.py lldb-api :: functionalities/thread/concurrent_events/TestConcurrentCrashWithBreak.py lldb-api :: lang/objc/foundation/TestObjCMethods2.py lldb-api :: functionalities/thread/concurrent_events/TestConcurrentCrashWithWatchpointBreakpointSignal.py lldb-api :: commands/expression/deleting-implicit-copy-constructor/TestDeletingImplicitCopyConstructor.py lldb-api :: commands/expression/diagnostics/TestExprDiagnostics.py lldb-api :: api/multiple-debuggers/TestMultipleDebuggers.py lldb-api :: commands/frame/diagnose/local-variable/TestLocalVariable.py lldb-api :: lang/cpp/multiple-inheritance/TestCppMultipleInheritance.py lldb-api :: benchmarks/continue/TestBenchmarkContinue.py lldb-api :: functionalities/unwind/sigtramp/TestSigtrampUnwind.py lldb-api :: functionalities/breakpoint/breakpoint_ids/TestBreakpointIDs.py lldb-api :: lang/c/blocks/TestBlocks.py lldb-api :: commands/watchpoints/watchpoint_size/TestWatchpointSizes.py lldb-api :: functionalities/data-formatter/user-format-vs-summary/TestUserFormatVsSummary.py lldb-api :: commands/watchpoints/watchpoint_commands/TestWatchpointCommands.py lldb-api :: lang/objc/foundation/TestObjCMethodsString.py lldb-api :: lang/objc/rdar-10967107/TestRdar10967107.py lldb-api :: functionalities/data-formatter/setvaluefromcstring/TestSetValueFromCString.py lldb-api :: commands/expression/import-std-module/vector-dbg-info-content/TestDbgInfoContentVectorFromStdModule.py lldb-api :: tools/lldb-server/thread-name/TestGdbRemoteThreadName.py lldb-api :: lang/cpp/modules-import/TestCXXModulesImport.py lldb-api :: commands/session/save/TestSessionSave.py lldb-api :: python_api/lldbutil/process/TestPrintStackTraces.py lldb-api :: functionalities/thread/break_after_join/TestBreakAfterJoin.py lldb-api :: tools/lldb-vscode/disconnect/TestVSCode_disconnect.py lldb-api :: commands/frame/recognizer/TestFrameRecognizer.py lldb-api :: functionalities/breakpoint/address_breakpoints/TestBadAddressBreakpoints.py lldb-api :: functionalities/plugins/python_os_plugin/TestPythonOSPlugin.py lldb-api :: lang/objc/objc++/TestObjCXX.py lldb-api :: lang/cpp/subst_template_type_param/TestSubstTemplateTypeParam.py lldb-api :: commands/command/script/import/rdar-12586188/TestRdar12586188.py lldb-api :: lang/cpp/static_methods/TestCPPStaticMethods.py lldb-api :: functionalities/data-formatter/data-formatter-caching/TestDataFormatterCaching.py lldb-api :: functionalities/data-formatter/synthupdate/TestSyntheticFilterRecompute.py lldb-api :: functionalities/testid/TestTestId.py lldb-api :: lang/objc/blocks/TestObjCIvarsInBlocks.py lldb-api :: functionalities/data-formatter/data-formatter-stl/libcxx/multiset/TestDataFormatterLibcxxMultiSet.py lldb-api :: functionalities/postmortem/wow64_minidump/TestWow64MiniDump.py lldb-api :: functionalities/data-formatter/data-formatter-stl/libcxx/bitset/TestDataFormatterLibcxxBitset.py lldb-api :: test_utils/TestPExpectTest.py lldb-api :: functionalities/data-formatter/data-formatter-objc/TestDataFormatterObjNSException.py lldb-api :: functionalities/data-formatter/nsdictionarysynth/TestNSDictionarySynthetic.py lldb-api :: functionalities/thread/concurrent_events/TestConcurrentManySignals.py lldb-api :: commands/quit/TestQuit.py lldb-api :: commands/expression/formatters/TestFormatters.py lldb-api :: functionalities/breakpoint/breakpoint_options/TestBreakpointOptions.py lldb-api :: macosx/builtin-debugtrap/TestBuiltinDebugTrap.py lldb-api :: commands/command/script_alias/TestCommandScriptAlias.py lldb-api :: commands/expression/xvalue/TestXValuePrinting.py lldb-api :: lang/cpp/function-qualifiers/TestCppFunctionQualifiers.py lldb-api :: functionalities/memory/find/TestMemoryFind.py lldb-api :: lang/c/anonymous/TestAnonymous.py lldb-api :: commands/target/create-no-such-arch/TestNoSuchArch.py lldb-api :: lang/cpp/namespace_conflicts/TestNamespaceConflicts.py lldb-api :: functionalities/data-formatter/type_summary_list_arg/TestTypeSummaryListArg.py lldb-api :: lang/objc/objc-super/TestObjCSuper.py lldb-api :: functionalities/data-formatter/data-formatter-objc/nsindexpath/TestDataFormatterNSIndexPath.py lldb-api :: lang/objc/rdar-12408181/TestRdar12408181.py lldb-api :: functionalities/avoids-fd-leak/TestFdLeak.py lldb-api :: lang/cpp/template-specialization-type/TestTemplateSpecializationType.py lldb-api :: commands/expression/function_template_specialization_temp_args/TestFunctionTemplateSpecializationTempArgs.py lldb-api :: types/TestDoubleTypesExpr.py lldb-api :: functionalities/gdb_remote_client/TestWasm.py lldb-api :: functionalities/darwin_log/filter/regex/activity-chain/TestDarwinLogFilterRegexActivityChain.py lldb-api :: functionalities/data-formatter/data-formatter-stl/libcxx/list/loop/TestDataFormatterLibcxxListLoop.py lldb-api :: lang/c/conflicting-symbol/TestConflictingSymbol.py lldb-api :: functionalities/breakpoint/step_over_breakpoint/TestStepOverBreakpoint.py lldb-api :: functionalities/thread/concurrent_events/TestConcurrentManyCrash.py lldb-api :: python_api/value/TestValueAPI.py lldb-api :: commands/expression/call-throws/TestCallThatThrows.py lldb-api :: functionalities/darwin_log/filter/regex/message/TestDarwinLogFilterRegexMessage.py lldb-api :: functionalities/tail_call_frames/cross_object/TestCrossObjectTailCalls.py lldb-api :: tools/lldb-server/TestGdbRemote_qThreadStopInfo.py lldb-api :: macosx/function-starts/TestFunctionStarts.py lldb-api :: functionalities/data-formatter/summary-string-onfail/Test-rdar-9974002.py lldb-api :: lang/cpp/bitfields/TestCppBitfields.py lldb-api :: commands/command/delete/TestCommandDelete.py lldb-api :: commands/expression/multiline-completion/TestMultilineCompletion.py lldb-api :: commands/breakpoint/command/list/TestBreakpointCommandList.py lldb-api :: functionalities/data-formatter/synthcapping/TestSyntheticCapping.py lldb-api :: commands/expression/ir-interpreter/TestIRInterpreter.py lldb-api :: functionalities/data-formatter/array_typedef/TestArrayTypedef.py lldb-api :: functionalities/thread/concurrent_events/TestConcurrentTwoWatchpointsOneDelayBreakpoint.py lldb-api :: lang/cpp/default-template-args/TestDefaultTemplateArgs.py lldb-api :: functionalities/breakpoint/hardware_breakpoints/require_hw_breakpoints/TestRequireHWBreakpoints.py lldb-api :: functionalities/data-formatter/type_summary_list_script/TestTypeSummaryListScript.py lldb-api :: functionalities/tty/TestTerminal.py lldb-api :: commands/register/register/intel_xtended_registers/mpx_bound_violation/TestBoundViolation.py lldb-api :: python_api/breakpoint/TestBreakpointAPI.py lldb-api :: lang/objc/modules-non-objc-target/TestObjCModulesNonObjCTarget.py lldb-api :: functionalities/thread/concurrent_events/TestConcurrentSignalWatchBreak.py lldb-api :: commands/expression/import-std-module/weak_ptr/TestWeakPtrFromStdModule.py lldb-api :: commands/target/stop-hooks/TestStopHooks.py lldb-api :: lang/c/set_values/TestSetValues.py lldb-api :: commands/expression/persistent_ptr_update/TestPersistentPtrUpdate.py lldb-api :: functionalities/data-formatter/data-formatter-cpp/TestDataFormatterCpp.py lldb-api :: functionalities/tail_call_frames/thread_step_out_or_return/TestSteppingOutWithArtificialFrames.py lldb-api :: commands/expression/import_base_class_when_class_has_derived_member/TestImportBaseClassWhenClassHasDerivedMember.py lldb-api :: functionalities/data-formatter/data-formatter-stl/libstdcpp/tuple/TestDataFormatterStdTuple.py lldb-api :: tools/lldb-vscode/breakpoint-events/TestVSCode_breakpointEvents.py lldb-api :: macosx/version_zero/TestGetVersionZeroVersion.py lldb-api :: iohandler/autosuggestion/TestAutosuggestion.py lldb-api :: tools/lldb-server/registers-target-xml-reading/TestGdbRemoteTargetXmlPacket.py lldb-api :: functionalities/type_get_module/TestTypeGetModule.py lldb-api :: functionalities/data-formatter/data-formatter-stl/libcxx/initializerlist/TestInitializerList.py lldb-api :: lang/cpp/non-type-template-param/TestCppNonTypeTemplateParam.py lldb-api :: lang/cpp/class_static/TestStaticVariables.py lldb-api :: lang/objc/unicode-string/TestUnicodeString.py lldb-api :: functionalities/thread/concurrent_events/TestConcurrentWatchpointDelayWatchpointOneBreakpoint.py lldb-api :: functionalities/data-formatter/data-formatter-enum-format/TestDataFormatterEnumFormat.py lldb-api :: functionalities/gdb_remote_client/TestThreadSelectionBug.py lldb-api :: commands/process/attach/attach_denied/TestAttachDenied.py lldb-api :: macosx/thread_suspend/TestInternalThreadSuspension.py lldb-api :: commands/expression/call-function/TestCallBuiltinFunction.py lldb-api :: commands/expression/multiline-navigation/TestMultilineNavigation.py lldb-api :: functionalities/breakpoint/inlined_breakpoints/TestInlinedBreakpoints.py lldb-api :: python_api/type/TestTypeList.py lldb-api :: functionalities/signal/TestSendSignal.py lldb-api :: functionalities/darwin_log/source/debug/TestDarwinLogSourceDebug.py lldb-api :: functionalities/tsan/basic/TestTsanBasic.py lldb-api :: functionalities/stats_api/TestStatisticsAPI.py lldb-api :: lang/cpp/accelerator-table/TestCPPAccelerator.py lldb-api :: commands/apropos/basic/TestApropos.py lldb-api :: functionalities/abbreviation/TestAbbreviations.py lldb-api :: python_api/signals/TestSignalsAPI.py lldb-api :: commands/settings/use_source_cache/TestUseSourceCache.py lldb-api :: commands/expression/completion/TestExprCompletion.py lldb-api :: linux/sepdebugsymlink/TestTargetSymbolsSepDebugSymlink.py lldb-api :: commands/expression/vector_of_enums/TestVectorOfEnums.py lldb-api :: lang/objc/foundation/TestObjCMethodsNSError.py lldb-api :: benchmarks/turnaround/TestCompileRunToBreakpointTurnaround.py lldb-api :: commands/process/attach/TestProcessAttach.py lldb-api :: commands/register/register/intel_xtended_registers/mpx_offset_intersection/TestMPXOffsetIntersection.py lldb-api :: commands/frame/diagnose/dereference-this/TestDiagnoseDereferenceThis.py lldb-api :: lang/objc/rdar-11355592/TestRdar11355592.py lldb-api :: commands/expression/codegen-crash-typedefdecl-not-in_declcontext/TestCodegenCrashTypedefDeclNotInDeclContext.py lldb-api :: functionalities/data-formatter/data-formatter-stl/libcxx/iterator/TestDataFormatterLibccIterator.py lldb-api :: tools/lldb-vscode/runInTerminal/TestVSCode_runInTerminal.py lldb-api :: functionalities/thread/state/TestThreadStates.py lldb-api :: functionalities/data-formatter/varscript_formatting/TestDataFormatterVarScriptFormatting.py lldb-api :: functionalities/history/TestHistoryRecall.py lldb-api :: commands/expression/issue_11588/Test11588.py lldb-api :: tools/lldb-vscode/step/TestVSCode_step.py lldb-api :: types/TestShortTypeExpr.py lldb-api :: functionalities/breakpoint/cpp/TestCPPBreakpointLocations.py lldb-api :: lang/c/array_types/TestArrayTypes.py lldb-api :: functionalities/data-formatter/data-formatter-objc/TestDataFormatterObjCKVO.py lldb-api :: lang/c/function_types/TestFunctionTypes.py lldb-api :: commands/expression/scoped_enums/TestScopedEnumType.py lldb-api :: functionalities/postmortem/minidump-new/TestMiniDumpUUID.py lldb-api :: tools/lldb-server/platform-process-connect/TestPlatformProcessConnect.py lldb-api :: lang/cpp/function-template-parameter-pack/TestFunctionTemplateParameterPack.py lldb-api :: macosx/load-kext/TestLoadKext.py lldb-api :: lang/c/complex_int/TestComplexInt.py lldb-api :: tools/lldb-server/TestGdbRemoteThreadsInStopReply.py lldb-api :: functionalities/thread/concurrent_events/TestConcurrentBreakpointDelayBreakpointOneSignal.py lldb-api :: lang/objc/modules-cache/TestClangModulesCache.py lldb-api :: functionalities/unwind/standard/TestStandardUnwind.py lldb-api :: api/multiple-targets/TestMultipleTargets.py lldb-api :: lang/c/vla/TestVLA.py lldb-api :: lang/c/unions/TestUnionMembers.py lldb-api :: tools/lldb-vscode/console/TestVSCode_console.py lldb-api :: commands/log/basic/TestLogging.py lldb-api :: commands/expression/save_jit_objects/TestSaveJITObjects.py lldb-api :: functionalities/darwin_log/filter/exact_match/category/TestDarwinLogFilterMatchCategory.py lldb-api :: functionalities/inferior-assert/TestInferiorAssert.py lldb-api :: lang/objc/objc-optimized/TestObjcOptimized.py lldb-api :: lang/objc/modules/TestObjCModules.py lldb-api :: functionalities/gdb_remote_client/TestRecognizeBreakpoint.py lldb-api :: functionalities/tail_call_frames/unambiguous_sequence/TestUnambiguousTailCalls.py lldb-api :: functionalities/signal/handle-abrt/TestHandleAbort.py lldb-api :: python_api/thread/TestThreadAPI.py lldb-api :: tools/lldb-server/TestGdbRemoteKill.py lldb-api :: arm/breakpoint-thumb-codesection/TestBreakpointThumbCodesection.py lldb-api :: functionalities/wrong_commands/TestWrongCommands.py lldb-api :: macosx/debugserver-exit-code/TestDebugServerExitCode.py lldb-api :: functionalities/data-formatter/ostypeformatting/TestFormattersOsType.py lldb-api :: functionalities/thread/concurrent_events/TestConcurrentTwoBreakpointsOneWatchpoint.py lldb-api :: functionalities/inferior-crashing/recursive-inferior/TestRecursiveInferior.py lldb-api :: functionalities/rerun/TestRerun.py lldb-api :: lang/cpp/printf/TestPrintf.py lldb-api :: commands/expression/result_numbering/TestResultNumbering.py lldb-api :: linux/builtin_trap/TestBuiltinTrap.py lldb-api :: types/TestRecursiveTypes.py lldb-api :: functionalities/data-formatter/data-formatter-synth/TestDataFormatterSynth.py lldb-api :: functionalities/thread/concurrent_events/TestConcurrentSignalBreak.py lldb-api :: lang/c/stepping/TestThreadStepping.py lldb-api :: commands/target/basic/TestTargetCommand.py lldb-api :: commands/expression/persistent_types/TestPersistentTypes.py lldb-api :: lang/cpp/template/TestTemplateArgs.py lldb-api :: commands/expression/rdar44436068/Test128BitsInteger.py lldb-api :: functionalities/ubsan/user-expression/TestUbsanUserExpression.py lldb-api :: types/TestIntegerTypeExpr.py lldb-api :: lang/cpp/class-template-non-type-parameter-pack/TestClassTemplateNonTypeParameterPack.py lldb-api :: macosx/lc-note/kern-ver-str/TestKernVerStrLCNOTE.py lldb-api :: types/TestLongTypesExpr.py lldb-api :: python_api/watchpoint/watchlocation/TestTargetWatchAddress.py lldb-api :: tools/lldb-server/inferior-crash/TestGdbRemoteAbort.py lldb-api :: commands/frame/diagnose/array/TestArray.py lldb-api :: tools/lldb-server/TestGdbRemoteCompletion.py lldb-api :: lang/objcxx/class-name-clash/TestNameClash.py lldb-api :: lang/c/global_variables/TestGlobalVariables.py lldb-api :: lang/cpp/type_lookup/TestCppTypeLookup.py lldb-api :: api/log/TestAPILog.py lldb-api :: functionalities/unwind/ehframe/TestEhFrameUnwind.py lldb-api :: lang/mixed/TestMixedLanguages.py lldb-api :: functionalities/tail_call_frames/disambiguate_paths_to_common_sink/TestDisambiguatePathsToCommonSink.py lldb-api :: functionalities/postmortem/minidump-new/TestMiniDumpNew.py lldb-api :: macosx/DBGSourcePathRemapping/TestDSYMSourcePathRemapping.py lldb-api :: lang/c/local_variables/TestLocalVariables.py lldb-api :: commands/statistics/basic/TestStats.py lldb-api :: lang/objc/conflicting-definition/TestConflictingDefinition.py lldb-api :: functionalities/breakpoint/cpp_exception/TestCPPExceptionBreakpoint.py lldb-api :: commands/gui/breakpoints/TestGuiBreakpoints.py lldb-api :: tools/lldb-server/TestGdbRemoteHostInfo.py lldb-api :: python_api/hello_world/TestHelloWorld.py lldb-api :: python_api/default-constructor/TestDefaultConstructorForAPIObjects.py lldb-api :: functionalities/load_using_paths/TestLoadUsingPaths.py lldb-api :: functionalities/data-formatter/data-formatter-proper-plurals/TestFormattersOneIsSingular.py lldb-api :: lang/objc/objc-new-syntax/TestObjCNewSyntaxLiteral.py lldb-api :: commands/expression/import-std-module/list-dbg-info-content/TestDbgInfoContentListFromStdModule.py lldb-api :: lang/cpp/rvalue-references/TestRvalueReferences.py lldb-api :: iohandler/resize/TestIOHandlerResize.py lldb-api :: commands/source/info/TestSourceInfo.py lldb-api :: commands/trace/TestTraceLoad.py lldb-api :: commands/expression/context-object-objc/TestContextObjectObjc.py lldb-api :: functionalities/tail_call_frames/thread_step_out_message/TestArtificialFrameStepOutMessage.py lldb-api :: functionalities/ptr_refs/TestPtrRefs.py lldb-api :: lang/c/tls_globals/TestTlsGlobals.py lldb-api :: python_api/interpreter/TestCommandInterpreterAPI.py lldb-api :: functionalities/data-formatter/boolreference/TestFormattersBoolRefPtr.py lldb-api :: commands/expression/import-std-module/weak_ptr-dbg-info-content/TestDbgInfoContentWeakPtrFromStdModule.py lldb-api :: functionalities/breakpoint/comp_dir_symlink/TestCompDirSymLink.py lldb-api :: python_api/symbol-context/two-files/TestSymbolContextTwoFiles.py lldb-api :: lang/objc/variadic_methods/TestVariadicMethods.py lldb-api :: functionalities/darwin_log/filter/regex/activity/TestDarwinLogFilterRegexActivity.py lldb-api :: functionalities/inferior-crashing/TestInferiorCrashingStep.py lldb-api :: lang/c/enum_types/TestEnumTypes.py lldb-api :: python_api/value/linked_list/TestValueAPILinkedList.py lldb-api :: lang/c/shared_lib/TestSharedLib.py lldb-api :: lang/cpp/namespace/TestNamespaceLookup.py lldb-api :: lang/cpp/this/TestCPPThis.py lldb-api :: python_api/sberror/TestSBError.py lldb-api :: lang/c/const_variables/TestConstVariables.py lldb-api :: lang/cpp/scope/TestCppScope.py lldb-api :: lang/c/step_over_no_deadlock/TestStepOverDoesntBlock.py lldb-api :: commands/expression/import-std-module/unique_ptr-dbg-info-content/TestUniquePtrDbgInfoContent.py lldb-api :: macosx/profile_vrs_detach/TestDetachVrsProfile.py lldb-api :: functionalities/darwin_log/basic/TestDarwinLogBasic.py lldb-api :: tools/lldb-server/TestGdbRemoteExitCode.py lldb-api :: tools/lldb-server/TestGdbRemoteProcessInfo.py lldb-api :: lang/cpp/trivial_abi/TestTrivialABI.py lldb-api :: lang/cpp/llvm-style/TestLLVMStyle.py lldb-api :: functionalities/data-formatter/data-formatter-stl/libcxx/deque/TestDataFormatterLibcxxDeque.py lldb-api :: lang/c/cpp_keyword_identifiers/TestCppKeywordsAsCIdentifiers.py lldb-api :: functionalities/data-formatter/data-formatter-stl/libcxx/variant/TestDataFormatterLibcxxVariant.py lldb-api :: macosx/macCatalystAppMacOSFramework/TestMacCatalystAppWithMacOSFramework.py lldb-api :: commands/expression/po_verbosity/TestPoVerbosity.py lldb-api :: commands/expression/ignore-artificial-constructors/TestIgnoreArtificialConstructors.py lldb-api :: functionalities/darwin_log/source/info/TestDarwinLogSourceInfo.py lldb-api :: tools/lldb-server/TestGdbRemote_vContThreads.py lldb-api :: lang/objc/foundation/TestConstStrings.py lldb-api :: lang/cpp/unicode-literals/TestUnicodeLiterals.py lldb-api :: commands/expression/import-std-module/queue/TestQueueFromStdModule.py lldb-api :: commands/expression/context-object/TestContextObject.py lldb-api :: commands/watchpoints/multi_watchpoint_slots/TestWatchpointMultipleSlots.py lldb-api :: python_api/disassemble-raw-data/TestDisassemble_VST1_64.py lldb-api :: functionalities/tail_call_frames/sbapi_support/TestTailCallFrameSBAPI.py lldb-api :: commands/watchpoints/multiple_threads/TestWatchpointMultipleThreads.py lldb-api :: functionalities/data-formatter/frameformat_smallstruct/TestFrameFormatSmallStruct.py lldb-api :: functionalities/conditional_break/TestConditionalBreak.py lldb-api :: commands/watchpoints/watchpoint_events/TestWatchpointEvents.py lldb-api :: lang/objc/foundation/TestRuntimeTypes.py lldb-api :: lang/cpp/wchar_t/TestCxxWCharT.py lldb-api :: lang/objc/foundation/TestObjCMethodsNSArray.py lldb-api :: tools/lldb-server/TestGdbRemoteExpeditedRegisters.py lldb-api :: functionalities/dynamic_value_child_count/TestDynamicValueChildCount.py lldb-api :: commands/frame/diagnose/virtual-method-call/TestDiagnoseDereferenceVirtualMethodCall.py lldb-api :: commands/expression/class_template_specialization_empty_pack/TestClassTemplateSpecializationParametersHandling.py lldb-api :: functionalities/data-formatter/data-formatter-python-synth/TestDataFormatterPythonSynth.py lldb-api :: python_api/event/TestEvents.py lldb-api :: macosx/simulator/TestSimulatorPlatform.py lldb-api :: functionalities/data-formatter/data-formatter-synthtype/TestDataFormatterSynthType.py lldb-api :: lang/c/local_types/TestUseClosestType.py lldb-api :: lang/c/struct_types/TestStructTypes.py lldb-api :: lang/cpp/alignas_base_class/TestAlignAsBaseClass.py lldb-api :: functionalities/signal/raise/TestRaise.py lldb-api :: lang/objc/objc-runtime-ivars/TestRuntimeIvars.py lldb-api :: functionalities/data-formatter/cstring-utf8-summary/TestCstringUnicode.py lldb-api :: functionalities/process_crash_info/TestProcessCrashInfo.py lldb-api :: functionalities/backticks/TestBackticksWithoutATarget.py lldb-api :: python_api/sbvalue_const_addrof/TestSBValueConstAddrOf.py lldb-api :: commands/register/register/aarch64_sve_registers/rw_access_static_config/TestSVERegisters.py lldb-api :: commands/help/TestHelp.py lldb-api :: commands/expression/import-std-module/no-std-module/TestMissingStdModule.py lldb-api :: commands/expression/timeout/TestCallWithTimeout.py lldb-api :: commands/expression/persistent_variables/TestPersistentVariables.py lldb-api :: functionalities/thread/concurrent_events/TestConcurrentNWatchNBreak.py lldb-api :: functionalities/thread/ignore_suspended/TestIgnoreSuspendedThread.py lldb-api :: functionalities/memory/cache/TestMemoryCache.py lldb-api :: functionalities/data-formatter/data-formatter-stl/libstdcpp/list/TestDataFormatterStdList.py lldb-api :: commands/expression/import-std-module/pair/TestPairFromStdModule.py lldb-api :: lang/c/shared_lib_stripped_symbols/TestSharedLibStrippedSymbols.py lldb-api :: functionalities/thread/concurrent_events/TestConcurrentTwoBreakpointsOneSignal.py lldb-api :: functionalities/tail_call_frames/ambiguous_tail_call_seq2/TestAmbiguousTailCallSeq2.py lldb-api :: functionalities/thread/concurrent_events/TestConcurrentWatchBreakDelay.py lldb-api :: tools/lldb-server/inferior-crash/TestGdbRemoteSegFault.py lldb-api :: functionalities/gdb_remote_client/TestRestartBug.py lldb-api :: lang/cpp/chained-calls/TestCppChainedCalls.py lldb-api :: functionalities/thread/concurrent_events/TestConcurrentTwoWatchpointsOneBreakpoint.py lldb-api :: functionalities/data-formatter/data-formatter-stl/libstdcpp/smart_ptr/TestDataFormatterStdSmartPtr.py lldb-api :: functionalities/breakpoint/breakpoint_command/TestRegexpBreakCommand.py lldb-api :: lang/objc/exceptions/TestObjCExceptions.py lldb-api :: lang/cpp/constructors/TestCppConstructors.py lldb-api :: python_api/symbol-context/TestSymbolContext.py lldb-api :: functionalities/data-formatter/data-formatter-ptr-to-array/TestPtrToArrayFormatting.py lldb-api :: functionalities/data-formatter/builtin-formats/TestBuiltinFormats.py lldb-api :: iohandler/resize/TestIOHandlerResizeNoEditline.py lldb-api :: functionalities/float-display/TestFloatDisplay.py lldb-api :: lang/cpp/breakpoint-commands/TestCPPBreakpointCommands.py lldb-api :: functionalities/breakpoint/source_regexp/TestSourceRegexBreakpoints.py lldb-api :: lang/objc/modules-hash-mismatch/TestClangModulesHashMismatch.py lldb-api :: types/TestShortType.py lldb-api :: commands/trace/TestTraceStartStop.py lldb-api :: commands/watchpoints/watchpoint_commands/command/TestWatchpointCommandPython.py lldb-api :: lang/objc/objc-dyn-sbtype/TestObjCDynamicSBType.py lldb-api :: commands/watchpoints/step_over_watchpoint/TestStepOverWatchpoint.py lldb-api :: lang/objc/foundation/TestObjCMethods.py lldb-api :: functionalities/thread/concurrent_events/TestConcurrentDelayWatchBreak.py lldb-api :: functionalities/tail_call_frames/ambiguous_tail_call_seq1/TestAmbiguousTailCallSeq1.py lldb-api :: functionalities/data-formatter/data-formatter-objc/TestDataFormatterObjCNSURL.py lldb-api :: functionalities/data-formatter/data-formatter-stl/libcxx/map/TestDataFormatterLibccMap.py lldb-api :: functionalities/inferior-crashing/TestInferiorCrashing.py lldb-api :: commands/platform/sdk/TestPlatformSDK.py lldb-api :: benchmarks/expression/TestRepeatedExprs.py lldb-api :: types/TestCharType.py lldb-api :: functionalities/thread/concurrent_events/TestConcurrentCrashWithWatchpoint.py lldb-api :: functionalities/data-formatter/data-formatter-objc/TestDataFormatterObjCNSDate.py lldb-api :: commands/register/register/register_command/TestRegisters.py lldb-api :: commands/watchpoints/watchpoint_disable/TestWatchpointDisable.py lldb-api :: python_api/get-value-32bit-int/TestGetValue32BitInt.py lldb-api :: functionalities/step_scripted/TestStepScripted.py lldb-api :: lang/cpp/stl/TestSTL.py lldb-api :: commands/command/script/TestCommandScript.py lldb-api :: lang/c/stepping/TestThreadStepInAvoidRegexp.py lldb-api :: commands/expression/rdar42038760/TestScalarURem.py lldb-api :: functionalities/thread/concurrent_events/TestConcurrentCrashWithSignal.py lldb-api :: assert_messages_test/TestAssertMessages.py lldb-api :: functionalities/gdb_remote_client/TestGDBRemoteLoad.py lldb-api :: commands/expression/import-std-module/sysroot/TestStdModuleSysroot.py lldb-api :: functionalities/tsan/cpp_global_location/TestTsanCPPGlobalLocation.py lldb-api :: commands/platform/basic/TestPlatformCommand.py lldb-api :: commands/expression/import-std-module/shared_ptr/TestSharedPtrFromStdModule.py lldb-api :: functionalities/thread/create_after_attach/TestCreateAfterAttach.py lldb-api :: lang/objc/objc-ivar-stripped/TestObjCIvarStripped.py lldb-api :: functionalities/thread/jump/TestThreadJump.py lldb-api :: lang/cpp/elaborated-types/TestElaboratedTypes.py lldb-api :: lang/objc/objc-static-method-stripped/TestObjCStaticMethodStripped.py lldb-api :: python_api/value/empty_class/TestValueAPIEmptyClass.py lldb-api :: commands/apropos/with-process/TestAproposWithProcess.py lldb-api :: commands/expression/radar_8638051/Test8638051.py lldb-api :: functionalities/tsan/global_location/TestTsanGlobalLocation.py lldb-api :: commands/expression/calculator_mode/TestCalculatorMode.py lldb-api :: functionalities/thread/concurrent_events/TestConcurrentTwoBreakpointThreads.py lldb-api :: functionalities/step-avoids-no-debug/TestStepNoDebug.py lldb-api :: functionalities/tsan/thread_leak/TestTsanThreadLeak.py lldb-api :: functionalities/data-formatter/refpointer-recursion/TestDataFormatterRefPtrRecursion.py lldb-api :: lang/c/modules/TestCModules.py lldb-api :: python_api/section/TestSectionAPI.py lldb-api :: lang/cpp/incomplete-types/TestCppIncompleteTypes.py lldb-api :: commands/expression/argument_passing_restrictions/TestArgumentPassingRestrictions.py lldb-api :: commands/expression/weak_symbols/TestWeakSymbols.py lldb-api :: lang/objc/objc-struct-argument/TestObjCStructArgument.py lldb-api :: functionalities/thread/backtrace_limit/TestBacktraceLimit.py lldb-api :: functionalities/thread/exit_during_step/TestExitDuringStep.py lldb-api :: functionalities/exec/TestExec.py lldb-api :: lang/objc/objc-dynamic-value/TestObjCDynamicValue.py lldb-api :: functionalities/thread/exit_during_break/TestExitDuringBreak.py lldb-api :: tools/lldb-server/libraries-svr4/TestGdbRemoteLibrariesSvr4Support.py lldb-api :: lang/cpp/std-function-step-into-callable/TestStdFunctionStepIntoCallable.py lldb-api :: functionalities/data-formatter/data-formatter-objc/TestDataFormatterObjCNSContainer.py lldb-api :: commands/expression/codegen-crash-import-def-arraytype-element/TestImportDefinitionArrayType.py lldb-api :: functionalities/var_path/TestVarPath.py lldb-api :: functionalities/inline-stepping/TestInlineStepping.py lldb-api :: commands/expression/expr-in-syscall/TestExpressionInSyscall.py lldb-api :: functionalities/gdb_remote_client/TestQemuAArch64TargetXml.py lldb-api :: commands/watchpoints/hello_watchlocation/TestWatchLocation.py lldb-api :: functionalities/thread/exit_during_expression/TestExitDuringExpression.py lldb-api :: python_api/lldbutil/iter/TestRegistersIterator.py lldb-api :: functionalities/paths/TestPaths.py lldb-api :: commands/target/stop-hooks/TestStopHookScripted.py lldb-api :: functionalities/pointer_num_children/TestPointerNumChildren.py lldb-api :: lang/objc/bitfield_ivars/TestBitfieldIvars.py lldb-api :: commands/version/TestVersion.py lldb-api :: functionalities/param_entry_vals/basic_entry_values/TestBasicEntryValues.py lldb-api :: functionalities/data-formatter/data-formatter-stl/libstdcpp/string/TestDataFormatterStdString.py lldb-api :: functionalities/thread/concurrent_events/TestConcurrentTwoBreakpointsOneDelaySignal.py lldb-api :: lang/cpp/namespace/TestNamespace.py lldb-api :: commands/target/stop-hook/enable/TestTargetStopHookEnable.py lldb-api :: functionalities/jitloader_gdb/TestJITLoaderGDB.py lldb-api :: linux/aarch64/mte_memory_region/TestAArch64LinuxMTEMemoryRegion.py lldb-api :: functionalities/tsan/multiple/TestTsanMultiple.py lldb-api :: lang/objc/objc-struct-return/TestObjCStructReturn.py lldb-api :: lang/c/typedef/Testtypedef.py lldb-api :: lang/cpp/typedef/TestCppTypedef.py lldb-api :: functionalities/data-formatter/data-formatter-objc/TestDataFormatterObjCNSData.py lldb-api :: commands/expression/import-std-module/list/TestListFromStdModule.py lldb-api :: macosx/universal/TestUniversal.py lldb-api :: functionalities/data-formatter/data-formatter-stl/libstdcpp/map/TestDataFormatterStdMap.py lldb-api :: commands/watchpoints/variable_out_of_scope/TestWatchedVarHitWhenInScope.py lldb-api :: lang/cpp/static_members/TestCPPStaticMembers.py lldb-api :: functionalities/breakpoint/hardware_breakpoints/hardware_breakpoint_on_multiple_threads/TestHWBreakMultiThread.py lldb-api :: sanity/TestModuleCacheSanity.py lldb-api :: commands/expression/import-std-module/empty-module/TestEmptyStdModule.py lldb-api :: lang/objc/print-obj/TestPrintObj.py lldb-api :: lang/cpp/template-function/TestTemplateFunctions.py lldb-api :: commands/expression/call-function/TestCallUserDefinedFunction.py lldb-api :: functionalities/gdb_remote_client/TestNoGPacketSupported.py lldb-api :: python_api/sbdata/TestSBData.py lldb-api :: commands/expression/call-restarts/TestCallThatRestarts.py lldb-api :: python_api/watchpoint/condition/TestWatchpointConditionAPI.py lldb-api :: benchmarks/expression/TestExpressionCmd.py lldb-api :: functionalities/thread/concurrent_events/TestConcurrentBreakpointOneDelayBreakpointThreads.py lldb-api :: commands/expression/call-function/TestCallStdStringFunction.py lldb-api :: functionalities/postmortem/minidump/TestMiniDump.py lldb-api :: functionalities/thread/concurrent_events/TestConcurrentTwoWatchpointsOneSignal.py lldb-api :: tools/lldb-server/TestAppleSimulatorOSType.py lldb-api :: commands/watchpoints/watchpoint_commands/command/TestWatchpointCommandLLDB.py lldb-api :: benchmarks/startup/TestStartupDelays.py lldb-api :: lang/c/unicode/TestUnicodeSymbols.py lldb-api :: functionalities/set-data/TestSetData.py lldb-api :: tools/lldb-vscode/launch/TestVSCode_launch.py lldb-api :: python_api/module_section/TestModuleAndSection.py lldb-api :: functionalities/reproducers/attach/TestReproducerAttach.py lldb-api :: python_api/lldbutil/iter/TestLLDBIterator.py lldb-api :: commands/expression/inline-namespace/TestInlineNamespace.py lldb-api :: commands/trace/TestTraceSchema.py lldb-api :: lang/objc/objc-baseclass-sbtype/TestObjCBaseClassSBType.py lldb-api :: functionalities/darwin_log/filter/regex/category/TestDarwinLogFilterRegexCategory.py lldb-api :: functionalities/gdb_remote_client/TestPlatformClient.py lldb-api :: functionalities/breakpoint/hardware_breakpoints/write_memory_with_hw_breakpoint/TestWriteMemoryWithHWBreakpoint.py lldb-api :: functionalities/dead-strip/TestDeadStrip.py lldb-api :: lang/cpp/gmodules/TestWithModuleDebugging.py lldb-api :: api/command-return-object/TestSBCommandReturnObject.py lldb-api :: lang/objc/objc-foundation-dictionary-empty/TestNSDictionary0.py lldb-api :: commands/command/script/import/TestImport.py lldb-api :: commands/log/invalid-args/TestInvalidArgsLog.py lldb-api :: lang/cpp/inlines/TestInlines.py lldb-api :: commands/process/launch/TestProcessLaunch.py lldb-api :: functionalities/postmortem/elf-core/gcore/TestGCore.py lldb-api :: commands/expression/namespace_local_var_same_name_obj_c/TestNamespaceLocalVarSameNameObjC.py lldb-api :: functionalities/data-formatter/data-formatter-stl/libstdcpp/unique_ptr/invalid/TestDataFormatterInvalidStdUniquePtr.py lldb-api :: python_api/lldbutil/TestSwigVersion.py lldb-api :: lang/c/step-target/TestStepTarget.py lldb-api :: lang/objc/objc-ivar-offsets/TestObjCIvarOffsets.py lldb-api :: functionalities/data-formatter/data-formatter-stl/libcxx/vbool/TestDataFormatterLibcxxVBool.py lldb-api :: lang/objc/foundation/TestObjectDescriptionAPI.py lldb-api :: functionalities/thread/thread_exit/TestThreadExit.py lldb-api :: functionalities/unwind/noreturn/TestNoreturnUnwind.py lldb-api :: functionalities/data-formatter/data-formatter-objc/TestDataFormatterObjCNSError.py lldb-api :: python_api/sbplatform/TestSBPlatform.py lldb-api :: python_api/function_symbol/TestSymbolAPI.py lldb-api :: functionalities/gdb_remote_client/TestNestedRegDefinitions.py lldb-api :: functionalities/data-formatter/data-formatter-stl/libcxx/optional/TestDataFormatterLibcxxOptional.py lldb-api :: commands/expression/call-function/TestCallStopAndContinue.py lldb-api :: lang/cpp/enum_types/TestCPP11EnumTypes.py lldb-api :: commands/command/invalid-args/TestInvalidArgsCommand.py lldb-api :: commands/expression/static-initializers/TestStaticInitializers.py lldb-api :: tools/lldb-server/TestGdbRemoteSingleStep.py lldb-api :: commands/expression/char/TestExprsChar.py lldb-api :: commands/target/select/TestTargetSelect.py lldb-api :: lang/cpp/char8_t/TestCxxChar8_t.py lldb-api :: functionalities/postmortem/elf-core/thread_crash/TestLinuxCoreThreads.py lldb-api :: benchmarks/libcxxmap/TestBenchmarkLibcxxMap.py lldb-api :: macosx/find-dsym/deep-bundle/TestDeepBundle.py lldb-api :: commands/expression/import-std-module/forward_list-dbg-info-content/TestDbgInfoContentForwardListFromStdModule.py lldb-api :: functionalities/data-formatter/data-formatter-advanced/TestDataFormatterAdv.py lldb-api :: commands/watchpoints/watchpoint_on_vectors/TestValueOfVectorVariable.py lldb-api :: tools/lldb-server/memory-allocation/TestGdbRemoteMemoryAllocation.py lldb-api :: python_api/sblaunchinfo/TestSBLaunchInfo.py lldb-api :: functionalities/gdb_remote_client/TestArmRegisterDefinition.py lldb-api :: functionalities/return-value/TestReturnValue.py lldb-api :: tools/lldb-server/TestGdbRemoteModuleInfo.py lldb-api :: functionalities/data-formatter/data-formatter-stl/libcxx/multimap/TestDataFormatterLibccMultiMap.py lldb-api :: python_api/sbstructureddata/TestStructuredDataAPI.py lldb-api :: functionalities/data-formatter/data-formatter-skip-summary/TestDataFormatterSkipSummary.py lldb-api :: sanity/TestSettingSkipping.py lldb-api :: commands/expression/import_builtin_fileid/TestImportBuiltinFileID.py lldb-api :: functionalities/data-formatter/data-formatter-stl/libcxx/function/TestLibCxxFunction.py lldb-api :: driver/batch_mode/TestBatchMode.py lldb-api :: lang/cpp/global_operators/TestCppGlobalOperators.py lldb-api :: functionalities/gdb_remote_client/TestIOSSimulator.py lldb-api :: functionalities/darwin_log/filter/regex/subsystem/TestDarwinLogFilterRegexSubsystem.py lldb-api :: lang/cpp/dynamic-value/TestCppValueCast.py lldb-api :: lang/objc/hidden-ivars/TestHiddenIvars.py lldb-api :: functionalities/optimized_code/TestNoASanExceptionAfterEvalOP_piece.py lldb-api :: functionalities/breakpoint/scripted_bkpt/TestScriptedResolver.py lldb-api :: commands/expression/dont_allow_jit/TestAllowJIT.py lldb-api :: functionalities/limit-debug-info/TestLimitDebugInfo.py lldb-api :: commands/expression/radar_9673664/TestExprHelpExamples.py lldb-api :: functionalities/breakpoint/breakpoint_in_delayslot/TestAvoidBreakpointInDelaySlot.py lldb-api :: functionalities/data-formatter/parray/TestPrintArray.py lldb-api :: functionalities/data-formatter/data-formatter-stl/libcxx/atomic/TestLibCxxAtomic.py lldb-api :: functionalities/gdb_remote_client/TestJLink6Armv7RegisterDefinition.py lldb-api :: tools/lldb-server/commandline/TestStubSetSID.py lldb-api :: functionalities/darwin_log/filter/exact_match/activity/TestDarwinLogFilterMatchActivity.py lldb-api :: tools/lldb-server/signal-filtering/TestGdbRemote_QPassSignals.py lldb-api :: commands/expression/completion-crash-invalid-iterator/TestInvalidIteratorCompletionCrash.py lldb-api :: functionalities/gdb_remote_client/TestStopPCs.py lldb-api :: commands/target/auto-install-main-executable/TestAutoInstallMainExecutable.py lldb-api :: commands/watchpoints/hello_watchpoint/TestMyFirstWatchpoint.py lldb-api :: arm/emulation/TestEmulations.py lldb-api :: functionalities/type_lookup/TestTypeLookup.py lldb-api :: commands/expression/import-std-module/stack/TestStackFromStdModule.py lldb-api :: commands/expression/import-std-module/vector-of-vectors/TestVectorOfVectorsFromStdModule.py lldb-api :: lang/cpp/stl/TestStdCXXDisassembly.py lldb-api :: tools/lldb-server/TestGdbRemoteRegisterState.py lldb-api :: types/TestIntegerType.py lldb-api :: functionalities/darwin_log/filter/exact_match/subsystem/TestDarwinLogFilterMatchSubsystem.py lldb-api :: commands/expression/import-std-module/shared_ptr-dbg-info-content/TestSharedPtrDbgInfoContentFromStdModule.py lldb-api :: functionalities/postmortem/elf-core/TestLinuxCore.py lldb-api :: functionalities/data-formatter/data-formatter-categories/TestDataFormatterCategories.py lldb-api :: functionalities/thread/step_until/TestStepUntil.py lldb-api :: functionalities/data-formatter/data-formatter-objc/nsstring/TestDataFormatterNSString.py lldb-api :: lang/cpp/gmodules-templates/TestGModules.py lldb-api :: functionalities/breakpoint/breakpoint_command/TestBreakpointCommandsFromPython.py lldb-api :: macosx/nslog/TestDarwinNSLogOutput.py lldb-api :: iohandler/unicode/TestUnicode.py lldb-api :: functionalities/thread/backtrace_all/TestBacktraceAll.py lldb-api :: commands/expression/entry-bp/TestExprEntryBP.py lldb-api :: functionalities/data-formatter/data-formatter-script/TestDataFormatterScript.py lldb-api :: lang/objc/ptr_refs/TestPtrRefsObjC.py lldb-api :: lang/cpp/class_types/TestClassTypes.py lldb-api :: lang/cpp/exceptions/TestCPPExceptionBreakpoints.py lldb-api :: python_api/sbtype_typeclass/TestSBTypeTypeClass.py lldb-api :: functionalities/thread_plan/TestThreadPlanCommands.py lldb-api :: functionalities/data-formatter/vector-types/TestVectorTypesFormatting.py lldb-api :: commands/breakpoint/set/func-regex/TestBreakpointRegexError.py lldb-api :: api/check_public_api_headers/TestPublicAPIHeaders.py lldb-api :: source-manager/TestSourceManager.py lldb-api :: functionalities/multidebugger_commands/TestMultipleDebuggersCommands.py lldb-api :: functionalities/data-formatter/data-formatter-objc/TestDataFormatterObjCNSBundle.py lldb-api :: functionalities/thread/concurrent_events/TestConcurrentDelayedCrashWithBreakpointWatchpoint.py lldb-api :: functionalities/breakpoint/breakpoint_names/TestBreakpointNames.py lldb-api :: commands/frame/diagnose/dereference-argument/TestDiagnoseDereferenceArgument.py lldb-api :: lang/objc/real-definition/TestRealDefinition.py lldb-api :: functionalities/data-formatter/nsarraysynth/TestNSArraySynthetic.py lldb-api :: functionalities/gdb_remote_client/TestAArch64XMLRegOffsets.py lldb-api :: functionalities/thread/thread_specific_break/TestThreadSpecificBreakpoint.py lldb-api :: types/TestDoubleTypes.py lldb-api :: functionalities/breakpoint/breakpoint_hit_count/TestBreakpointHitCount.py lldb-api :: macosx/find-dsym/bundle-with-dot-in-filename/TestBundleWithDotInFilename.py lldb-api :: lang/objc/global_ptrs/TestGlobalObjects.py lldb-api :: python_api/sbenvironment/TestSBEnvironment.py lldb-api :: lang/c/bitfields/TestBitfields.py lldb-api :: functionalities/breakpoint/auto_continue/TestBreakpointAutoContinue.py lldb-api :: linux/thread/create_during_instruction_step/TestCreateDuringInstructionStep.py lldb-api :: commands/expression/import-std-module/vector/TestVectorFromStdModule.py lldb-api :: lang/c/record_decl_in_expr/TestRecordDeclInExpr.py lldb-api :: functionalities/tail_call_frames/disambiguate_tail_call_seq/TestDisambiguateTailCallSeq.py lldb-api :: lang/cpp/typeof/TestTypeOfDeclTypeExpr.py lldb-api :: commands/gui/viewlarge/TestGuiViewLarge.py

Hide Details

Hide Details

Testing Time: 193.02s Unsupported : 72 Passed : 1252 Expectedly Failed: 11 Failed : 905 FAILED: tools/lldb/test/CMakeFiles/check-lldb-lit cd /Users/buildslave/jenkins/workspace/lldb-cmake/lldb-build/tools/lldb/test && /usr/local/Frameworks/Python.framework/Versions/3.7/bin/python3.7 /Users/buildslave/jenkins/workspace/lldb-cmake/lldb-build/./bin/llvm-lit -v --time-tests --shuffle --xunit-xml-output=/Users/buildslave/jenkins/workspace/lldb-cmake/test/results.xml -v -j 4 /Users/buildslave/jenkins/workspace/lldb-cmake/lldb-build/tools/lldb/test ninja: build stopped: subcommand failed. Command failed: Command '['/usr/bin/env', 'TERM=vt100', '/usr/local/bin/ninja', '-v', 'check-lldb']' returned non-zero exit status 1 Command: ['/usr/bin/env', 'TERM=vt100', '/usr/local/bin/ninja', '-v', 'check-lldb'] [Pipeline] } [Pipeline] // timeout [Pipeline] } [Pipeline] // stage [Pipeline] stage [Pipeline] { (Declarative: Post Actions) [Pipeline] scanForIssues [Clang (LLVM based)] Sleeping for 5 seconds due to JENKINS-32191... [Clang (LLVM based)] Parsing console log (workspace: '/Users/buildslave/jenkins/workspace/lldb-cmake') [Clang (LLVM based)] Successfully parsed console log [Clang (LLVM based)] -> found 10 issues (skipped 15 duplicates) [Clang (LLVM based)] Post processing issues on 'green-dragon-10' with source code encoding 'UTF-8' [Clang (LLVM based)] Creating SCM blamer to obtain author and commit information for affected files [Clang (LLVM based)] Creating SCM miner to obtain statistics for affected repository files [Clang (LLVM based)] Resolving file names for all issues in source directory '/Users/buildslave/jenkins/workspace/lldb-cmake' [Clang (LLVM based)] -> resolved paths in source directory (7 found, 0 not found) [Clang (LLVM based)] Resolving module names from module definitions (build.xml, pom.xml, or Manifest.mf files) [Clang (LLVM based)] -> resolved module names for 10 issues [Clang (LLVM based)] Resolving package names (or namespaces) by parsing the affected files [Clang (LLVM based)] -> resolved package names of 7 affected files [Clang (LLVM based)] No filter has been set, publishing all 10 issues [Clang (LLVM based)] Creating fingerprints for all affected code blocks to track issues over different builds [Clang (LLVM based)] -> created fingerprints for 10 issues (skipped 0 issues) [Clang (LLVM based)] Copying affected files to Jenkins' build folder '/Users/Shared/Jenkins/Home/jobs/lldb-cmake/builds/25154/files-with-issues' [Clang (LLVM based)] -> 5 copied, 2 not in workspace, 0 not-found, 0 with I/O error [Pipeline] junit Recording test results [Pipeline] } [Pipeline] // stage [Pipeline] } [Pipeline] // withEnv [Pipeline] } [Pipeline] // node [Pipeline] End of Pipeline [Checks API] No suitable checks publisher found. ERROR: script returned exit code 1 Finished: FAILURE