FailedConsole Output

Skipping 7,956 KB.. Full Log
tring *) str12 = 0x0000606000008f00 @"Process Name:  a.out Process Id:  93488"
(NSString *) strA1 = 0x0000606000008f60 @"A rather short ASCII NSString object is here"
(NSString *) strA2 = 0x0000606000008fc0 @"A rather short UTF8 NSString object is here"
(NSString *) strA3 = 0x0000000100006170 @"A string made with the at sign is here"
(NSString *) strA4 = 0x0000606000009020 @"This is string number 4 right here"
(NSString *) strA5 = 0x00006040000019d0 @"{{1, 1}, {5, 5}}"
(NSString *) strA6 = 0x00006030000032e0 @"1ST"
(NSString *) strA7 = 0x0000603000003310 @"σxx"
(NSString *) strA8 = 0x000061b000001580 @"hasVeryLongExtensionThisTimehasVeryLongExtensionThisTimehasVeryLongExtensionThisTimehasVeryLongExtensionThisTimehasVeryLongExtensionThisTimehasVeryLongExtensionThisTimehasVeryLongExtensionThisTimehasVeryLongExtensionThisTimehasVeryLongExtensionThisTimehasVeryLongExtensionThisTimehasVeryLongExtensionThisTimehasVeryLongExtensionThisTimehasVeryLongExtensionThisTimehasVeryLongExtensionThisTimehasVeryLongExtensionThisTimehasVeryLongExtensionThisTimehasVeryLongExtensionThisTimehasVeryLongExtensionThisTimehasVeryLongExtensionThisTimehasVeryLongExtensionThisTimehasVeryLongExtensionThisTimehasVeryLongExtensionThisTimehasVeryLongExtensionThisTimehasVeryLongExtensionThisTimehasVeryLongExtensionThisTimehasVeryLongExtensionThisTimehasVeryLongExtensionThisTimehasVeryLongExtensionThisTime"
(NSString *) strA9 = 0x000060d000001e50 @"a very much boring task to write a string this way!!σ\0"
(NSString *) strA10 = 0x000060c000002680 @"This is a Unicode string σ number 4 right here"
(NSString *) strA11 = 0x0000603000003340 @"__NSCFString"
(NSString *) strA12 = 0x0000606000009080 @"Process Name:  a.out Process Id:  93488"
(NSString *) strB1 = 0x00006060000090e0 @"A rather short ASCII NSString object is here"
(NSString *) strB2 = 0x0000606000009140 @"A rather short UTF8 NSString object is here"
(NSString *) strB3 = 0x0000000100006170 @"A string made with the at sign is here"
(NSString *) strB4 = 0x00006060000091a0 @"This is string number 4 right here"
(NSString *) strB5 = 0x0000604000001b10 @"{{1, 1}, {5, 5}}"
(NSString *) strB6 = 0x0000603000003370 @"1ST"
(NSString *) strB7 = 0x00006030000033a0 @"σxx"
(NSString *) strB8 = 0x000061b000002380 @"hasVeryLongExtensionThisTimehasVeryLongExtensionThisTimehasVeryLongExtensionThisTimehasVeryLongExtensionThisTimehasVeryLongExtensionThisTimehasVeryLongExtensionThisTimehasVeryLongExtensionThisTimehasVeryLongExtensionThisTimehasVeryLongExtensionThisTimehasVeryLongExtensionThisTimehasVeryLongExtensionThisTimehasVeryLongExtensionThisTimehasVeryLongExtensionThisTimehasVeryLongExtensionThisTimehasVeryLongExtensionThisTimehasVeryLongExtensionThisTimehasVeryLongExtensionThisTimehasVeryLongExtensionThisTimehasVeryLongExtensionThisTimehasVeryLongExtensionThisTimehasVeryLongExtensionThisTimehasVeryLongExtensionThisTimehasVeryLongExtensionThisTimehasVeryLongExtensionThisTimehasVeryLongExtensionThisTimehasVeryLongExtensionThisTimehasVeryLongExtensionThisTimehasVeryLongExtensionThisTime"
(NSString *) strB9 = 0x000060d000001f20 @"a very much boring task to write a string this way!!σ\0"
(NSString *) strB10 = 0x000060c000002a40 @"This is a Unicode string σ number 4 right here"
(NSString *) strB11 = 0x00006030000033d0 @"__NSCFString"
(NSString *) strB12 = 0x0000606000009200 @"Process Name:  a.out Process Id:  93488"
(NSString *) strC11 = 0x0000603000003400 @"__NSCFString"
(NSString *) strC12 = 0x0000606000009260 @"Process Name:  a.out Process Id:  93488"
(NSString *) strC1 = 0x00006060000092c0 @"A rather short ASCII NSString object is here"
(NSString *) strC2 = 0x0000606000009320 @"A rather short UTF8 NSString object is here"
(NSString *) strC3 = 0x0000000100006170 @"A string made with the at sign is here"
(NSString *) strC4 = 0x0000606000009380 @"This is string number 4 right here"
(NSString *) strC5 = 0x0000604000001c90 @"{{1, 1}, {5, 5}}"
(NSString *) strC6 = 0x0000603000003430 @"1ST"
(NSString *) strC7 = 0x0000603000003460 @"σxx"
(NSString *) strC8 = 0x000061b000003180 @"hasVeryLongExtensionThisTimehasVeryLongExtensionThisTimehasVeryLongExtensionThisTimehasVeryLongExtensionThisTimehasVeryLongExtensionThisTimehasVeryLongExtensionThisTimehasVeryLongExtensionThisTimehasVeryLongExtensionThisTimehasVeryLongExtensionThisTimehasVeryLongExtensionThisTimehasVeryLongExtensionThisTimehasVeryLongExtensionThisTimehasVeryLongExtensionThisTimehasVeryLongExtensionThisTimehasVeryLongExtensionThisTimehasVeryLongExtensionThisTimehasVeryLongExtensionThisTimehasVeryLongExtensionThisTimehasVeryLongExtensionThisTimehasVeryLongExtensionThisTimehasVeryLongExtensionThisTimehasVeryLongExtensionThisTimehasVeryLongExtensionThisTimehasVeryLongExtensionThisTimehasVeryLongExtensionThisTimehasVeryLongExtensionThisTimehasVeryLongExtensionThisTimehasVeryLongExtensionThisTime"
(NSString *) strC9 = 0x000060d000001ff0 @"a very much boring task to write a string this way!!σ\0"
(NSString *) strC10 = 0x000060c000002ec0 @"This is a Unicode string σ number 4 right here"
(NSString *) strD11 = 0x0000603000003490 @"__NSCFString"
(NSString *) strD12 = 0x00006060000093e0 @"Process Name:  a.out Process Id:  93488"
(NSString *) eAcute = 0x00006030000034f0 @"é"
(NSString *) randomHaziChar = 0x0000603000003550 @"鷅"
(NSString *) japanese = 0x00000001000062b0 @"色は匂へど散りぬるを"
(NSString *) italian = 0x00000001000062d0 @"L'Italia è una Repubblica democratica, fondata sul lavoro. La sovranità appartiene al popolo, che la esercita nelle forme e nei limiti della Costituzione."
(NSString *) french = 0x00000001000062f0 @"Que veut cette horde d'esclaves, De traîtres, de rois conjurés?"
(NSString *) german = 0x0000000100006310 @"Über-Ich und aus den Ansprüchen der sozialen Umwelt"
(void *[3]) data_set = ([0] = 0x0000606000008ba0, [1] = 0x0000606000008c00, [2] = 0x0000000100006170)
(NSString *) hebrew = 0x0000000100006330 @"לילה טוב"
(NSArray *) newArray = 0x0000604000001dd0 @"50 elements"
(NSDictionary *) newDictionary = 0x0000619000001980 12 key/value pairs
(NSDictionary *) newMutableDictionary = 0x0000603000003610 21 key/value pairs
(id [4]) cfKeys = {
  [0] = 0x0000000100006350
  [1] = 0x0000000100006610
  [2] = 0x0000000100006630
  [3] = 0x0000000100006650
}
(id [4]) cfValues = {
  [0] = 0x0000000100006350
  [1] = 0x0000000100006610
  [2] = 0x0000000100006630
  [3] = 0x0000000100006650
}
(NSDictionary *) nsDictionary = 0x00006060000095c0 2 key/value pairs
(NSDictionary *) nscfDictionary = 0x0000606000009620 4 key/value pairs
(CFDictionaryRef) cfDictionaryRef = 0x00006060000095c0 2 key/value pairs
(NSAttributedString *) attrString = 0x00006030000036a0 @"hello world from foo"
(NSAttributedString *) mutableAttrString = 0x0000603000003790 @"hello world from foo"
(NSString *) mutableString = 0x0000604000001f90 @"foo said this string needs to be very long so much longer than whatever other string has been seen ever before by anyone of the mankind that of course this is still not long enough given what foo our friend foo our lovely dearly friend foo desired of us so i am adding more stuff here for the sake of it and for the joy of our friend who is named guess what just foo. hence, dear friend foo, stay safe, your string is now  long enough to accommodate your testing need and I will make sure that if not we extend it with even more fuzzy random meaningless words pasted one after the other from a long tiresome friday evening spent working in my office. my office mate went home but I am still randomly typing just for the fun of seeing what happens of the length of a Mutable String in Cocoa if it goes beyond one byte.. so be it, dear foo"
(NSString *) mutableGetConst = 0x0000618000000080 @"foo said this string needs to be very long so much longer than whatever other string has been seen ever before by anyone of the mankind that of course this is still not long enough given what foo our friend foo our lovely dearly friend foo desired of us so i am adding more stuff here for the sake of it and for the joy of our friend who is named guess what just foo. hence, dear friend foo, stay safe, your string is now  long enough to accommodate your testing need and I will make sure that if not we extend it with even more fuzzy random meaningless words pasted one after the other from a long tiresome friday evening spent working in my office. my office mate went home but I am still randomly typing just for the fun of seeing what happens of the length of a Mutable String in Cocoa if it goes beyond one byte.. so be it, dear foo"
(NSData *) immutableData = 0x00006030000037f0 5 bytes
(NSData *) mutableData = 0x0000604000002010 14 bytes
(unsigned int) concreteLength = 100000
(void *) zeroes1 = 0x0000633000000800
(NSData *) concreteData = 0x0000603000003820 100000 bytes
(void *) zeroes2 = 0x000063300001c800
(NSMutableData *) concreteMutableData = 0x0000604000002050 100000 bytes
(NSSet *) nsset = 0x0000604000002090 3 elements
(NSSet *) nsmutableset = 0x0000603000003880 4 elements
(NSSet *) nscfSet = 0x00006040000020d0 2 elements
(CFSetRef) cfSetRef = 0x00006040000020d0 2 elements
(CFDataRef) data_ref = 0x0000607000003f20 @"5 bytes"
(CFMutableDataRef) mutable_data_ref = 0x0000607000003f90 @"5 bytes"
(CFMutableStringRef) mutable_string_ref = 0x0000604000002110 @"Wish ya knew"
(CFStringRef) cfstring_ref = 0x00000001000066d0 @"HELLO WORLD"
(CFArrayRef) cfarray_ref = 0x0000607000004000 @"3 elements"
(CFMutableArrayRef) mutable_array_ref = 0x0000604000002150 @"11 elements"
(CFBinaryHeapRef) binheap_ref = 0x000060c000003640 @"21 items"
(CFURLRef) cfurl_ref = 0x000060b000002350 @"http://www.foo.bar/"
(CFURLRef) cfchildurl_ref = 0x00006070000040e0 @"page.html -- http://www.foo.bar/"
(CFURLRef) cfgchildurl_ref = 0x0000607000004150 @"?whatever -- http://www.foo.bar/page.html"
(NSDictionary *) error_userInfo = 0x0000606000009e60 2 key/value pairs
(NSError *) nserror = 0x0000604000002290 domain: @"Foobar" - code: 12
(NSError **) nserrorptr = 0x00007ffeefbfee28 domain: @"Foobar" - code: 12
(NSBundle *) bundle_string = 0x0000607000004310 @"/System/Library/Frameworks/Accelerate.framework"
(NSBundle *) bundle_url = 0x0000607000004af0 @"/System/Library/Frameworks/Foundation.framework"
(NSBundle *) main_bundle = 0x0000607000004cb0 @"/Users/buildslave/jenkins/workspace/lldb-cmake-sanitized/lldb-build/lldb-test-build.noindex/functionalities/data-formatter/data-formatter-objc/TestDataFormatterObjCCF.test_coreframeworks_and_run_command_dwarf"
(NSArray *) bundles = 0x0000604000002450 @"1 element"
(NSURL *) nsurl0 = 0x0000608000001320 @"file:///Users/buildslave/jenkins/workspace/lldb-cmake-sanitized/lldb-build/lldb-test-build.noindex/functionalities/data-formatter/data-formatter-objc/TestDataFormatterObjCCF.test_coreframeworks_and_run_command_dwarf/"
(NSException *) except0 = 0x00006040000024d0 @"First"
(NSException *) except1 = 0x0000604000002510 @"Second"
(NSException *) except2 = 0x0000604000002550 @"Third"
(NSException *) except3 = 0x0000604000002590 @"Fourth"
(NSURL *) nsurl = 0x000060b0000028d0 @"http://www.foo.bar"
(NSURL *) nsurl2 = 0x0000607000004ee0 @"page.html -- http://www.foo.bar"
(NSURL *) nsurl3 = 0x0000607000004f50 @"?whatever -- http://www.foo.bar/page.html"
(NSDate *) date1 = 0x9a11f894372fdf59 1985-04-10 18:00:00 UTC
(NSDate *) date2 = 0x0000604000008e90 2011-01-01 08:00:00 UTC
(NSDate *) date3 = 0x0000602000003bb0 2020-05-30 01:51:35 UTC
(NSDate *) date4 = 0x9a614b53d72fdf59 1970-01-02 00:00:00 UTC
(NSDate *) date5 = 0x1a6e2c9184afdf59 2020-05-30 01:51:35 UTC
(CFAbsoluteTime) date1_abs = 1985-04-10 10:00:00 PST
(CFAbsoluteTime) date2_abs = 2011-01-01 00:00:00 PST
(CFAbsoluteTime) date3_abs = 2020-05-29 18:51:35 PDT
(CFAbsoluteTime) date4_abs = 1970-01-01 16:00:00 PST
(CFAbsoluteTime) date5_abs = 2020-05-29 18:51:35 PDT
(NSIndexSet *) iset1 = 0x0000603000009760 4 indexes
(NSIndexSet *) iset2 = 0x0000603000009790 512 indexes
(NSMutableIndexSet *) imset = 0x0000604000008f10 10 indexes
(CFTimeZoneRef) cupertino = 0x0000608000001a20 @"America/Los_Angeles"
(CFTimeZoneRef) home = 0x0000608000001ba0 @"Europe/Rome"
(CFTimeZoneRef) europe = 0x0000608000001d20 @"Europe/Paris"
(NSTimeZone *) cupertino_ns = 0x0000608000001a20 @"America/Los_Angeles"
(NSTimeZone *) home_ns = 0x0000608000001ba0 @"Europe/Rome"
(NSTimeZone *) europe_ns = 0x0000608000001d20 @"Europe/Paris"
(CFGregorianUnits) cf_greg_units = 1 years, 3 months, 5 days, 12 hours, 5 minutes 7 seconds
(CFGregorianDate) cf_greg_date = @"4/10/1985 18:0:0"
(CFRange) cf_range = location=4 length=4
(NSPoint) ns_point = (x = 4, y = 4)
(NSRange) ns_range = location=4, length=4
(NSRect) ns_rect = (origin = (x = 1, y = 1), size = (width = 5, height = 5))
(NSRect *) ns_rect_ptr = (origin = (x = 1, y = 1), size = (width = 5, height = 5))
(NSRectArray) ns_rect_arr = ((x = 1, y = 1), (width = 5, height = 5)), ...
(NSSize) ns_size = (width = 5, height = 7)
(NSSize *) ns_size_ptr = (width = 5, height = 7)
(CGSize) cg_size = (width = 1, height = 6)
(CGPoint) cg_point = (x = 2, y = 7)
(CGRect) cg_rect = (origin = (x = 1, y = 2), size = (width = 7, height = 7))
(RGBColor) rgb_color = red=3 green=56 blue=35
(RGBColor *) rgb_color_ptr = red=3 green=56 blue=35
(Rect) rect = (t=4, l=8, b=4, r=7)
(Rect *) rect_ptr = (t=4, l=8, b=4, r=7)
(Point) point = (v=7, h=12)
(Point *) point_ptr = (v=7, h=12)
(HIPoint) hi_point = (x=7, y=12)
(HIRect) hi_rect = origin=(x = 3, y = 5) size=(width = 4, height = 6)
(SEL) foo_selector = "foo_selector_impl"
(CFMutableBitVectorRef) mut_bv = 0x0000604000009490 1110 0110 1011 0000 1101 1010 1000 1111 0011 0101 1101 0001 00
(Molecule *) molecule = 0x0000602000003c50
(Class) myclass = NSValue
(Class) myclass2 = NSTaggedPointerString
(Class) myclass3 = Molecule
(Class) myclass4 = NSMutableArray
(Class) myclass5 = nil
(NSArray *) components = 0x00006040000094d0 @"3 elements"
(NSString *) path = 0x0000604000009510 @"usr/blah/stuff"

Hide Details

Hide Details

Expecting sub string: (CFGregorianUnits) cf_greg_units = 1 years, 3 months, 5 days, 12 hours, 5 minutes 7 seconds Matched

Hide Details

Expecting sub string: (CFGregorianDate) cf_greg_date = @"4/10/1985 18:0:0" Matched

Hide Details

Expecting sub string: (CFRange) cf_range = location=4 length=4 Matched

Hide Details

Expecting sub string: (NSPoint) ns_point = (x = 4, y = 4) Matched

Hide Details

Expecting sub string: (NSRange) ns_range = location=4, length=4 Matched

Hide Details

Expecting sub string: (NSRect) ns_rect = (origin = (x = 1, y = 1), size = (width = 5, height = 5)) Matched

Hide Details

Expecting sub string: (NSRectArray) ns_rect_arr = ((x = 1, y = 1), (width = 5, height = 5)), ... Matched

Hide Details

Expecting sub string: (NSSize) ns_size = (width = 5, height = 7) Matched

Hide Details

Expecting sub string: (CGSize) cg_size = (width = 1, height = 6) Matched

Hide Details

Expecting sub string: (CGPoint) cg_point = (x = 2, y = 7) Matched

Hide Details

Expecting sub string: (CGRect) cg_rect = (origin = (x = 1, y = 2), size = (width = 7, height = 7)) Matched

Hide Details

Expecting sub string: (Rect) rect = (t=4, l=8, b=4, r=7) Matched

Hide Details

Expecting sub string: (Rect *) rect_ptr = (t=4, l=8, b=4, r=7) Matched

Hide Details

Expecting sub string: (Point) point = (v=7, h=12) Matched

Hide Details

Expecting sub string: (Point *) point_ptr = (v=7, h=12) Matched

Hide Details

Expecting sub string: (SEL) foo_selector = "foo_selector_impl" Matched

Hide Details

runCmd: frame variable output: (int) argc = 1 (const char **) argv = 0x00007ffeefbff420 (NSAutoreleasePool *) pool = 0x00006040000016d0 (MyClass *) object = 0x0000603000002ef0 (MyOtherClass *) object2 = 0x0000603000002f20 (NSNumber *) num1 = 0x5bac6c68572fda73 (int)5 (NSNumber *) num2 = 0x0000603000002fb0 (float)3.140000 (NSNumber *) num3 = 0x0000603000002fe0 (double)3.14 (NSNumber *) num4 = 0x0000603000003010 (int128_t)18446744073709551614 (NSNumber *) num5 = 0x5bac6c68572f9e53 (char)65 (NSNumber *) num6 = 0x5bac6c68572f2063 (long)255 (NSNumber *) num7 = 0x5bac6c6849ab5f63 (long)2000000 (NSNumber *) num8_Y = 0x00007fff93b39c30 YES (NSNumber *) num8_N = 0x00007fff93b39c40 NO (NSNumber *) num9 = 0xa4539397a8ab5f43 (short)-31616 (NSNumber *) num_at1 = 0x5bac6c68572fd373 (int)12 (NSNumber *) num_at2 = 0xa4539397a8d02b73 (int)-12 (NSNumber *) num_at3 = 0x0000603000003040 (double)12.5 (NSNumber *) num_at4 = 0x0000603000003070 (double)-12.5 (NSDecimalNumber *) decimal_number = 0x00006030000030a0 123456 x 10^-10 (NSDecimalNumber *) decimal_number_neg = 0x00006030000030d0 -123456 x 10^10 (NSDecimalNumber *) decimal_one = 0x0000603000003100 1 x 10^0 (NSDecimalNumber *) decimal_zero = 0x0000602000002370 0 (NSDecimalNumber *) decimal_nan = 0x0000602000002390 NaN (NSString *) str0 = 0x5bac6c68621aed61 @"255" (NSString *) str1 = 0x0000606000008ba0 @"A rather short ASCII NSString object is here" (NSString *) str2 = 0x0000606000008c00 @"A rather short UTF8 NSString object is here" (NSString *) str3 = 0x0000000100006170 @"A string made with the at sign is here" (NSString *) str4 = 0x0000606000008c60 @"This is string number 4 right here" (NSRect) ns_rect_4str = (origin = (x = 1, y = 1), size = (width = 5, height = 5)) (NSString *) str5 = 0x0000604000001810 @"{{1, 1}, {5, 5}}" (NSString *) str6 = 0x00006030000031f0 @"1ST" (const unichar [3]) myCharacters = { [0] = U+03c3 u'σ' [1] = U+0078 u'x' [2] = U+0078 u'x' } (NSString *) str7 = 0x0000603000003220 @"σxx" (NSString *) str8 = 0x000061b000000780 @"hasVeryLongExtensionThisTimehasVeryLongExtensionThisTimehasVeryLongExtensionThisTimehasVeryLongExtensionThisTimehasVeryLongExtensionThisTimehasVeryLongExtensionThisTimehasVeryLongExtensionThisTimehasVeryLongExtensionThisTimehasVeryLongExtensionThisTimehasVeryLongExtensionThisTimehasVeryLongExtensionThisTimehasVeryLongExtensionThisTimehasVeryLongExtensionThisTimehasVeryLongExtensionThisTimehasVeryLongExtensionThisTimehasVeryLongExtensionThisTimehasVeryLongExtensionThisTimehasVeryLongExtensionThisTimehasVeryLongExtensionThisTimehasVeryLongExtensionThisTimehasVeryLongExtensionThisTimehasVeryLongExtensionThisTimehasVeryLongExtensionThisTimehasVeryLongExtensionThisTimehasVeryLongExtensionThisTimehasVeryLongExtensionThisTimehasVeryLongExtensionThisTimehasVeryLongExtensionThisTime" (const unichar [54]) myOtherCharacters = { [0] = U+0061 u'a' [1] = U+0020 u' ' [2] = U+0076 u'v' [3] = U+0065 u'e' [4] = U+0072 u'r' [5] = U+0079 u'y' [6] = U+0020 u' ' [7] = U+006d u'm' [8] = U+0075 u'u' [9] = U+0063 u'c' [10] = U+0068 u'h' [11] = U+0020 u' ' [12] = U+0062 u'b' [13] = U+006f u'o' [14] = U+0072 u'r' [15] = U+0069 u'i' [16] = U+006e u'n' [17] = U+0067 u'g' [18] = U+0020 u' ' [19] = U+0074 u't' [20] = U+0061 u'a' [21] = U+0073 u's' [22] = U+006b u'k' [23] = U+0020 u' ' [24] = U+0074 u't' [25] = U+006f u'o' [26] = U+0020 u' ' [27] = U+0077 u'w' [28] = U+0072 u'r' [29] = U+0069 u'i' [30] = U+0074 u't' [31] = U+0065 u'e' [32] = U+0020 u' ' [33] = U+0061 u'a' [34] = U+0020 u' ' [35] = U+0073 u's' [36] = U+0074 u't' [37] = U+0072 u'r' [38] = U+0069 u'i' [39] = U+006e u'n' [40] = U+0067 u'g' [41] = U+0020 u' ' [42] = U+0074 u't' [43] = U+0068 u'h' [44] = U+0069 u'i' [45] = U+0073 u's' [46] = U+0020 u' ' [47] = U+0077 u'w' [48] = U+0061 u'a' [49] = U+0079 u'y' [50] = U+0021 u'!' [51] = U+0021 u'!' [52] = U+03c3 u'σ' [53] = U+0000 u'\0' } (NSString *) str9 = 0x000060d000001be0 @"a very much boring task to write a string this way!!σ\0" (const unichar [2]) myNextCharacters = { [0] = U+03c3 u'σ' [1] = U+0000 u'\0' } (NSString *) str10 = 0x000060c000002200 @"This is a Unicode string σ number 4 right here" (NSString *) str11 = 0x0000603000003250 @"__NSCFString" (NSString *) label1 = 0x0000000100006210 @"Process Name: " (NSString *) label2 = 0x0000000100006230 @"Process Id: " (NSString *) processName = 0x5bac181d3801be01 @"a.out" (NSString *) processID = 0x5bac5450631ce601 @"93488" (NSString *) str12 = 0x0000606000008f00 @"Process Name: a.out Process Id: 93488" (NSString *) strA1 = 0x0000606000008f60 @"A rather short ASCII NSString object is here" (NSString *) strA2 = 0x0000606000008fc0 @"A rather short UTF8 NSString object is here" (NSString *) strA3 = 0x0000000100006170 @"A string made with the at sign is here" (NSString *) strA4 = 0x0000606000009020 @"This is string number 4 right here" (NSString *) strA5 = 0x00006040000019d0 @"{{1, 1}, {5, 5}}" (NSString *) strA6 = 0x00006030000032e0 @"1ST" (NSString *) strA7 = 0x0000603000003310 @"σxx" (NSString *) strA8 = 0x000061b000001580 @"hasVeryLongExtensionThisTimehasVeryLongExtensionThisTimehasVeryLongExtensionThisTimehasVeryLongExtensionThisTimehasVeryLongExtensionThisTimehasVeryLongExtensionThisTimehasVeryLongExtensionThisTimehasVeryLongExtensionThisTimehasVeryLongExtensionThisTimehasVeryLongExtensionThisTimehasVeryLongExtensionThisTimehasVeryLongExtensionThisTimehasVeryLongExtensionThisTimehasVeryLongExtensionThisTimehasVeryLongExtensionThisTimehasVeryLongExtensionThisTimehasVeryLongExtensionThisTimehasVeryLongExtensionThisTimehasVeryLongExtensionThisTimehasVeryLongExtensionThisTimehasVeryLongExtensionThisTimehasVeryLongExtensionThisTimehasVeryLongExtensionThisTimehasVeryLongExtensionThisTimehasVeryLongExtensionThisTimehasVeryLongExtensionThisTimehasVeryLongExtensionThisTimehasVeryLongExtensionThisTime" (NSString *) strA9 = 0x000060d000001e50 @"a very much boring task to write a string this way!!σ\0" (NSString *) strA10 = 0x000060c000002680 @"This is a Unicode string σ number 4 right here" (NSString *) strA11 = 0x0000603000003340 @"__NSCFString" (NSString *) strA12 = 0x0000606000009080 @"Process Name: a.out Process Id: 93488" (NSString *) strB1 = 0x00006060000090e0 @"A rather short ASCII NSString object is here" (NSString *) strB2 = 0x0000606000009140 @"A rather short UTF8 NSString object is here" (NSString *) strB3 = 0x0000000100006170 @"A string made with the at sign is here" (NSString *) strB4 = 0x00006060000091a0 @"This is string number 4 right here" (NSString *) strB5 = 0x0000604000001b10 @"{{1, 1}, {5, 5}}" (NSString *) strB6 = 0x0000603000003370 @"1ST" (NSString *) strB7 = 0x00006030000033a0 @"σxx" (NSString *) strB8 = 0x000061b000002380 @"hasVeryLongExtensionThisTimehasVeryLongExtensionThisTimehasVeryLongExtensionThisTimehasVeryLongExtensionThisTimehasVeryLongExtensionThisTimehasVeryLongExtensionThisTimehasVeryLongExtensionThisTimehasVeryLongExtensionThisTimehasVeryLongExtensionThisTimehasVeryLongExtensionThisTimehasVeryLongExtensionThisTimehasVeryLongExtensionThisTimehasVeryLongExtensionThisTimehasVeryLongExtensionThisTimehasVeryLongExtensionThisTimehasVeryLongExtensionThisTimehasVeryLongExtensionThisTimehasVeryLongExtensionThisTimehasVeryLongExtensionThisTimehasVeryLongExtensionThisTimehasVeryLongExtensionThisTimehasVeryLongExtensionThisTimehasVeryLongExtensionThisTimehasVeryLongExtensionThisTimehasVeryLongExtensionThisTimehasVeryLongExtensionThisTimehasVeryLongExtensionThisTimehasVeryLongExtensionThisTime" (NSString *) strB9 = 0x000060d000001f20 @"a very much boring task to write a string this way!!σ\0" (NSString *) strB10 = 0x000060c000002a40 @"This is a Unicode string σ number 4 right here" (NSString *) strB11 = 0x00006030000033d0 @"__NSCFString" (NSString *) strB12 = 0x0000606000009200 @"Process Name: a.out Process Id: 93488" (NSString *) strC11 = 0x0000603000003400 @"__NSCFString" (NSString *) strC12 = 0x0000606000009260 @"Process Name: a.out Process Id: 93488" (NSString *) strC1 = 0x00006060000092c0 @"A rather short ASCII NSString object is here" (NSString *) strC2 = 0x0000606000009320 @"A rather short UTF8 NSString object is here" (NSString *) strC3 = 0x0000000100006170 @"A string made with the at sign is here" (NSString *) strC4 = 0x0000606000009380 @"This is string number 4 right here" (NSString *) strC5 = 0x0000604000001c90 @"{{1, 1}, {5, 5}}" (NSString *) strC6 = 0x0000603000003430 @"1ST" (NSString *) strC7 = 0x0000603000003460 @"σxx" (NSString *) strC8 = 0x000061b000003180 @"hasVeryLongExtensionThisTimehasVeryLongExtensionThisTimehasVeryLongExtensionThisTimehasVeryLongExtensionThisTimehasVeryLongExtensionThisTimehasVeryLongExtensionThisTimehasVeryLongExtensionThisTimehasVeryLongExtensionThisTimehasVeryLongExtensionThisTimehasVeryLongExtensionThisTimehasVeryLongExtensionThisTimehasVeryLongExtensionThisTimehasVeryLongExtensionThisTimehasVeryLongExtensionThisTimehasVeryLongExtensionThisTimehasVeryLongExtensionThisTimehasVeryLongExtensionThisTimehasVeryLongExtensionThisTimehasVeryLongExtensionThisTimehasVeryLongExtensionThisTimehasVeryLongExtensionThisTimehasVeryLongExtensionThisTimehasVeryLongExtensionThisTimehasVeryLongExtensionThisTimehasVeryLongExtensionThisTimehasVeryLongExtensionThisTimehasVeryLongExtensionThisTimehasVeryLongExtensionThisTime" (NSString *) strC9 = 0x000060d000001ff0 @"a very much boring task to write a string this way!!σ\0" (NSString *) strC10 = 0x000060c000002ec0 @"This is a Unicode string σ number 4 right here" (NSString *) strD11 = 0x0000603000003490 @"__NSCFString" (NSString *) strD12 = 0x00006060000093e0 @"Process Name: a.out Process Id: 93488" (NSString *) eAcute = 0x00006030000034f0 @"é" (NSString *) randomHaziChar = 0x0000603000003550 @"鷅" (NSString *) japanese = 0x00000001000062b0 @"色は匂へど散りぬるを" (NSString *) italian = 0x00000001000062d0 @"L'Italia è una Repubblica democratica, fondata sul lavoro. La sovranità appartiene al popolo, che la esercita nelle forme e nei limiti della Costituzione." (NSString *) french = 0x00000001000062f0 @"Que veut cette horde d'esclaves, De traîtres, de rois conjurés?" (NSString *) german = 0x0000000100006310 @"Über-Ich und aus den Ansprüchen der sozialen Umwelt" (void *[3]) data_set = ([0] = 0x0000606000008ba0, [1] = 0x0000606000008c00, [2] = 0x0000000100006170) (NSString *) hebrew = 0x0000000100006330 @"לילה טוב" (NSArray *) newArray = 0x0000604000001dd0 @"50 elements" (NSDictionary *) newDictionary = 0x0000619000001980 12 key/value pairs (NSDictionary *) newMutableDictionary = 0x0000603000003610 21 key/value pairs (id [4]) cfKeys = { [0] = 0x0000000100006350 [1] = 0x0000000100006610 [2] = 0x0000000100006630 [3] = 0x0000000100006650 } (id [4]) cfValues = { [0] = 0x0000000100006350 [1] = 0x0000000100006610 [2] = 0x0000000100006630 [3] = 0x0000000100006650 } (NSDictionary *) nsDictionary = 0x00006060000095c0 2 key/value pairs (NSDictionary *) nscfDictionary = 0x0000606000009620 4 key/value pairs (CFDictionaryRef) cfDictionaryRef = 0x00006060000095c0 2 key/value pairs (NSAttributedString *) attrString = 0x00006030000036a0 @"hello world from foo" (NSAttributedString *) mutableAttrString = 0x0000603000003790 @"hello world from foo" (NSString *) mutableString = 0x0000604000001f90 @"foo said this string needs to be very long so much longer than whatever other string has been seen ever before by anyone of the mankind that of course this is still not long enough given what foo our friend foo our lovely dearly friend foo desired of us so i am adding more stuff here for the sake of it and for the joy of our friend who is named guess what just foo. hence, dear friend foo, stay safe, your string is now long enough to accommodate your testing need and I will make sure that if not we extend it with even more fuzzy random meaningless words pasted one after the other from a long tiresome friday evening spent working in my office. my office mate went home but I am still randomly typing just for the fun of seeing what happens of the length of a Mutable String in Cocoa if it goes beyond one byte.. so be it, dear foo" (NSString *) mutableGetConst = 0x0000618000000080 @"foo said this string needs to be very long so much longer than whatever other string has been seen ever before by anyone of the mankind that of course this is still not long enough given what foo our friend foo our lovely dearly friend foo desired of us so i am adding more stuff here for the sake of it and for the joy of our friend who is named guess what just foo. hence, dear friend foo, stay safe, your string is now long enough to accommodate your testing need and I will make sure that if not we extend it with even more fuzzy random meaningless words pasted one after the other from a long tiresome friday evening spent working in my office. my office mate went home but I am still randomly typing just for the fun of seeing what happens of the length of a Mutable String in Cocoa if it goes beyond one byte.. so be it, dear foo" (NSData *) immutableData = 0x00006030000037f0 5 bytes (NSData *) mutableData = 0x0000604000002010 14 bytes (unsigned int) concreteLength = 100000 (void *) zeroes1 = 0x0000633000000800 (NSData *) concreteData = 0x0000603000003820 100000 bytes (void *) zeroes2 = 0x000063300001c800 (NSMutableData *) concreteMutableData = 0x0000604000002050 100000 bytes (NSSet *) nsset = 0x0000604000002090 3 elements (NSSet *) nsmutableset = 0x0000603000003880 4 elements (NSSet *) nscfSet = 0x00006040000020d0 2 elements (CFSetRef) cfSetRef = 0x00006040000020d0 2 elements (CFDataRef) data_ref = 0x0000607000003f20 @"5 bytes" (CFMutableDataRef) mutable_data_ref = 0x0000607000003f90 @"5 bytes" (CFMutableStringRef) mutable_string_ref = 0x0000604000002110 @"Wish ya knew" (CFStringRef) cfstring_ref = 0x00000001000066d0 @"HELLO WORLD" (CFArrayRef) cfarray_ref = 0x0000607000004000 @"3 elements" (CFMutableArrayRef) mutable_array_ref = 0x0000604000002150 @"11 elements" (CFBinaryHeapRef) binheap_ref = 0x000060c000003640 @"21 items" (CFURLRef) cfurl_ref = 0x000060b000002350 @"http://www.foo.bar/" (CFURLRef) cfchildurl_ref = 0x00006070000040e0 @"page.html -- http://www.foo.bar/" (CFURLRef) cfgchildurl_ref = 0x0000607000004150 @"?whatever -- http://www.foo.bar/page.html" (NSDictionary *) error_userInfo = 0x0000606000009e60 2 key/value pairs (NSError *) nserror = 0x0000604000002290 domain: @"Foobar" - code: 12 (NSError **) nserrorptr = 0x00007ffeefbfee28 domain: @"Foobar" - code: 12 (NSBundle *) bundle_string = 0x0000607000004310 @"/System/Library/Frameworks/Accelerate.framework" (NSBundle *) bundle_url = 0x0000607000004af0 @"/System/Library/Frameworks/Foundation.framework" (NSBundle *) main_bundle = 0x0000607000004cb0 @"/Users/buildslave/jenkins/workspace/lldb-cmake-sanitized/lldb-build/lldb-test-build.noindex/functionalities/data-formatter/data-formatter-objc/TestDataFormatterObjCCF.test_coreframeworks_and_run_command_dwarf" (NSArray *) bundles = 0x0000604000002450 @"1 element" (NSURL *) nsurl0 = 0x0000608000001320 @"file:///Users/buildslave/jenkins/workspace/lldb-cmake-sanitized/lldb-build/lldb-test-build.noindex/functionalities/data-formatter/data-formatter-objc/TestDataFormatterObjCCF.test_coreframeworks_and_run_command_dwarf/" (NSException *) except0 = 0x00006040000024d0 @"First" (NSException *) except1 = 0x0000604000002510 @"Second" (NSException *) except2 = 0x0000604000002550 @"Third" (NSException *) except3 = 0x0000604000002590 @"Fourth" (NSURL *) nsurl = 0x000060b0000028d0 @"http://www.foo.bar" (NSURL *) nsurl2 = 0x0000607000004ee0 @"page.html -- http://www.foo.bar" (NSURL *) nsurl3 = 0x0000607000004f50 @"?whatever -- http://www.foo.bar/page.html" (NSDate *) date1 = 0x9a11f894372fdf59 1985-04-10 18:00:00 UTC (NSDate *) date2 = 0x0000604000008e90 2011-01-01 08:00:00 UTC (NSDate *) date3 = 0x0000602000003bb0 2020-05-30 01:51:35 UTC (NSDate *) date4 = 0x9a614b53d72fdf59 1970-01-02 00:00:00 UTC (NSDate *) date5 = 0x1a6e2c9184afdf59 2020-05-30 01:51:35 UTC (CFAbsoluteTime) date1_abs = 1985-04-10 10:00:00 PST (CFAbsoluteTime) date2_abs = 2011-01-01 00:00:00 PST (CFAbsoluteTime) date3_abs = 2020-05-29 18:51:35 PDT (CFAbsoluteTime) date4_abs = 1970-01-01 16:00:00 PST (CFAbsoluteTime) date5_abs = 2020-05-29 18:51:35 PDT (NSIndexSet *) iset1 = 0x0000603000009760 4 indexes (NSIndexSet *) iset2 = 0x0000603000009790 512 indexes (NSMutableIndexSet *) imset = 0x0000604000008f10 10 indexes (CFTimeZoneRef) cupertino = 0x0000608000001a20 @"America/Los_Angeles" (CFTimeZoneRef) home = 0x0000608000001ba0 @"Europe/Rome" (CFTimeZoneRef) europe = 0x0000608000001d20 @"Europe/Paris" (NSTimeZone *) cupertino_ns = 0x0000608000001a20 @"America/Los_Angeles" (NSTimeZone *) home_ns = 0x0000608000001ba0 @"Europe/Rome" (NSTimeZone *) europe_ns = 0x0000608000001d20 @"Europe/Paris" (CFGregorianUnits) cf_greg_units = 1 years, 3 months, 5 days, 12 hours, 5 minutes 7 seconds (CFGregorianDate) cf_greg_date = @"4/10/1985 18:0:0" (CFRange) cf_range = location=4 length=4 (NSPoint) ns_point = (x = 4, y = 4) (NSRange) ns_range = location=4, length=4 (NSRect) ns_rect = (origin = (x = 1, y = 1), size = (width = 5, height = 5)) (NSRect *) ns_rect_ptr = (origin = (x = 1, y = 1), size = (width = 5, height = 5)) (NSRectArray) ns_rect_arr = ((x = 1, y = 1), (width = 5, height = 5)), ... (NSSize) ns_size = (width = 5, height = 7) (NSSize *) ns_size_ptr = (width = 5, height = 7) (CGSize) cg_size = (width = 1, height = 6) (CGPoint) cg_point = (x = 2, y = 7) (CGRect) cg_rect = (origin = (x = 1, y = 2), size = (width = 7, height = 7)) (RGBColor) rgb_color = red=3 green=56 blue=35 (RGBColor *) rgb_color_ptr = red=3 green=56 blue=35 (Rect) rect = (t=4, l=8, b=4, r=7) (Rect *) rect_ptr = (t=4, l=8, b=4, r=7) (Point) point = (v=7, h=12) (Point *) point_ptr = (v=7, h=12) (HIPoint) hi_point = (x=7, y=12) (HIRect) hi_rect = origin=(x = 3, y = 5) size=(width = 4, height = 6) (SEL) foo_selector = "foo_selector_impl" (CFMutableBitVectorRef) mut_bv = 0x0000604000009490 1110 0110 1011 0000 1101 1010 1000 1111 0011 0101 1101 0001 00 (Molecule *) molecule = 0x0000602000003c50 (Class) myclass = NSValue (Class) myclass2 = NSTaggedPointerString (Class) myclass3 = Molecule (Class) myclass4 = NSMutableArray (Class) myclass5 = nil (NSArray *) components = 0x00006040000094d0 @"3 elements" (NSString *) path = 0x0000604000009510 @"usr/blah/stuff"

Hide Details

Assertion failed: (tokenKind == tok::kw___bridge_retain), function ParseParenExpression, file /Users/buildslave/jenkins/workspace/lldb-cmake-sanitized/llvm-project/clang/lib/Parse/ParseExpr.cpp, line 2804.

Hide Details

--

Hide Details

******************** PASS: lldb-unit :: Symbol/./SymbolTests/LineEntryTest.GetSameLineContiguousAddressRangeNestedInline (1518 of 2027) PASS: lldb-shell :: Minidump/memory-region-from-module.yaml (1519 of 2027) PASS: lldb-unit :: ObjectFile/Breakpad/./ObjectFileBreakpadTests/ModuleRecord.parse (1520 of 2027) PASS: lldb-api :: commands/expression/regression-access-function-template-in-record/TestRegressionAccessFunctionTemplateInRecord.py (1521 of 2027) PASS: lldb-api :: lang/cpp/namespace_definitions/TestNamespaceDefinitions.py (1522 of 2027) PASS: lldb-api :: python_api/file_handle/TestFileHandle.py (1523 of 2027) PASS: lldb-api :: commands/source/info/TestSourceInfo.py (1524 of 2027) PASS: lldb-api :: functionalities/data-formatter/data-formatter-stl/libcxx/forward_list/TestDataFormatterLibcxxForwardList.py (1525 of 2027) PASS: lldb-unit :: Utility/./UtilityTests/EventTest.DumpEventDataBytes (1526 of 2027) FAIL: lldb-api :: lang/objc/objc-ivar-protocols/TestIvarProtocols.py (1527 of 2027) ******************** TEST 'lldb-api :: lang/objc/objc-ivar-protocols/TestIvarProtocols.py' FAILED ******************** Script: -- /Users/buildslave/jenkins/workspace/lldb-cmake-sanitized/lldb-build/lldb-test-build.noindex/copied-system-python /Users/buildslave/jenkins/workspace/lldb-cmake-sanitized/llvm-project/lldb/test/API/dotest.py --arch x86_64 -s /Users/buildslave/jenkins/workspace/lldb-cmake-sanitized/lldb-build/lldb-test-traces -S nm -u CXXFLAGS -u CFLAGS --codesign-identity lldb_codesign --server /Users/buildslave/jenkins/workspace/lldb-cmake-sanitized/lldb-build/./bin/debugserver --arch x86_64 --build-dir /Users/buildslave/jenkins/workspace/lldb-cmake-sanitized/lldb-build/lldb-test-build.noindex -s=/Users/buildslave/jenkins/workspace/lldb-cmake-sanitized/test/logs -t --env TERM=vt100 --env LLVM_LIBS_DIR=/Users/buildslave/jenkins/workspace/lldb-cmake-sanitized/lldb-build/./lib --inferior-env ASAN_OPTIONS=detect_stack_use_after_return=1 --inferior-env DYLD_INSERT_LIBRARIES=/Users/buildslave/jenkins/workspace/lldb-cmake-sanitized/host-compiler/lib/clang/11.0.0/lib/darwin/libclang_rt.asan_osx_dynamic.dylib --build-dir /Users/buildslave/jenkins/workspace/lldb-cmake-sanitized/lldb-build/lldb-test-build.noindex --lldb-module-cache-dir /Users/buildslave/jenkins/workspace/lldb-cmake-sanitized/lldb-build/lldb-test-build.noindex/module-cache-lldb/lldb-api --clang-module-cache-dir /Users/buildslave/jenkins/workspace/lldb-cmake-sanitized/lldb-build/lldb-test-build.noindex/module-cache-clang/lldb-api --executable /Users/buildslave/jenkins/workspace/lldb-cmake-sanitized/lldb-build/./bin/lldb --compiler /Users/buildslave/jenkins/workspace/lldb-cmake-sanitized/lldb-build/./bin/clang --dsymutil /Users/buildslave/jenkins/workspace/lldb-cmake-sanitized/lldb-build/./bin/dsymutil --filecheck /Users/buildslave/jenkins/workspace/lldb-cmake-sanitized/lldb-build/./bin/FileCheck --lldb-libs-dir /Users/buildslave/jenkins/workspace/lldb-cmake-sanitized/lldb-build/./lib /Users/buildslave/jenkins/workspace/lldb-cmake-sanitized/llvm-project/lldb/test/API/lang/objc/objc-ivar-protocols -p TestIvarProtocols.py -- Exit Code: -6

Hide Details

Command Output (stdout): -- lldb version 11.0.99 clang revision 4034d0ce207d0c545799ceae5aaf2e35d400407c llvm revision 4034d0ce207d0c545799ceae5aaf2e35d400407c

Hide Details

-- Command Output (stderr): -- Assertion failed: (tokenKind == tok::kw___bridge_retain), function ParseParenExpression, file /Users/buildslave/jenkins/workspace/lldb-cmake-sanitized/llvm-project/clang/lib/Parse/ParseExpr.cpp, line 2804.

Hide Details

--

Hide Details

******************** PASS: lldb-unit :: Utility/./UtilityTests/StringListTest.JoinEmpty (1528 of 2027) PASS: lldb-unit :: Process/gdb-remote/./ProcessGdbRemoteTests/GDBRemoteCommunicationClientTest.SendGetDataPacket (1529 of 2027) PASS: lldb-unit :: Utility/./UtilityTests/ConstStringTest.FromMidOfBufferStringRef (1530 of 2027) PASS: lldb-shell :: SymbolFile/NativePDB/global-classes.cpp (1531 of 2027) PASS: lldb-shell :: Quit/TestQuitExitCodeNonInt.test (1532 of 2027) PASS: lldb-unit :: Host/./HostTests/MainLoopTest.Signal (1533 of 2027) PASS: lldb-shell :: Reproducer/TestPythonImport.test (1534 of 2027) PASS: lldb-api :: python_api/get-value-32bit-int/TestGetValue32BitInt.py (1535 of 2027) PASS: lldb-unit :: Symbol/./SymbolTests/TestTypeSystemClang.TestBuiltinTypeForEncodingAndBitSize (1536 of 2027) PASS: lldb-api :: types/TestCharTypeExpr.py (1537 of 2027) PASS: lldb-api :: commands/command/script/import/TestImport.py (1538 of 2027) PASS: lldb-unit :: Utility/./UtilityTests/FileSpecTest.GuessPathStyle (1539 of 2027) PASS: lldb-api :: commands/expression/argument_passing_restrictions/TestArgumentPassingRestrictions.py (1540 of 2027) PASS: lldb-api :: functionalities/thread/crash_during_step/TestCrashDuringStep.py (1541 of 2027) PASS: lldb-unit :: Utility/./UtilityTests/OptionsWithRawTest.EmptyInput (1542 of 2027) PASS: lldb-api :: commands/command/script/import/rdar-12586188/TestRdar12586188.py (1543 of 2027) UNSUPPORTED: lldb-shell :: Register/aarch64-fp-read.test (1544 of 2027) UNSUPPORTED: lldb-shell :: BuildScript/toolchain-msvc.test (1545 of 2027) PASS: lldb-unit :: UnwindAssembly/x86/./UnwindAssemblyx86Tests/Testx86AssemblyInspectionEngine.TestPushR12 (1546 of 2027) PASS: lldb-shell :: SymbolFile/NativePDB/ast-methods.cpp (1547 of 2027) UNSUPPORTED: lldb-shell :: Register/x86-64-ymm16-read.test (1548 of 2027) PASS: lldb-api :: commands/frame/diagnose/bad-reference/TestBadReference.py (1549 of 2027) PASS: lldb-api :: python_api/value/TestValueAPI.py (1550 of 2027) PASS: lldb-shell :: Quit/TestQuitExitCode0.test (1551 of 2027) PASS: lldb-unit :: Utility/./UtilityTests/StringListTest.CopyListEmpty (1552 of 2027) PASS: lldb-unit :: Host/./HostTests/ProcessLaunchInfoTest.Constructor (1553 of 2027) PASS: lldb-shell :: SymbolFile/DWARF/dir-separator-no-comp-dir-relative-name.s (1554 of 2027) PASS: lldb-api :: macosx/find-dsym/bundle-with-dot-in-filename/TestBundleWithDotInFilename.py (1555 of 2027) PASS: lldb-unit :: Utility/./UtilityTests/ProcessInstanceInfoMatch.Name (1556 of 2027) PASS: lldb-shell :: SymbolFile/DWARF/debug_rnglists.s (1557 of 2027) PASS: lldb-shell :: Minidump/Windows/broken-unwind.test (1558 of 2027) PASS: lldb-api :: lang/cpp/overloaded-functions/TestOverloadedFunctions.py (1559 of 2027) PASS: lldb-api :: functionalities/object-file/TestImageListMultiArchitecture.py (1560 of 2027) PASS: lldb-api :: commands/expression/test/TestExprs2.py (1561 of 2027) PASS: lldb-unit :: Language/Highlighting/./HighlighterTests/HighlighterTest.ClangPPDirectives (1562 of 2027) PASS: lldb-shell :: SymbolFile/Breakpad/line-table-missing-file.test (1563 of 2027) PASS: lldb-unit :: Utility/./UtilityTests/BinaryStreamTest.PutULEB128SevenBytes (1564 of 2027) PASS: lldb-shell :: Driver/TestSingleQuote.test (1565 of 2027) PASS: lldb-api :: functionalities/tail_call_frames/thread_step_out_or_return/TestSteppingOutWithArtificialFrames.py (1566 of 2027) PASS: lldb-api :: commands/platform/process/list/TestProcessList.py (1567 of 2027) PASS: lldb-api :: functionalities/gdb_remote_client/TestStopPCs.py (1568 of 2027) PASS: lldb-unit :: Utility/./UtilityTests/StringListTest.AppendList (1569 of 2027) PASS: lldb-api :: lang/cpp/unsigned_types/TestUnsignedTypes.py (1570 of 2027) PASS: lldb-unit :: Process/gdb-remote/./ProcessGdbRemoteTests/GDBRemoteCommunicationTest.ReadPacket_checksum (1571 of 2027) PASS: lldb-unit :: Target/./TargetTests/StackFrameRecognizerTest.NullModuleRegex (1572 of 2027) PASS: lldb-unit :: Process/minidump/./LLDBMinidumpTests/MinidumpParserTest.InvalidMinidump (1573 of 2027) PASS: lldb-unit :: Utility/./UtilityTests/StreamTest.PutBytesAsRawHex8ToBigEndian (1574 of 2027) PASS: lldb-shell :: SymbolFile/DWARF/find-method.cpp (1575 of 2027) PASS: lldb-unit :: Platform/./LLDBPlatformTests/PlatformDarwinTest.FindComponentInPath (1576 of 2027) PASS: lldb-api :: functionalities/breakpoint/serialize/TestBreakpointSerialization.py (1577 of 2027) PASS: lldb-api :: functionalities/thread_plan/TestThreadPlanCommands.py (1578 of 2027) PASS: lldb-shell :: Settings/TestDisableColor.test (1579 of 2027) PASS: lldb-unit :: Process/minidump/./LLDBMinidumpTests/MinidumpParserTest.GetMemoryRegionInfoFromMemory64List (1580 of 2027) PASS: lldb-shell :: ObjectFile/ELF/many-sections.s (1581 of 2027) FAIL: lldb-api :: lang/objc/objc++/TestObjCXX.py (1582 of 2027) ******************** TEST 'lldb-api :: lang/objc/objc++/TestObjCXX.py' FAILED ******************** Script: -- /Users/buildslave/jenkins/workspace/lldb-cmake-sanitized/lldb-build/lldb-test-build.noindex/copied-system-python /Users/buildslave/jenkins/workspace/lldb-cmake-sanitized/llvm-project/lldb/test/API/dotest.py --arch x86_64 -s /Users/buildslave/jenkins/workspace/lldb-cmake-sanitized/lldb-build/lldb-test-traces -S nm -u CXXFLAGS -u CFLAGS --codesign-identity lldb_codesign --server /Users/buildslave/jenkins/workspace/lldb-cmake-sanitized/lldb-build/./bin/debugserver --arch x86_64 --build-dir /Users/buildslave/jenkins/workspace/lldb-cmake-sanitized/lldb-build/lldb-test-build.noindex -s=/Users/buildslave/jenkins/workspace/lldb-cmake-sanitized/test/logs -t --env TERM=vt100 --env LLVM_LIBS_DIR=/Users/buildslave/jenkins/workspace/lldb-cmake-sanitized/lldb-build/./lib --inferior-env ASAN_OPTIONS=detect_stack_use_after_return=1 --inferior-env DYLD_INSERT_LIBRARIES=/Users/buildslave/jenkins/workspace/lldb-cmake-sanitized/host-compiler/lib/clang/11.0.0/lib/darwin/libclang_rt.asan_osx_dynamic.dylib --build-dir /Users/buildslave/jenkins/workspace/lldb-cmake-sanitized/lldb-build/lldb-test-build.noindex --lldb-module-cache-dir /Users/buildslave/jenkins/workspace/lldb-cmake-sanitized/lldb-build/lldb-test-build.noindex/module-cache-lldb/lldb-api --clang-module-cache-dir /Users/buildslave/jenkins/workspace/lldb-cmake-sanitized/lldb-build/lldb-test-build.noindex/module-cache-clang/lldb-api --executable /Users/buildslave/jenkins/workspace/lldb-cmake-sanitized/lldb-build/./bin/lldb --compiler /Users/buildslave/jenkins/workspace/lldb-cmake-sanitized/lldb-build/./bin/clang --dsymutil /Users/buildslave/jenkins/workspace/lldb-cmake-sanitized/lldb-build/./bin/dsymutil --filecheck /Users/buildslave/jenkins/workspace/lldb-cmake-sanitized/lldb-build/./bin/FileCheck --lldb-libs-dir /Users/buildslave/jenkins/workspace/lldb-cmake-sanitized/lldb-build/./lib /Users/buildslave/jenkins/workspace/lldb-cmake-sanitized/llvm-project/lldb/test/API/lang/objc/objc++ -p TestObjCXX.py -- Exit Code: -6

Hide Details

Command Output (stdout): -- lldb version 11.0.99 clang revision 4034d0ce207d0c545799ceae5aaf2e35d400407c llvm revision 4034d0ce207d0c545799ceae5aaf2e35d400407c

Hide Details

-- Command Output (stderr): -- Assertion failed: (tokenKind == tok::kw___bridge_retain), function ParseParenExpression, file /Users/buildslave/jenkins/workspace/lldb-cmake-sanitized/llvm-project/clang/lib/Parse/ParseExpr.cpp, line 2804.

Hide Details

--

Hide Details

******************** UNSUPPORTED: lldb-shell :: ScriptInterpreter/Lua/nested_sessions.test (1583 of 2027) PASS: lldb-shell :: Reproducer/TestDiscard.test (1584 of 2027) PASS: lldb-unit :: Utility/./UtilityTests/Flags.IsClear (1585 of 2027) PASS: lldb-unit :: ScriptInterpreter/Python/./ScriptInterpreterPythonTests/PythonDataObjectsTest.TestPythonDictionaryToStructuredDictionary (1586 of 2027) PASS: lldb-unit :: Breakpoint/./LLDBBreakpointTests/BreakpointIDTest.StringIsBreakpointName (1587 of 2027) PASS: lldb-api :: commands/expression/dollar-in-variable/TestDollarInVariable.py (1588 of 2027) PASS: lldb-shell :: Reproducer/TestDSYM.test (1589 of 2027) PASS: lldb-unit :: Utility/./UtilityTests/ArchSpecTest.MergeFrom (1590 of 2027) PASS: lldb-unit :: ScriptInterpreter/Python/./ScriptInterpreterPythonTests/PythonDataObjectsTest.TestPythonListValueEquality (1591 of 2027) PASS: lldb-api :: commands/expression/radar_9531204/TestPrintfAfterUp.py (1592 of 2027) PASS: lldb-unit :: Utility/./UtilityTests/ConstStringTest.CompareStringRef (1593 of 2027) PASS: lldb-unit :: Utility/./UtilityTests/StreamTeeTest.Write (1594 of 2027) PASS: lldb-api :: functionalities/data-formatter/refpointer-recursion/TestDataFormatterRefPtrRecursion.py (1595 of 2027) PASS: lldb-shell :: Reproducer/TestCaptureEnvOverride.test (1596 of 2027) PASS: lldb-api :: lang/c/anonymous/TestAnonymous.py (1597 of 2027) PASS: lldb-api :: functionalities/dead-strip/TestDeadStrip.py (1598 of 2027) PASS: lldb-unit :: Utility/./UtilityTests/UriParserTest.TypicalPortPathIPv4 (1599 of 2027) PASS: lldb-api :: macosx/profile_vrs_detach/TestDetachVrsProfile.py (1600 of 2027) PASS: lldb-unit :: ScriptInterpreter/Python/./ScriptInterpreterPythonTests/PythonDataObjectsTest.TestPythonString (1601 of 2027) PASS: lldb-shell :: Heap/heap-cstr.test (1602 of 2027) PASS: lldb-unit :: Utility/./UtilityTests/ConstStringTest.YAML (1603 of 2027) PASS: lldb-api :: functionalities/data-formatter/data-formatter-stl/libcxx/list/loop/TestDataFormatterLibcxxListLoop.py (1604 of 2027) PASS: lldb-unit :: Utility/./UtilityTests/RangeTest.Copy (1605 of 2027) FAIL: lldb-api :: lang/objc/print-obj/TestPrintObj.py (1606 of 2027) ******************** TEST 'lldb-api :: lang/objc/print-obj/TestPrintObj.py' FAILED ******************** Script: -- /Users/buildslave/jenkins/workspace/lldb-cmake-sanitized/lldb-build/lldb-test-build.noindex/copied-system-python /Users/buildslave/jenkins/workspace/lldb-cmake-sanitized/llvm-project/lldb/test/API/dotest.py --arch x86_64 -s /Users/buildslave/jenkins/workspace/lldb-cmake-sanitized/lldb-build/lldb-test-traces -S nm -u CXXFLAGS -u CFLAGS --codesign-identity lldb_codesign --server /Users/buildslave/jenkins/workspace/lldb-cmake-sanitized/lldb-build/./bin/debugserver --arch x86_64 --build-dir /Users/buildslave/jenkins/workspace/lldb-cmake-sanitized/lldb-build/lldb-test-build.noindex -s=/Users/buildslave/jenkins/workspace/lldb-cmake-sanitized/test/logs -t --env TERM=vt100 --env LLVM_LIBS_DIR=/Users/buildslave/jenkins/workspace/lldb-cmake-sanitized/lldb-build/./lib --inferior-env ASAN_OPTIONS=detect_stack_use_after_return=1 --inferior-env DYLD_INSERT_LIBRARIES=/Users/buildslave/jenkins/workspace/lldb-cmake-sanitized/host-compiler/lib/clang/11.0.0/lib/darwin/libclang_rt.asan_osx_dynamic.dylib --build-dir /Users/buildslave/jenkins/workspace/lldb-cmake-sanitized/lldb-build/lldb-test-build.noindex --lldb-module-cache-dir /Users/buildslave/jenkins/workspace/lldb-cmake-sanitized/lldb-build/lldb-test-build.noindex/module-cache-lldb/lldb-api --clang-module-cache-dir /Users/buildslave/jenkins/workspace/lldb-cmake-sanitized/lldb-build/lldb-test-build.noindex/module-cache-clang/lldb-api --executable /Users/buildslave/jenkins/workspace/lldb-cmake-sanitized/lldb-build/./bin/lldb --compiler /Users/buildslave/jenkins/workspace/lldb-cmake-sanitized/lldb-build/./bin/clang --dsymutil /Users/buildslave/jenkins/workspace/lldb-cmake-sanitized/lldb-build/./bin/dsymutil --filecheck /Users/buildslave/jenkins/workspace/lldb-cmake-sanitized/lldb-build/./bin/FileCheck --lldb-libs-dir /Users/buildslave/jenkins/workspace/lldb-cmake-sanitized/lldb-build/./lib /Users/buildslave/jenkins/workspace/lldb-cmake-sanitized/llvm-project/lldb/test/API/lang/objc/print-obj -p TestPrintObj.py -- Exit Code: -6

Hide Details

Command Output (stdout): -- lldb version 11.0.99 clang revision 4034d0ce207d0c545799ceae5aaf2e35d400407c llvm revision 4034d0ce207d0c545799ceae5aaf2e35d400407c

Hide Details

-- Command Output (stderr): -- Assertion failed: (tokenKind == tok::kw___bridge_retain), function ParseParenExpression, file /Users/buildslave/jenkins/workspace/lldb-cmake-sanitized/llvm-project/clang/lib/Parse/ParseExpr.cpp, line 2804.

Hide Details

--

Hide Details

******************** PASS: lldb-unit :: Target/./TargetTests/ModuleCacheTest.GetAndPutUuidExists (1607 of 2027) UNSUPPORTED: lldb-api :: functionalities/asan/TestReportData.py (1608 of 2027) PASS: lldb-shell :: ObjectFile/PECOFF/basic-info.yaml (1609 of 2027) PASS: lldb-unit :: Utility/./UtilityTests/Predicate.WaitForValueNotEqualTo (1610 of 2027) PASS: lldb-unit :: Symbol/./SymbolTests/TestTypeSystemClang.TestDisplayName (1611 of 2027) PASS: lldb-api :: lang/cpp/member-and-local-vars-with-same-name/TestMembersAndLocalsWithSameName.py (1612 of 2027) PASS: lldb-unit :: Utility/./UtilityTests/RegisterValueTest.GetSet8 (1613 of 2027) PASS: lldb-unit :: Utility/./UtilityTests/AnsiTerminal.AtStart (1614 of 2027) PASS: lldb-unit :: Utility/./UtilityTests/StringLexerTest.NextIf (1615 of 2027) PASS: lldb-shell :: Reproducer/Functionalities/TestStepping.test (1616 of 2027) FAIL: lldb-api :: lang/objc/objc_direct-methods/TestObjCDirectMethods.py (1617 of 2027) ******************** TEST 'lldb-api :: lang/objc/objc_direct-methods/TestObjCDirectMethods.py' FAILED ******************** Script: -- /Users/buildslave/jenkins/workspace/lldb-cmake-sanitized/lldb-build/lldb-test-build.noindex/copied-system-python /Users/buildslave/jenkins/workspace/lldb-cmake-sanitized/llvm-project/lldb/test/API/dotest.py --arch x86_64 -s /Users/buildslave/jenkins/workspace/lldb-cmake-sanitized/lldb-build/lldb-test-traces -S nm -u CXXFLAGS -u CFLAGS --codesign-identity lldb_codesign --server /Users/buildslave/jenkins/workspace/lldb-cmake-sanitized/lldb-build/./bin/debugserver --arch x86_64 --build-dir /Users/buildslave/jenkins/workspace/lldb-cmake-sanitized/lldb-build/lldb-test-build.noindex -s=/Users/buildslave/jenkins/workspace/lldb-cmake-sanitized/test/logs -t --env TERM=vt100 --env LLVM_LIBS_DIR=/Users/buildslave/jenkins/workspace/lldb-cmake-sanitized/lldb-build/./lib --inferior-env ASAN_OPTIONS=detect_stack_use_after_return=1 --inferior-env DYLD_INSERT_LIBRARIES=/Users/buildslave/jenkins/workspace/lldb-cmake-sanitized/host-compiler/lib/clang/11.0.0/lib/darwin/libclang_rt.asan_osx_dynamic.dylib --build-dir /Users/buildslave/jenkins/workspace/lldb-cmake-sanitized/lldb-build/lldb-test-build.noindex --lldb-module-cache-dir /Users/buildslave/jenkins/workspace/lldb-cmake-sanitized/lldb-build/lldb-test-build.noindex/module-cache-lldb/lldb-api --clang-module-cache-dir /Users/buildslave/jenkins/workspace/lldb-cmake-sanitized/lldb-build/lldb-test-build.noindex/module-cache-clang/lldb-api --executable /Users/buildslave/jenkins/workspace/lldb-cmake-sanitized/lldb-build/./bin/lldb --compiler /Users/buildslave/jenkins/workspace/lldb-cmake-sanitized/lldb-build/./bin/clang --dsymutil /Users/buildslave/jenkins/workspace/lldb-cmake-sanitized/lldb-build/./bin/dsymutil --filecheck /Users/buildslave/jenkins/workspace/lldb-cmake-sanitized/lldb-build/./bin/FileCheck --lldb-libs-dir /Users/buildslave/jenkins/workspace/lldb-cmake-sanitized/lldb-build/./lib /Users/buildslave/jenkins/workspace/lldb-cmake-sanitized/llvm-project/lldb/test/API/lang/objc/objc_direct-methods -p TestObjCDirectMethods.py -- Exit Code: -6

Hide Details

Command Output (stdout): -- lldb version 11.0.99 clang revision 4034d0ce207d0c545799ceae5aaf2e35d400407c llvm revision 4034d0ce207d0c545799ceae5aaf2e35d400407c

Hide Details

-- Command Output (stderr): -- Assertion failed: (tokenKind == tok::kw___bridge_retain), function ParseParenExpression, file /Users/buildslave/jenkins/workspace/lldb-cmake-sanitized/llvm-project/clang/lib/Parse/ParseExpr.cpp, line 2804.

Hide Details

--

Hide Details

******************** PASS: lldb-unit :: Utility/./UtilityTests/AnsiTerminal.Incomplete (1618 of 2027) PASS: lldb-shell :: SymbolFile/NativePDB/function-types-builtins.cpp (1619 of 2027) PASS: lldb-unit :: Language/Highlighting/./HighlighterTests/HighlighterTest.ClangBraces (1620 of 2027) PASS: lldb-shell :: ObjectFile/ELF/PT_TLS-overlap-PT_LOAD.yaml (1621 of 2027) PASS: lldb-api :: commands/expression/char/TestExprsChar.py (1622 of 2027) PASS: lldb-shell :: ObjectFile/ELF/basic-info.yaml (1623 of 2027) PASS: lldb-unit :: Utility/./UtilityTests/RangeTest.ContainsAddrInvalid (1624 of 2027) PASS: lldb-api :: commands/expression/cast_int_to_anonymous_enum/TestCastIntToAnonymousEnum.py (1625 of 2027) PASS: lldb-shell :: Commands/command-breakpoint-col.test (1626 of 2027) PASS: lldb-api :: functionalities/breakpoint/auto_continue/TestBreakpointAutoContinue.py (1627 of 2027) PASS: lldb-unit :: ObjectFile/Breakpad/./ObjectFileBreakpadTests/LineRecord.parse (1628 of 2027) PASS: lldb-shell :: Driver/TestConvenienceVariables.test (1629 of 2027) PASS: lldb-api :: functionalities/source-map/TestTargetSourceMap.py (1630 of 2027) PASS: lldb-unit :: UnwindAssembly/x86/./UnwindAssemblyx86Tests/Testx86AssemblyInspectionEngine.Testi386IgnoredRegisters (1631 of 2027) PASS: lldb-unit :: Utility/./UtilityTests/ConstStringTest.CompareConstString (1632 of 2027) PASS: lldb-unit :: Symbol/./SymbolTests/TestClangASTImporter.DeportTypeTagDecl (1633 of 2027) PASS: lldb-api :: functionalities/conditional_break/TestConditionalBreak.py (1634 of 2027) PASS: lldb-unit :: Signals/./SignalsTests/UnixSignalsTest.GetFilteredSignals (1635 of 2027) PASS: lldb-unit :: Utility/./UtilityTests/StringListTest.SplitIntoLinesEmpty (1636 of 2027) PASS: lldb-unit :: Utility/./UtilityTests/UriParserTest.MinimalPort (1637 of 2027) PASS: lldb-api :: lang/cpp/dynamic-value-same-basename/TestDynamicValueSameBase.py (1638 of 2027) PASS: lldb-unit :: Utility/./UtilityTests/ArgsTest.GetArgumentArrayRef (1639 of 2027) PASS: lldb-unit :: UnwindAssembly/x86/./UnwindAssemblyx86Tests/Testx86AssemblyInspectionEngine.TestPushR15 (1640 of 2027) PASS: lldb-api :: lang/cpp/namespace/TestNamespace.py (1641 of 2027) PASS: lldb-api :: functionalities/thread/exit_during_break/TestExitDuringBreak.py (1642 of 2027) PASS: lldb-unit :: Utility/./UtilityTests/SerializationRountripTest.SerializeDeserializePodReferences (1643 of 2027) PASS: lldb-unit :: Process/minidump/./LLDBMinidumpTests/MinidumpParserTest.GetLinuxProcStatus_no_stream (1644 of 2027) PASS: lldb-unit :: Host/./HostTests/FileSystemTest.EmptyTest (1645 of 2027) PASS: lldb-unit :: Symbol/./SymbolTests/TestTypeSystemClang.TestDeletingImplicitCopyCstrDueToMoveCStr (1646 of 2027) PASS: lldb-unit :: Utility/./UtilityTests/DataExtractorTest.GetMaxS64 (1647 of 2027) PASS: lldb-api :: functionalities/thread/concurrent_events/TestConcurrentSignalBreak.py (1648 of 2027) PASS: lldb-api :: functionalities/process_group/TestChangeProcessGroup.py (1649 of 2027) UNSUPPORTED: lldb-api :: functionalities/process_save_core/TestProcessSaveCore.py (1650 of 2027) PASS: lldb-shell :: Reproducer/TestMultipleTargets.test (1651 of 2027) PASS: lldb-unit :: Utility/./UtilityTests/StreamTeeTest.DefaultConstructor (1652 of 2027) PASS: lldb-shell :: SymbolFile/DWARF/debug-types-basic.test (1653 of 2027) PASS: lldb-unit :: Utility/./UtilityTests/LogChannelTest.Disable (1654 of 2027) PASS: lldb-unit :: Utility/./UtilityTests/StringListTest.GetMaxStringLengthEmpty (1655 of 2027) PASS: lldb-shell :: Breakpoint/debug_addrx.test (1656 of 2027) PASS: lldb-shell :: SymbolFile/DWARF/debug_loc-aslr.s (1657 of 2027) PASS: lldb-api :: commands/expression/options/TestExprOptions.py (1658 of 2027) PASS: lldb-unit :: Utility/./UtilityTests/BinaryStreamTest.PutSLEB128MaxValue (1659 of 2027) PASS: lldb-unit :: SymbolFile/NativePDB/./SymbolFileNativePDBTests/PDBFPOProgramToDWARFExpressionTests.InvalidAssignmentMultiple (1660 of 2027) PASS: lldb-unit :: UnwindAssembly/x86/./UnwindAssemblyx86Tests/Testx86AssemblyInspectionEngine.TestPopRBPWithREX (1661 of 2027) PASS: lldb-unit :: Symbol/./SymbolTests/PostfixExpression.ToDWARF (1662 of 2027) UNSUPPORTED: lldb-api :: functionalities/tsan/thread_leak/TestTsanThreadLeak.py (1663 of 2027) PASS: lldb-api :: functionalities/memory-region/TestMemoryRegion.py (1664 of 2027) PASS: lldb-shell :: SymbolFile/NativePDB/bitfields.cpp (1665 of 2027) PASS: lldb-api :: functionalities/data-formatter/data-formatter-script/TestDataFormatterScript.py (1666 of 2027) PASS: lldb-api :: functionalities/return-value/TestReturnValue.py (1667 of 2027) PASS: lldb-unit :: Utility/./UtilityTests/RangeTest.NotEqualInvalid (1668 of 2027) PASS: lldb-api :: functionalities/target-new-solib-notifications/TestModuleLoadedNotifys.py (1669 of 2027) PASS: lldb-shell :: Reproducer/Functionalities/TestImageList.test (1670 of 2027) PASS: lldb-api :: lang/cpp/bitfields/TestCppBitfields.py (1671 of 2027) PASS: lldb-api :: functionalities/data-formatter/stringprinter/TestStringPrinter.py (1672 of 2027) PASS: lldb-shell :: SymbolFile/DWARF/dwarf5-index-is-used.cpp (1673 of 2027) PASS: lldb-api :: functionalities/tail_call_frames/disambiguate_call_site/TestDisambiguateCallSite.py (1674 of 2027) UNSUPPORTED: lldb-shell :: Register/x86-64-gp-write.test (1675 of 2027) PASS: lldb-api :: commands/watchpoints/watchpoint_commands/command/TestWatchpointCommandLLDB.py (1676 of 2027) UNSUPPORTED: lldb-shell :: Register/arm-gp-read.test (1677 of 2027) PASS: lldb-api :: commands/frame/recognizer/TestFrameRecognizer.py (1678 of 2027) UNSUPPORTED: lldb-shell :: SymbolFile/DWARF/split-dwarf-expression-eval-bug.cpp (1679 of 2027) PASS: lldb-api :: functionalities/breakpoint/breakpoint_by_line_and_column/TestBreakpointByLineAndColumn.py (1680 of 2027) PASS: lldb-api :: linux/builtin_trap/TestBuiltinTrap.py (1681 of 2027) PASS: lldb-shell :: Quit/TestQuitExitCodeTooManyArgs.test (1682 of 2027) PASS: lldb-api :: commands/frame/language/TestGuessLanguage.py (1683 of 2027) PASS: lldb-api :: python_api/breakpoint/TestBreakpointAPI.py (1684 of 2027) PASS: lldb-api :: lang/cpp/class_static/TestStaticVariables.py (1685 of 2027) PASS: lldb-unit :: Utility/./UtilityTests/NameMatchesTest.Ignore (1686 of 2027) PASS: lldb-unit :: Utility/./UtilityTests/ArgsTest.ReplaceArgumentAtIndexLonger (1687 of 2027) PASS: lldb-api :: python_api/section/TestSectionAPI.py (1688 of 2027) FAIL: lldb-api :: functionalities/data-formatter/synthupdate/TestSyntheticFilterRecompute.py (1689 of 2027) ******************** TEST 'lldb-api :: functionalities/data-formatter/synthupdate/TestSyntheticFilterRecompute.py' FAILED ******************** Script: -- /Users/buildslave/jenkins/workspace/lldb-cmake-sanitized/lldb-build/lldb-test-build.noindex/copied-system-python /Users/buildslave/jenkins/workspace/lldb-cmake-sanitized/llvm-project/lldb/test/API/dotest.py --arch x86_64 -s /Users/buildslave/jenkins/workspace/lldb-cmake-sanitized/lldb-build/lldb-test-traces -S nm -u CXXFLAGS -u CFLAGS --codesign-identity lldb_codesign --server /Users/buildslave/jenkins/workspace/lldb-cmake-sanitized/lldb-build/./bin/debugserver --arch x86_64 --build-dir /Users/buildslave/jenkins/workspace/lldb-cmake-sanitized/lldb-build/lldb-test-build.noindex -s=/Users/buildslave/jenkins/workspace/lldb-cmake-sanitized/test/logs -t --env TERM=vt100 --env LLVM_LIBS_DIR=/Users/buildslave/jenkins/workspace/lldb-cmake-sanitized/lldb-build/./lib --inferior-env ASAN_OPTIONS=detect_stack_use_after_return=1 --inferior-env DYLD_INSERT_LIBRARIES=/Users/buildslave/jenkins/workspace/lldb-cmake-sanitized/host-compiler/lib/clang/11.0.0/lib/darwin/libclang_rt.asan_osx_dynamic.dylib --build-dir /Users/buildslave/jenkins/workspace/lldb-cmake-sanitized/lldb-build/lldb-test-build.noindex --lldb-module-cache-dir /Users/buildslave/jenkins/workspace/lldb-cmake-sanitized/lldb-build/lldb-test-build.noindex/module-cache-lldb/lldb-api --clang-module-cache-dir /Users/buildslave/jenkins/workspace/lldb-cmake-sanitized/lldb-build/lldb-test-build.noindex/module-cache-clang/lldb-api --executable /Users/buildslave/jenkins/workspace/lldb-cmake-sanitized/lldb-build/./bin/lldb --compiler /Users/buildslave/jenkins/workspace/lldb-cmake-sanitized/lldb-build/./bin/clang --dsymutil /Users/buildslave/jenkins/workspace/lldb-cmake-sanitized/lldb-build/./bin/dsymutil --filecheck /Users/buildslave/jenkins/workspace/lldb-cmake-sanitized/lldb-build/./bin/FileCheck --lldb-libs-dir /Users/buildslave/jenkins/workspace/lldb-cmake-sanitized/lldb-build/./lib /Users/buildslave/jenkins/workspace/lldb-cmake-sanitized/llvm-project/lldb/test/API/functionalities/data-formatter/synthupdate -p TestSyntheticFilterRecompute.py -- Exit Code: -6

Hide Details

Command Output (stdout): -- lldb version 11.0.99 clang revision 4034d0ce207d0c545799ceae5aaf2e35d400407c llvm revision 4034d0ce207d0c545799ceae5aaf2e35d400407c

Hide Details

-- Command Output (stderr): --

Hide Details

Session logs for test failures/errors/unexpected successes will go into directory '/Users/buildslave/jenkins/workspace/lldb-cmake-sanitized/test/logs' Command invoked: /Users/buildslave/jenkins/workspace/lldb-cmake-sanitized/llvm-project/lldb/test/API/dotest.py --arch x86_64 -s /Users/buildslave/jenkins/workspace/lldb-cmake-sanitized/lldb-build/lldb-test-traces -S nm -u CXXFLAGS -u CFLAGS --codesign-identity lldb_codesign --server /Users/buildslave/jenkins/workspace/lldb-cmake-sanitized/lldb-build/./bin/debugserver --arch x86_64 --build-dir /Users/buildslave/jenkins/workspace/lldb-cmake-sanitized/lldb-build/lldb-test-build.noindex -s=/Users/buildslave/jenkins/workspace/lldb-cmake-sanitized/test/logs -t --env TERM=vt100 --env LLVM_LIBS_DIR=/Users/buildslave/jenkins/workspace/lldb-cmake-sanitized/lldb-build/./lib --inferior-env ASAN_OPTIONS=detect_stack_use_after_return=1 --inferior-env DYLD_INSERT_LIBRARIES=/Users/buildslave/jenkins/workspace/lldb-cmake-sanitized/host-compiler/lib/clang/11.0.0/lib/darwin/libclang_rt.asan_osx_dynamic.dylib --build-dir /Users/buildslave/jenkins/workspace/lldb-cmake-sanitized/lldb-build/lldb-test-build.noindex --lldb-module-cache-dir /Users/buildslave/jenkins/workspace/lldb-cmake-sanitized/lldb-build/lldb-test-build.noindex/module-cache-lldb/lldb-api --clang-module-cache-dir /Users/buildslave/jenkins/workspace/lldb-cmake-sanitized/lldb-build/lldb-test-build.noindex/module-cache-clang/lldb-api --executable /Users/buildslave/jenkins/workspace/lldb-cmake-sanitized/lldb-build/./bin/lldb --compiler /Users/buildslave/jenkins/workspace/lldb-cmake-sanitized/lldb-build/./bin/clang --dsymutil /Users/buildslave/jenkins/workspace/lldb-cmake-sanitized/lldb-build/./bin/dsymutil --filecheck /Users/buildslave/jenkins/workspace/lldb-cmake-sanitized/lldb-build/./bin/FileCheck --lldb-libs-dir /Users/buildslave/jenkins/workspace/lldb-cmake-sanitized/lldb-build/./lib /Users/buildslave/jenkins/workspace/lldb-cmake-sanitized/llvm-project/lldb/test/API/functionalities/data-formatter/synthupdate -p TestSyntheticFilterRecompute.py Change dir to: /Users/buildslave/jenkins/workspace/lldb-cmake-sanitized/llvm-project/lldb/test/API/functionalities/data-formatter/synthupdate runCmd: settings clear -all output:

Hide Details

runCmd: settings set symbols.enable-external-lookup false output:

Hide Details

runCmd: settings set target.auto-apply-fixits false output:

Hide Details

runCmd: settings set plugin.process.gdb-remote.packet-timeout 60 output:

Hide Details

runCmd: settings set symbols.clang-modules-cache-path "/Users/buildslave/jenkins/workspace/lldb-cmake-sanitized/lldb-build/lldb-test-build.noindex/module-cache-lldb/lldb-api" output:

Hide Details

runCmd: settings set use-color false output:

Hide Details

runCmd: setting set target.prefer-dynamic-value no-dynamic-values output:

Hide Details

runCmd: settings set target.env-vars ASAN_OPTIONS=detect_stack_use_after_return=1 DYLD_INSERT_LIBRARIES=/Users/buildslave/jenkins/workspace/lldb-cmake-sanitized/host-compiler/lib/clang/11.0.0/lib/darwin/libclang_rt.asan_osx_dynamic.dylib output:

Hide Details

runCmd: file /Users/buildslave/jenkins/workspace/lldb-cmake-sanitized/lldb-build/lldb-test-build.noindex/functionalities/data-formatter/synthupdate/TestSyntheticFilterRecompute.test_rdar12437442_with_run_command_dsym/a.out output: Current executable set to '/Users/buildslave/jenkins/workspace/lldb-cmake-sanitized/lldb-build/lldb-test-build.noindex/functionalities/data-formatter/synthupdate/TestSyntheticFilterRecompute.test_rdar12437442_with_run_command_dsym/a.out' (x86_64).

Hide Details

Hide Details

runCmd: breakpoint set -f "main.m" -l 11 output: Breakpoint 1: where = a.out`main + 722 at main.m:11:9, address = 0x0000000100000ec2

Hide Details

Hide Details

Expecting pattern: ^Breakpoint (?P<bpno>[0-9]+): (?P<num_locations>[0-9]+) locations\.$ Not matched

Hide Details

Expecting pattern: ^Breakpoint (?P<bpno>[0-9]+): (?P<num_locations>no) locations \(pending\)\. Not matched

Hide Details

Expecting pattern: ^Breakpoint (?P<bpno>[0-9]+): where = (?P<module>.*)`(?P<symbol>[+\-]{0,1}[^+]+)( \+ (?P<offset>[0-9]+)){0,1}( \[inlined\] (?P<inline_symbol>.*)){0,1} at (?P<file>[^:]+):(?P<line_no>[0-9]+)(?P<column>(:[0-9]+)?), address = (?P<address>0x[0-9a-fA-F]+)$ Matched

Hide Details

runCmd: run output: Process 6535 stopped * thread #1, queue = 'com.apple.main-thread', stop reason = breakpoint 1.1 frame #0: 0x0000000100000ec2 a.out`main(argc=1, argv=0x00007ffeefbff428) at main.m:11:9 8 NSArray* foo = [NSArray arrayWithObjects:@1,@2,@3,@4,@5, nil]; 9 NSDictionary *bar = @{@1 : @"one",@2 : @"two", @3 : @"three", @4 : @"four", @5 : @"five", @6 : @"six", @7 : @"seven"}; 10 id x = foo; -> 11 x = bar; // Set break point at this line. ^ 12 13 [pool drain]; 14 return 0;

Hide Details

Process 6535 launched: '/Users/buildslave/jenkins/workspace/lldb-cmake-sanitized/lldb-build/lldb-test-build.noindex/functionalities/data-formatter/synthupdate/TestSyntheticFilterRecompute.test_rdar12437442_with_run_command_dsym/a.out' (x86_64)

Hide Details

Hide Details

runCmd: thread list output: Process 6535 stopped * thread #1: tid = 0x47fa16, 0x0000000100000ec2 a.out`main(argc=1, argv=0x00007ffeefbff428) at main.m:11:9, queue = 'com.apple.main-thread', stop reason = breakpoint 1.1

Hide Details

Hide Details

Expecting sub string: stopped Matched

Hide Details

Expecting sub string: stop reason = breakpoint Matched

Hide Details

Adding tearDown hook: def cleanup(): self.runCmd('type format clear', check=False) self.runCmd('type summary clear', check=False) self.runCmd('type synth clear', check=False)

Hide Details

Hide Details

runCmd: expr --dynamic-type run-target --ptr-depth 1 -- x output: (__NSArrayI *) $0 = 0x00006060000087e0 @"5 elements" { [0] = 0xf432cf47d9143395 (int)1 [1] = 0xf432cf47d9143095 (int)2 [2] = 0xf432cf47d9143195 (int)3 [3] = 0xf432cf47d9143695 (int)4 [4] = 0xf432cf47d9143795 (int)5 }

Hide Details

Hide Details

runCmd: next output: Process 6535 stopped * thread #1, queue = 'com.apple.main-thread', stop reason = step over frame #0: 0x0000000100000ed0 a.out`main(argc=1, argv=0x00007ffeefbff428) at main.m:13:6 10 id x = foo; 11 x = bar; // Set break point at this line. 12 -> 13 [pool drain]; ^ 14 return 0; 15 } 16

Hide Details

Hide Details

Hide Details

runCmd: frame select 0 output: frame #0: 0x0000000100000ed0 a.out`main(argc=1, argv=0x00007ffeefbff428) at main.m:13:6 10 id x = foo; 11 x = bar; // Set break point at this line. 12 -> 13 [pool drain]; ^ 14 return 0; 15 } 16

Hide Details

Hide Details

runCmd: expr --dynamic-type run-target --ptr-depth 1 -- x output: (__NSDictionaryI *) $1 = 0x0000611000002980 7 key/value pairs { [0] = { key = 0xf432cf47d9143795 (int)5 value = 0x00000001000010b0 @"five" } [1] = { key = 0xf432cf47d9143395 (int)1 value = 0x0000000100001030 @"one" } [2] = { key = 0xf432cf47d9143495 (int)6 value = 0x00000001000010d0 @"six" } [3] = { key = 0xf432cf47d9143095 (int)2 value = 0x0000000100001050 @"two" } [4] = { key = 0xf432cf47d9143595 (int)7 value = 0x00000001000010f0 @"seven" } [5] = { key = 0xf432cf47d9143195 (int)3 value = 0x0000000100001070 @"three" } [6] = { key = 0xf432cf47d9143695 (int)4 value = 0x0000000100001090 @"four" } }

Hide Details

Hide Details

<bound method SBProcess.Kill of <lldb.SBProcess; proxy of <Swig Object of type 'lldb::SBProcess *' at 0x108bfb9c0> >>: success

Hide Details

Executing tearDown hook: def cleanup(): self.runCmd('type format clear', check=False) self.runCmd('type summary clear', check=False) self.runCmd('type synth clear', check=False)

Hide Details

Hide Details

runCmd: type format clear check of return status not required output:

Hide Details

runCmd: type summary clear check of return status not required output:

Hide Details

runCmd: type synth clear check of return status not required output:

Hide Details

PASS: LLDB (/Users/buildslave/jenkins/workspace/lldb-cmake-sanitized/lldb-build/bin/clang-11-x86_64) :: test_rdar12437442_with_run_command_dsym (TestSyntheticFilterRecompute.SyntheticFilterRecomputingTestCase) runCmd: settings clear -all output:

Hide Details

runCmd: settings set symbols.enable-external-lookup false output:

Hide Details

runCmd: settings set target.auto-apply-fixits false output:

Hide Details

runCmd: settings set plugin.process.gdb-remote.packet-timeout 60 output: Assertion failed: (tokenKind == tok::kw___bridge_retain), function ParseParenExpression, file /Users/buildslave/jenkins/workspace/lldb-cmake-sanitized/llvm-project/clang/lib/Parse/ParseExpr.cpp, line 2804.

Hide Details

--

Hide Details

******************** FAIL: lldb-api :: lang/objc/objc-static-method/TestObjCStaticMethod.py (1690 of 2027) ******************** TEST 'lldb-api :: lang/objc/objc-static-method/TestObjCStaticMethod.py' FAILED ******************** Script: -- /Users/buildslave/jenkins/workspace/lldb-cmake-sanitized/lldb-build/lldb-test-build.noindex/copied-system-python /Users/buildslave/jenkins/workspace/lldb-cmake-sanitized/llvm-project/lldb/test/API/dotest.py --arch x86_64 -s /Users/buildslave/jenkins/workspace/lldb-cmake-sanitized/lldb-build/lldb-test-traces -S nm -u CXXFLAGS -u CFLAGS --codesign-identity lldb_codesign --server /Users/buildslave/jenkins/workspace/lldb-cmake-sanitized/lldb-build/./bin/debugserver --arch x86_64 --build-dir /Users/buildslave/jenkins/workspace/lldb-cmake-sanitized/lldb-build/lldb-test-build.noindex -s=/Users/buildslave/jenkins/workspace/lldb-cmake-sanitized/test/logs -t --env TERM=vt100 --env LLVM_LIBS_DIR=/Users/buildslave/jenkins/workspace/lldb-cmake-sanitized/lldb-build/./lib --inferior-env ASAN_OPTIONS=detect_stack_use_after_return=1 --inferior-env DYLD_INSERT_LIBRARIES=/Users/buildslave/jenkins/workspace/lldb-cmake-sanitized/host-compiler/lib/clang/11.0.0/lib/darwin/libclang_rt.asan_osx_dynamic.dylib --build-dir /Users/buildslave/jenkins/workspace/lldb-cmake-sanitized/lldb-build/lldb-test-build.noindex --lldb-module-cache-dir /Users/buildslave/jenkins/workspace/lldb-cmake-sanitized/lldb-build/lldb-test-build.noindex/module-cache-lldb/lldb-api --clang-module-cache-dir /Users/buildslave/jenkins/workspace/lldb-cmake-sanitized/lldb-build/lldb-test-build.noindex/module-cache-clang/lldb-api --executable /Users/buildslave/jenkins/workspace/lldb-cmake-sanitized/lldb-build/./bin/lldb --compiler /Users/buildslave/jenkins/workspace/lldb-cmake-sanitized/lldb-build/./bin/clang --dsymutil /Users/buildslave/jenkins/workspace/lldb-cmake-sanitized/lldb-build/./bin/dsymutil --filecheck /Users/buildslave/jenkins/workspace/lldb-cmake-sanitized/lldb-build/./bin/FileCheck --lldb-libs-dir /Users/buildslave/jenkins/workspace/lldb-cmake-sanitized/lldb-build/./lib /Users/buildslave/jenkins/workspace/lldb-cmake-sanitized/llvm-project/lldb/test/API/lang/objc/objc-static-method -p TestObjCStaticMethod.py -- Exit Code: -6

Hide Details

Command Output (stdout): -- lldb version 11.0.99 clang revision 4034d0ce207d0c545799ceae5aaf2e35d400407c llvm revision 4034d0ce207d0c545799ceae5aaf2e35d400407c

Hide Details

-- Command Output (stderr): -- Assertion failed: (tokenKind == tok::kw___bridge_retain), function ParseParenExpression, file /Users/buildslave/jenkins/workspace/lldb-cmake-sanitized/llvm-project/clang/lib/Parse/ParseExpr.cpp, line 2804.

Hide Details

--

Hide Details

******************** PASS: lldb-unit :: Utility/./UtilityTests/DataExtractorTest.GetCStrEmpty (1691 of 2027) PASS: lldb-unit :: UnwindAssembly/x86/./UnwindAssemblyx86Tests/Testx86AssemblyInspectionEngine.TestSpillRegToStackViaMOVi386 (1692 of 2027) PASS: lldb-unit :: Symbol/./SymbolTests/TestTypeSystemClang.TestGetTypeClassNested (1693 of 2027) PASS: lldb-shell :: SymbolFile/DWARF/array-sizes.s (1694 of 2027) PASS: lldb-unit :: Utility/./UtilityTests/OptionsWithRawTest.LeadingSpaceArgs (1695 of 2027) PASS: lldb-unit :: Utility/./UtilityTests/ScalarTest.ComparisonFloat (1696 of 2027) XFAIL: lldb-shell :: Register/x86-mm-xmm-read.test (1697 of 2027) PASS: lldb-unit :: Utility/./UtilityTests/AnsiTerminal.AtEnd (1698 of 2027) PASS: lldb-shell :: ObjectFile/ELF/aarch64-relocations.yaml (1699 of 2027) PASS: lldb-api :: lang/c/const_variables/TestConstVariables.py (1700 of 2027) PASS: lldb-api :: commands/expression/call-function/TestCallStdStringFunction.py (1701 of 2027) FAIL: lldb-api :: lang/objc/self/TestObjCSelf.py (1702 of 2027) ******************** TEST 'lldb-api :: lang/objc/self/TestObjCSelf.py' FAILED ******************** Script: -- /Users/buildslave/jenkins/workspace/lldb-cmake-sanitized/lldb-build/lldb-test-build.noindex/copied-system-python /Users/buildslave/jenkins/workspace/lldb-cmake-sanitized/llvm-project/lldb/test/API/dotest.py --arch x86_64 -s /Users/buildslave/jenkins/workspace/lldb-cmake-sanitized/lldb-build/lldb-test-traces -S nm -u CXXFLAGS -u CFLAGS --codesign-identity lldb_codesign --server /Users/buildslave/jenkins/workspace/lldb-cmake-sanitized/lldb-build/./bin/debugserver --arch x86_64 --build-dir /Users/buildslave/jenkins/workspace/lldb-cmake-sanitized/lldb-build/lldb-test-build.noindex -s=/Users/buildslave/jenkins/workspace/lldb-cmake-sanitized/test/logs -t --env TERM=vt100 --env LLVM_LIBS_DIR=/Users/buildslave/jenkins/workspace/lldb-cmake-sanitized/lldb-build/./lib --inferior-env ASAN_OPTIONS=detect_stack_use_after_return=1 --inferior-env DYLD_INSERT_LIBRARIES=/Users/buildslave/jenkins/workspace/lldb-cmake-sanitized/host-compiler/lib/clang/11.0.0/lib/darwin/libclang_rt.asan_osx_dynamic.dylib --build-dir /Users/buildslave/jenkins/workspace/lldb-cmake-sanitized/lldb-build/lldb-test-build.noindex --lldb-module-cache-dir /Users/buildslave/jenkins/workspace/lldb-cmake-sanitized/lldb-build/lldb-test-build.noindex/module-cache-lldb/lldb-api --clang-module-cache-dir /Users/buildslave/jenkins/workspace/lldb-cmake-sanitized/lldb-build/lldb-test-build.noindex/module-cache-clang/lldb-api --executable /Users/buildslave/jenkins/workspace/lldb-cmake-sanitized/lldb-build/./bin/lldb --compiler /Users/buildslave/jenkins/workspace/lldb-cmake-sanitized/lldb-build/./bin/clang --dsymutil /Users/buildslave/jenkins/workspace/lldb-cmake-sanitized/lldb-build/./bin/dsymutil --filecheck /Users/buildslave/jenkins/workspace/lldb-cmake-sanitized/lldb-build/./bin/FileCheck --lldb-libs-dir /Users/buildslave/jenkins/workspace/lldb-cmake-sanitized/lldb-build/./lib /Users/buildslave/jenkins/workspace/lldb-cmake-sanitized/llvm-project/lldb/test/API/lang/objc/self -p TestObjCSelf.py -- Exit Code: -6

Hide Details

Command Output (stdout): -- lldb version 11.0.99 clang revision 4034d0ce207d0c545799ceae5aaf2e35d400407c llvm revision 4034d0ce207d0c545799ceae5aaf2e35d400407c

Hide Details

-- Command Output (stderr): -- Assertion failed: (tokenKind == tok::kw___bridge_retain), function ParseParenExpression, file /Users/buildslave/jenkins/workspace/lldb-cmake-sanitized/llvm-project/clang/lib/Parse/ParseExpr.cpp, line 2804.

Hide Details

--

Hide Details

******************** PASS: lldb-unit :: Language/Highlighting/./HighlighterTests/HighlighterTest.ClangCursorPosBeforeOtherToken (1703 of 2027) PASS: lldb-shell :: Quit/TestQuitExitCodeImplicit0.test (1704 of 2027) UNSUPPORTED: lldb-shell :: SymbolFile/PDB/udt-layout.test (1705 of 2027) PASS: lldb-api :: tools/lldb-server/TestGdbRemoteExpeditedRegisters.py (1706 of 2027) UNSUPPORTED: lldb-api :: lang/objc/ptr_refs/TestPtrRefsObjC.py (1707 of 2027) PASS: lldb-unit :: Host/./HostTests/FileSystemTest.GetByteSize (1708 of 2027) PASS: lldb-unit :: Core/./LLDBCoreTests/RichManglingContextTest.IPDRealloc (1709 of 2027) PASS: lldb-api :: functionalities/postmortem/minidump-new/TestMiniDumpUUID.py (1710 of 2027) PASS: lldb-api :: functionalities/thread/concurrent_events/TestConcurrentSignalWatch.py (1711 of 2027) PASS: lldb-unit :: Utility/./UtilityTests/FileSpecTest.EqualDotsPosixRoot (1712 of 2027) PASS: lldb-api :: functionalities/avoids-fd-leak/TestFdLeak.py (1713 of 2027) PASS: lldb-api :: commands/settings/use_source_cache/TestUseSourceCache.py (1714 of 2027) PASS: lldb-api :: functionalities/thread/thread_specific_break/TestThreadSpecificBreakpoint.py (1715 of 2027) PASS: lldb-unit :: Utility/./UtilityTests/RangeTest.ContainsEndInclusiveInvalid (1716 of 2027) PASS: lldb-api :: lang/cpp/operator-overload/TestOperatorOverload.py (1717 of 2027) PASS: lldb-unit :: Utility/./UtilityTests/StreamTest.PutPtr (1718 of 2027) PASS: lldb-shell :: Register/x86-64-read.test (1719 of 2027) UNSUPPORTED: lldb-api :: functionalities/darwin_log/filter/exact_match/activity/TestDarwinLogFilterMatchActivity.py (1720 of 2027) PASS: lldb-shell :: SymbolFile/DWARF/find-basic-function.cpp (1721 of 2027) PASS: lldb-api :: functionalities/gdb_remote_client/TestRegDefinitionInParts.py (1722 of 2027) PASS: lldb-api :: functionalities/data-formatter/ptr_ref_typedef/TestPtrRef2Typedef.py (1723 of 2027) FAIL: lldb-api :: commands/expression/call-throws/TestCallThatThrows.py (1724 of 2027) ******************** TEST 'lldb-api :: commands/expression/call-throws/TestCallThatThrows.py' FAILED ******************** Script: -- /Users/buildslave/jenkins/workspace/lldb-cmake-sanitized/lldb-build/lldb-test-build.noindex/copied-system-python /Users/buildslave/jenkins/workspace/lldb-cmake-sanitized/llvm-project/lldb/test/API/dotest.py --arch x86_64 -s /Users/buildslave/jenkins/workspace/lldb-cmake-sanitized/lldb-build/lldb-test-traces -S nm -u CXXFLAGS -u CFLAGS --codesign-identity lldb_codesign --server /Users/buildslave/jenkins/workspace/lldb-cmake-sanitized/lldb-build/./bin/debugserver --arch x86_64 --build-dir /Users/buildslave/jenkins/workspace/lldb-cmake-sanitized/lldb-build/lldb-test-build.noindex -s=/Users/buildslave/jenkins/workspace/lldb-cmake-sanitized/test/logs -t --env TERM=vt100 --env LLVM_LIBS_DIR=/Users/buildslave/jenkins/workspace/lldb-cmake-sanitized/lldb-build/./lib --inferior-env ASAN_OPTIONS=detect_stack_use_after_return=1 --inferior-env DYLD_INSERT_LIBRARIES=/Users/buildslave/jenkins/workspace/lldb-cmake-sanitized/host-compiler/lib/clang/11.0.0/lib/darwin/libclang_rt.asan_osx_dynamic.dylib --build-dir /Users/buildslave/jenkins/workspace/lldb-cmake-sanitized/lldb-build/lldb-test-build.noindex --lldb-module-cache-dir /Users/buildslave/jenkins/workspace/lldb-cmake-sanitized/lldb-build/lldb-test-build.noindex/module-cache-lldb/lldb-api --clang-module-cache-dir /Users/buildslave/jenkins/workspace/lldb-cmake-sanitized/lldb-build/lldb-test-build.noindex/module-cache-clang/lldb-api --executable /Users/buildslave/jenkins/workspace/lldb-cmake-sanitized/lldb-build/./bin/lldb --compiler /Users/buildslave/jenkins/workspace/lldb-cmake-sanitized/lldb-build/./bin/clang --dsymutil /Users/buildslave/jenkins/workspace/lldb-cmake-sanitized/lldb-build/./bin/dsymutil --filecheck /Users/buildslave/jenkins/workspace/lldb-cmake-sanitized/lldb-build/./bin/FileCheck --lldb-libs-dir /Users/buildslave/jenkins/workspace/lldb-cmake-sanitized/lldb-build/./lib /Users/buildslave/jenkins/workspace/lldb-cmake-sanitized/llvm-project/lldb/test/API/commands/expression/call-throws -p TestCallThatThrows.py -- Exit Code: -6

Hide Details

Command Output (stdout): -- lldb version 11.0.99 clang revision 4034d0ce207d0c545799ceae5aaf2e35d400407c llvm revision 4034d0ce207d0c545799ceae5aaf2e35d400407c

Hide Details

-- Command Output (stderr): -- Assertion failed: (tokenKind == tok::kw___bridge_retain), function ParseParenExpression, file /Users/buildslave/jenkins/workspace/lldb-cmake-sanitized/llvm-project/clang/lib/Parse/ParseExpr.cpp, line 2804.

Hide Details

--

Hide Details

******************** PASS: lldb-unit :: UnwindAssembly/x86/./UnwindAssemblyx86Tests/Testx86AssemblyInspectionEngine.TestPopR13 (1725 of 2027) PASS: lldb-api :: functionalities/inferior-crashing/TestInferiorCrashingStep.py (1726 of 2027) PASS: lldb-api :: functionalities/tail_call_frames/ambiguous_tail_call_seq1/TestAmbiguousTailCallSeq1.py (1727 of 2027) PASS: lldb-unit :: UnwindAssembly/x86/./UnwindAssemblyx86Tests/Testx86AssemblyInspectionEngine.TestPushEDX (1728 of 2027) PASS: lldb-unit :: Utility/./UtilityTests/StringExtractorTest.GetHexBytes (1729 of 2027) PASS: lldb-unit :: Interpreter/./InterpreterTests/CompletionTest.FileCompletionAbsolute (1730 of 2027) PASS: lldb-unit :: Utility/./UtilityTests/StringExtractorTest.DecodeHexU8_Extra (1731 of 2027) PASS: lldb-unit :: Utility/./UtilityTests/NameMatchesTest.Contains (1732 of 2027) PASS: lldb-api :: functionalities/unwind/noreturn/module-end/TestNoReturnModuleEnd.py (1733 of 2027) PASS: lldb-api :: lang/objc/direct-dispatch-step/TestObjCDirectDispatchStepping.py (1734 of 2027) PASS: lldb-unit :: Utility/./UtilityTests/StringListTest.SplitIntoLines (1735 of 2027) PASS: lldb-unit :: Utility/./UtilityTests/BinaryStreamTest.PutSLEB128One (1736 of 2027) PASS: lldb-api :: lang/cpp/type_lookup/TestCppTypeLookup.py (1737 of 2027) PASS: lldb-unit :: UnwindAssembly/x86/./UnwindAssemblyx86Tests/Testx86AssemblyInspectionEngine.Test32BitOnlyInstruction (1738 of 2027) PASS: lldb-unit :: Utility/./UtilityTests/OptionsWithRawTest.EmptySuffixSingleWhitespace (1739 of 2027) PASS: lldb-unit :: Utility/./UtilityTests/XcodeSDKTest.SDKSupportsModules (1740 of 2027) PASS: lldb-unit :: Host/./HostTests/SocketTest.DomainGetConnectURI (1741 of 2027) PASS: lldb-unit :: Utility/./UtilityTests/FileSpecTest.OperatorBool (1742 of 2027) PASS: lldb-api :: lang/cpp/exceptions/TestCPPExceptionBreakpoints.py (1743 of 2027) PASS: lldb-unit :: Process/gdb-remote/./ProcessGdbRemoteTests/GDBRemoteClientBaseTest.SendContinueAndAsyncPacket (1744 of 2027) PASS: lldb-unit :: Process/gdb-remote/./ProcessGdbRemoteTests/GDBRemoteCommunicationClientTest.SendStartTracePacket (1745 of 2027) PASS: lldb-api :: functionalities/breakpoint/breakpoint_command/TestBreakpointCommand.py (1746 of 2027) PASS: lldb-api :: commands/expression/codegen-crash-typedefdecl-not-in_declcontext/TestCodegenCrashTypedefDeclNotInDeclContext.py (1747 of 2027) PASS: lldb-api :: lang/c/conflicting-symbol/TestConflictingSymbol.py (1748 of 2027) PASS: lldb-api :: functionalities/tail_call_frames/unambiguous_sequence/TestUnambiguousTailCalls.py (1749 of 2027) PASS: lldb-unit :: Utility/./UtilityTests/ScalarTest.CastOperations (1750 of 2027) PASS: lldb-unit :: Utility/./UtilityTests/UriParserTest.BracketedHostname (1751 of 2027) PASS: lldb-api :: commands/expression/import-std-module/basic/TestImportStdModule.py (1752 of 2027) UNSUPPORTED: lldb-shell :: Register/x86-gp-write.test (1753 of 2027) PASS: lldb-shell :: SymbolFile/Breakpad/unwind-via-stack-win-no-memory-info.yaml (1754 of 2027) PASS: lldb-api :: lang/objc/objc-ivar-stripped/TestObjCIvarStripped.py (1755 of 2027) PASS: lldb-api :: functionalities/breakpoint/breakpoint_options/TestBreakpointOptions.py (1756 of 2027) PASS: lldb-unit :: Symbol/./SymbolTests/Type.CompilerContextPattern (1757 of 2027) PASS: lldb-api :: commands/expression/import-std-module/list-dbg-info-content/TestDbgInfoContentListFromStdModule.py (1758 of 2027) UNSUPPORTED: lldb-api :: tools/lldb-vscode/completions/TestVSCode_completions.py (1759 of 2027) UNSUPPORTED: lldb-shell :: Expr/TestIRMemoryMapWindows.test (1760 of 2027) PASS: lldb-api :: functionalities/data-formatter/data-formatter-enum-format/TestDataFormatterEnumFormat.py (1761 of 2027) PASS: lldb-api :: functionalities/data-formatter/data-formatter-objc/TestDataFormatterObjCPlain.py (1762 of 2027) UNSUPPORTED: lldb-shell :: Unwind/eh-frame-small-fde.test (1763 of 2027) PASS: lldb-api :: commands/target/create-deps/TestTargetCreateDeps.py (1764 of 2027) PASS: lldb-api :: functionalities/thread/step_out/TestThreadStepOut.py (1765 of 2027) PASS: lldb-unit :: Utility/./UtilityTests/SerializationRountripTest.SerializeDeserializePod (1766 of 2027) PASS: lldb-api :: lang/cpp/class_types/TestClassTypes.py (1767 of 2027) PASS: lldb-api :: lang/objc/real-definition/TestRealDefinition.py (1768 of 2027) FAIL: lldb-api :: lang/objc/unicode-string/TestUnicodeString.py (1769 of 2027) ******************** TEST 'lldb-api :: lang/objc/unicode-string/TestUnicodeString.py' FAILED ******************** Script: -- /Users/buildslave/jenkins/workspace/lldb-cmake-sanitized/lldb-build/lldb-test-build.noindex/copied-system-python /Users/buildslave/jenkins/workspace/lldb-cmake-sanitized/llvm-project/lldb/test/API/dotest.py --arch x86_64 -s /Users/buildslave/jenkins/workspace/lldb-cmake-sanitized/lldb-build/lldb-test-traces -S nm -u CXXFLAGS -u CFLAGS --codesign-identity lldb_codesign --server /Users/buildslave/jenkins/workspace/lldb-cmake-sanitized/lldb-build/./bin/debugserver --arch x86_64 --build-dir /Users/buildslave/jenkins/workspace/lldb-cmake-sanitized/lldb-build/lldb-test-build.noindex -s=/Users/buildslave/jenkins/workspace/lldb-cmake-sanitized/test/logs -t --env TERM=vt100 --env LLVM_LIBS_DIR=/Users/buildslave/jenkins/workspace/lldb-cmake-sanitized/lldb-build/./lib --inferior-env ASAN_OPTIONS=detect_stack_use_after_return=1 --inferior-env DYLD_INSERT_LIBRARIES=/Users/buildslave/jenkins/workspace/lldb-cmake-sanitized/host-compiler/lib/clang/11.0.0/lib/darwin/libclang_rt.asan_osx_dynamic.dylib --build-dir /Users/buildslave/jenkins/workspace/lldb-cmake-sanitized/lldb-build/lldb-test-build.noindex --lldb-module-cache-dir /Users/buildslave/jenkins/workspace/lldb-cmake-sanitized/lldb-build/lldb-test-build.noindex/module-cache-lldb/lldb-api --clang-module-cache-dir /Users/buildslave/jenkins/workspace/lldb-cmake-sanitized/lldb-build/lldb-test-build.noindex/module-cache-clang/lldb-api --executable /Users/buildslave/jenkins/workspace/lldb-cmake-sanitized/lldb-build/./bin/lldb --compiler /Users/buildslave/jenkins/workspace/lldb-cmake-sanitized/lldb-build/./bin/clang --dsymutil /Users/buildslave/jenkins/workspace/lldb-cmake-sanitized/lldb-build/./bin/dsymutil --filecheck /Users/buildslave/jenkins/workspace/lldb-cmake-sanitized/lldb-build/./bin/FileCheck --lldb-libs-dir /Users/buildslave/jenkins/workspace/lldb-cmake-sanitized/lldb-build/./lib /Users/buildslave/jenkins/workspace/lldb-cmake-sanitized/llvm-project/lldb/test/API/lang/objc/unicode-string -p TestUnicodeString.py -- Exit Code: -6

Hide Details

Command Output (stdout): -- lldb version 11.0.99 clang revision 4034d0ce207d0c545799ceae5aaf2e35d400407c llvm revision 4034d0ce207d0c545799ceae5aaf2e35d400407c

Hide Details

-- Command Output (stderr): -- Assertion failed: (tokenKind == tok::kw___bridge_retain), function ParseParenExpression, file /Users/buildslave/jenkins/workspace/lldb-cmake-sanitized/llvm-project/clang/lib/Parse/ParseExpr.cpp, line 2804.

Hide Details

--

Hide Details

******************** UNSUPPORTED: lldb-api :: lang/c/typedef/Testtypedef.py (1770 of 2027) PASS: lldb-api :: functionalities/gdb_remote_client/TestNestedRegDefinitions.py (1771 of 2027) PASS: lldb-api :: functionalities/data-formatter/array_typedef/TestArrayTypedef.py (1772 of 2027) PASS: lldb-api :: lang/cpp/typedef/TestCppTypedef.py (1773 of 2027) PASS: lldb-shell :: SymbolFile/DWARF/DW_AT_loclists_base.s (1774 of 2027) FAIL: lldb-api :: lang/objc/objc-optimized/TestObjcOptimized.py (1775 of 2027) ******************** TEST 'lldb-api :: lang/objc/objc-optimized/TestObjcOptimized.py' FAILED ******************** Script: -- /Users/buildslave/jenkins/workspace/lldb-cmake-sanitized/lldb-build/lldb-test-build.noindex/copied-system-python /Users/buildslave/jenkins/workspace/lldb-cmake-sanitized/llvm-project/lldb/test/API/dotest.py --arch x86_64 -s /Users/buildslave/jenkins/workspace/lldb-cmake-sanitized/lldb-build/lldb-test-traces -S nm -u CXXFLAGS -u CFLAGS --codesign-identity lldb_codesign --server /Users/buildslave/jenkins/workspace/lldb-cmake-sanitized/lldb-build/./bin/debugserver --arch x86_64 --build-dir /Users/buildslave/jenkins/workspace/lldb-cmake-sanitized/lldb-build/lldb-test-build.noindex -s=/Users/buildslave/jenkins/workspace/lldb-cmake-sanitized/test/logs -t --env TERM=vt100 --env LLVM_LIBS_DIR=/Users/buildslave/jenkins/workspace/lldb-cmake-sanitized/lldb-build/./lib --inferior-env ASAN_OPTIONS=detect_stack_use_after_return=1 --inferior-env DYLD_INSERT_LIBRARIES=/Users/buildslave/jenkins/workspace/lldb-cmake-sanitized/host-compiler/lib/clang/11.0.0/lib/darwin/libclang_rt.asan_osx_dynamic.dylib --build-dir /Users/buildslave/jenkins/workspace/lldb-cmake-sanitized/lldb-build/lldb-test-build.noindex --lldb-module-cache-dir /Users/buildslave/jenkins/workspace/lldb-cmake-sanitized/lldb-build/lldb-test-build.noindex/module-cache-lldb/lldb-api --clang-module-cache-dir /Users/buildslave/jenkins/workspace/lldb-cmake-sanitized/lldb-build/lldb-test-build.noindex/module-cache-clang/lldb-api --executable /Users/buildslave/jenkins/workspace/lldb-cmake-sanitized/lldb-build/./bin/lldb --compiler /Users/buildslave/jenkins/workspace/lldb-cmake-sanitized/lldb-build/./bin/clang --dsymutil /Users/buildslave/jenkins/workspace/lldb-cmake-sanitized/lldb-build/./bin/dsymutil --filecheck /Users/buildslave/jenkins/workspace/lldb-cmake-sanitized/lldb-build/./bin/FileCheck --lldb-libs-dir /Users/buildslave/jenkins/workspace/lldb-cmake-sanitized/lldb-build/./lib /Users/buildslave/jenkins/workspace/lldb-cmake-sanitized/llvm-project/lldb/test/API/lang/objc/objc-optimized -p TestObjcOptimized.py -- Exit Code: -6

Hide Details

Command Output (stdout): -- lldb version 11.0.99 clang revision 4034d0ce207d0c545799ceae5aaf2e35d400407c llvm revision 4034d0ce207d0c545799ceae5aaf2e35d400407c a.out was compiled with optimization - stepping may behave oddly; variables may not be available. a.out was compiled with optimization - stepping may behave oddly; variables may not be available. a.out was compiled with optimization - stepping may behave oddly; variables may not be available.

Hide Details

-- Command Output (stderr): -- Assertion failed: (tokenKind == tok::kw___bridge_retain), function ParseParenExpression, file /Users/buildslave/jenkins/workspace/lldb-cmake-sanitized/llvm-project/clang/lib/Parse/ParseExpr.cpp, line 2804.

Hide Details

--

Hide Details

******************** PASS: lldb-api :: lang/cpp/dynamic-value/TestCppValueCast.py (1776 of 2027) PASS: lldb-api :: functionalities/data-formatter/synthcapping/TestSyntheticCapping.py (1777 of 2027) PASS: lldb-api :: types/TestDoubleTypes.py (1778 of 2027) PASS: lldb-api :: python_api/symbol-context/TestSymbolContext.py (1779 of 2027) PASS: lldb-unit :: Utility/./UtilityTests/StringExtractorTest.GetNameColonValueNoSemicolon (1780 of 2027) XFAIL: lldb-shell :: Unwind/prefer-debug-over-eh-frame.test (1781 of 2027) PASS: lldb-api :: functionalities/postmortem/wow64_minidump/TestWow64MiniDump.py (1782 of 2027) PASS: lldb-api :: commands/command/history/TestCommandHistory.py (1783 of 2027) PASS: lldb-unit :: Utility/./UtilityTests/ProcessInfoTest.Constructor (1784 of 2027) PASS: lldb-unit :: Utility/./UtilityTests/GeneratorTest.GetOrCreate (1785 of 2027) PASS: lldb-api :: python_api/watchpoint/condition/TestWatchpointConditionAPI.py (1786 of 2027) PASS: lldb-api :: lang/cpp/namespace_conflicts/TestNamespaceConflicts.py (1787 of 2027) PASS: lldb-api :: commands/expression/import-std-module/weak_ptr-dbg-info-content/TestDbgInfoContentWeakPtrFromStdModule.py (1788 of 2027) PASS: lldb-unit :: SymbolFile/DWARF/./SymbolFileDWARFTests/SymbolFileDWARFTests.TestAbbrevOrder1Start5 (1789 of 2027) PASS: lldb-api :: functionalities/inferior-changed/TestInferiorChanged.py (1790 of 2027) PASS: lldb-unit :: Utility/./UtilityTests/CompletionRequest.ShiftArguments (1791 of 2027) PASS: lldb-unit :: Language/Highlighting/./HighlighterTests/HighlighterTest.FallbackHighlighter (1792 of 2027) PASS: lldb-api :: functionalities/data-formatter/ostypeformatting/TestFormattersOsType.py (1793 of 2027) PASS: lldb-unit :: Host/./HostTests/ConnectionFileDescriptorTest.TCPGetURIv4 (1794 of 2027) PASS: lldb-api :: functionalities/data-formatter/data-formatter-objc/TestDataFormatterObjCNSDate.py (1795 of 2027) UNSUPPORTED: lldb-shell :: SymbolFile/PDB/class-layout.test (1796 of 2027) PASS: lldb-unit :: Symbol/./SymbolTests/TestClangASTImporter.DeportDeclTagDecl (1797 of 2027) PASS: lldb-unit :: SymbolFile/NativePDB/./SymbolFileNativePDBTests/PDBFPOProgramToDWARFExpressionTests.InvalidOpBinary (1798 of 2027) PASS: lldb-unit :: ScriptInterpreter/Python/./ScriptInterpreterPythonTests/PythonDataObjectsTest.TestPythonListManipulation (1799 of 2027) PASS: lldb-unit :: Utility/./UtilityTests/StreamTest.PutCharWhitespace (1800 of 2027) PASS: lldb-unit :: Expression/./ExpressionTests/ClangExpressionDeclMapTest.TestPersistentDeclLookup (1801 of 2027) PASS: lldb-api :: lang/cpp/dynamic-value/TestDynamicValue.py (1802 of 2027) PASS: lldb-api :: lang/cpp/global_variables/TestCPPGlobalVariables.py (1803 of 2027) PASS: lldb-unit :: Utility/./UtilityTests/BroadcasterTest.EventTypeHasListeners (1804 of 2027) PASS: lldb-unit :: Utility/./UtilityTests/RangeTest.DoesAdjoinOrIntersect (1805 of 2027) FAIL: lldb-api :: functionalities/data-formatter/poarray/TestPrintObjectArray.py (1806 of 2027) ******************** TEST 'lldb-api :: functionalities/data-formatter/poarray/TestPrintObjectArray.py' FAILED ******************** Script: -- /Users/buildslave/jenkins/workspace/lldb-cmake-sanitized/lldb-build/lldb-test-build.noindex/copied-system-python /Users/buildslave/jenkins/workspace/lldb-cmake-sanitized/llvm-project/lldb/test/API/dotest.py --arch x86_64 -s /Users/buildslave/jenkins/workspace/lldb-cmake-sanitized/lldb-build/lldb-test-traces -S nm -u CXXFLAGS -u CFLAGS --codesign-identity lldb_codesign --server /Users/buildslave/jenkins/workspace/lldb-cmake-sanitized/lldb-build/./bin/debugserver --arch x86_64 --build-dir /Users/buildslave/jenkins/workspace/lldb-cmake-sanitized/lldb-build/lldb-test-build.noindex -s=/Users/buildslave/jenkins/workspace/lldb-cmake-sanitized/test/logs -t --env TERM=vt100 --env LLVM_LIBS_DIR=/Users/buildslave/jenkins/workspace/lldb-cmake-sanitized/lldb-build/./lib --inferior-env ASAN_OPTIONS=detect_stack_use_after_return=1 --inferior-env DYLD_INSERT_LIBRARIES=/Users/buildslave/jenkins/workspace/lldb-cmake-sanitized/host-compiler/lib/clang/11.0.0/lib/darwin/libclang_rt.asan_osx_dynamic.dylib --build-dir /Users/buildslave/jenkins/workspace/lldb-cmake-sanitized/lldb-build/lldb-test-build.noindex --lldb-module-cache-dir /Users/buildslave/jenkins/workspace/lldb-cmake-sanitized/lldb-build/lldb-test-build.noindex/module-cache-lldb/lldb-api --clang-module-cache-dir /Users/buildslave/jenkins/workspace/lldb-cmake-sanitized/lldb-build/lldb-test-build.noindex/module-cache-clang/lldb-api --executable /Users/buildslave/jenkins/workspace/lldb-cmake-sanitized/lldb-build/./bin/lldb --compiler /Users/buildslave/jenkins/workspace/lldb-cmake-sanitized/lldb-build/./bin/clang --dsymutil /Users/buildslave/jenkins/workspace/lldb-cmake-sanitized/lldb-build/./bin/dsymutil --filecheck /Users/buildslave/jenkins/workspace/lldb-cmake-sanitized/lldb-build/./bin/FileCheck --lldb-libs-dir /Users/buildslave/jenkins/workspace/lldb-cmake-sanitized/lldb-build/./lib /Users/buildslave/jenkins/workspace/lldb-cmake-sanitized/llvm-project/lldb/test/API/functionalities/data-formatter/poarray -p TestPrintObjectArray.py -- Exit Code: -6

Hide Details

Command Output (stdout): -- lldb version 11.0.99 clang revision 4034d0ce207d0c545799ceae5aaf2e35d400407c llvm revision 4034d0ce207d0c545799ceae5aaf2e35d400407c

Hide Details

-- Command Output (stderr): --

Hide Details

Session logs for test failures/errors/unexpected successes will go into directory '/Users/buildslave/jenkins/workspace/lldb-cmake-sanitized/test/logs' Command invoked: /Users/buildslave/jenkins/workspace/lldb-cmake-sanitized/llvm-project/lldb/test/API/dotest.py --arch x86_64 -s /Users/buildslave/jenkins/workspace/lldb-cmake-sanitized/lldb-build/lldb-test-traces -S nm -u CXXFLAGS -u CFLAGS --codesign-identity lldb_codesign --server /Users/buildslave/jenkins/workspace/lldb-cmake-sanitized/lldb-build/./bin/debugserver --arch x86_64 --build-dir /Users/buildslave/jenkins/workspace/lldb-cmake-sanitized/lldb-build/lldb-test-build.noindex -s=/Users/buildslave/jenkins/workspace/lldb-cmake-sanitized/test/logs -t --env TERM=vt100 --env LLVM_LIBS_DIR=/Users/buildslave/jenkins/workspace/lldb-cmake-sanitized/lldb-build/./lib --inferior-env ASAN_OPTIONS=detect_stack_use_after_return=1 --inferior-env DYLD_INSERT_LIBRARIES=/Users/buildslave/jenkins/workspace/lldb-cmake-sanitized/host-compiler/lib/clang/11.0.0/lib/darwin/libclang_rt.asan_osx_dynamic.dylib --build-dir /Users/buildslave/jenkins/workspace/lldb-cmake-sanitized/lldb-build/lldb-test-build.noindex --lldb-module-cache-dir /Users/buildslave/jenkins/workspace/lldb-cmake-sanitized/lldb-build/lldb-test-build.noindex/module-cache-lldb/lldb-api --clang-module-cache-dir /Users/buildslave/jenkins/workspace/lldb-cmake-sanitized/lldb-build/lldb-test-build.noindex/module-cache-clang/lldb-api --executable /Users/buildslave/jenkins/workspace/lldb-cmake-sanitized/lldb-build/./bin/lldb --compiler /Users/buildslave/jenkins/workspace/lldb-cmake-sanitized/lldb-build/./bin/clang --dsymutil /Users/buildslave/jenkins/workspace/lldb-cmake-sanitized/lldb-build/./bin/dsymutil --filecheck /Users/buildslave/jenkins/workspace/lldb-cmake-sanitized/lldb-build/./bin/FileCheck --lldb-libs-dir /Users/buildslave/jenkins/workspace/lldb-cmake-sanitized/lldb-build/./lib /Users/buildslave/jenkins/workspace/lldb-cmake-sanitized/llvm-project/lldb/test/API/functionalities/data-formatter/poarray -p TestPrintObjectArray.py Change dir to: /Users/buildslave/jenkins/workspace/lldb-cmake-sanitized/llvm-project/lldb/test/API/functionalities/data-formatter/poarray runCmd: settings clear -all output:

Hide Details

runCmd: settings set symbols.enable-external-lookup false output:

Hide Details

runCmd: settings set target.auto-apply-fixits false output:

Hide Details

runCmd: settings set plugin.process.gdb-remote.packet-timeout 60 output:

Hide Details

runCmd: settings set symbols.clang-modules-cache-path "/Users/buildslave/jenkins/workspace/lldb-cmake-sanitized/lldb-build/lldb-test-build.noindex/module-cache-lldb/lldb-api" output:

Hide Details

runCmd: settings set use-color false output:

Hide Details

runCmd: setting set target.prefer-dynamic-value no-dynamic-values output:

Hide Details

runCmd: settings set target.env-vars ASAN_OPTIONS=detect_stack_use_after_return=1 DYLD_INSERT_LIBRARIES=/Users/buildslave/jenkins/workspace/lldb-cmake-sanitized/host-compiler/lib/clang/11.0.0/lib/darwin/libclang_rt.asan_osx_dynamic.dylib output:

Hide Details

runCmd: file /Users/buildslave/jenkins/workspace/lldb-cmake-sanitized/lldb-build/lldb-test-build.noindex/functionalities/data-formatter/poarray/TestPrintObjectArray.test_print_array_dsym/a.out output: Current executable set to '/Users/buildslave/jenkins/workspace/lldb-cmake-sanitized/lldb-build/lldb-test-build.noindex/functionalities/data-formatter/poarray/TestPrintObjectArray.test_print_array_dsym/a.out' (x86_64).

Hide Details

Hide Details

runCmd: breakpoint set -f "main.mm" -l 20 output: Breakpoint 1: where = a.out`main + 459 at main.mm:20:3, address = 0x0000000100000efb

Hide Details

Hide Details

Expecting pattern: ^Breakpoint (?P<bpno>[0-9]+): (?P<num_locations>[0-9]+) locations\.$ Not matched

Hide Details

Expecting pattern: ^Breakpoint (?P<bpno>[0-9]+): (?P<num_locations>no) locations \(pending\)\. Not matched

Hide Details

Expecting pattern: ^Breakpoint (?P<bpno>[0-9]+): where = (?P<module>.*)`(?P<symbol>[+\-]{0,1}[^+]+)( \+ (?P<offset>[0-9]+)){0,1}( \[inlined\] (?P<inline_symbol>.*)){0,1} at (?P<file>[^:]+):(?P<line_no>[0-9]+)(?P<column>(:[0-9]+)?), address = (?P<address>0x[0-9a-fA-F]+)$ Matched

Hide Details

runCmd: run output: Process 18438 stopped * thread #1, queue = 'com.apple.main-thread', stop reason = breakpoint 1.1 frame #0: 0x0000000100000efb a.out`main at main.mm:20:3 17 tobjects->two = array2; 18 tobjects->three = dictionary; 19 id* objects = (id*)tobjects; -> 20 return 0; // break here ^ 21 }

Hide Details

Process 18438 launched: '/Users/buildslave/jenkins/workspace/lldb-cmake-sanitized/lldb-build/lldb-test-build.noindex/functionalities/data-formatter/poarray/TestPrintObjectArray.test_print_array_dsym/a.out' (x86_64)

Hide Details

Hide Details

runCmd: thread list output: Process 18438 stopped * thread #1: tid = 0x4852be, 0x0000000100000efb a.out`main at main.mm:20:3, queue = 'com.apple.main-thread', stop reason = breakpoint 1.1

Hide Details

Hide Details

Expecting sub string: stopped Matched

Hide Details

Expecting sub string: stop reason = breakpoint Matched

Hide Details

Adding tearDown hook: def cleanup(): self.runCmd('type format clear', check=False) self.runCmd('type summary clear', check=False) self.runCmd('type synth clear', check=False)

Hide Details

Hide Details

runCmd: expr --element-count 3 --object-description -- objects output: { <__NSArrayI 0x604000001710>( 3735928559, 4276993775, 3203398366 )

Hide Details

<__NSArrayI 0x603000002ef0>( Hello, World )

Hide Details

{ Two = ( Hello, World ); 1 = ( Hello, World ); }

Hide Details

}

Hide Details

Hide Details

Expecting sub string: 3735928559 Matched

Hide Details

Expecting sub string: 4276993775 Matched

Hide Details

Expecting sub string: 3203398366 Matched

Hide Details

Expecting sub string: Hello Matched

Hide Details

Expecting sub string: World Matched

Hide Details

Expecting sub string: Two = Matched

Hide Details

Expecting sub string: 1 = Matched

Hide Details

runCmd: poarray 3 objects output: { <__NSArrayI 0x604000001710>( 3735928559, 4276993775, 3203398366 )

Hide Details

<__NSArrayI 0x603000002ef0>( Hello, World )

Hide Details

{ Two = ( Hello, World ); 1 = ( Hello, World ); }

Hide Details

}

Hide Details

Hide Details

Expecting sub string: 3735928559 Matched

Hide Details

Expecting sub string: 4276993775 Matched

Hide Details

Expecting sub string: 3203398366 Matched

Hide Details

Expecting sub string: Hello Matched

Hide Details

Expecting sub string: World Matched

Hide Details

Expecting sub string: Two = Matched

Hide Details

Expecting sub string: 1 = Matched

Hide Details

runCmd: expr --element-count 3 --object-description --description-verbosity=full -- objects output: (id *) $2 = 0x0000603000002f80 { (id) [0] = 0x0000604000001710 <__NSArrayI 0x604000001710>( 3735928559, 4276993775, 3203398366 )

Hide Details

(id) [1] = 0x0000603000002ef0 <__NSArrayI 0x603000002ef0>( Hello, World )

Hide Details

(id) [2] = 0x0000606000008a20 { Two = ( Hello, World ); 1 = ( Hello, World ); }

Hide Details

}

Hide Details

Hide Details

Expecting sub string: [0] = Matched

Hide Details

Expecting sub string: 3735928559 Matched

Hide Details

Expecting sub string: 4276993775 Matched

Hide Details

Expecting sub string: 3203398366 Matched

Hide Details

Expecting sub string: [1] = Matched

Hide Details

Expecting sub string: Hello Matched

Hide Details

Expecting sub string: World Matched

Hide Details

Expecting sub string: [2] = Matched

Hide Details

Expecting sub string: Two = Matched

Hide Details

Expecting sub string: 1 = Matched

Hide Details

runCmd: parray 3 objects output: (id *) $3 = 0x0000603000002f80 { (id) [0] = 0x0000604000001710 (id) [1] = 0x0000603000002ef0 (id) [2] = 0x0000606000008a20 }

Hide Details

Hide Details

Expecting sub string: [0] = 0x Matched

Hide Details

Expecting sub string: [1] = 0x Matched

Hide Details

Expecting sub string: [2] = 0x Matched

Hide Details

runCmd: expr --element-count 3 -d run -- objects output: (id *) $4 = 0x0000603000002f80 { (__NSArrayI *) [0] = 0x0000604000001710 3 elements (__NSArrayI *) [1] = 0x0000603000002ef0 2 elements (__NSDictionaryI *) [2] = 0x0000606000008a20 2 key/value pairs }

Hide Details

Hide Details

Expecting sub string: 3 elements Matched

Hide Details

Expecting sub string: 2 elements Matched

Hide Details

Expecting sub string: 2 key/value pairs Matched

Hide Details

runCmd: expr --element-count 3 -d run --ptr-depth=1 -- objects output: (id *) $5 = 0x0000603000002f80 { (__NSArrayI *) [0] = 0x0000604000001710 3 elements { [0] = 0x0a4fb2928b8e52a1 3735928559 [1] = 0x0a4fb2b2cb8e52a1 4276993775 [2] = 0x0a4fb2f2c9ca63a1 3203398366 } (__NSArrayI *) [1] = 0x0000603000002ef0 2 elements { [0] = 0x0000000100001038 "Hello" [1] = 0x0000000100001058 "World" } (__NSDictionaryI *) [2] = 0x0000606000008a20 2 key/value pairs { [0] = { key = 0x0000000100001078 "Two" value = 0x0000603000002ef0 2 elements } [1] = { key = 0x0a4fb24c2630bcb1 1 value = 0x0000603000002ef0 2 elements } } }

Hide Details

Assertion failed: (tokenKind == tok::kw___bridge_retain), function ParseParenExpression, file /Users/buildslave/jenkins/workspace/lldb-cmake-sanitized/llvm-project/clang/lib/Parse/ParseExpr.cpp, line 2804.

Hide Details

--

Hide Details

******************** PASS: lldb-api :: macosx/thread_suspend/TestInternalThreadSuspension.py (1807 of 2027) PASS: lldb-api :: functionalities/data-formatter/data-formatter-stl/libcxx/variant/TestDataFormatterLibcxxVariant.py (1808 of 2027) PASS: lldb-shell :: ObjectFile/ELF/section-permissions.yaml (1809 of 2027) FAIL: lldb-api :: commands/expression/po_verbosity/TestPoVerbosity.py (1810 of 2027) ******************** TEST 'lldb-api :: commands/expression/po_verbosity/TestPoVerbosity.py' FAILED ******************** Script: -- /Users/buildslave/jenkins/workspace/lldb-cmake-sanitized/lldb-build/lldb-test-build.noindex/copied-system-python /Users/buildslave/jenkins/workspace/lldb-cmake-sanitized/llvm-project/lldb/test/API/dotest.py --arch x86_64 -s /Users/buildslave/jenkins/workspace/lldb-cmake-sanitized/lldb-build/lldb-test-traces -S nm -u CXXFLAGS -u CFLAGS --codesign-identity lldb_codesign --server /Users/buildslave/jenkins/workspace/lldb-cmake-sanitized/lldb-build/./bin/debugserver --arch x86_64 --build-dir /Users/buildslave/jenkins/workspace/lldb-cmake-sanitized/lldb-build/lldb-test-build.noindex -s=/Users/buildslave/jenkins/workspace/lldb-cmake-sanitized/test/logs -t --env TERM=vt100 --env LLVM_LIBS_DIR=/Users/buildslave/jenkins/workspace/lldb-cmake-sanitized/lldb-build/./lib --inferior-env ASAN_OPTIONS=detect_stack_use_after_return=1 --inferior-env DYLD_INSERT_LIBRARIES=/Users/buildslave/jenkins/workspace/lldb-cmake-sanitized/host-compiler/lib/clang/11.0.0/lib/darwin/libclang_rt.asan_osx_dynamic.dylib --build-dir /Users/buildslave/jenkins/workspace/lldb-cmake-sanitized/lldb-build/lldb-test-build.noindex --lldb-module-cache-dir /Users/buildslave/jenkins/workspace/lldb-cmake-sanitized/lldb-build/lldb-test-build.noindex/module-cache-lldb/lldb-api --clang-module-cache-dir /Users/buildslave/jenkins/workspace/lldb-cmake-sanitized/lldb-build/lldb-test-build.noindex/module-cache-clang/lldb-api --executable /Users/buildslave/jenkins/workspace/lldb-cmake-sanitized/lldb-build/./bin/lldb --compiler /Users/buildslave/jenkins/workspace/lldb-cmake-sanitized/lldb-build/./bin/clang --dsymutil /Users/buildslave/jenkins/workspace/lldb-cmake-sanitized/lldb-build/./bin/dsymutil --filecheck /Users/buildslave/jenkins/workspace/lldb-cmake-sanitized/lldb-build/./bin/FileCheck --lldb-libs-dir /Users/buildslave/jenkins/workspace/lldb-cmake-sanitized/lldb-build/./lib /Users/buildslave/jenkins/workspace/lldb-cmake-sanitized/llvm-project/lldb/test/API/commands/expression/po_verbosity -p TestPoVerbosity.py -- Exit Code: -6

Hide Details

Command Output (stdout): -- lldb version 11.0.99 clang revision 4034d0ce207d0c545799ceae5aaf2e35d400407c llvm revision 4034d0ce207d0c545799ceae5aaf2e35d400407c

Hide Details

-- Command Output (stderr): -- Assertion failed: (tokenKind == tok::kw___bridge_retain), function ParseParenExpression, file /Users/buildslave/jenkins/workspace/lldb-cmake-sanitized/llvm-project/clang/lib/Parse/ParseExpr.cpp, line 2804.

Hide Details

--

Hide Details

******************** PASS: lldb-api :: functionalities/data-formatter/type_summary_list_arg/TestTypeSummaryListArg.py (1811 of 2027) PASS: lldb-api :: python_api/signals/TestSignalsAPI.py (1812 of 2027) PASS: lldb-unit :: Utility/./UtilityTests/StringExtractorTest.GetHexU8_Underflow2 (1813 of 2027) PASS: lldb-api :: python_api/interpreter/TestCommandInterpreterAPI.py (1814 of 2027) PASS: lldb-unit :: SymbolFile/DWARF/./SymbolFileDWARFTests/SymbolFileDWARFTests.TestAbilitiesForDWARF (1815 of 2027) PASS: lldb-unit :: Utility/./UtilityTests/OptionsWithRawTest.ArgsButNoDelimiter (1816 of 2027) PASS: lldb-shell :: Reproducer/TestFileRepro.test (1817 of 2027) PASS: lldb-shell :: Commands/CommandScriptImmediateOutput/CommandScriptImmediateOutputFile.test (1818 of 2027) UNSUPPORTED: lldb-api :: functionalities/data-formatter/data-formatter-stl/libstdcpp/tuple/TestDataFormatterStdTuple.py (1819 of 2027) PASS: lldb-api :: functionalities/breakpoint/inlined_breakpoints/TestInlinedBreakpoints.py (1820 of 2027) PASS: lldb-api :: functionalities/thread/concurrent_events/TestConcurrentBreakpointsDelayedBreakpointOneWatchpoint.py (1821 of 2027) PASS: lldb-unit :: Utility/./UtilityTests/OptionsWithRawTest.QuotedSuffix (1822 of 2027) PASS: lldb-unit :: Process/minidump/./LLDBMinidumpTests/MinidumpParserTest.MinidumpModuleOrder (1823 of 2027) PASS: lldb-api :: commands/quit/TestQuit.py (1824 of 2027) FAIL: lldb-api :: commands/expression/context-object-objc/TestContextObjectObjc.py (1825 of 2027) ******************** TEST 'lldb-api :: commands/expression/context-object-objc/TestContextObjectObjc.py' FAILED ******************** Script: -- /Users/buildslave/jenkins/workspace/lldb-cmake-sanitized/lldb-build/lldb-test-build.noindex/copied-system-python /Users/buildslave/jenkins/workspace/lldb-cmake-sanitized/llvm-project/lldb/test/API/dotest.py --arch x86_64 -s /Users/buildslave/jenkins/workspace/lldb-cmake-sanitized/lldb-build/lldb-test-traces -S nm -u CXXFLAGS -u CFLAGS --codesign-identity lldb_codesign --server /Users/buildslave/jenkins/workspace/lldb-cmake-sanitized/lldb-build/./bin/debugserver --arch x86_64 --build-dir /Users/buildslave/jenkins/workspace/lldb-cmake-sanitized/lldb-build/lldb-test-build.noindex -s=/Users/buildslave/jenkins/workspace/lldb-cmake-sanitized/test/logs -t --env TERM=vt100 --env LLVM_LIBS_DIR=/Users/buildslave/jenkins/workspace/lldb-cmake-sanitized/lldb-build/./lib --inferior-env ASAN_OPTIONS=detect_stack_use_after_return=1 --inferior-env DYLD_INSERT_LIBRARIES=/Users/buildslave/jenkins/workspace/lldb-cmake-sanitized/host-compiler/lib/clang/11.0.0/lib/darwin/libclang_rt.asan_osx_dynamic.dylib --build-dir /Users/buildslave/jenkins/workspace/lldb-cmake-sanitized/lldb-build/lldb-test-build.noindex --lldb-module-cache-dir /Users/buildslave/jenkins/workspace/lldb-cmake-sanitized/lldb-build/lldb-test-build.noindex/module-cache-lldb/lldb-api --clang-module-cache-dir /Users/buildslave/jenkins/workspace/lldb-cmake-sanitized/lldb-build/lldb-test-build.noindex/module-cache-clang/lldb-api --executable /Users/buildslave/jenkins/workspace/lldb-cmake-sanitized/lldb-build/./bin/lldb --compiler /Users/buildslave/jenkins/workspace/lldb-cmake-sanitized/lldb-build/./bin/clang --dsymutil /Users/buildslave/jenkins/workspace/lldb-cmake-sanitized/lldb-build/./bin/dsymutil --filecheck /Users/buildslave/jenkins/workspace/lldb-cmake-sanitized/lldb-build/./bin/FileCheck --lldb-libs-dir /Users/buildslave/jenkins/workspace/lldb-cmake-sanitized/lldb-build/./lib /Users/buildslave/jenkins/workspace/lldb-cmake-sanitized/llvm-project/lldb/test/API/commands/expression/context-object-objc -p TestContextObjectObjc.py -- Exit Code: -6

Hide Details

Command Output (stdout): -- lldb version 11.0.99 clang revision 4034d0ce207d0c545799ceae5aaf2e35d400407c llvm revision 4034d0ce207d0c545799ceae5aaf2e35d400407c

Hide Details

-- Command Output (stderr): -- Assertion failed: (tokenKind == tok::kw___bridge_retain), function ParseParenExpression, file /Users/buildslave/jenkins/workspace/lldb-cmake-sanitized/llvm-project/clang/lib/Parse/ParseExpr.cpp, line 2804.

Hide Details

--

Hide Details

******************** PASS: lldb-unit :: Utility/./UtilityTests/LogTest.Unregister (1826 of 2027) PASS: lldb-unit :: Utility/./UtilityTests/UserIDResolver.GetUserName (1827 of 2027) PASS: lldb-unit :: Expression/./ExpressionTests/CppModuleConfigurationTest.Xcode (1828 of 2027) PASS: lldb-unit :: Language/CPlusPlus/./LanguageCPlusPlusTests/CPlusPlusLanguage.MethodNameParsing (1829 of 2027) PASS: lldb-shell :: ObjectFile/MachO/symtab.yaml (1830 of 2027) PASS: lldb-shell :: Reproducer/TestDriverOptions.test (1831 of 2027) PASS: lldb-unit :: SymbolFile/DWARF/./SymbolFileDWARFTests/SymbolFileDWARFTests.ParseArangesNonzeroSegmentSize (1832 of 2027) PASS: lldb-api :: lang/objc/rdar-10967107/TestRdar10967107.py (1833 of 2027) PASS: lldb-api :: commands/expression/invalid-args/TestInvalidArgsExpression.py (1834 of 2027) PASS: lldb-api :: api/multiple-targets/TestMultipleTargets.py (1835 of 2027) PASS: lldb-api :: commands/add-dsym/uuid/TestAddDsymCommand.py (1836 of 2027) PASS: lldb-unit :: Utility/./UtilityTests/StreamTeeTest.SetStreamAtIndexOutOfBounds (1837 of 2027) PASS: lldb-unit :: Host/./HostTests/HostInfoTest.GetHostname (1838 of 2027) PASS: lldb-unit :: Language/Highlighting/./HighlighterTests/HighlighterTest.HighlighterSelectionType (1839 of 2027) PASS: lldb-unit :: Symbol/./SymbolTests/TestTypeSystemClang.TestConvertAccessTypeToAccessSpecifier (1840 of 2027) PASS: lldb-api :: functionalities/thread/concurrent_events/TestConcurrentWatchpointDelayWatchpointOneBreakpoint.py (1841 of 2027) PASS: lldb-unit :: Utility/./UtilityTests/ArchSpecTest.TestParseMachCPUDashSubtypeTripleSimple (1842 of 2027) PASS: lldb-shell :: SymbolFile/DWARF/deterministic-build.cpp (1843 of 2027) PASS: lldb-api :: commands/disassemble/basic/TestDisassembleBreakpoint.py (1844 of 2027) PASS: lldb-shell :: SymbolFile/DWARF/inline-function-address.ll (1845 of 2027) PASS: lldb-api :: commands/watchpoints/hello_watchpoint/TestMyFirstWatchpoint.py (1846 of 2027) PASS: lldb-shell :: SymbolFile/DWARF/debug_loclists-dwo.s (1847 of 2027) UNSUPPORTED: lldb-api :: commands/target/auto-install-main-executable/TestAutoInstallMainExecutable.py (1848 of 2027) PASS: lldb-shell :: SymbolFile/NativePDB/ast-types.cpp (1849 of 2027) PASS: lldb-api :: functionalities/param_entry_vals/basic_entry_values/TestBasicEntryValues.py (1850 of 2027) PASS: lldb-unit :: Utility/./UtilityTests/StreamTest.PutULEB128 (1851 of 2027) PASS: lldb-shell :: SymbolFile/DWARF/find-basic-variable.cpp (1852 of 2027) PASS: lldb-shell :: Breakpoint/split-dwarf5-debug-stroffsets.test (1853 of 2027) PASS: lldb-unit :: ScriptInterpreter/Python/./ScriptInterpreterPythonTests/PythonDataObjectsTest.TestObjectAttributes (1854 of 2027) PASS: lldb-api :: functionalities/tail_call_frames/cross_object/TestCrossObjectTailCalls.py (1855 of 2027) PASS: lldb-api :: functionalities/gdb_remote_client/TestqOffsets.py (1856 of 2027) PASS: lldb-unit :: Utility/./UtilityTests/StreamTest.PutHex64ByteOrderBig (1857 of 2027) PASS: lldb-unit :: Host/./HostTests/Host.GetEnvironment (1858 of 2027) PASS: lldb-unit :: Utility/./UtilityTests/RecordReplayTest.InstrumentedBarRef (1859 of 2027) UNSUPPORTED: lldb-api :: functionalities/darwin_log/filter/exact_match/message/TestDarwinLogFilterMatchMessage.py (1860 of 2027) PASS: lldb-unit :: Utility/./UtilityTests/SerializationRountripTest.SerializeDeserializeCStringArrayNullptrElem (1861 of 2027) PASS: lldb-unit :: Utility/./UtilityTests/StreamTest.AddressRangeInvalidRange (1862 of 2027) PASS: lldb-api :: tools/lldb-server/TestGdbRemoteSingleStep.py (1863 of 2027) UNSUPPORTED: lldb-api :: functionalities/exec/TestExec.py (1864 of 2027) PASS: lldb-unit :: Utility/./UtilityTests/StringLexerTest.GetUnlexed (1865 of 2027) PASS: lldb-shell :: Breakpoint/case-sensitive.test (1866 of 2027) PASS: lldb-unit :: Symbol/./SymbolTests/PostfixExpression.ParseFPOProgram (1867 of 2027) PASS: lldb-api :: commands/expression/rdar42038760/TestScalarURem.py (1868 of 2027) UNSUPPORTED: lldb-shell :: Watchpoint/netbsd-nouserdbregs.test (1869 of 2027) FAIL: lldb-api :: lang/objc/objc-struct-return/TestObjCStructReturn.py (1870 of 2027) ******************** TEST 'lldb-api :: lang/objc/objc-struct-return/TestObjCStructReturn.py' FAILED ******************** Script: -- /Users/buildslave/jenkins/workspace/lldb-cmake-sanitized/lldb-build/lldb-test-build.noindex/copied-system-python /Users/buildslave/jenkins/workspace/lldb-cmake-sanitized/llvm-project/lldb/test/API/dotest.py --arch x86_64 -s /Users/buildslave/jenkins/workspace/lldb-cmake-sanitized/lldb-build/lldb-test-traces -S nm -u CXXFLAGS -u CFLAGS --codesign-identity lldb_codesign --server /Users/buildslave/jenkins/workspace/lldb-cmake-sanitized/lldb-build/./bin/debugserver --arch x86_64 --build-dir /Users/buildslave/jenkins/workspace/lldb-cmake-sanitized/lldb-build/lldb-test-build.noindex -s=/Users/buildslave/jenkins/workspace/lldb-cmake-sanitized/test/logs -t --env TERM=vt100 --env LLVM_LIBS_DIR=/Users/buildslave/jenkins/workspace/lldb-cmake-sanitized/lldb-build/./lib --inferior-env ASAN_OPTIONS=detect_stack_use_after_return=1 --inferior-env DYLD_INSERT_LIBRARIES=/Users/buildslave/jenkins/workspace/lldb-cmake-sanitized/host-compiler/lib/clang/11.0.0/lib/darwin/libclang_rt.asan_osx_dynamic.dylib --build-dir /Users/buildslave/jenkins/workspace/lldb-cmake-sanitized/lldb-build/lldb-test-build.noindex --lldb-module-cache-dir /Users/buildslave/jenkins/workspace/lldb-cmake-sanitized/lldb-build/lldb-test-build.noindex/module-cache-lldb/lldb-api --clang-module-cache-dir /Users/buildslave/jenkins/workspace/lldb-cmake-sanitized/lldb-build/lldb-test-build.noindex/module-cache-clang/lldb-api --executable /Users/buildslave/jenkins/workspace/lldb-cmake-sanitized/lldb-build/./bin/lldb --compiler /Users/buildslave/jenkins/workspace/lldb-cmake-sanitized/lldb-build/./bin/clang --dsymutil /Users/buildslave/jenkins/workspace/lldb-cmake-sanitized/lldb-build/./bin/dsymutil --filecheck /Users/buildslave/jenkins/workspace/lldb-cmake-sanitized/lldb-build/./bin/FileCheck --lldb-libs-dir /Users/buildslave/jenkins/workspace/lldb-cmake-sanitized/lldb-build/./lib /Users/buildslave/jenkins/workspace/lldb-cmake-sanitized/llvm-project/lldb/test/API/lang/objc/objc-struct-return -p TestObjCStructReturn.py -- Exit Code: -6

Hide Details

Command Output (stdout): -- lldb version 11.0.99 clang revision 4034d0ce207d0c545799ceae5aaf2e35d400407c llvm revision 4034d0ce207d0c545799ceae5aaf2e35d400407c

Hide Details

-- Command Output (stderr): -- Assertion failed: (tokenKind == tok::kw___bridge_retain), function ParseParenExpression, file /Users/buildslave/jenkins/workspace/lldb-cmake-sanitized/llvm-project/clang/lib/Parse/ParseExpr.cpp, line 2804.

Hide Details

--

Hide Details

******************** PASS: lldb-shell :: SymbolFile/NativePDB/globals-bss.cpp (1871 of 2027) PASS: lldb-api :: functionalities/breakpoint/objc/TestObjCBreakpoints.py (1872 of 2027) PASS: lldb-api :: functionalities/signal/handle-abrt/TestHandleAbort.py (1873 of 2027) PASS: lldb-api :: commands/watchpoints/multiple_hits/TestMultipleHits.py (1874 of 2027) PASS: lldb-unit :: Language/Highlighting/./HighlighterTests/HighlighterTest.ClangCursorOutOfBounds (1875 of 2027) PASS: lldb-unit :: Utility/./UtilityTests/VMRange.CollectionContains (1876 of 2027) PASS: lldb-api :: lang/cpp/stl/TestStdCXXDisassembly.py (1877 of 2027) PASS: lldb-api :: python_api/process/read-mem-cstring/TestReadMemCString.py (1878 of 2027) PASS: lldb-unit :: Process/minidump/./LLDBMinidumpTests/MinidumpParserTest.GetArchitecture (1879 of 2027) PASS: lldb-unit :: UnwindAssembly/x86/./UnwindAssemblyx86Tests/Testx86AssemblyInspectionEngine.TestPushImm (1880 of 2027) PASS: lldb-unit :: Signals/./SignalsTests/UnixSignalsTest.GetInfo (1881 of 2027) PASS: lldb-shell :: SymbolFile/DWARF/dir-separator-posix.s (1882 of 2027) PASS: lldb-api :: api/command-return-object/TestSBCommandReturnObject.py (1883 of 2027) PASS: lldb-shell :: SymbolFile/DWARF/dir-separator-windows.s (1884 of 2027) UNSUPPORTED: lldb-api :: commands/register/register/intel_xtended_registers/mpx_offset_intersection/TestMPXOffsetIntersection.py (1885 of 2027) PASS: lldb-unit :: Symbol/./SymbolTests/TestClangASTImporter.MetadataPropagationAfterCopying (1886 of 2027) PASS: lldb-unit :: Utility/./UtilityTests/StringListTest.CopyListSingle (1887 of 2027) PASS: lldb-unit :: Symbol/./SymbolTests/TestClangASTImporter.MetadataPropagationIndirectImport (1888 of 2027) UNSUPPORTED: lldb-api :: functionalities/longjmp/TestLongjmp.py (1889 of 2027) PASS: lldb-unit :: Language/Highlighting/./HighlighterTests/HighlighterTest.ClangOperators (1890 of 2027) PASS: lldb-shell :: ObjectFile/ELF/PT_LOAD.yaml (1891 of 2027) PASS: lldb-unit :: Expression/./ExpressionTests/CppModuleConfigurationTest.UnrelatedLibrary (1892 of 2027) PASS: lldb-unit :: Utility/./UtilityTests/StreamTest.AddressPrefixAndSuffix (1893 of 2027) PASS: lldb-shell :: ObjectFile/wasm/embedded-debug-sections.yaml (1894 of 2027) PASS: lldb-api :: functionalities/data-formatter/data-formatter-objc/TestDataFormatterObjNSException.py (1895 of 2027) PASS: lldb-api :: functionalities/tail_call_frames/inlining_and_tail_calls/TestInliningAndTailCalls.py (1896 of 2027) PASS: lldb-api :: lang/objc/foundation/TestObjCMethods2.py (1897 of 2027) PASS: lldb-api :: functionalities/thread/concurrent_events/TestConcurrentCrashWithBreak.py (1898 of 2027) PASS: lldb-api :: commands/watchpoints/watchpoint_events/TestWatchpointEvents.py (1899 of 2027) PASS: lldb-api :: functionalities/data-formatter/data-formatter-synth/TestDataFormatterSynth.py (1900 of 2027) UNSUPPORTED: lldb-api :: functionalities/darwin_log/filter/regex/activity-chain/TestDarwinLogFilterRegexActivityChain.py (1901 of 2027) PASS: lldb-unit :: Process/gdb-remote/./ProcessGdbRemoteTests/GDBRemoteCommunicationServerTest.SendErrorResponse_StringError (1902 of 2027) PASS: lldb-api :: functionalities/breakpoint/global_constructor/TestBreakpointInGlobalConstructor.py (1903 of 2027) PASS: lldb-unit :: Utility/./UtilityTests/ScalarTest.Promotion (1904 of 2027) PASS: lldb-unit :: UnwindAssembly/x86/./UnwindAssemblyx86Tests/Testx86AssemblyInspectionEngine.TestPopR12 (1905 of 2027) PASS: lldb-unit :: UnwindAssembly/x86/./UnwindAssemblyx86Tests/Testx86AssemblyInspectionEngine.Test32bitFramelessSmallStackFrame (1906 of 2027) PASS: lldb-unit :: Utility/./UtilityTests/BinaryStreamTest.PutSLEB128EightBytes (1907 of 2027) PASS: lldb-api :: commands/expression/persistent_types/TestPersistentTypes.py (1908 of 2027) PASS: lldb-api :: lang/c/bitfields/TestBitfields.py (1909 of 2027) PASS: lldb-shell :: Commands/command-backtrace.test (1910 of 2027) PASS: lldb-shell :: SymbolFile/DWARF/anon_class_w_and_wo_export_symbols.ll (1911 of 2027) PASS: lldb-unit :: SymbolFile/NativePDB/./SymbolFileNativePDBTests/PDBFPOProgramToDWARFExpressionTests.UnresolvedCyclicRegisterAssignmentReference (1912 of 2027) PASS: lldb-unit :: Symbol/./SymbolTests/TestTypeSystemClang.TestNotDeletingUserCopyCstrDueToMoveCStr (1913 of 2027) PASS: lldb-api :: commands/watchpoints/watchpoint_commands/condition/TestWatchpointConditionCmd.py (1914 of 2027) PASS: lldb-unit :: Utility/./UtilityTests/StringLexerTest.NextIfList (1915 of 2027) PASS: lldb-unit :: Utility/./UtilityTests/FileSpecTest.CopyByAppendingPathComponent (1916 of 2027) PASS: lldb-unit :: Utility/./UtilityTests/ArchSpecTest.OperatorBool (1917 of 2027) PASS: lldb-unit :: Symbol/./SymbolTests/TestClangASTImporter.CanImportInvalidType (1918 of 2027) PASS: lldb-unit :: Utility/./UtilityTests/ProcessInstanceInfo.DumpTable (1919 of 2027) PASS: lldb-unit :: Process/minidump/./LLDBMinidumpTests/MinidumpParserTest.GetMemoryRegionInfoFromMemoryList (1920 of 2027) PASS: lldb-unit :: Core/./LLDBCoreTests/MangledTest.ResultForValidName (1921 of 2027) PASS: lldb-unit :: Utility/./UtilityTests/XcodeSDKTest.MergeTest (1922 of 2027) UNSUPPORTED: lldb-api :: functionalities/thread/concurrent_events/TestConcurrentManySignals.py (1923 of 2027) PASS: lldb-unit :: Utility/./UtilityTests/BinaryStreamTest.PutULEB128Zero (1924 of 2027) PASS: lldb-api :: functionalities/step_scripted/TestStepScripted.py (1925 of 2027) PASS: lldb-unit :: Expression/./ExpressionTests/ClangExpressionDeclMapTest.TestUnknownIdentifierLookup (1926 of 2027) UNSUPPORTED: lldb-shell :: Register/arm-fp-read.test (1927 of 2027) PASS: lldb-unit :: Utility/./UtilityTests/VASprintfTest.BufferResize (1928 of 2027) FAIL: lldb-api :: commands/expression/persist_objc_pointeetype/TestPersistObjCPointeeType.py (1929 of 2027) ******************** TEST 'lldb-api :: commands/expression/persist_objc_pointeetype/TestPersistObjCPointeeType.py' FAILED ******************** Script: -- /Users/buildslave/jenkins/workspace/lldb-cmake-sanitized/lldb-build/lldb-test-build.noindex/copied-system-python /Users/buildslave/jenkins/workspace/lldb-cmake-sanitized/llvm-project/lldb/test/API/dotest.py --arch x86_64 -s /Users/buildslave/jenkins/workspace/lldb-cmake-sanitized/lldb-build/lldb-test-traces -S nm -u CXXFLAGS -u CFLAGS --codesign-identity lldb_codesign --server /Users/buildslave/jenkins/workspace/lldb-cmake-sanitized/lldb-build/./bin/debugserver --arch x86_64 --build-dir /Users/buildslave/jenkins/workspace/lldb-cmake-sanitized/lldb-build/lldb-test-build.noindex -s=/Users/buildslave/jenkins/workspace/lldb-cmake-sanitized/test/logs -t --env TERM=vt100 --env LLVM_LIBS_DIR=/Users/buildslave/jenkins/workspace/lldb-cmake-sanitized/lldb-build/./lib --inferior-env ASAN_OPTIONS=detect_stack_use_after_return=1 --inferior-env DYLD_INSERT_LIBRARIES=/Users/buildslave/jenkins/workspace/lldb-cmake-sanitized/host-compiler/lib/clang/11.0.0/lib/darwin/libclang_rt.asan_osx_dynamic.dylib --build-dir /Users/buildslave/jenkins/workspace/lldb-cmake-sanitized/lldb-build/lldb-test-build.noindex --lldb-module-cache-dir /Users/buildslave/jenkins/workspace/lldb-cmake-sanitized/lldb-build/lldb-test-build.noindex/module-cache-lldb/lldb-api --clang-module-cache-dir /Users/buildslave/jenkins/workspace/lldb-cmake-sanitized/lldb-build/lldb-test-build.noindex/module-cache-clang/lldb-api --executable /Users/buildslave/jenkins/workspace/lldb-cmake-sanitized/lldb-build/./bin/lldb --compiler /Users/buildslave/jenkins/workspace/lldb-cmake-sanitized/lldb-build/./bin/clang --dsymutil /Users/buildslave/jenkins/workspace/lldb-cmake-sanitized/lldb-build/./bin/dsymutil --filecheck /Users/buildslave/jenkins/workspace/lldb-cmake-sanitized/lldb-build/./bin/FileCheck --lldb-libs-dir /Users/buildslave/jenkins/workspace/lldb-cmake-sanitized/lldb-build/./lib /Users/buildslave/jenkins/workspace/lldb-cmake-sanitized/llvm-project/lldb/test/API/commands/expression/persist_objc_pointeetype -p TestPersistObjCPointeeType.py -- Exit Code: -6

Hide Details

Command Output (stdout): -- lldb version 11.0.99 clang revision 4034d0ce207d0c545799ceae5aaf2e35d400407c llvm revision 4034d0ce207d0c545799ceae5aaf2e35d400407c

Hide Details

-- Command Output (stderr): -- Assertion failed: (tokenKind == tok::kw___bridge_retain), function ParseParenExpression, file /Users/buildslave/jenkins/workspace/lldb-cmake-sanitized/llvm-project/clang/lib/Parse/ParseExpr.cpp, line 2804.

Hide Details

--

Hide Details

******************** UNSUPPORTED: lldb-shell :: SymbolFile/dissassemble-entry-point.s (1930 of 2027) PASS: lldb-api :: commands/frame/var/TestFrameVar.py (1931 of 2027) PASS: lldb-api :: functionalities/data-formatter/data-formatter-python-synth/TestDataFormatterPythonSynth.py (1932 of 2027) UNSUPPORTED: lldb-shell :: Register/x86-64-zmm-read.test (1933 of 2027) PASS: lldb-shell :: SymbolFile/DWARF/debug-types-dwo-cross-reference.cpp (1934 of 2027) PASS: lldb-api :: lang/objc/objc-dyn-sbtype/TestObjCDynamicSBType.py (1935 of 2027) PASS: lldb-api :: commands/help/TestHelp.py (1936 of 2027) PASS: lldb-shell :: SymbolFile/DWARF/dwarf5_locations.s (1937 of 2027) PASS: lldb-unit :: Utility/./UtilityTests/IndexToObjectTest.ObjectForIndex (1938 of 2027) UNSUPPORTED: lldb-shell :: ScriptInterpreter/Lua/lua.test (1939 of 2027) PASS: lldb-shell :: Reproducer/TestGDBRemoteRepro.test (1940 of 2027) PASS: lldb-api :: types/TestLongTypes.py (1941 of 2027) PASS: lldb-unit :: Utility/./UtilityTests/RegularExpression.CopyAssignment (1942 of 2027) UNSUPPORTED: lldb-shell :: SymbolFile/target-symbols-add-unwind.test (1943 of 2027) PASS: lldb-unit :: Utility/./UtilityTests/Flags.AnySet (1944 of 2027) PASS: lldb-shell :: SymbolFile/DWARF/debug-types-address-ranges.s (1945 of 2027) PASS: lldb-unit :: Utility/./UtilityTests/StringExtractorTest.GetHexU8_Underflow (1946 of 2027) PASS: lldb-unit :: Process/gdb-remote/./ProcessGdbRemoteTests/GDBRemoteCommunicationClientTest.SendGetTraceConfigPacket (1947 of 2027) PASS: lldb-shell :: ObjectFile/ELF/section-types-edgecases.yaml (1948 of 2027) PASS: lldb-api :: lang/cpp/bool/TestCPPBool.py (1949 of 2027) UNSUPPORTED: lldb-api :: linux/mix-dwo-and-regular-objects/TestMixedDwarfBinary.py (1950 of 2027) PASS: lldb-unit :: DataFormatter/./LLDBFormatterTests/StringPrinterTests.CxxUTF8 (1951 of 2027) PASS: lldb-unit :: Utility/./UtilityTests/RecordReplayTest.InstrumentedFoo (1952 of 2027) PASS: lldb-unit :: Language/Highlighting/./HighlighterTests/HighlighterTest.DefaultHighlighter (1953 of 2027) PASS: lldb-unit :: Host/./HostTests/FileSystemTest.EnumerateDirectory (1954 of 2027) PASS: lldb-api :: commands/expression/import-std-module/queue/TestQueueFromStdModule.py (1955 of 2027) PASS: lldb-unit :: Process/minidump/./LLDBMinidumpTests/MinidumpParserTest.GetFilteredModuleList (1956 of 2027) PASS: lldb-api :: functionalities/data-formatter/parray/TestPrintArray.py (1957 of 2027) PASS: lldb-api :: functionalities/breakpoint/breakpoint_ids/TestBreakpointIDs.py (1958 of 2027) UNSUPPORTED: lldb-api :: functionalities/data-formatter/data-formatter-stl/libstdcpp/vbool/TestDataFormatterStdVBool.py (1959 of 2027) PASS: lldb-api :: python_api/lldbutil/iter/TestRegistersIterator.py (1960 of 2027) PASS: lldb-api :: functionalities/thread/concurrent_events/TestConcurrentDelayedCrashWithBreakpointWatchpoint.py (1961 of 2027) PASS: lldb-unit :: UnwindAssembly/x86/./UnwindAssemblyx86Tests/Testx86AssemblyInspectionEngine.TestPopRBP (1962 of 2027) UNSUPPORTED: lldb-api :: functionalities/darwin_log/basic/TestDarwinLogBasic.py (1963 of 2027) PASS: lldb-api :: functionalities/data-formatter/data-formatter-caching/TestDataFormatterCaching.py (1964 of 2027) PASS: lldb-unit :: Utility/./UtilityTests/VMRange.Reset (1965 of 2027) PASS: lldb-api :: api/listeners/TestListener.py (1966 of 2027) PASS: lldb-unit :: Utility/./UtilityTests/DataExtractorTest.PeekData (1967 of 2027) PASS: lldb-unit :: Utility/./UtilityTests/StringListTest.AppendStringMove (1968 of 2027) PASS: lldb-shell :: SymbolFile/NativePDB/source-list.cpp (1969 of 2027) PASS: lldb-api :: tools/lldb-vscode/breakpoint/TestVSCode_setExceptionBreakpoints.py (1970 of 2027) PASS: lldb-api :: functionalities/tail_call_frames/ambiguous_tail_call_seq2/TestAmbiguousTailCallSeq2.py (1971 of 2027) PASS: lldb-unit :: Core/./LLDBCoreTests/RichManglingContextTest.Basic (1972 of 2027) PASS: lldb-api :: tools/lldb-server/TestGdbRemoteAttach.py (1973 of 2027) PASS: lldb-unit :: Utility/./UtilityTests/OptionsWithRawTest.ArgsButNoLeadingDash (1974 of 2027) PASS: lldb-unit :: Utility/./UtilityTests/BroadcasterTest.BroadcastEvent (1975 of 2027) PASS: lldb-api :: tools/lldb-vscode/breakpoint/TestVSCode_setFunctionBreakpoints.py (1976 of 2027) PASS: lldb-unit :: Utility/./UtilityTests/UriParserTest.PortOverflow (1977 of 2027) PASS: lldb-api :: commands/watchpoints/watchpoint_commands/command/TestWatchpointCommandPython.py (1978 of 2027) PASS: lldb-shell :: ObjectFile/ELF/compressed-sections.yaml (1979 of 2027) PASS: lldb-api :: tools/lldb-server/TestAppleSimulatorOSType.py (1980 of 2027) PASS: lldb-unit :: UnwindAssembly/x86/./UnwindAssemblyx86Tests/Testx86AssemblyInspectionEngine.Test64bitFramelessBigStackFrame (1981 of 2027) PASS: lldb-unit :: Interpreter/./InterpreterTests/CompletionTest.DirCompletionUsername (1982 of 2027) UNSUPPORTED: lldb-shell :: Minidump/Windows/arm-fp-unwind.test (1983 of 2027) PASS: lldb-api :: functionalities/show_location/TestShowLocationDwarf5.py (1984 of 2027) PASS: lldb-unit :: Utility/./UtilityTests/DataExtractorTest.GetCStrAtNullOffset (1985 of 2027) FAIL: lldb-api :: lang/objc/blocks/TestObjCIvarsInBlocks.py (1986 of 2027) ******************** TEST 'lldb-api :: lang/objc/blocks/TestObjCIvarsInBlocks.py' FAILED ******************** Script: -- /Users/buildslave/jenkins/workspace/lldb-cmake-sanitized/lldb-build/lldb-test-build.noindex/copied-system-python /Users/buildslave/jenkins/workspace/lldb-cmake-sanitized/llvm-project/lldb/test/API/dotest.py --arch x86_64 -s /Users/buildslave/jenkins/workspace/lldb-cmake-sanitized/lldb-build/lldb-test-traces -S nm -u CXXFLAGS -u CFLAGS --codesign-identity lldb_codesign --server /Users/buildslave/jenkins/workspace/lldb-cmake-sanitized/lldb-build/./bin/debugserver --arch x86_64 --build-dir /Users/buildslave/jenkins/workspace/lldb-cmake-sanitized/lldb-build/lldb-test-build.noindex -s=/Users/buildslave/jenkins/workspace/lldb-cmake-sanitized/test/logs -t --env TERM=vt100 --env LLVM_LIBS_DIR=/Users/buildslave/jenkins/workspace/lldb-cmake-sanitized/lldb-build/./lib --inferior-env ASAN_OPTIONS=detect_stack_use_after_return=1 --inferior-env DYLD_INSERT_LIBRARIES=/Users/buildslave/jenkins/workspace/lldb-cmake-sanitized/host-compiler/lib/clang/11.0.0/lib/darwin/libclang_rt.asan_osx_dynamic.dylib --build-dir /Users/buildslave/jenkins/workspace/lldb-cmake-sanitized/lldb-build/lldb-test-build.noindex --lldb-module-cache-dir /Users/buildslave/jenkins/workspace/lldb-cmake-sanitized/lldb-build/lldb-test-build.noindex/module-cache-lldb/lldb-api --clang-module-cache-dir /Users/buildslave/jenkins/workspace/lldb-cmake-sanitized/lldb-build/lldb-test-build.noindex/module-cache-clang/lldb-api --executable /Users/buildslave/jenkins/workspace/lldb-cmake-sanitized/lldb-build/./bin/lldb --compiler /Users/buildslave/jenkins/workspace/lldb-cmake-sanitized/lldb-build/./bin/clang --dsymutil /Users/buildslave/jenkins/workspace/lldb-cmake-sanitized/lldb-build/./bin/dsymutil --filecheck /Users/buildslave/jenkins/workspace/lldb-cmake-sanitized/lldb-build/./bin/FileCheck --lldb-libs-dir /Users/buildslave/jenkins/workspace/lldb-cmake-sanitized/lldb-build/./lib /Users/buildslave/jenkins/workspace/lldb-cmake-sanitized/llvm-project/lldb/test/API/lang/objc/blocks -p TestObjCIvarsInBlocks.py -- Exit Code: -6

Hide Details

Command Output (stdout): -- lldb version 11.0.99 clang revision 4034d0ce207d0c545799ceae5aaf2e35d400407c llvm revision 4034d0ce207d0c545799ceae5aaf2e35d400407c

Hide Details

-- Command Output (stderr): -- Assertion failed: (tokenKind == tok::kw___bridge_retain), function ParseParenExpression, file /Users/buildslave/jenkins/workspace/lldb-cmake-sanitized/llvm-project/clang/lib/Parse/ParseExpr.cpp, line 2804.

Hide Details

--

Hide Details

******************** PASS: lldb-api :: lang/c/offsetof/TestOffsetof.py (1987 of 2027) PASS: lldb-unit :: Utility/./UtilityTests/StringExtractorTest.GetHexU8_InvalidHex (1988 of 2027) PASS: lldb-unit :: ObjectFile/ELF/./ObjectFileELFTests/ObjectFileELFTest.GetSymtab_NoSymEntryPointArmThumbAddressClass (1989 of 2027) PASS: lldb-api :: commands/expression/inline-namespace/TestInlineNamespace.py (1990 of 2027) PASS: lldb-shell :: Process/Optimization.test (1991 of 2027) UNSUPPORTED: lldb-api :: functionalities/ubsan/user-expression/TestUbsanUserExpression.py (1992 of 2027) PASS: lldb-unit :: Utility/./UtilityTests/ArgsTest.StringListConstructor (1993 of 2027) PASS: lldb-api :: functionalities/data-formatter/data-formatter-stl/libcxx/set/TestDataFormatterLibcxxSet.py (1994 of 2027) PASS: lldb-api :: lang/cpp/call-function/TestCallCPPFunction.py (1995 of 2027) PASS: lldb-api :: functionalities/thread/concurrent_events/TestConcurrentTwoBreakpointsOneWatchpoint.py (1996 of 2027) PASS: lldb-unit :: Expression/./ExpressionTests/CppModuleConfigurationTest.AmbiguousLibCpp (1997 of 2027) PASS: lldb-api :: functionalities/target_var/TestTargetVar.py (1998 of 2027) PASS: lldb-unit :: Process/gdb-remote/./ProcessGdbRemoteTests/GDBRemoteCommunicationClientTest.SyncThreadState (1999 of 2027) PASS: lldb-unit :: Utility/./UtilityTests/UUIDTest.RelationalOperators (2000 of 2027) PASS: lldb-api :: functionalities/wrong_commands/TestWrongCommands.py (2001 of 2027) PASS: lldb-unit :: SymbolFile/NativePDB/./SymbolFileNativePDBTests/PDBFPOProgramToDWARFExpressionTests.SingleAssignmentRegisterRef (2002 of 2027) PASS: lldb-unit :: Utility/./UtilityTests/XcodeSDKTest.GetSDKTypeForTriple (2003 of 2027) PASS: lldb-unit :: SymbolFile/NativePDB/./SymbolFileNativePDBTests/PDBFPOProgramToDWARFExpressionTests.MultipleDependentAssignments (2004 of 2027) PASS: lldb-unit :: Utility/./UtilityTests/StringListTest.JoinSingle (2005 of 2027) PASS: lldb-api :: tools/lldb-vscode/breakpoint-events/TestVSCode_breakpointEvents.py (2006 of 2027) PASS: lldb-api :: functionalities/breakpoint/cpp/TestCPPBreakpointLocations.py (2007 of 2027) PASS: lldb-api :: functionalities/multiword-commands/TestMultiWordCommands.py (2008 of 2027) PASS: lldb-api :: functionalities/plugins/python_os_plugin/TestPythonOSPlugin.py (2009 of 2027) PASS: lldb-unit :: Utility/./UtilityTests/FileSpecTest.Yaml (2010 of 2027) PASS: lldb-shell :: SymbolFile/DWARF/compilercontext.ll (2011 of 2027) PASS: lldb-shell :: Commands/command-target-modules-dump-sections.yaml (2012 of 2027) PASS: lldb-unit :: debugserver/./debugserverTests/JSON.Parse (2013 of 2027) PASS: lldb-api :: functionalities/data-formatter/data-formatter-stl/libcxx/map/TestDataFormatterLibccMap.py (2014 of 2027) PASS: lldb-unit :: UnwindAssembly/x86/./UnwindAssemblyx86Tests/Testx86AssemblyInspectionEngine.TestSubESP (2015 of 2027) UNSUPPORTED: lldb-api :: python_api/disassemble-raw-data/TestDisassemble_VST1_64.py (2016 of 2027) PASS: lldb-api :: commands/expression/import-std-module/forward_list/TestForwardListFromStdModule.py (2017 of 2027) PASS: lldb-unit :: Expression/./ExpressionTests/DWARFExpression.DW_OP_convert (2018 of 2027) PASS: lldb-shell :: ObjectFile/ELF/section-addresses.yaml (2019 of 2027) PASS: lldb-unit :: Target/./TargetTests/ExecutionContextTest.GetByteOrder (2020 of 2027) PASS: lldb-unit :: Utility/./UtilityTests/StreamTest.AddressPrefix (2021 of 2027) PASS: lldb-unit :: Utility/./UtilityTests/BinaryStreamTest.PutULEB128SixBytes (2022 of 2027) PASS: lldb-shell :: ObjectFile/PECOFF/uuid.yaml (2023 of 2027) PASS: lldb-shell :: SymbolFile/DWARF/split-dwarf-inlining.cpp (2024 of 2027) UNSUPPORTED: lldb-api :: lang/objc/objc-dynamic-value/TestObjCDynamicValue.py (2025 of 2027) UNSUPPORTED: lldb-api :: tools/lldb-server/TestGdbRemoteAuxvSupport.py (2026 of 2027) PASS: lldb-api :: lang/cpp/enum_types/TestCPP11EnumTypes.py (2027 of 2027) Slowest Tests: -------------------------------------------------------------------------- 481.38s: lldb-api :: tools/lldb-server/TestLldbGdbServer.py 399.01s: lldb-api :: api/multithreaded/TestMultithreaded.py 378.60s: lldb-api :: lang/cpp/enum_types/TestCPP11EnumTypes.py 271.94s: lldb-api :: tools/lldb-server/TestGdbRemoteThreadsInStopReply.py 242.32s: lldb-api :: lang/objc/exceptions/TestObjCExceptions.py 227.28s: lldb-api :: lang/cpp/namespace/TestNamespaceLookup.py 226.29s: lldb-api :: lang/objc/real-definition/TestRealDefinition.py 177.51s: lldb-api :: types/TestLongTypesExpr.py 177.03s: lldb-api :: lang/objc/foundation/TestObjCMethods.py 161.49s: lldb-api :: python_api/exprpath_synthetic/TestExprPathSynthetic.py 160.63s: lldb-api :: lang/objc/forward-decl/TestForwardDecl.py 156.09s: lldb-api :: python_api/lldbutil/iter/TestLLDBIterator.py 137.50s: lldb-api :: api/check_public_api_headers/TestPublicAPIHeaders.py 136.03s: lldb-api :: commands/settings/TestSettings.py 135.71s: lldb-api :: functionalities/data-formatter/compactvectors/TestCompactVectors.py 130.32s: lldb-api :: tools/lldb-server/TestGdbRemote_qThreadStopInfo.py 124.41s: lldb-api :: commands/expression/import-std-module/stack/TestStackFromStdModule.py 118.57s: lldb-api :: types/TestLongTypes.py 112.81s: lldb-api :: commands/expression/import-std-module/queue/TestQueueFromStdModule.py 112.63s: lldb-api :: functionalities/thread/backtrace_all/TestBacktraceAll.py

Hide Details

Tests Times: -------------------------------------------------------------------------- [ Range ] :: [ Percentage ] :: [ Count ] -------------------------------------------------------------------------- [480s,500s) :: [ ] :: [ 1/2027] [460s,480s) :: [ ] :: [ 0/2027] [440s,460s) :: [ ] :: [ 0/2027] [420s,440s) :: [ ] :: [ 0/2027] [400s,420s) :: [ ] :: [ 1/2027] [380s,400s) :: [ ] :: [ 1/2027] [360s,380s) :: [ ] :: [ 0/2027] [340s,360s) :: [ ] :: [ 0/2027] [320s,340s) :: [ ] :: [ 0/2027] [300s,320s) :: [ ] :: [ 0/2027] [280s,300s) :: [ ] :: [ 1/2027] [260s,280s) :: [ ] :: [ 0/2027] [240s,260s) :: [ ] :: [ 1/2027] [220s,240s) :: [ ] :: [ 2/2027] [200s,220s) :: [ ] :: [ 0/2027] [180s,200s) :: [ ] :: [ 2/2027] [160s,180s) :: [ ] :: [ 3/2027] [140s,160s) :: [ ] :: [ 3/2027] [120s,140s) :: [ ] :: [ 3/2027] [100s,120s) :: [ ] :: [ 8/2027] [ 80s,100s) :: [ ] :: [ 38/2027] [ 60s, 80s) :: [* ] :: [ 83/2027] [ 40s, 60s) :: [ ] :: [ 48/2027] [ 20s, 40s) :: [** ] :: [ 126/2027] [ 0s, 20s) :: [********************************* ] :: [1706/2027] -------------------------------------------------------------------------- ******************** Unresolved Tests (1): lldb-api :: commands/watchpoints/step_over_watchpoint/TestStepOverWatchpoint.py

Hide Details

******************** Failing Tests (53): lldb-api :: lang/objc/foundation/TestConstStrings.py lldb-api :: lang/objc/objc-runtime-ivars/TestRuntimeIvars.py lldb-api :: lang/objc/objc-struct-argument/TestObjCStructArgument.py lldb-api :: lang/objc/foundation/TestObjCMethodsNSError.py lldb-api :: lang/objc/foundation/TestObjCMethodsNSArray.py lldb-api :: python_api/exprpath_synthetic/TestExprPathSynthetic.py lldb-api :: lang/objc/orderedset/TestOrderedSet.py lldb-api :: commands/expression/diagnostics/TestExprDiagnostics.py lldb-api :: functionalities/set-data/TestSetData.py lldb-api :: lang/objcxx/objcxx-ivar-vector/TestIvarVector.py lldb-api :: lang/objc/objc-property/TestObjCProperty.py lldb-api :: commands/expression/two-files/TestObjCTypeQueryFromOtherCompileUnit.py lldb-api :: functionalities/data-formatter/data-formatter-objc/nsindexpath/TestDataFormatterNSIndexPath.py lldb-api :: lang/objc/foundation/TestObjCMethods.py lldb-api :: lang/objc/objc-new-syntax/TestObjCNewSyntaxLiteral.py lldb-api :: lang/objc/objc-new-syntax/TestObjCNewSyntaxArray.py lldb-api :: functionalities/data-formatter/data-formatter-objc/TestDataFormatterObjCNSError.py lldb-api :: lang/objc/modules-non-objc-target/TestObjCModulesNonObjCTarget.py lldb-api :: lang/objc/objc-new-syntax/TestObjCNewSyntaxDictionary.py lldb-api :: lang/objc/radar-9691614/TestObjCMethodReturningBOOL.py lldb-api :: lang/objc/objc-super/TestObjCSuper.py lldb-api :: lang/objc/foundation/TestObjCMethodsString.py lldb-api :: functionalities/data-formatter/data-formatter-objc/TestDataFormatterObjCNSContainer.py lldb-api :: lang/objc/rdar-11355592/TestRdar11355592.py lldb-api :: commands/expression/import_builtin_fileid/TestImportBuiltinFileID.py lldb-api :: lang/objc/forward-decl/TestForwardDecl.py lldb-api :: lang/objc/variadic_methods/TestVariadicMethods.py lldb-api :: lang/objc/modules/TestObjCModules.py lldb-api :: commands/expression/namespace_local_var_same_name_obj_c/TestNamespaceLocalVarSameNameObjC.py lldb-api :: lang/objc/conflicting-definition/TestConflictingDefinition.py lldb-api :: lang/objc/bitfield_ivars/TestBitfieldIvars.py lldb-api :: lang/objc/objc-class-method/TestObjCClassMethod.py lldb-api :: lang/objc/foundation/TestRuntimeTypes.py lldb-api :: lang/objc/hidden-ivars/TestHiddenIvars.py lldb-api :: functionalities/data-formatter/data-formatter-objc/TestDataFormatterObjCExpr.py lldb-api :: lang/objcxx/cxx-bridged-po/TestObjCXXBridgedPO.py lldb-api :: functionalities/data-formatter/data-formatter-objc/TestDataFormatterObjCCF.py lldb-api :: lang/objc/objc-ivar-protocols/TestIvarProtocols.py lldb-api :: lang/objc/objc++/TestObjCXX.py lldb-api :: lang/objc/print-obj/TestPrintObj.py lldb-api :: lang/objc/objc_direct-methods/TestObjCDirectMethods.py lldb-api :: functionalities/data-formatter/synthupdate/TestSyntheticFilterRecompute.py lldb-api :: lang/objc/objc-static-method/TestObjCStaticMethod.py lldb-api :: lang/objc/self/TestObjCSelf.py lldb-api :: commands/expression/call-throws/TestCallThatThrows.py lldb-api :: lang/objc/objc-optimized/TestObjcOptimized.py lldb-api :: lang/objc/unicode-string/TestUnicodeString.py lldb-api :: functionalities/data-formatter/poarray/TestPrintObjectArray.py lldb-api :: commands/expression/po_verbosity/TestPoVerbosity.py lldb-api :: commands/expression/context-object-objc/TestContextObjectObjc.py lldb-api :: lang/objc/objc-struct-return/TestObjCStructReturn.py lldb-api :: commands/expression/persist_objc_pointeetype/TestPersistObjCPointeeType.py lldb-api :: lang/objc/blocks/TestObjCIvarsInBlocks.py

Hide Details

Hide Details

Testing Time: 6332.79s Unsupported Tests : 170 Expected Passes : 1797 Expected Failures : 6 Unresolved Tests : 1 Unexpected Failures: 53 FAILED: tools/lldb/test/CMakeFiles/check-lldb-lit cd /Users/buildslave/jenkins/workspace/lldb-cmake-sanitized/lldb-build/tools/lldb/test && /usr/local/Frameworks/Python.framework/Versions/3.7/bin/python3.7 /Users/buildslave/jenkins/workspace/lldb-cmake-sanitized/lldb-build/./bin/llvm-lit -v --time-tests --shuffle --xunit-xml-output=/Users/buildslave/jenkins/workspace/lldb-cmake-sanitized/test/results.xml -v -j 4 --timeout 1200 /Users/buildslave/jenkins/workspace/lldb-cmake-sanitized/lldb-build/tools/lldb/test ninja: build stopped: subcommand failed. Command failed: Command '['/usr/bin/env', 'TERM=vt100', '/usr/local/bin/ninja', '-v', 'check-lldb']' returned non-zero exit status 1. Command: ['/usr/bin/env', 'TERM=vt100', '/usr/local/bin/ninja', '-v', 'check-lldb'] [Pipeline] } [Pipeline] // timeout [Pipeline] } [Pipeline] // stage [Pipeline] stage [Pipeline] { (Declarative: Post Actions) [Pipeline] scanForIssues [Clang (LLVM based)] Sleeping for 5 seconds due to JENKINS-32191... [Clang (LLVM based)] Parsing console log (workspace: '/Users/buildslave/jenkins/workspace/lldb-cmake-sanitized') [Clang (LLVM based)] Successfully parsed console log [Clang (LLVM based)] -> found 2 issues (skipped 0 duplicates) [Clang (LLVM based)] Post processing issues on 'green-dragon-23' with source code encoding 'UTF-8' [Clang (LLVM based)] Creating SCM blamer to obtain author and commit information for affected files [Clang (LLVM based)] Creating SCM miner to obtain statistics for affected repository files [Clang (LLVM based)] Resolving file names for all issues in source directory '/Users/buildslave/jenkins/workspace/lldb-cmake-sanitized' [Clang (LLVM based)] -> resolved paths in source directory (1 found, 0 not found) [Clang (LLVM based)] Resolving module names from module definitions (build.xml, pom.xml, or Manifest.mf files) [Clang (LLVM based)] -> resolved module names for 2 issues [Clang (LLVM based)] Resolving package names (or namespaces) by parsing the affected files [Clang (LLVM based)] -> resolved package names of 1 affected files [Clang (LLVM based)] No filter has been set, publishing all 2 issues [Clang (LLVM based)] Creating fingerprints for all affected code blocks to track issues over different builds [Clang (LLVM based)] -> created fingerprints for 2 issues (skipped 0 issues) [Clang (LLVM based)] Copying affected files to Jenkins' build folder '/Users/Shared/Jenkins/Home/jobs/lldb-cmake-sanitized/builds/1491/files-with-issues' [Clang (LLVM based)] -> 1 copied, 0 not in workspace, 0 not-found, 0 with I/O error [Pipeline] junit Recording test results [Pipeline] } [Pipeline] // stage [Pipeline] } [Pipeline] // withEnv [Pipeline] } [Pipeline] // node [Pipeline] End of Pipeline ERROR: script returned exit code 1 Finished: FAILURE