FailedConsole Output

Skipping 9,045 KB.. Full Log
InfoContentWeakPtrFromStdModule.py (1640 of 2030)
PASS: lldb-unit :: Utility/./UtilityTests/StringListTest.ForRangeEmpty (1641 of 2030)
PASS: lldb-unit :: Host/./HostTests/HostInfoTest.GetXcodeSDK (1642 of 2030)
PASS: lldb-shell :: SymbolFile/symbol-binding.test (1643 of 2030)
PASS: lldb-unit :: UnwindAssembly/x86/./UnwindAssemblyx86Tests/Testx86AssemblyInspectionEngine.TestPopEBX (1644 of 2030)
PASS: lldb-unit :: Utility/./UtilityTests/RangeTest.ContainsEndInclusive (1645 of 2030)
PASS: lldb-api :: commands/expression/radar_8638051/Test8638051.py (1646 of 2030)
PASS: lldb-api :: functionalities/gdb_remote_client/TestGDBRemoteClient.py (1647 of 2030)
PASS: lldb-unit :: Process/minidump/./LLDBMinidumpTests/MinidumpParserTest.GetMemoryRegionInfoFromMemoryList (1648 of 2030)
PASS: lldb-unit :: Expression/./ExpressionTests/DiagnosticManagerTest.AppendMessageNoDiag (1649 of 2030)
PASS: lldb-api :: lang/objc/modules-hash-mismatch/TestClangModulesHashMismatch.py (1650 of 2030)
PASS: lldb-unit :: Utility/./UtilityTests/Flags.AnySet (1651 of 2030)
PASS: lldb-api :: commands/watchpoints/watchpoint_set_command/TestWatchLocationWithWatchSet.py (1652 of 2030)
UNSUPPORTED: lldb-shell :: SymbolFile/target-symbols-add-unwind.test (1653 of 2030)
PASS: lldb-api :: functionalities/tail_call_frames/thread_step_out_message/TestArtificialFrameStepOutMessage.py (1654 of 2030)
PASS: lldb-api :: tools/lldb-server/TestGdbRemoteThreadsInStopReply.py (1655 of 2030)
PASS: lldb-unit :: Utility/./UtilityTests/SubsystemRAIITest.SubsystemWithErrorSuccess (1656 of 2030)
PASS: lldb-api :: commands/watchpoints/watchpoint_commands/command/TestWatchpointCommandLLDB.py (1657 of 2030)
PASS: lldb-unit :: Utility/./UtilityTests/StringListTest.JoinMultiCharSeparator (1658 of 2030)
PASS: lldb-unit :: UnwindAssembly/x86/./UnwindAssemblyx86Tests/Testx86AssemblyInspectionEngine.TestPopRBX (1659 of 2030)
PASS: lldb-shell :: Settings/TestLineMarkerColor.test (1660 of 2030)
PASS: lldb-unit :: Process/gdb-remote/./ProcessGdbRemoteTests/GDBRemoteCommunicationClientTest.GetQOffsets (1661 of 2030)
PASS: lldb-api :: functionalities/data-formatter/varscript_formatting/TestDataFormatterVarScriptFormatting.py (1662 of 2030)
UNSUPPORTED: lldb-shell :: SymbolFile/PDB/pointers.test (1663 of 2030)
PASS: lldb-unit :: Utility/./UtilityTests/StringListTest.Join (1664 of 2030)
PASS: lldb-api :: commands/expression/import-std-module/conflicts/TestStdModuleWithConflicts.py (1665 of 2030)
PASS: lldb-unit :: ObjectFile/Breakpad/./ObjectFileBreakpadTests/StackWinRecord.parse (1666 of 2030)
PASS: lldb-unit :: ScriptInterpreter/Python/./ScriptInterpreterPythonTests/PythonDataObjectsTest.TestScript (1667 of 2030)
PASS: lldb-shell :: SymbolFile/NativePDB/ast-methods.cpp (1668 of 2030)
PASS: lldb-api :: lang/c/forward/TestForwardDeclaration.py (1669 of 2030)
PASS: lldb-unit :: Utility/./UtilityTests/UriParserTest.SchemeHostSeparator4 (1670 of 2030)
PASS: lldb-api :: lang/cpp/gmodules-templates/TestGModules.py (1671 of 2030)
PASS: lldb-shell :: ObjectFile/ELF/section-types.yaml (1672 of 2030)
PASS: lldb-unit :: Symbol/./SymbolTests/TestClangASTImporter.CopyTypeTagDecl (1673 of 2030)
PASS: lldb-api :: lang/objc/foundation/TestObjectDescriptionAPI.py (1674 of 2030)
PASS: lldb-shell :: ObjectFile/wasm/stripped-debug-sections.yaml (1675 of 2030)
PASS: lldb-api :: python_api/symbol-context/TestSymbolContext.py (1676 of 2030)
PASS: lldb-api :: commands/target/create-deps/TestTargetCreateDeps.py (1677 of 2030)
PASS: lldb-api :: python_api/watchpoint/TestWatchpointIgnoreCount.py (1678 of 2030)
PASS: lldb-unit :: Utility/./UtilityTests/LogChannelEnabledTest.LLDB_LOG_ERROR (1679 of 2030)
PASS: lldb-shell :: SymbolFile/NativePDB/ast-functions.cpp (1680 of 2030)
PASS: lldb-shell :: SymbolFile/DWARF/debug_line-relative_path.s (1681 of 2030)
PASS: lldb-unit :: UnwindAssembly/x86/./UnwindAssemblyx86Tests/Testx86AssemblyInspectionEngine.Test32BitOnlyInstruction (1682 of 2030)
PASS: lldb-api :: functionalities/memory/read/TestMemoryRead.py (1683 of 2030)
PASS: lldb-api :: functionalities/thread/concurrent_events/TestConcurrentManyBreakpoints.py (1684 of 2030)
PASS: lldb-unit :: UnwindAssembly/x86/./UnwindAssemblyx86Tests/Testx86AssemblyInspectionEngine.TestLEAVE (1685 of 2030)
PASS: lldb-api :: commands/expression/import-std-module/list/TestListFromStdModule.py (1686 of 2030)
PASS: lldb-api :: tools/lldb-vscode/breakpoint/TestVSCode_setExceptionBreakpoints.py (1687 of 2030)
UNSUPPORTED: lldb-api :: tools/lldb-server/TestGdbRemoteModuleInfo.py (1688 of 2030)
UNSUPPORTED: lldb-api :: functionalities/breakpoint/breakpoint_callback_command_source/TestBreakpointCallbackCommandSource.py (1689 of 2030)
PASS: lldb-unit :: Utility/./UtilityTests/StreamTest.PutRawBytesToMixedEndian (1690 of 2030)
PASS: lldb-unit :: Utility/./UtilityTests/ArgsTest.TestSingleArg (1691 of 2030)
PASS: lldb-unit :: Editline/./EditlineTests/EditlineTestFixture.EditlineReceivesMultiLineText (1692 of 2030)
PASS: lldb-unit :: Host/./HostTests/SocketTest.UDPConnect (1693 of 2030)
PASS: lldb-shell :: Register/x86-64-read.test (1694 of 2030)
PASS: lldb-api :: functionalities/data-formatter/data-formatter-stl/libcxx/bitset/TestDataFormatterLibcxxBitset.py (1695 of 2030)
PASS: lldb-unit :: Utility/./UtilityTests/StringListTest.LongestCommonPrefixEmpty (1696 of 2030)
PASS: lldb-api :: tools/lldb-server/register-reading/TestGdbRemoteGPacket.py (1697 of 2030)
PASS: lldb-api :: functionalities/breakpoint/hardware_breakpoints/hardware_breakpoint_on_multiple_threads/TestHWBreakMultiThread.py (1698 of 2030)
PASS: lldb-api :: macosx/thread-names/TestInterruptThreadNames.py (1699 of 2030)
PASS: lldb-unit :: Utility/./UtilityTests/SubsystemRAIITest.NormalSubsystem (1700 of 2030)
PASS: lldb-api :: functionalities/data-formatter/ostypeformatting/TestFormattersOsType.py (1701 of 2030)
PASS: lldb-api :: commands/expression/import-std-module/basic/TestImportStdModule.py (1702 of 2030)
PASS: lldb-shell :: SymbolFile/DWARF/find-basic-variable.cpp (1703 of 2030)
PASS: lldb-unit :: ObjectFile/ELF/./ObjectFileELFTests/ObjectFileELFTest.SectionsResolveConsistently (1704 of 2030)
PASS: lldb-unit :: ScriptInterpreter/Python/./ScriptInterpreterPythonTests/PythonDataObjectsTest.TestPythonTupleSize (1705 of 2030)
PASS: lldb-api :: commands/frame/diagnose/local-variable/TestLocalVariable.py (1706 of 2030)
PASS: lldb-unit :: Platform/./LLDBPlatformTests/PlatformDarwinTest.TestParseVersionBuildDir (1707 of 2030)
UNSUPPORTED: lldb-shell :: BuildScript/toolchain-msvc.test (1708 of 2030)
PASS: lldb-shell :: ScriptInterpreter/Python/sb_address_exception.test (1709 of 2030)
PASS: lldb-unit :: Process/gdb-remote/./ProcessGdbRemoteTests/GDBRemoteCommunicationServerTest.SendErrorResponse_StringError (1710 of 2030)
PASS: lldb-api :: commands/watchpoints/watchpoint_on_vectors/TestValueOfVectorVariable.py (1711 of 2030)
PASS: lldb-unit :: Symbol/./SymbolTests/TestClangASTImporter.MetadataPropagationAfterCopying (1712 of 2030)
PASS: lldb-unit :: Symbol/./SymbolTests/TestTypeSystemClang.TestIsClangType (1713 of 2030)
PASS: lldb-unit :: ScriptInterpreter/Python/./ScriptInterpreterPythonTests/PythonDataObjectsTest.TestExceptions (1714 of 2030)
PASS: lldb-api :: functionalities/data-formatter/data-formatter-objc/TestDataFormatterObjCKVO.py (1715 of 2030)
UNSUPPORTED: lldb-shell :: Minidump/Windows/arm-fp-unwind.test (1716 of 2030)
PASS: lldb-api :: functionalities/data-formatter/stringprinter/TestStringPrinter.py (1717 of 2030)
PASS: lldb-api :: functionalities/gdb_remote_client/TestRestartBug.py (1718 of 2030)
PASS: lldb-unit :: debugserver/./debugserverTests/RNBSocket.LoopBackConnectIPv4 (1719 of 2030)
PASS: lldb-unit :: Process/gdb-remote/./ProcessGdbRemoteTests/GDBRemoteClientBaseTest.SendContinueAndAsyncPacket (1720 of 2030)
FAIL: lldb-api :: lang/objc/objc-struct-return/TestObjCStructReturn.py (1721 of 2030)
******************** TEST 'lldb-api :: lang/objc/objc-struct-return/TestObjCStructReturn.py' FAILED ********************
Script:
--
/Users/buildslave/jenkins/workspace/lldb-cmake-sanitized/lldb-build/lldb-test-build.noindex/copied-system-python /Users/buildslave/jenkins/workspace/lldb-cmake-sanitized/llvm-project/lldb/test/API/dotest.py --arch x86_64 -s /Users/buildslave/jenkins/workspace/lldb-cmake-sanitized/lldb-build/lldb-test-traces -S nm -u CXXFLAGS -u CFLAGS --codesign-identity lldb_codesign --server /Users/buildslave/jenkins/workspace/lldb-cmake-sanitized/lldb-build/./bin/debugserver --arch x86_64 --build-dir /Users/buildslave/jenkins/workspace/lldb-cmake-sanitized/lldb-build/lldb-test-build.noindex -s=/Users/buildslave/jenkins/workspace/lldb-cmake-sanitized/test/logs -t --env TERM=vt100 --env LLVM_LIBS_DIR=/Users/buildslave/jenkins/workspace/lldb-cmake-sanitized/lldb-build/./lib --inferior-env ASAN_OPTIONS=detect_stack_use_after_return=1 --inferior-env DYLD_INSERT_LIBRARIES=/Users/buildslave/jenkins/workspace/lldb-cmake-sanitized/host-compiler/lib/clang/11.0.0/lib/darwin/libclang_rt.asan_osx_dynamic.dylib --build-dir /Users/buildslave/jenkins/workspace/lldb-cmake-sanitized/lldb-build/lldb-test-build.noindex --lldb-module-cache-dir /Users/buildslave/jenkins/workspace/lldb-cmake-sanitized/lldb-build/lldb-test-build.noindex/module-cache-lldb/lldb-api --clang-module-cache-dir /Users/buildslave/jenkins/workspace/lldb-cmake-sanitized/lldb-build/lldb-test-build.noindex/module-cache-clang/lldb-api --executable /Users/buildslave/jenkins/workspace/lldb-cmake-sanitized/lldb-build/./bin/lldb --compiler /Users/buildslave/jenkins/workspace/lldb-cmake-sanitized/lldb-build/./bin/clang --dsymutil /Users/buildslave/jenkins/workspace/lldb-cmake-sanitized/lldb-build/./bin/dsymutil --filecheck /Users/buildslave/jenkins/workspace/lldb-cmake-sanitized/lldb-build/./bin/FileCheck --lldb-libs-dir /Users/buildslave/jenkins/workspace/lldb-cmake-sanitized/lldb-build/./lib /Users/buildslave/jenkins/workspace/lldb-cmake-sanitized/llvm-project/lldb/test/API/lang/objc/objc-struct-return -p TestObjCStructReturn.py
--
Exit Code: -6

Hide Details

Command Output (stdout): -- lldb version 11.0.99 clang revision c2e27ac1ce3e3141f9cf0c4f6982cd56347bc323 llvm revision c2e27ac1ce3e3141f9cf0c4f6982cd56347bc323

Hide Details

-- Command Output (stderr): -- Assertion failed: (tokenKind == tok::kw___bridge_retain), function ParseParenExpression, file /Users/buildslave/jenkins/workspace/lldb-cmake-sanitized/llvm-project/clang/lib/Parse/ParseExpr.cpp, line 2819.

Hide Details

--

Hide Details

******************** PASS: lldb-unit :: Utility/./UtilityTests/ProcessInstanceInfo.Dump (1722 of 2030) PASS: lldb-api :: commands/command/invalid-args/TestInvalidArgsCommand.py (1723 of 2030) UNSUPPORTED: lldb-api :: lang/objc/rdar-12408181/TestRdar12408181.py (1724 of 2030) PASS: lldb-unit :: Utility/./UtilityTests/Flags.IsClear (1725 of 2030) PASS: lldb-unit :: Breakpoint/./LLDBBreakpointTests/BreakpointIDTest.StringIsBreakpointName (1726 of 2030) PASS: lldb-unit :: Host/./HostTests/FileSystemTest.FileAndDirectoryComponents (1727 of 2030) PASS: lldb-unit :: Symbol/./SymbolTests/TestTypeSystemClang.TestGetEnumIntegerTypeUnexpectedType (1728 of 2030) PASS: lldb-api :: functionalities/data-formatter/frameformat_smallstruct/TestFrameFormatSmallStruct.py (1729 of 2030) PASS: lldb-shell :: Quit/TestQuitExitCode0.test (1730 of 2030) PASS: lldb-unit :: Utility/./UtilityTests/RangeTest.Union (1731 of 2030) PASS: lldb-api :: commands/command/script/import/rdar-12586188/TestRdar12586188.py (1732 of 2030) PASS: lldb-shell :: SymbolFile/NativePDB/function-types-classes.cpp (1733 of 2030) PASS: lldb-api :: lang/c/offsetof/TestOffsetof.py (1734 of 2030) PASS: lldb-api :: python_api/watchpoint/watchlocation/TestSetWatchlocation.py (1735 of 2030) PASS: lldb-unit :: Utility/./UtilityTests/EnvironmentTest.EnvpConversion (1736 of 2030) PASS: lldb-api :: macosx/indirect_symbol/TestIndirectSymbols.py (1737 of 2030) PASS: lldb-shell :: Commands/command-source.test (1738 of 2030) PASS: lldb-api :: functionalities/tail_call_frames/inlining_and_tail_calls/TestInliningAndTailCalls.py (1739 of 2030) PASS: lldb-api :: commands/frame/language/TestGuessLanguage.py (1740 of 2030) UNSUPPORTED: lldb-api :: functionalities/gdb_remote_client/TestWasm.py (1741 of 2030) PASS: lldb-unit :: Utility/./UtilityTests/StreamTeeTest.GetStreamAtIndexOutOfBoundsEmpty (1742 of 2030) PASS: lldb-api :: lang/objc/objc-ivar-offsets/TestObjCIvarOffsets.py (1743 of 2030) PASS: lldb-shell :: SymbolFile/Breakpad/stack-cfi-parsing.test (1744 of 2030) PASS: lldb-unit :: Host/./HostTests/NativeProcessProtocolTest.SetBreakpointFailRead (1745 of 2030) PASS: lldb-unit :: UnwindAssembly/x86/./UnwindAssemblyx86Tests/Testx86AssemblyInspectionEngine.TestPush0 (1746 of 2030) PASS: lldb-api :: lang/c/modules/TestCModules.py (1747 of 2030) PASS: lldb-unit :: Utility/./UtilityTests/ArgsTest.TestSingleQuotedArgWithSpace (1748 of 2030) PASS: lldb-unit :: Utility/./UtilityTests/BinaryStreamTest.PutSLEB128ThreeBytes (1749 of 2030) PASS: lldb-unit :: Utility/./UtilityTests/RecordReplayTest.InstrumentedFoo (1750 of 2030) PASS: lldb-api :: lang/cpp/char1632_t/TestChar1632T.py (1751 of 2030) PASS: lldb-unit :: Host/./HostTests/SocketTest.DecodeHostAndPort (1752 of 2030) PASS: lldb-api :: functionalities/data-formatter/data-formatter-proper-plurals/TestFormattersOneIsSingular.py (1753 of 2030) PASS: lldb-unit :: Utility/./UtilityTests/SerializationRountripTest.SerializeDeserializePodReferences (1754 of 2030) PASS: lldb-unit :: SymbolFile/NativePDB/./SymbolFileNativePDBTests/PDBFPOProgramToDWARFExpressionTests.UnresolvedDependentCyclicRegisterAssignmentReference (1755 of 2030) UNSUPPORTED: lldb-api :: functionalities/darwin_log/filter/regex/activity/TestDarwinLogFilterRegexActivity.py (1756 of 2030) PASS: lldb-shell :: SymbolFile/DWARF/find-basic-function.cpp (1757 of 2030) PASS: lldb-unit :: Utility/./UtilityTests/ArgsTest.ReplaceArgumentAtIndexShort (1758 of 2030) PASS: lldb-unit :: UnwindAssembly/x86/./UnwindAssemblyx86Tests/Testx86AssemblyInspectionEngine.TestPushRBX (1759 of 2030) FAIL: lldb-api :: lang/objc/bitfield_ivars/TestBitfieldIvars.py (1760 of 2030) ******************** TEST 'lldb-api :: lang/objc/bitfield_ivars/TestBitfieldIvars.py' FAILED ******************** Script: -- /Users/buildslave/jenkins/workspace/lldb-cmake-sanitized/lldb-build/lldb-test-build.noindex/copied-system-python /Users/buildslave/jenkins/workspace/lldb-cmake-sanitized/llvm-project/lldb/test/API/dotest.py --arch x86_64 -s /Users/buildslave/jenkins/workspace/lldb-cmake-sanitized/lldb-build/lldb-test-traces -S nm -u CXXFLAGS -u CFLAGS --codesign-identity lldb_codesign --server /Users/buildslave/jenkins/workspace/lldb-cmake-sanitized/lldb-build/./bin/debugserver --arch x86_64 --build-dir /Users/buildslave/jenkins/workspace/lldb-cmake-sanitized/lldb-build/lldb-test-build.noindex -s=/Users/buildslave/jenkins/workspace/lldb-cmake-sanitized/test/logs -t --env TERM=vt100 --env LLVM_LIBS_DIR=/Users/buildslave/jenkins/workspace/lldb-cmake-sanitized/lldb-build/./lib --inferior-env ASAN_OPTIONS=detect_stack_use_after_return=1 --inferior-env DYLD_INSERT_LIBRARIES=/Users/buildslave/jenkins/workspace/lldb-cmake-sanitized/host-compiler/lib/clang/11.0.0/lib/darwin/libclang_rt.asan_osx_dynamic.dylib --build-dir /Users/buildslave/jenkins/workspace/lldb-cmake-sanitized/lldb-build/lldb-test-build.noindex --lldb-module-cache-dir /Users/buildslave/jenkins/workspace/lldb-cmake-sanitized/lldb-build/lldb-test-build.noindex/module-cache-lldb/lldb-api --clang-module-cache-dir /Users/buildslave/jenkins/workspace/lldb-cmake-sanitized/lldb-build/lldb-test-build.noindex/module-cache-clang/lldb-api --executable /Users/buildslave/jenkins/workspace/lldb-cmake-sanitized/lldb-build/./bin/lldb --compiler /Users/buildslave/jenkins/workspace/lldb-cmake-sanitized/lldb-build/./bin/clang --dsymutil /Users/buildslave/jenkins/workspace/lldb-cmake-sanitized/lldb-build/./bin/dsymutil --filecheck /Users/buildslave/jenkins/workspace/lldb-cmake-sanitized/lldb-build/./bin/FileCheck --lldb-libs-dir /Users/buildslave/jenkins/workspace/lldb-cmake-sanitized/lldb-build/./lib /Users/buildslave/jenkins/workspace/lldb-cmake-sanitized/llvm-project/lldb/test/API/lang/objc/bitfield_ivars -p TestBitfieldIvars.py -- Exit Code: -6

Hide Details

Command Output (stdout): -- lldb version 11.0.99 clang revision c2e27ac1ce3e3141f9cf0c4f6982cd56347bc323 llvm revision c2e27ac1ce3e3141f9cf0c4f6982cd56347bc323

Hide Details

-- Command Output (stderr): -- Assertion failed: (tokenKind == tok::kw___bridge_retain), function ParseParenExpression, file /Users/buildslave/jenkins/workspace/lldb-cmake-sanitized/llvm-project/clang/lib/Parse/ParseExpr.cpp, line 2819.

Hide Details

--

Hide Details

******************** PASS: lldb-shell :: SymbolFile/DWARF/anon_class_w_and_wo_export_symbols.ll (1761 of 2030) PASS: lldb-unit :: Utility/./UtilityTests/StreamTest.PutHex32ByteOrderBig (1762 of 2030) PASS: lldb-unit :: Platform/./LLDBPlatformTests/PlatformDarwinTest.FindXcodeContentsDirectoryInPath (1763 of 2030) PASS: lldb-unit :: Utility/./UtilityTests/GeneratorTest.Create (1764 of 2030) PASS: lldb-api :: functionalities/load_using_paths/TestLoadUsingPaths.py (1765 of 2030) PASS: lldb-api :: functionalities/thread/concurrent_events/TestConcurrentTwoBreakpointThreads.py (1766 of 2030) PASS: lldb-api :: commands/expression/dollar-in-variable/TestDollarInVariable.py (1767 of 2030) PASS: lldb-unit :: Language/CPlusPlus/./LanguageCPlusPlusTests/CPlusPlusLanguage.CPlusPlusNameParser (1768 of 2030) PASS: lldb-api :: functionalities/gdb_remote_client/TestThreadSelectionBug.py (1769 of 2030) PASS: lldb-unit :: Utility/./UtilityTests/UriParserTest.BracketedHostnameWithColon (1770 of 2030) PASS: lldb-unit :: Utility/./UtilityTests/OptionsWithRawTest.MultiWordSuffix (1771 of 2030) PASS: lldb-shell :: Minidump/disassemble-no-module.yaml (1772 of 2030) PASS: lldb-shell :: Driver/TestProcessAttach.test (1773 of 2030) PASS: lldb-unit :: API/./APITests/SBCommandInterpreterTest.MultiWordCommand (1774 of 2030) UNSUPPORTED: lldb-api :: functionalities/data-formatter/data-formatter-stl/libstdcpp/smart_ptr/TestDataFormatterStdSmartPtr.py (1775 of 2030) PASS: lldb-shell :: Process/UnsupportedLanguage.test (1776 of 2030) FAIL: lldb-api :: commands/expression/namespace_local_var_same_name_obj_c/TestNamespaceLocalVarSameNameObjC.py (1777 of 2030) ******************** TEST 'lldb-api :: commands/expression/namespace_local_var_same_name_obj_c/TestNamespaceLocalVarSameNameObjC.py' FAILED ******************** Script: -- /Users/buildslave/jenkins/workspace/lldb-cmake-sanitized/lldb-build/lldb-test-build.noindex/copied-system-python /Users/buildslave/jenkins/workspace/lldb-cmake-sanitized/llvm-project/lldb/test/API/dotest.py --arch x86_64 -s /Users/buildslave/jenkins/workspace/lldb-cmake-sanitized/lldb-build/lldb-test-traces -S nm -u CXXFLAGS -u CFLAGS --codesign-identity lldb_codesign --server /Users/buildslave/jenkins/workspace/lldb-cmake-sanitized/lldb-build/./bin/debugserver --arch x86_64 --build-dir /Users/buildslave/jenkins/workspace/lldb-cmake-sanitized/lldb-build/lldb-test-build.noindex -s=/Users/buildslave/jenkins/workspace/lldb-cmake-sanitized/test/logs -t --env TERM=vt100 --env LLVM_LIBS_DIR=/Users/buildslave/jenkins/workspace/lldb-cmake-sanitized/lldb-build/./lib --inferior-env ASAN_OPTIONS=detect_stack_use_after_return=1 --inferior-env DYLD_INSERT_LIBRARIES=/Users/buildslave/jenkins/workspace/lldb-cmake-sanitized/host-compiler/lib/clang/11.0.0/lib/darwin/libclang_rt.asan_osx_dynamic.dylib --build-dir /Users/buildslave/jenkins/workspace/lldb-cmake-sanitized/lldb-build/lldb-test-build.noindex --lldb-module-cache-dir /Users/buildslave/jenkins/workspace/lldb-cmake-sanitized/lldb-build/lldb-test-build.noindex/module-cache-lldb/lldb-api --clang-module-cache-dir /Users/buildslave/jenkins/workspace/lldb-cmake-sanitized/lldb-build/lldb-test-build.noindex/module-cache-clang/lldb-api --executable /Users/buildslave/jenkins/workspace/lldb-cmake-sanitized/lldb-build/./bin/lldb --compiler /Users/buildslave/jenkins/workspace/lldb-cmake-sanitized/lldb-build/./bin/clang --dsymutil /Users/buildslave/jenkins/workspace/lldb-cmake-sanitized/lldb-build/./bin/dsymutil --filecheck /Users/buildslave/jenkins/workspace/lldb-cmake-sanitized/lldb-build/./bin/FileCheck --lldb-libs-dir /Users/buildslave/jenkins/workspace/lldb-cmake-sanitized/lldb-build/./lib /Users/buildslave/jenkins/workspace/lldb-cmake-sanitized/llvm-project/lldb/test/API/commands/expression/namespace_local_var_same_name_obj_c -p TestNamespaceLocalVarSameNameObjC.py -- Exit Code: -6

Hide Details

Command Output (stdout): -- lldb version 11.0.99 clang revision c2e27ac1ce3e3141f9cf0c4f6982cd56347bc323 llvm revision c2e27ac1ce3e3141f9cf0c4f6982cd56347bc323

Hide Details

-- Command Output (stderr): -- Assertion failed: (tokenKind == tok::kw___bridge_retain), function ParseParenExpression, file /Users/buildslave/jenkins/workspace/lldb-cmake-sanitized/llvm-project/clang/lib/Parse/ParseExpr.cpp, line 2819.

Hide Details

--

Hide Details

******************** PASS: lldb-unit :: Utility/./UtilityTests/OptionsWithRawTest.ArgsButNoLeadingDash (1778 of 2030) UNSUPPORTED: lldb-shell :: Unwind/eh-frame-small-fde.test (1779 of 2030) PASS: lldb-unit :: Utility/./UtilityTests/Flags.GetBitSize (1780 of 2030) PASS: lldb-api :: commands/expression/ir-interpreter/TestIRInterpreter.py (1781 of 2030) PASS: lldb-unit :: Utility/./UtilityTests/AnsiTerminal.Unknown (1782 of 2030) PASS: lldb-unit :: Utility/./UtilityTests/NameMatchesTest.Contains (1783 of 2030) PASS: lldb-shell :: SymbolFile/NativePDB/source-list.cpp (1784 of 2030) PASS: lldb-shell :: SymbolFile/NativePDB/function-types-builtins.cpp (1785 of 2030) PASS: lldb-api :: functionalities/data-formatter/data-formatter-objc/TestDataFormatterObjCNSBundle.py (1786 of 2030) UNSUPPORTED: lldb-api :: functionalities/data-formatter/data-formatter-stl/libstdcpp/vector/TestDataFormatterStdVector.py (1787 of 2030) UNSUPPORTED: lldb-api :: commands/expression/macros/TestMacros.py (1788 of 2030) PASS: lldb-api :: tools/lldb-server/TestGdbRemote_vCont.py (1789 of 2030) FAIL: lldb-api :: lang/objc/print-obj/TestPrintObj.py (1790 of 2030) ******************** TEST 'lldb-api :: lang/objc/print-obj/TestPrintObj.py' FAILED ******************** Script: -- /Users/buildslave/jenkins/workspace/lldb-cmake-sanitized/lldb-build/lldb-test-build.noindex/copied-system-python /Users/buildslave/jenkins/workspace/lldb-cmake-sanitized/llvm-project/lldb/test/API/dotest.py --arch x86_64 -s /Users/buildslave/jenkins/workspace/lldb-cmake-sanitized/lldb-build/lldb-test-traces -S nm -u CXXFLAGS -u CFLAGS --codesign-identity lldb_codesign --server /Users/buildslave/jenkins/workspace/lldb-cmake-sanitized/lldb-build/./bin/debugserver --arch x86_64 --build-dir /Users/buildslave/jenkins/workspace/lldb-cmake-sanitized/lldb-build/lldb-test-build.noindex -s=/Users/buildslave/jenkins/workspace/lldb-cmake-sanitized/test/logs -t --env TERM=vt100 --env LLVM_LIBS_DIR=/Users/buildslave/jenkins/workspace/lldb-cmake-sanitized/lldb-build/./lib --inferior-env ASAN_OPTIONS=detect_stack_use_after_return=1 --inferior-env DYLD_INSERT_LIBRARIES=/Users/buildslave/jenkins/workspace/lldb-cmake-sanitized/host-compiler/lib/clang/11.0.0/lib/darwin/libclang_rt.asan_osx_dynamic.dylib --build-dir /Users/buildslave/jenkins/workspace/lldb-cmake-sanitized/lldb-build/lldb-test-build.noindex --lldb-module-cache-dir /Users/buildslave/jenkins/workspace/lldb-cmake-sanitized/lldb-build/lldb-test-build.noindex/module-cache-lldb/lldb-api --clang-module-cache-dir /Users/buildslave/jenkins/workspace/lldb-cmake-sanitized/lldb-build/lldb-test-build.noindex/module-cache-clang/lldb-api --executable /Users/buildslave/jenkins/workspace/lldb-cmake-sanitized/lldb-build/./bin/lldb --compiler /Users/buildslave/jenkins/workspace/lldb-cmake-sanitized/lldb-build/./bin/clang --dsymutil /Users/buildslave/jenkins/workspace/lldb-cmake-sanitized/lldb-build/./bin/dsymutil --filecheck /Users/buildslave/jenkins/workspace/lldb-cmake-sanitized/lldb-build/./bin/FileCheck --lldb-libs-dir /Users/buildslave/jenkins/workspace/lldb-cmake-sanitized/lldb-build/./lib /Users/buildslave/jenkins/workspace/lldb-cmake-sanitized/llvm-project/lldb/test/API/lang/objc/print-obj -p TestPrintObj.py -- Exit Code: -6

Hide Details

Command Output (stdout): -- lldb version 11.0.99 clang revision c2e27ac1ce3e3141f9cf0c4f6982cd56347bc323 llvm revision c2e27ac1ce3e3141f9cf0c4f6982cd56347bc323

Hide Details

-- Command Output (stderr): -- Assertion failed: (tokenKind == tok::kw___bridge_retain), function ParseParenExpression, file /Users/buildslave/jenkins/workspace/lldb-cmake-sanitized/llvm-project/clang/lib/Parse/ParseExpr.cpp, line 2819.

Hide Details

--

Hide Details

******************** PASS: lldb-api :: commands/version/TestVersion.py (1791 of 2030) PASS: lldb-api :: functionalities/postmortem/minidump/TestMiniDump.py (1792 of 2030) UNSUPPORTED: lldb-shell :: Register/x86-64-zmm-read.test (1793 of 2030) PASS: lldb-api :: functionalities/inferior-crashing/TestInferiorCrashingStep.py (1794 of 2030) PASS: lldb-unit :: Core/./LLDBCoreTests/StreamCallbackTest.Callback (1795 of 2030) PASS: lldb-api :: tools/lldb-vscode/step/TestVSCode_step.py (1796 of 2030) XFAIL: lldb-shell :: Register/x86-64-write.test (1797 of 2030) PASS: lldb-unit :: Utility/./UtilityTests/RangeTest.Clear (1798 of 2030) PASS: lldb-unit :: Expression/./ExpressionTests/CppModuleConfigurationTest.AmbiguousLibCpp (1799 of 2030) FAIL: lldb-api :: commands/expression/po_verbosity/TestPoVerbosity.py (1800 of 2030) ******************** TEST 'lldb-api :: commands/expression/po_verbosity/TestPoVerbosity.py' FAILED ******************** Script: -- /Users/buildslave/jenkins/workspace/lldb-cmake-sanitized/lldb-build/lldb-test-build.noindex/copied-system-python /Users/buildslave/jenkins/workspace/lldb-cmake-sanitized/llvm-project/lldb/test/API/dotest.py --arch x86_64 -s /Users/buildslave/jenkins/workspace/lldb-cmake-sanitized/lldb-build/lldb-test-traces -S nm -u CXXFLAGS -u CFLAGS --codesign-identity lldb_codesign --server /Users/buildslave/jenkins/workspace/lldb-cmake-sanitized/lldb-build/./bin/debugserver --arch x86_64 --build-dir /Users/buildslave/jenkins/workspace/lldb-cmake-sanitized/lldb-build/lldb-test-build.noindex -s=/Users/buildslave/jenkins/workspace/lldb-cmake-sanitized/test/logs -t --env TERM=vt100 --env LLVM_LIBS_DIR=/Users/buildslave/jenkins/workspace/lldb-cmake-sanitized/lldb-build/./lib --inferior-env ASAN_OPTIONS=detect_stack_use_after_return=1 --inferior-env DYLD_INSERT_LIBRARIES=/Users/buildslave/jenkins/workspace/lldb-cmake-sanitized/host-compiler/lib/clang/11.0.0/lib/darwin/libclang_rt.asan_osx_dynamic.dylib --build-dir /Users/buildslave/jenkins/workspace/lldb-cmake-sanitized/lldb-build/lldb-test-build.noindex --lldb-module-cache-dir /Users/buildslave/jenkins/workspace/lldb-cmake-sanitized/lldb-build/lldb-test-build.noindex/module-cache-lldb/lldb-api --clang-module-cache-dir /Users/buildslave/jenkins/workspace/lldb-cmake-sanitized/lldb-build/lldb-test-build.noindex/module-cache-clang/lldb-api --executable /Users/buildslave/jenkins/workspace/lldb-cmake-sanitized/lldb-build/./bin/lldb --compiler /Users/buildslave/jenkins/workspace/lldb-cmake-sanitized/lldb-build/./bin/clang --dsymutil /Users/buildslave/jenkins/workspace/lldb-cmake-sanitized/lldb-build/./bin/dsymutil --filecheck /Users/buildslave/jenkins/workspace/lldb-cmake-sanitized/lldb-build/./bin/FileCheck --lldb-libs-dir /Users/buildslave/jenkins/workspace/lldb-cmake-sanitized/lldb-build/./lib /Users/buildslave/jenkins/workspace/lldb-cmake-sanitized/llvm-project/lldb/test/API/commands/expression/po_verbosity -p TestPoVerbosity.py -- Exit Code: -6

Hide Details

Command Output (stdout): -- lldb version 11.0.99 clang revision c2e27ac1ce3e3141f9cf0c4f6982cd56347bc323 llvm revision c2e27ac1ce3e3141f9cf0c4f6982cd56347bc323

Hide Details

-- Command Output (stderr): -- Assertion failed: (tokenKind == tok::kw___bridge_retain), function ParseParenExpression, file /Users/buildslave/jenkins/workspace/lldb-cmake-sanitized/llvm-project/clang/lib/Parse/ParseExpr.cpp, line 2819.

Hide Details

--

Hide Details

******************** PASS: lldb-shell :: SymbolFile/DWARF/parallel-indexing-stress.s (1801 of 2030) PASS: lldb-api :: commands/frame/var-scope/TestFrameVariableScope.py (1802 of 2030) FAIL: lldb-api :: lang/objc/hidden-ivars/TestHiddenIvars.py (1803 of 2030) ******************** TEST 'lldb-api :: lang/objc/hidden-ivars/TestHiddenIvars.py' FAILED ******************** Script: -- /Users/buildslave/jenkins/workspace/lldb-cmake-sanitized/lldb-build/lldb-test-build.noindex/copied-system-python /Users/buildslave/jenkins/workspace/lldb-cmake-sanitized/llvm-project/lldb/test/API/dotest.py --arch x86_64 -s /Users/buildslave/jenkins/workspace/lldb-cmake-sanitized/lldb-build/lldb-test-traces -S nm -u CXXFLAGS -u CFLAGS --codesign-identity lldb_codesign --server /Users/buildslave/jenkins/workspace/lldb-cmake-sanitized/lldb-build/./bin/debugserver --arch x86_64 --build-dir /Users/buildslave/jenkins/workspace/lldb-cmake-sanitized/lldb-build/lldb-test-build.noindex -s=/Users/buildslave/jenkins/workspace/lldb-cmake-sanitized/test/logs -t --env TERM=vt100 --env LLVM_LIBS_DIR=/Users/buildslave/jenkins/workspace/lldb-cmake-sanitized/lldb-build/./lib --inferior-env ASAN_OPTIONS=detect_stack_use_after_return=1 --inferior-env DYLD_INSERT_LIBRARIES=/Users/buildslave/jenkins/workspace/lldb-cmake-sanitized/host-compiler/lib/clang/11.0.0/lib/darwin/libclang_rt.asan_osx_dynamic.dylib --build-dir /Users/buildslave/jenkins/workspace/lldb-cmake-sanitized/lldb-build/lldb-test-build.noindex --lldb-module-cache-dir /Users/buildslave/jenkins/workspace/lldb-cmake-sanitized/lldb-build/lldb-test-build.noindex/module-cache-lldb/lldb-api --clang-module-cache-dir /Users/buildslave/jenkins/workspace/lldb-cmake-sanitized/lldb-build/lldb-test-build.noindex/module-cache-clang/lldb-api --executable /Users/buildslave/jenkins/workspace/lldb-cmake-sanitized/lldb-build/./bin/lldb --compiler /Users/buildslave/jenkins/workspace/lldb-cmake-sanitized/lldb-build/./bin/clang --dsymutil /Users/buildslave/jenkins/workspace/lldb-cmake-sanitized/lldb-build/./bin/dsymutil --filecheck /Users/buildslave/jenkins/workspace/lldb-cmake-sanitized/lldb-build/./bin/FileCheck --lldb-libs-dir /Users/buildslave/jenkins/workspace/lldb-cmake-sanitized/lldb-build/./lib /Users/buildslave/jenkins/workspace/lldb-cmake-sanitized/llvm-project/lldb/test/API/lang/objc/hidden-ivars -p TestHiddenIvars.py -- Exit Code: -6

Hide Details

Command Output (stdout): -- lldb version 11.0.99 clang revision c2e27ac1ce3e3141f9cf0c4f6982cd56347bc323 llvm revision c2e27ac1ce3e3141f9cf0c4f6982cd56347bc323

Hide Details

-- Command Output (stderr): -- Assertion failed: (tokenKind == tok::kw___bridge_retain), function ParseParenExpression, file /Users/buildslave/jenkins/workspace/lldb-cmake-sanitized/llvm-project/clang/lib/Parse/ParseExpr.cpp, line 2819.

Hide Details

--

Hide Details

******************** PASS: lldb-unit :: Utility/./UtilityTests/StringListTest.Clear (1804 of 2030) PASS: lldb-unit :: Utility/./UtilityTests/ConstStringTest.YAML (1805 of 2030) PASS: lldb-api :: macosx/lc-note/kern-ver-str/TestKernVerStrLCNOTE.py (1806 of 2030) PASS: lldb-api :: functionalities/target-new-solib-notifications/TestModuleLoadedNotifys.py (1807 of 2030) PASS: lldb-shell :: ObjectFile/ELF/many-sections.s (1808 of 2030) PASS: lldb-api :: commands/watchpoints/hello_watchpoint/TestMyFirstWatchpoint.py (1809 of 2030) PASS: lldb-unit :: Utility/./UtilityTests/BinaryStreamTest.PutULEB128EightBytes (1810 of 2030) PASS: lldb-api :: functionalities/data-formatter/data-formatter-caching/TestDataFormatterCaching.py (1811 of 2030) PASS: lldb-api :: macosx/universal/TestUniversal.py (1812 of 2030) PASS: lldb-unit :: UnwindAssembly/x86/./UnwindAssemblyx86Tests/Testx86AssemblyInspectionEngine.TestPopR13 (1813 of 2030) PASS: lldb-unit :: Utility/./UtilityTests/Flags.Test (1814 of 2030) PASS: lldb-api :: python_api/class_members/TestSBTypeClassMembers.py (1815 of 2030) UNSUPPORTED: lldb-api :: functionalities/darwin_log/filter/regex/subsystem/TestDarwinLogFilterRegexSubsystem.py (1816 of 2030) PASS: lldb-api :: functionalities/data-formatter/var-in-aggregate-misuse/TestVarInAggregateMisuse.py (1817 of 2030) PASS: lldb-unit :: Utility/./UtilityTests/StringListTest.AppendStringMove (1818 of 2030) PASS: lldb-api :: commands/expression/import-std-module/weak_ptr/TestWeakPtrFromStdModule.py (1819 of 2030) PASS: lldb-unit :: Utility/./UtilityTests/StreamTeeTest.Constructor2Streams (1820 of 2030) PASS: lldb-shell :: ScriptInterpreter/Python/scripted_breakpoint.test (1821 of 2030) PASS: lldb-unit :: Utility/./UtilityTests/UriParserTest.MinimalPortPath (1822 of 2030) PASS: lldb-unit :: UnwindAssembly/x86/./UnwindAssemblyx86Tests/Testx86AssemblyInspectionEngine.TestPushExtended (1823 of 2030) PASS: lldb-unit :: debugserver/./debugserverTests/RNBSocket.LoopBackListenIPv4 (1824 of 2030) PASS: lldb-unit :: Utility/./UtilityTests/ProcessInstanceInfo.DumpTable (1825 of 2030) PASS: lldb-shell :: Minidump/fb-dump.test (1826 of 2030) PASS: lldb-unit :: Host/./HostTests/Host.GetEnvironment (1827 of 2030) PASS: lldb-unit :: Expression/./ExpressionTests/CppModuleConfigurationTest.LinuxLocalLibCpp (1828 of 2030) PASS: lldb-api :: functionalities/breakpoint/debugbreak/TestDebugBreak.py (1829 of 2030) PASS: lldb-shell :: Reproducer/TestPythonImport.test (1830 of 2030) PASS: lldb-shell :: SymbolFile/DWARF/debug-names-compressed.cpp (1831 of 2030) PASS: lldb-unit :: Utility/./UtilityTests/StringExtractorTest.GetHexU8_Extra (1832 of 2030) PASS: lldb-shell :: Settings/TestFrameFormatNoColor.test (1833 of 2030) PASS: lldb-unit :: DataFormatter/./LLDBFormatterTests/FormatManagerTests.CompatibleLangs (1834 of 2030) PASS: lldb-api :: commands/expression/import-std-module/list-dbg-info-content/TestDbgInfoContentListFromStdModule.py (1835 of 2030) PASS: lldb-shell :: ScriptInterpreter/None/import_module.test (1836 of 2030) PASS: lldb-unit :: Symbol/./SymbolTests/TestTypeSystemClang.TestBuiltinTypeForEncodingAndBitSize (1837 of 2030) PASS: lldb-unit :: Target/./TargetTests/PathMappingListTest.RemapRoot (1838 of 2030) PASS: lldb-unit :: Utility/./UtilityTests/StreamTest.PutBytesAsRawHex8ToBigEndian (1839 of 2030) PASS: lldb-unit :: Utility/./UtilityTests/RangeTest.ContainsRangeStartingFromZero (1840 of 2030) PASS: lldb-shell :: Driver/TestConvenienceVariables.test (1841 of 2030) PASS: lldb-api :: commands/expression/call-function/TestCallBuiltinFunction.py (1842 of 2030) PASS: lldb-shell :: SymbolFile/DWARF/find-inline-method.s (1843 of 2030) FAIL: lldb-api :: lang/objc/objc-optimized/TestObjcOptimized.py (1844 of 2030) ******************** TEST 'lldb-api :: lang/objc/objc-optimized/TestObjcOptimized.py' FAILED ******************** Script: -- /Users/buildslave/jenkins/workspace/lldb-cmake-sanitized/lldb-build/lldb-test-build.noindex/copied-system-python /Users/buildslave/jenkins/workspace/lldb-cmake-sanitized/llvm-project/lldb/test/API/dotest.py --arch x86_64 -s /Users/buildslave/jenkins/workspace/lldb-cmake-sanitized/lldb-build/lldb-test-traces -S nm -u CXXFLAGS -u CFLAGS --codesign-identity lldb_codesign --server /Users/buildslave/jenkins/workspace/lldb-cmake-sanitized/lldb-build/./bin/debugserver --arch x86_64 --build-dir /Users/buildslave/jenkins/workspace/lldb-cmake-sanitized/lldb-build/lldb-test-build.noindex -s=/Users/buildslave/jenkins/workspace/lldb-cmake-sanitized/test/logs -t --env TERM=vt100 --env LLVM_LIBS_DIR=/Users/buildslave/jenkins/workspace/lldb-cmake-sanitized/lldb-build/./lib --inferior-env ASAN_OPTIONS=detect_stack_use_after_return=1 --inferior-env DYLD_INSERT_LIBRARIES=/Users/buildslave/jenkins/workspace/lldb-cmake-sanitized/host-compiler/lib/clang/11.0.0/lib/darwin/libclang_rt.asan_osx_dynamic.dylib --build-dir /Users/buildslave/jenkins/workspace/lldb-cmake-sanitized/lldb-build/lldb-test-build.noindex --lldb-module-cache-dir /Users/buildslave/jenkins/workspace/lldb-cmake-sanitized/lldb-build/lldb-test-build.noindex/module-cache-lldb/lldb-api --clang-module-cache-dir /Users/buildslave/jenkins/workspace/lldb-cmake-sanitized/lldb-build/lldb-test-build.noindex/module-cache-clang/lldb-api --executable /Users/buildslave/jenkins/workspace/lldb-cmake-sanitized/lldb-build/./bin/lldb --compiler /Users/buildslave/jenkins/workspace/lldb-cmake-sanitized/lldb-build/./bin/clang --dsymutil /Users/buildslave/jenkins/workspace/lldb-cmake-sanitized/lldb-build/./bin/dsymutil --filecheck /Users/buildslave/jenkins/workspace/lldb-cmake-sanitized/lldb-build/./bin/FileCheck --lldb-libs-dir /Users/buildslave/jenkins/workspace/lldb-cmake-sanitized/lldb-build/./lib /Users/buildslave/jenkins/workspace/lldb-cmake-sanitized/llvm-project/lldb/test/API/lang/objc/objc-optimized -p TestObjcOptimized.py -- Exit Code: -6

Hide Details

Command Output (stdout): -- lldb version 11.0.99 clang revision c2e27ac1ce3e3141f9cf0c4f6982cd56347bc323 llvm revision c2e27ac1ce3e3141f9cf0c4f6982cd56347bc323 a.out was compiled with optimization - stepping may behave oddly; variables may not be available. a.out was compiled with optimization - stepping may behave oddly; variables may not be available. a.out was compiled with optimization - stepping may behave oddly; variables may not be available.

Hide Details

-- Command Output (stderr): -- Assertion failed: (tokenKind == tok::kw___bridge_retain), function ParseParenExpression, file /Users/buildslave/jenkins/workspace/lldb-cmake-sanitized/llvm-project/clang/lib/Parse/ParseExpr.cpp, line 2819.

Hide Details

--

Hide Details

******************** PASS: lldb-unit :: Utility/./UtilityTests/UriParserTest.BracketedHostnameWithPortIPv6 (1845 of 2030) PASS: lldb-shell :: ObjectFile/ELF/compressed-sections.yaml (1846 of 2030) PASS: lldb-unit :: Language/Highlighting/./HighlighterTests/HighlighterTest.ClangTrailingBackslashWithWhitespace (1847 of 2030) PASS: lldb-api :: commands/expression/rdar42038760/TestScalarURem.py (1848 of 2030) PASS: lldb-api :: python_api/value/change_values/TestChangeValueAPI.py (1849 of 2030) PASS: lldb-api :: functionalities/tail_call_frames/sbapi_support/TestTailCallFrameSBAPI.py (1850 of 2030) UNSUPPORTED: lldb-api :: functionalities/tty/TestTerminal.py (1851 of 2030) PASS: lldb-unit :: Utility/./UtilityTests/StreamTest.PutMaxHex64ByteOrderLittle (1852 of 2030) PASS: lldb-unit :: Utility/./UtilityTests/StreamTeeTest.Write (1853 of 2030) FAIL: lldb-api :: lang/objc/orderedset/TestOrderedSet.py (1854 of 2030) ******************** TEST 'lldb-api :: lang/objc/orderedset/TestOrderedSet.py' FAILED ******************** Script: -- /Users/buildslave/jenkins/workspace/lldb-cmake-sanitized/lldb-build/lldb-test-build.noindex/copied-system-python /Users/buildslave/jenkins/workspace/lldb-cmake-sanitized/llvm-project/lldb/test/API/dotest.py --arch x86_64 -s /Users/buildslave/jenkins/workspace/lldb-cmake-sanitized/lldb-build/lldb-test-traces -S nm -u CXXFLAGS -u CFLAGS --codesign-identity lldb_codesign --server /Users/buildslave/jenkins/workspace/lldb-cmake-sanitized/lldb-build/./bin/debugserver --arch x86_64 --build-dir /Users/buildslave/jenkins/workspace/lldb-cmake-sanitized/lldb-build/lldb-test-build.noindex -s=/Users/buildslave/jenkins/workspace/lldb-cmake-sanitized/test/logs -t --env TERM=vt100 --env LLVM_LIBS_DIR=/Users/buildslave/jenkins/workspace/lldb-cmake-sanitized/lldb-build/./lib --inferior-env ASAN_OPTIONS=detect_stack_use_after_return=1 --inferior-env DYLD_INSERT_LIBRARIES=/Users/buildslave/jenkins/workspace/lldb-cmake-sanitized/host-compiler/lib/clang/11.0.0/lib/darwin/libclang_rt.asan_osx_dynamic.dylib --build-dir /Users/buildslave/jenkins/workspace/lldb-cmake-sanitized/lldb-build/lldb-test-build.noindex --lldb-module-cache-dir /Users/buildslave/jenkins/workspace/lldb-cmake-sanitized/lldb-build/lldb-test-build.noindex/module-cache-lldb/lldb-api --clang-module-cache-dir /Users/buildslave/jenkins/workspace/lldb-cmake-sanitized/lldb-build/lldb-test-build.noindex/module-cache-clang/lldb-api --executable /Users/buildslave/jenkins/workspace/lldb-cmake-sanitized/lldb-build/./bin/lldb --compiler /Users/buildslave/jenkins/workspace/lldb-cmake-sanitized/lldb-build/./bin/clang --dsymutil /Users/buildslave/jenkins/workspace/lldb-cmake-sanitized/lldb-build/./bin/dsymutil --filecheck /Users/buildslave/jenkins/workspace/lldb-cmake-sanitized/lldb-build/./bin/FileCheck --lldb-libs-dir /Users/buildslave/jenkins/workspace/lldb-cmake-sanitized/lldb-build/./lib /Users/buildslave/jenkins/workspace/lldb-cmake-sanitized/llvm-project/lldb/test/API/lang/objc/orderedset -p TestOrderedSet.py -- Exit Code: -6

Hide Details

Command Output (stdout): -- lldb version 11.0.99 clang revision c2e27ac1ce3e3141f9cf0c4f6982cd56347bc323 llvm revision c2e27ac1ce3e3141f9cf0c4f6982cd56347bc323

Hide Details

-- Command Output (stderr): -- Assertion failed: (tokenKind == tok::kw___bridge_retain), function ParseParenExpression, file /Users/buildslave/jenkins/workspace/lldb-cmake-sanitized/llvm-project/clang/lib/Parse/ParseExpr.cpp, line 2819.

Hide Details

--

Hide Details

******************** PASS: lldb-unit :: Utility/./UtilityTests/ArgsTest.ReplaceArgumentAtIndexOutOfRange (1855 of 2030) PASS: lldb-unit :: Host/./HostTests/NativeProcessProtocolTest.SetBreakpointFailWrite (1856 of 2030) PASS: lldb-unit :: Utility/./UtilityTests/BroadcasterTest.BroadcastEvent (1857 of 2030) PASS: lldb-unit :: Utility/./UtilityTests/StringLexerTest.Next (1858 of 2030) PASS: lldb-unit :: Signals/./SignalsTests/UnixSignalsTest.Iteration (1859 of 2030) PASS: lldb-unit :: ObjectFile/Breakpad/./ObjectFileBreakpadTests/FileRecord.parse (1860 of 2030) PASS: lldb-api :: functionalities/data-formatter/data-formatter-stl/libcxx/function/TestLibCxxFunction.py (1861 of 2030) PASS: lldb-api :: functionalities/tail_call_frames/thread_step_out_or_return/TestSteppingOutWithArtificialFrames.py (1862 of 2030) PASS: lldb-api :: lang/c/unicode/TestUnicodeSymbols.py (1863 of 2030) PASS: lldb-unit :: Utility/./UtilityTests/ScalarTest.RightShiftOperator (1864 of 2030) PASS: lldb-unit :: Utility/./UtilityTests/ArgsTest.BareSingleQuote (1865 of 2030) PASS: lldb-api :: functionalities/unwind/noreturn/module-end/TestNoReturnModuleEnd.py (1866 of 2030) PASS: lldb-unit :: Host/./HostTests/FileActionTest.Open (1867 of 2030) PASS: lldb-unit :: UnwindAssembly/x86/./UnwindAssemblyx86Tests/Testx86AssemblyInspectionEngine.TestPushEBP (1868 of 2030) PASS: lldb-api :: functionalities/breakpoint/comp_dir_symlink/TestCompDirSymLink.py (1869 of 2030) FAIL: lldb-api :: functionalities/data-formatter/data-formatter-objc/TestDataFormatterObjCNSContainer.py (1870 of 2030) ******************** TEST 'lldb-api :: functionalities/data-formatter/data-formatter-objc/TestDataFormatterObjCNSContainer.py' FAILED ******************** Script: -- /Users/buildslave/jenkins/workspace/lldb-cmake-sanitized/lldb-build/lldb-test-build.noindex/copied-system-python /Users/buildslave/jenkins/workspace/lldb-cmake-sanitized/llvm-project/lldb/test/API/dotest.py --arch x86_64 -s /Users/buildslave/jenkins/workspace/lldb-cmake-sanitized/lldb-build/lldb-test-traces -S nm -u CXXFLAGS -u CFLAGS --codesign-identity lldb_codesign --server /Users/buildslave/jenkins/workspace/lldb-cmake-sanitized/lldb-build/./bin/debugserver --arch x86_64 --build-dir /Users/buildslave/jenkins/workspace/lldb-cmake-sanitized/lldb-build/lldb-test-build.noindex -s=/Users/buildslave/jenkins/workspace/lldb-cmake-sanitized/test/logs -t --env TERM=vt100 --env LLVM_LIBS_DIR=/Users/buildslave/jenkins/workspace/lldb-cmake-sanitized/lldb-build/./lib --inferior-env ASAN_OPTIONS=detect_stack_use_after_return=1 --inferior-env DYLD_INSERT_LIBRARIES=/Users/buildslave/jenkins/workspace/lldb-cmake-sanitized/host-compiler/lib/clang/11.0.0/lib/darwin/libclang_rt.asan_osx_dynamic.dylib --build-dir /Users/buildslave/jenkins/workspace/lldb-cmake-sanitized/lldb-build/lldb-test-build.noindex --lldb-module-cache-dir /Users/buildslave/jenkins/workspace/lldb-cmake-sanitized/lldb-build/lldb-test-build.noindex/module-cache-lldb/lldb-api --clang-module-cache-dir /Users/buildslave/jenkins/workspace/lldb-cmake-sanitized/lldb-build/lldb-test-build.noindex/module-cache-clang/lldb-api --executable /Users/buildslave/jenkins/workspace/lldb-cmake-sanitized/lldb-build/./bin/lldb --compiler /Users/buildslave/jenkins/workspace/lldb-cmake-sanitized/lldb-build/./bin/clang --dsymutil /Users/buildslave/jenkins/workspace/lldb-cmake-sanitized/lldb-build/./bin/dsymutil --filecheck /Users/buildslave/jenkins/workspace/lldb-cmake-sanitized/lldb-build/./bin/FileCheck --lldb-libs-dir /Users/buildslave/jenkins/workspace/lldb-cmake-sanitized/lldb-build/./lib /Users/buildslave/jenkins/workspace/lldb-cmake-sanitized/llvm-project/lldb/test/API/functionalities/data-formatter/data-formatter-objc -p TestDataFormatterObjCNSContainer.py -- Exit Code: -6

Hide Details

Command Output (stdout): -- lldb version 11.0.99 clang revision c2e27ac1ce3e3141f9cf0c4f6982cd56347bc323 llvm revision c2e27ac1ce3e3141f9cf0c4f6982cd56347bc323

Hide Details

-- Command Output (stderr): --

Hide Details

Session logs for test failures/errors/unexpected successes will go into directory '/Users/buildslave/jenkins/workspace/lldb-cmake-sanitized/test/logs' Change dir to: /Users/buildslave/jenkins/workspace/lldb-cmake-sanitized/llvm-project/lldb/test/API/functionalities/data-formatter/data-formatter-objc runCmd: settings clear -all output:

Hide Details

runCmd: settings set symbols.enable-external-lookup false output:

Hide Details

runCmd: settings set target.auto-apply-fixits false output:

Hide Details

runCmd: settings set plugin.process.gdb-remote.packet-timeout 60 output:

Hide Details

runCmd: settings set symbols.clang-modules-cache-path "/Users/buildslave/jenkins/workspace/lldb-cmake-sanitized/lldb-build/lldb-test-build.noindex/module-cache-lldb/lldb-api" output:

Hide Details

runCmd: settings set use-color false output:

Hide Details

runCmd: setting set target.prefer-dynamic-value no-dynamic-values output:

Hide Details

runCmd: settings set target.env-vars ASAN_OPTIONS=detect_stack_use_after_return=1 DYLD_INSERT_LIBRARIES=/Users/buildslave/jenkins/workspace/lldb-cmake-sanitized/host-compiler/lib/clang/11.0.0/lib/darwin/libclang_rt.asan_osx_dynamic.dylib output:

Hide Details

runCmd: settings set target.env-vars ASAN_OPTIONS=detect_stack_use_after_return=1 DYLD_INSERT_LIBRARIES=/Users/buildslave/jenkins/workspace/lldb-cmake-sanitized/host-compiler/lib/clang/11.0.0/lib/darwin/libclang_rt.asan_osx_dynamic.dylib output:

Hide Details

runCmd: thread list output: Process 2736 stopped * thread #1: tid = 0x5bb563, 0x000000010000489b a.out`main(argc=1, argv=0x00007ffeefbff660) at main.m:770:4, queue = 'com.apple.main-thread', stop reason = breakpoint 1.1 thread #2: tid = 0x5bb583, 0x00007fff7d8915be libsystem_kernel.dylib`__workq_kernreturn + 10 thread #3: tid = 0x5bb584, 0x00007fff7d8915be libsystem_kernel.dylib`__workq_kernreturn + 10

Hide Details

Hide Details

Expecting sub string: stopped Matched

Hide Details

Expecting sub string: stop reason = breakpoint Matched

Hide Details

Adding tearDown hook: def cleanup(): self.runCmd('type format clear', check=False) self.runCmd('type summary clear', check=False) self.runCmd('type synth clear', check=False)

Hide Details

Hide Details

runCmd: frame variable newArray nsDictionary newDictionary nscfDictionary cfDictionaryRef newMutableDictionary cfarray_ref mutable_array_ref output: (NSArray *) newArray = 0x0000604000001dd0 @"50 elements" (NSDictionary *) nsDictionary = 0x00006060000095c0 2 key/value pairs (NSDictionary *) newDictionary = 0x0000619000001980 12 key/value pairs (NSDictionary *) nscfDictionary = 0x0000606000009620 4 key/value pairs (CFDictionaryRef) cfDictionaryRef = 0x00006060000095c0 2 key/value pairs (NSDictionary *) newMutableDictionary = 0x0000603000003610 21 key/value pairs (CFArrayRef) cfarray_ref = 0x0000607000004000 @"3 elements" (CFMutableArrayRef) mutable_array_ref = 0x0000604000002150 @"11 elements"

Hide Details

Hide Details

Expecting sub string: (NSArray *) newArray = Matched

Hide Details

Expecting sub string: @"50 elements" Matched

Hide Details

Expecting sub string: (NSDictionary *) nsDictionary = Matched

Hide Details

Expecting sub string: 2 key/value pairs Matched

Hide Details

Expecting sub string: (NSDictionary *) newDictionary = Matched

Hide Details

Expecting sub string: 12 key/value pairs Matched

Hide Details

Expecting sub string: (NSDictionary *) nscfDictionary = Matched

Hide Details

Expecting sub string: 4 key/value pairs Matched

Hide Details

Expecting sub string: (CFDictionaryRef) cfDictionaryRef = Matched

Hide Details

Expecting sub string: 2 key/value pairs Matched

Hide Details

Expecting sub string: (NSDictionary *) newMutableDictionary = Matched

Hide Details

Expecting sub string: 21 key/value pairs Matched

Hide Details

Expecting sub string: (CFArrayRef) cfarray_ref = Matched

Hide Details

Expecting sub string: @"3 elements" Matched

Hide Details

Expecting sub string: (CFMutableArrayRef) mutable_array_ref = Matched

Hide Details

Expecting sub string: @"11 elements" Matched

Hide Details

runCmd: frame variable -d run-target *nscfDictionary output: (__NSCFDictionary) *nscfDictionary = { [0] = { key = 0x0000000100006610 @"bar" value = 0x0000000100006610 @"bar" } [1] = { key = 0x0000000100006650 @"quux" value = 0x0000000100006650 @"quux" } [2] = { key = 0x0000000100006350 @"foo" value = 0x0000000100006350 @"foo" } [3] = { key = 0x0000000100006630 @"baz" value = 0x0000000100006630 @"baz" } }

Hide Details

Hide Details

Expecting pattern: \(__NSCFDictionary\) \*nscfDictionary = Matched

Hide Details

Expecting pattern: key = 0x.* @"foo" Matched

Hide Details

Expecting pattern: value = 0x.* @"foo" Matched

Hide Details

Expecting pattern: key = 0x.* @"bar" Matched

Hide Details

Expecting pattern: value = 0x.* @"bar" Matched

Hide Details

Expecting pattern: key = 0x.* @"baz" Matched

Hide Details

Expecting pattern: value = 0x.* @"baz" Matched

Hide Details

Expecting pattern: key = 0x.* @"quux" Matched

Hide Details

Expecting pattern: value = 0x.* @"quux" Matched

Hide Details

runCmd: frame variable -d run-target *cfDictionaryRef output: (const __CFDictionary) *cfDictionaryRef = { [0] = { key = 0x0000000100006350 @"foo" value = 0x0000000100006350 @"foo" } [1] = { key = 0x0000000100006610 @"bar" value = 0x0000000100006610 @"bar" } }

Hide Details

Hide Details

Expecting pattern: \(const __CFDictionary\) \*cfDictionaryRef = Matched

Hide Details

Expecting pattern: key = 0x.* @"foo" Matched

Hide Details

Expecting pattern: value = 0x.* @"foo" Matched

Hide Details

Expecting pattern: key = 0x.* @"bar" Matched

Hide Details

Expecting pattern: value = 0x.* @"bar" Matched

Hide Details

runCmd: frame var nscfSet cfSetRef output: (NSSet *) nscfSet = 0x00006040000020d0 2 elements (CFSetRef) cfSetRef = 0x00006040000020d0 2 elements

Hide Details

Hide Details

Expecting sub string: (NSSet *) nscfSet = Matched

Hide Details

Expecting sub string: 2 elements Matched

Hide Details

Expecting sub string: (CFSetRef) cfSetRef = Matched

Hide Details

Expecting sub string: 2 elements Matched

Hide Details

runCmd: frame variable -d run-target *nscfSet output: (__NSCFSet) *nscfSet = { [0] = 0x0000000100006350 @"foo" [1] = 0x0000000100006610 @"bar" }

Hide Details

Hide Details

Expecting pattern: \(__NSCFSet\) \*nscfSet = Matched

Hide Details

Expecting pattern: \[0\] = 0x.* @".*" Matched

Hide Details

Expecting pattern: \[1\] = 0x.* @".*" Matched

Hide Details

runCmd: frame variable -d run-target *cfSetRef output: (const __CFSet) *cfSetRef = { [0] = 0x0000000100006350 @"foo" [1] = 0x0000000100006610 @"bar" }

Hide Details

Hide Details

Expecting pattern: \(const __CFSet\) \*cfSetRef = Matched

Hide Details

Expecting pattern: \[0\] = 0x.* @".*" Matched

Hide Details

Expecting pattern: \[1\] = 0x.* @".*" Matched

Hide Details

runCmd: frame variable iset1 iset2 imset output: (NSIndexSet *) iset1 = 0x00006030000097f0 4 indexes (NSIndexSet *) iset2 = 0x0000603000009820 512 indexes (NSMutableIndexSet *) imset = 0x0000604000008f10 10 indexes

Hide Details

Hide Details

Expecting sub string: 4 indexes Matched

Hide Details

Expecting sub string: 512 indexes Matched

Hide Details

Expecting sub string: 10 indexes Matched

Hide Details

runCmd: frame variable binheap_ref output: (CFBinaryHeapRef) binheap_ref = 0x000060c000003640 @"21 items"

Hide Details

Hide Details

Expecting sub string: (CFBinaryHeapRef) binheap_ref = Matched

Hide Details

Expecting sub string: @"21 items" Matched

Hide Details

runCmd: expression -d run -- (NSArray*)[NSArray new] output: (__NSArray0 *) $0 = 0x0000602000001f30 @"0 elements"

Hide Details

Hide Details

Expecting sub string: @"0 elements" Matched

Hide Details

<bound method SBProcess.Kill of <lldb.SBProcess; proxy of <Swig Object of type 'lldb::SBProcess *' at 0x1286bb840> >>: success

Hide Details

Executing tearDown hook: def cleanup(): self.runCmd('type format clear', check=False) self.runCmd('type summary clear', check=False) self.runCmd('type synth clear', check=False)

Hide Details

Hide Details

runCmd: type format clear check of return status not required output:

Hide Details

runCmd: type summary clear check of return status not required output:

Hide Details

runCmd: type synth clear check of return status not required output:

Hide Details

PASS: LLDB (/Users/buildslave/jenkins/workspace/lldb-cmake-sanitized/lldb-build/bin/clang-11-x86_64) :: test_nscontainers_with_run_command_dsym (TestDataFormatterObjCNSContainer.ObjCDataFormatterNSContainer) runCmd: settings clear -all output:

Hide Details

runCmd: settings set symbols.enable-external-lookup false output:

Hide Details

runCmd: settings set target.auto-apply-fixits false output:

Hide Details

runCmd: settings set plugin.process.gdb-remote.packet-timeout 60 output:

Hide Details

runCmd: settings set symbols.clang-modules-cache-path "/Users/buildslave/jenkins/workspace/lldb-cmake-sanitized/lldb-build/lldb-test-build.noindex/module-cache-lldb/lldb-api" output:

Hide Details

runCmd: settings set use-color false output:

Hide Details

runCmd: setting set target.prefer-dynamic-value no-dynamic-values output:

Hide Details

runCmd: settings set target.env-vars ASAN_OPTIONS=detect_stack_use_after_return=1 DYLD_INSERT_LIBRARIES=/Users/buildslave/jenkins/workspace/lldb-cmake-sanitized/host-compiler/lib/clang/11.0.0/lib/darwin/libclang_rt.asan_osx_dynamic.dylib output: Assertion failed: (tokenKind == tok::kw___bridge_retain), function ParseParenExpression, file /Users/buildslave/jenkins/workspace/lldb-cmake-sanitized/llvm-project/clang/lib/Parse/ParseExpr.cpp, line 2819.

Hide Details

--

Hide Details

******************** PASS: lldb-unit :: Language/Highlighting/./HighlighterTests/HighlighterTest.ClangSquareBrackets (1871 of 2030) PASS: lldb-api :: functionalities/breakpoint/inlined_breakpoints/TestInlinedBreakpoints.py (1872 of 2030) PASS: lldb-unit :: Host/./HostTests/NativeProcessProtocolTest.SetBreakpointFailVerify (1873 of 2030) PASS: lldb-unit :: Symbol/./SymbolTests/TestTypeSystemClang.TestDisplayName (1874 of 2030) PASS: lldb-unit :: Utility/./UtilityTests/StreamTest.ShiftOperatorStrings (1875 of 2030) PASS: lldb-unit :: Utility/./UtilityTests/FileSpecTest.GuessPathStyle (1876 of 2030) PASS: lldb-unit :: Utility/./UtilityTests/ReproducerTest.SetReplay (1877 of 2030) PASS: lldb-unit :: Utility/./UtilityTests/StringListTest.CopyListSingle (1878 of 2030) PASS: lldb-api :: tools/lldb-server/TestGdbRemoteProcessInfo.py (1879 of 2030) PASS: lldb-unit :: Utility/./UtilityTests/StructuredDataTest.ParseJSONFromFile (1880 of 2030) PASS: lldb-shell :: Breakpoint/single-file-split-dwarf.test (1881 of 2030) UNSUPPORTED: lldb-api :: commands/register/register/intel_xtended_registers/mpx_bound_violation/TestBoundViolation.py (1882 of 2030) PASS: lldb-unit :: Utility/./UtilityTests/PassiveReplayTest.InstrumentedBarRef (1883 of 2030) PASS: lldb-shell :: Commands/command-target-modules-dump-sections.yaml (1884 of 2030) PASS: lldb-api :: python_api/section/TestSectionAPI.py (1885 of 2030) PASS: lldb-unit :: Utility/./UtilityTests/StringListTest.InsertStringAtIndexStdString (1886 of 2030) PASS: lldb-shell :: SymbolFile/DWARF/inline-function-address-shared.test (1887 of 2030) FAIL: lldb-api :: lang/objc/objc-class-method/TestObjCClassMethod.py (1888 of 2030) ******************** TEST 'lldb-api :: lang/objc/objc-class-method/TestObjCClassMethod.py' FAILED ******************** Script: -- /Users/buildslave/jenkins/workspace/lldb-cmake-sanitized/lldb-build/lldb-test-build.noindex/copied-system-python /Users/buildslave/jenkins/workspace/lldb-cmake-sanitized/llvm-project/lldb/test/API/dotest.py --arch x86_64 -s /Users/buildslave/jenkins/workspace/lldb-cmake-sanitized/lldb-build/lldb-test-traces -S nm -u CXXFLAGS -u CFLAGS --codesign-identity lldb_codesign --server /Users/buildslave/jenkins/workspace/lldb-cmake-sanitized/lldb-build/./bin/debugserver --arch x86_64 --build-dir /Users/buildslave/jenkins/workspace/lldb-cmake-sanitized/lldb-build/lldb-test-build.noindex -s=/Users/buildslave/jenkins/workspace/lldb-cmake-sanitized/test/logs -t --env TERM=vt100 --env LLVM_LIBS_DIR=/Users/buildslave/jenkins/workspace/lldb-cmake-sanitized/lldb-build/./lib --inferior-env ASAN_OPTIONS=detect_stack_use_after_return=1 --inferior-env DYLD_INSERT_LIBRARIES=/Users/buildslave/jenkins/workspace/lldb-cmake-sanitized/host-compiler/lib/clang/11.0.0/lib/darwin/libclang_rt.asan_osx_dynamic.dylib --build-dir /Users/buildslave/jenkins/workspace/lldb-cmake-sanitized/lldb-build/lldb-test-build.noindex --lldb-module-cache-dir /Users/buildslave/jenkins/workspace/lldb-cmake-sanitized/lldb-build/lldb-test-build.noindex/module-cache-lldb/lldb-api --clang-module-cache-dir /Users/buildslave/jenkins/workspace/lldb-cmake-sanitized/lldb-build/lldb-test-build.noindex/module-cache-clang/lldb-api --executable /Users/buildslave/jenkins/workspace/lldb-cmake-sanitized/lldb-build/./bin/lldb --compiler /Users/buildslave/jenkins/workspace/lldb-cmake-sanitized/lldb-build/./bin/clang --dsymutil /Users/buildslave/jenkins/workspace/lldb-cmake-sanitized/lldb-build/./bin/dsymutil --filecheck /Users/buildslave/jenkins/workspace/lldb-cmake-sanitized/lldb-build/./bin/FileCheck --lldb-libs-dir /Users/buildslave/jenkins/workspace/lldb-cmake-sanitized/lldb-build/./lib /Users/buildslave/jenkins/workspace/lldb-cmake-sanitized/llvm-project/lldb/test/API/lang/objc/objc-class-method -p TestObjCClassMethod.py -- Exit Code: -6

Hide Details

Command Output (stdout): -- lldb version 11.0.99 clang revision c2e27ac1ce3e3141f9cf0c4f6982cd56347bc323 llvm revision c2e27ac1ce3e3141f9cf0c4f6982cd56347bc323

Hide Details

-- Command Output (stderr): -- Assertion failed: (tokenKind == tok::kw___bridge_retain), function ParseParenExpression, file /Users/buildslave/jenkins/workspace/lldb-cmake-sanitized/llvm-project/clang/lib/Parse/ParseExpr.cpp, line 2819.

Hide Details

--

Hide Details

******************** FAIL: lldb-api :: lang/objc/unicode-string/TestUnicodeString.py (1889 of 2030) ******************** TEST 'lldb-api :: lang/objc/unicode-string/TestUnicodeString.py' FAILED ******************** Script: -- /Users/buildslave/jenkins/workspace/lldb-cmake-sanitized/lldb-build/lldb-test-build.noindex/copied-system-python /Users/buildslave/jenkins/workspace/lldb-cmake-sanitized/llvm-project/lldb/test/API/dotest.py --arch x86_64 -s /Users/buildslave/jenkins/workspace/lldb-cmake-sanitized/lldb-build/lldb-test-traces -S nm -u CXXFLAGS -u CFLAGS --codesign-identity lldb_codesign --server /Users/buildslave/jenkins/workspace/lldb-cmake-sanitized/lldb-build/./bin/debugserver --arch x86_64 --build-dir /Users/buildslave/jenkins/workspace/lldb-cmake-sanitized/lldb-build/lldb-test-build.noindex -s=/Users/buildslave/jenkins/workspace/lldb-cmake-sanitized/test/logs -t --env TERM=vt100 --env LLVM_LIBS_DIR=/Users/buildslave/jenkins/workspace/lldb-cmake-sanitized/lldb-build/./lib --inferior-env ASAN_OPTIONS=detect_stack_use_after_return=1 --inferior-env DYLD_INSERT_LIBRARIES=/Users/buildslave/jenkins/workspace/lldb-cmake-sanitized/host-compiler/lib/clang/11.0.0/lib/darwin/libclang_rt.asan_osx_dynamic.dylib --build-dir /Users/buildslave/jenkins/workspace/lldb-cmake-sanitized/lldb-build/lldb-test-build.noindex --lldb-module-cache-dir /Users/buildslave/jenkins/workspace/lldb-cmake-sanitized/lldb-build/lldb-test-build.noindex/module-cache-lldb/lldb-api --clang-module-cache-dir /Users/buildslave/jenkins/workspace/lldb-cmake-sanitized/lldb-build/lldb-test-build.noindex/module-cache-clang/lldb-api --executable /Users/buildslave/jenkins/workspace/lldb-cmake-sanitized/lldb-build/./bin/lldb --compiler /Users/buildslave/jenkins/workspace/lldb-cmake-sanitized/lldb-build/./bin/clang --dsymutil /Users/buildslave/jenkins/workspace/lldb-cmake-sanitized/lldb-build/./bin/dsymutil --filecheck /Users/buildslave/jenkins/workspace/lldb-cmake-sanitized/lldb-build/./bin/FileCheck --lldb-libs-dir /Users/buildslave/jenkins/workspace/lldb-cmake-sanitized/lldb-build/./lib /Users/buildslave/jenkins/workspace/lldb-cmake-sanitized/llvm-project/lldb/test/API/lang/objc/unicode-string -p TestUnicodeString.py -- Exit Code: -6

Hide Details

Command Output (stdout): -- lldb version 11.0.99 clang revision c2e27ac1ce3e3141f9cf0c4f6982cd56347bc323 llvm revision c2e27ac1ce3e3141f9cf0c4f6982cd56347bc323

Hide Details

-- Command Output (stderr): -- Assertion failed: (tokenKind == tok::kw___bridge_retain), function ParseParenExpression, file /Users/buildslave/jenkins/workspace/lldb-cmake-sanitized/llvm-project/clang/lib/Parse/ParseExpr.cpp, line 2819.

Hide Details

--

Hide Details

******************** UNSUPPORTED: lldb-api :: benchmarks/turnaround/TestCompileRunToBreakpointTurnaround.py (1890 of 2030) PASS: lldb-unit :: Utility/./UtilityTests/ArgsTest.TestMultipleArgs (1891 of 2030) PASS: lldb-api :: tools/lldb-server/commandline/TestStubSetSID.py (1892 of 2030) PASS: lldb-api :: lang/cpp/bitfields/TestCppBitfields.py (1893 of 2030) PASS: lldb-api :: functionalities/data-formatter/vector-types/TestVectorTypesFormatting.py (1894 of 2030) PASS: lldb-unit :: ObjectFile/Breakpad/./ObjectFileBreakpadTests/ModuleRecord.parse (1895 of 2030) PASS: lldb-api :: commands/expression/radar_9673664/TestExprHelpExamples.py (1896 of 2030) PASS: lldb-api :: tools/lldb-vscode/attach/TestVSCode_attach.py (1897 of 2030) FAIL: lldb-api :: lang/objcxx/objcxx-ivar-vector/TestIvarVector.py (1898 of 2030) ******************** TEST 'lldb-api :: lang/objcxx/objcxx-ivar-vector/TestIvarVector.py' FAILED ******************** Script: -- /Users/buildslave/jenkins/workspace/lldb-cmake-sanitized/lldb-build/lldb-test-build.noindex/copied-system-python /Users/buildslave/jenkins/workspace/lldb-cmake-sanitized/llvm-project/lldb/test/API/dotest.py --arch x86_64 -s /Users/buildslave/jenkins/workspace/lldb-cmake-sanitized/lldb-build/lldb-test-traces -S nm -u CXXFLAGS -u CFLAGS --codesign-identity lldb_codesign --server /Users/buildslave/jenkins/workspace/lldb-cmake-sanitized/lldb-build/./bin/debugserver --arch x86_64 --build-dir /Users/buildslave/jenkins/workspace/lldb-cmake-sanitized/lldb-build/lldb-test-build.noindex -s=/Users/buildslave/jenkins/workspace/lldb-cmake-sanitized/test/logs -t --env TERM=vt100 --env LLVM_LIBS_DIR=/Users/buildslave/jenkins/workspace/lldb-cmake-sanitized/lldb-build/./lib --inferior-env ASAN_OPTIONS=detect_stack_use_after_return=1 --inferior-env DYLD_INSERT_LIBRARIES=/Users/buildslave/jenkins/workspace/lldb-cmake-sanitized/host-compiler/lib/clang/11.0.0/lib/darwin/libclang_rt.asan_osx_dynamic.dylib --build-dir /Users/buildslave/jenkins/workspace/lldb-cmake-sanitized/lldb-build/lldb-test-build.noindex --lldb-module-cache-dir /Users/buildslave/jenkins/workspace/lldb-cmake-sanitized/lldb-build/lldb-test-build.noindex/module-cache-lldb/lldb-api --clang-module-cache-dir /Users/buildslave/jenkins/workspace/lldb-cmake-sanitized/lldb-build/lldb-test-build.noindex/module-cache-clang/lldb-api --executable /Users/buildslave/jenkins/workspace/lldb-cmake-sanitized/lldb-build/./bin/lldb --compiler /Users/buildslave/jenkins/workspace/lldb-cmake-sanitized/lldb-build/./bin/clang --dsymutil /Users/buildslave/jenkins/workspace/lldb-cmake-sanitized/lldb-build/./bin/dsymutil --filecheck /Users/buildslave/jenkins/workspace/lldb-cmake-sanitized/lldb-build/./bin/FileCheck --lldb-libs-dir /Users/buildslave/jenkins/workspace/lldb-cmake-sanitized/lldb-build/./lib /Users/buildslave/jenkins/workspace/lldb-cmake-sanitized/llvm-project/lldb/test/API/lang/objcxx/objcxx-ivar-vector -p TestIvarVector.py -- Exit Code: -6

Hide Details

Command Output (stdout): -- lldb version 11.0.99 clang revision c2e27ac1ce3e3141f9cf0c4f6982cd56347bc323 llvm revision c2e27ac1ce3e3141f9cf0c4f6982cd56347bc323

Hide Details

-- Command Output (stderr): -- Assertion failed: (tokenKind == tok::kw___bridge_retain), function ParseParenExpression, file /Users/buildslave/jenkins/workspace/lldb-cmake-sanitized/llvm-project/clang/lib/Parse/ParseExpr.cpp, line 2819.

Hide Details

--

Hide Details

******************** PASS: lldb-unit :: ScriptInterpreter/Python/./ScriptInterpreterPythonTests/PythonDataObjectsTest.TestInstanceNameResolutionNoDot (1899 of 2030) PASS: lldb-shell :: SymbolFile/DWARF/debug-types-address-ranges.s (1900 of 2030) UNSUPPORTED: lldb-shell :: SymbolFile/PDB/function-nested-block.test (1901 of 2030) UNSUPPORTED: lldb-api :: functionalities/tsan/thread_numbers/TestTsanThreadNumbers.py (1902 of 2030) FAIL: lldb-api :: functionalities/data-formatter/poarray/TestPrintObjectArray.py (1903 of 2030) ******************** TEST 'lldb-api :: functionalities/data-formatter/poarray/TestPrintObjectArray.py' FAILED ******************** Script: -- /Users/buildslave/jenkins/workspace/lldb-cmake-sanitized/lldb-build/lldb-test-build.noindex/copied-system-python /Users/buildslave/jenkins/workspace/lldb-cmake-sanitized/llvm-project/lldb/test/API/dotest.py --arch x86_64 -s /Users/buildslave/jenkins/workspace/lldb-cmake-sanitized/lldb-build/lldb-test-traces -S nm -u CXXFLAGS -u CFLAGS --codesign-identity lldb_codesign --server /Users/buildslave/jenkins/workspace/lldb-cmake-sanitized/lldb-build/./bin/debugserver --arch x86_64 --build-dir /Users/buildslave/jenkins/workspace/lldb-cmake-sanitized/lldb-build/lldb-test-build.noindex -s=/Users/buildslave/jenkins/workspace/lldb-cmake-sanitized/test/logs -t --env TERM=vt100 --env LLVM_LIBS_DIR=/Users/buildslave/jenkins/workspace/lldb-cmake-sanitized/lldb-build/./lib --inferior-env ASAN_OPTIONS=detect_stack_use_after_return=1 --inferior-env DYLD_INSERT_LIBRARIES=/Users/buildslave/jenkins/workspace/lldb-cmake-sanitized/host-compiler/lib/clang/11.0.0/lib/darwin/libclang_rt.asan_osx_dynamic.dylib --build-dir /Users/buildslave/jenkins/workspace/lldb-cmake-sanitized/lldb-build/lldb-test-build.noindex --lldb-module-cache-dir /Users/buildslave/jenkins/workspace/lldb-cmake-sanitized/lldb-build/lldb-test-build.noindex/module-cache-lldb/lldb-api --clang-module-cache-dir /Users/buildslave/jenkins/workspace/lldb-cmake-sanitized/lldb-build/lldb-test-build.noindex/module-cache-clang/lldb-api --executable /Users/buildslave/jenkins/workspace/lldb-cmake-sanitized/lldb-build/./bin/lldb --compiler /Users/buildslave/jenkins/workspace/lldb-cmake-sanitized/lldb-build/./bin/clang --dsymutil /Users/buildslave/jenkins/workspace/lldb-cmake-sanitized/lldb-build/./bin/dsymutil --filecheck /Users/buildslave/jenkins/workspace/lldb-cmake-sanitized/lldb-build/./bin/FileCheck --lldb-libs-dir /Users/buildslave/jenkins/workspace/lldb-cmake-sanitized/lldb-build/./lib /Users/buildslave/jenkins/workspace/lldb-cmake-sanitized/llvm-project/lldb/test/API/functionalities/data-formatter/poarray -p TestPrintObjectArray.py -- Exit Code: -6

Hide Details

Command Output (stdout): -- lldb version 11.0.99 clang revision c2e27ac1ce3e3141f9cf0c4f6982cd56347bc323 llvm revision c2e27ac1ce3e3141f9cf0c4f6982cd56347bc323

Hide Details

-- Command Output (stderr): --

Hide Details

Session logs for test failures/errors/unexpected successes will go into directory '/Users/buildslave/jenkins/workspace/lldb-cmake-sanitized/test/logs' Change dir to: /Users/buildslave/jenkins/workspace/lldb-cmake-sanitized/llvm-project/lldb/test/API/functionalities/data-formatter/poarray runCmd: settings clear -all output:

Hide Details

runCmd: settings set symbols.enable-external-lookup false output:

Hide Details

runCmd: settings set target.auto-apply-fixits false output:

Hide Details

runCmd: settings set plugin.process.gdb-remote.packet-timeout 60 output:

Hide Details

runCmd: settings set symbols.clang-modules-cache-path "/Users/buildslave/jenkins/workspace/lldb-cmake-sanitized/lldb-build/lldb-test-build.noindex/module-cache-lldb/lldb-api" output:

Hide Details

runCmd: settings set use-color false output:

Hide Details

runCmd: setting set target.prefer-dynamic-value no-dynamic-values output:

Hide Details

runCmd: settings set target.env-vars ASAN_OPTIONS=detect_stack_use_after_return=1 DYLD_INSERT_LIBRARIES=/Users/buildslave/jenkins/workspace/lldb-cmake-sanitized/host-compiler/lib/clang/11.0.0/lib/darwin/libclang_rt.asan_osx_dynamic.dylib output:

Hide Details

runCmd: file /Users/buildslave/jenkins/workspace/lldb-cmake-sanitized/lldb-build/lldb-test-build.noindex/functionalities/data-formatter/poarray/TestPrintObjectArray.test_print_array_dsym/a.out output: Current executable set to '/Users/buildslave/jenkins/workspace/lldb-cmake-sanitized/lldb-build/lldb-test-build.noindex/functionalities/data-formatter/poarray/TestPrintObjectArray.test_print_array_dsym/a.out' (x86_64).

Hide Details

Hide Details

runCmd: breakpoint set -f "main.mm" -l 20 output: Breakpoint 1: where = a.out`main + 459 at main.mm:20:3, address = 0x0000000100000efb

Hide Details

Hide Details

Expecting pattern: ^Breakpoint (?P<bpno>[0-9]+): (?P<num_locations>[0-9]+) locations\.$ Not matched

Hide Details

Expecting pattern: ^Breakpoint (?P<bpno>[0-9]+): (?P<num_locations>no) locations \(pending\)\. Not matched

Hide Details

Expecting pattern: ^Breakpoint (?P<bpno>[0-9]+): where = (?P<module>.*)`(?P<symbol>[+\-]{0,1}[^+]+)( \+ (?P<offset>[0-9]+)){0,1}( \[inlined\] (?P<inline_symbol>.*)){0,1} at (?P<file>[^:]+):(?P<line_no>[0-9]+)(?P<column>(:[0-9]+)?), address = (?P<address>0x[0-9a-fA-F]+)$ Matched

Hide Details

runCmd: run output: Process 5935 stopped * thread #1, queue = 'com.apple.main-thread', stop reason = breakpoint 1.1 frame #0: 0x0000000100000efb a.out`main at main.mm:20:3 17 tobjects->two = array2; 18 tobjects->three = dictionary; 19 id* objects = (id*)tobjects; -> 20 return 0; // break here ^ 21 }

Hide Details

Process 5935 launched: '/Users/buildslave/jenkins/workspace/lldb-cmake-sanitized/lldb-build/lldb-test-build.noindex/functionalities/data-formatter/poarray/TestPrintObjectArray.test_print_array_dsym/a.out' (x86_64)

Hide Details

Hide Details

runCmd: thread list output: Process 5935 stopped * thread #1: tid = 0x5bcc8c, 0x0000000100000efb a.out`main at main.mm:20:3, queue = 'com.apple.main-thread', stop reason = breakpoint 1.1

Hide Details

Hide Details

Expecting sub string: stopped Matched

Hide Details

Expecting sub string: stop reason = breakpoint Matched

Hide Details

Adding tearDown hook: def cleanup(): self.runCmd('type format clear', check=False) self.runCmd('type summary clear', check=False) self.runCmd('type synth clear', check=False)

Hide Details

Hide Details

runCmd: expr --element-count 3 --object-description -- objects output: { <__NSArrayI 0x604000001710>( 3735928559, 4276993775, 3203398366 )

Hide Details

<__NSArrayI 0x603000002ef0>( Hello, World )

Hide Details

{ Two = ( Hello, World ); 1 = ( Hello, World ); }

Hide Details

}

Hide Details

Hide Details

Expecting sub string: 3735928559 Matched

Hide Details

Expecting sub string: 4276993775 Matched

Hide Details

Expecting sub string: 3203398366 Matched

Hide Details

Expecting sub string: Hello Matched

Hide Details

Expecting sub string: World Matched

Hide Details

Expecting sub string: Two = Matched

Hide Details

Expecting sub string: 1 = Matched

Hide Details

runCmd: poarray 3 objects output: { <__NSArrayI 0x604000001710>( 3735928559, 4276993775, 3203398366 )

Hide Details

<__NSArrayI 0x603000002ef0>( Hello, World )

Hide Details

{ Two = ( Hello, World ); 1 = ( Hello, World ); }

Hide Details

}

Hide Details

Hide Details

Expecting sub string: 3735928559 Matched

Hide Details

Expecting sub string: 4276993775 Matched

Hide Details

Expecting sub string: 3203398366 Matched

Hide Details

Expecting sub string: Hello Matched

Hide Details

Expecting sub string: World Matched

Hide Details

Expecting sub string: Two = Matched

Hide Details

Expecting sub string: 1 = Matched

Hide Details

runCmd: expr --element-count 3 --object-description --description-verbosity=full -- objects output: (id *) $2 = 0x0000603000002f80 { (id) [0] = 0x0000604000001710 <__NSArrayI 0x604000001710>( 3735928559, 4276993775, 3203398366 )

Hide Details

(id) [1] = 0x0000603000002ef0 <__NSArrayI 0x603000002ef0>( Hello, World )

Hide Details

(id) [2] = 0x0000606000008a20 { Two = ( Hello, World ); 1 = ( Hello, World ); }

Hide Details

}

Hide Details

Hide Details

Expecting sub string: [0] = Matched

Hide Details

Expecting sub string: 3735928559 Matched

Hide Details

Expecting sub string: 4276993775 Matched

Hide Details

Expecting sub string: 3203398366 Matched

Hide Details

Expecting sub string: [1] = Matched

Hide Details

Expecting sub string: Hello Matched

Hide Details

Expecting sub string: World Matched

Hide Details

Expecting sub string: [2] = Matched

Hide Details

Expecting sub string: Two = Matched

Hide Details

Expecting sub string: 1 = Matched

Hide Details

runCmd: parray 3 objects output: (id *) $3 = 0x0000603000002f80 { (id) [0] = 0x0000604000001710 (id) [1] = 0x0000603000002ef0 (id) [2] = 0x0000606000008a20 }

Hide Details

Hide Details

Expecting sub string: [0] = 0x Matched

Hide Details

Expecting sub string: [1] = 0x Matched

Hide Details

Expecting sub string: [2] = 0x Matched

Hide Details

runCmd: expr --element-count 3 -d run -- objects output: (id *) $4 = 0x0000603000002f80 { (__NSArrayI *) [0] = 0x0000604000001710 3 elements (__NSArrayI *) [1] = 0x0000603000002ef0 2 elements (__NSDictionaryI *) [2] = 0x0000606000008a20 2 key/value pairs }

Hide Details

Hide Details

Expecting sub string: 3 elements Matched

Hide Details

Expecting sub string: 2 elements Matched

Hide Details

Expecting sub string: 2 key/value pairs Matched

Hide Details

runCmd: expr --element-count 3 -d run --ptr-depth=1 -- objects output: (id *) $5 = 0x0000603000002f80 { (__NSArrayI *) [0] = 0x0000604000001710 3 elements { [0] = 0xb84931baeb35c0ab 3735928559 [1] = 0xb849319aab35c0ab 4276993775 [2] = 0xb84931daa971f1ab 3203398366 } (__NSArrayI *) [1] = 0x0000603000002ef0 2 elements { [0] = 0x0000000100001038 "Hello" [1] = 0x0000000100001058 "World" } (__NSDictionaryI *) [2] = 0x0000606000008a20 2 key/value pairs { [0] = { key = 0x0000000100001078 "Two" value = 0x0000603000002ef0 2 elements } [1] = { key = 0xb8493164468b2ebb 1 value = 0x0000603000002ef0 2 elements } } }

Hide Details

Hide Details

Expecting sub string: 3 elements Matched

Hide Details

Expecting sub string: 3735928559 Matched

Hide Details

Expecting sub string: 4276993775 Matched

Hide Details

Expecting sub string: 3203398366 Matched

Hide Details

Expecting sub string: 2 elements Matched

Hide Details

Expecting sub string: "Hello" Matched

Hide Details

Expecting sub string: "World" Matched

Hide Details

Expecting sub string: 2 key/value pairs Matched

Hide Details

<bound method SBProcess.Kill of <lldb.SBProcess; proxy of <Swig Object of type 'lldb::SBProcess *' at 0x109c288d0> >>: success

Hide Details

Executing tearDown hook: def cleanup(): self.runCmd('type format clear', check=False) self.runCmd('type summary clear', check=False) self.runCmd('type synth clear', check=False)

Hide Details

Hide Details

runCmd: type format clear check of return status not required output:

Hide Details

runCmd: type summary clear check of return status not required output:

Hide Details

runCmd: type synth clear check of return status not required output:

Hide Details

PASS: LLDB (/Users/buildslave/jenkins/workspace/lldb-cmake-sanitized/lldb-build/bin/clang-11-x86_64) :: test_print_array_dsym (TestPrintObjectArray.PrintObjectArrayTestCase) runCmd: settings clear -all output:

Hide Details

runCmd: settings set symbols.enable-external-lookup false output:

Hide Details

runCmd: settings set target.auto-apply-fixits false output:

Hide Details

runCmd: settings set plugin.process.gdb-remote.packet-timeout 60 output:

Hide Details

runCmd: settings set symbols.clang-modules-cache-path "/Users/buildslave/jenkins/workspace/lldb-cmake-sanitized/lldb-build/lldb-test-build.noindex/module-cache-lldb/lldb-api" output:

Hide Details

runCmd: settings set use-color false output:

Hide Details

runCmd: setting set target.prefer-dynamic-value no-dynamic-values output:

Hide Details

runCmd: settings set target.env-vars ASAN_OPTIONS=detect_stack_use_after_return=1 DYLD_INSERT_LIBRARIES=/Users/buildslave/jenkins/workspace/lldb-cmake-sanitized/host-compiler/lib/clang/11.0.0/lib/darwin/libclang_rt.asan_osx_dynamic.dylib output: Assertion failed: (tokenKind == tok::kw___bridge_retain), function ParseParenExpression, file /Users/buildslave/jenkins/workspace/lldb-cmake-sanitized/llvm-project/clang/lib/Parse/ParseExpr.cpp, line 2819.

Hide Details

--

Hide Details

******************** PASS: lldb-unit :: Utility/./UtilityTests/StreamTest.PutHex16ByteOrderLittle (1904 of 2030) PASS: lldb-unit :: Utility/./UtilityTests/StreamTest.ChangingByteOrder (1905 of 2030) PASS: lldb-unit :: Utility/./UtilityTests/StateTest.Formatv (1906 of 2030) PASS: lldb-api :: types/TestShortType.py (1907 of 2030) UNSUPPORTED: lldb-shell :: Register/x86-gp-write.test (1908 of 2030) PASS: lldb-api :: python_api/lldbutil/iter/TestLLDBIterator.py (1909 of 2030) PASS: lldb-api :: lang/c/shared_lib/TestSharedLib.py (1910 of 2030) PASS: lldb-api :: python_api/value/linked_list/TestValueAPILinkedList.py (1911 of 2030) PASS: lldb-unit :: Process/gdb-remote/./ProcessGdbRemoteTests/GDBRemoteCommunicationServerTest.SendErrorResponse_ErrorNumber (1912 of 2030) UNSUPPORTED: lldb-api :: functionalities/thread/multi_break/TestMultipleBreakpoints.py (1913 of 2030) PASS: lldb-api :: commands/expression/persistent_types/TestPersistentTypes.py (1914 of 2030) PASS: lldb-api :: python_api/frame/get-variables/TestGetVariables.py (1915 of 2030) PASS: lldb-api :: python_api/thread/TestThreadAPI.py (1916 of 2030) PASS: lldb-unit :: SymbolFile/DWARF/./SymbolFileDWARFTests/DWARFASTParserClangTests.EnsureAllDIEsInDeclContextHaveBeenParsedParsesOnlyMatchingEntries (1917 of 2030) PASS: lldb-unit :: Utility/./UtilityTests/RangeDataVector.FindEntryThatContains_Overlap (1918 of 2030) PASS: lldb-shell :: Minidump/memory-region.yaml (1919 of 2030) PASS: lldb-unit :: Process/gdb-remote/./ProcessGdbRemoteTests/GDBRemoteCommunicationClientTest.SendGetTraceConfigPacket (1920 of 2030) PASS: lldb-api :: functionalities/testid/TestTestId.py (1921 of 2030) PASS: lldb-unit :: Utility/./UtilityTests/FileSpecTest.Equal (1922 of 2030) PASS: lldb-unit :: Expression/./ExpressionTests/DiagnosticManagerTest.GetStringMultiline (1923 of 2030) PASS: lldb-api :: lang/objc/modules-compile-error/TestModulesCompileError.py (1924 of 2030) PASS: lldb-unit :: Utility/./UtilityTests/FileSpecTest.EqualDotsPosix (1925 of 2030) PASS: lldb-unit :: Utility/./UtilityTests/LogChannelTest.Disable (1926 of 2030) PASS: lldb-api :: lang/cpp/stl/TestSTL.py (1927 of 2030) PASS: lldb-unit :: Core/./LLDBCoreTests/MangledTest.ResultForBlockInvocation (1928 of 2030) PASS: lldb-api :: functionalities/breakpoint/serialize/TestBreakpointSerialization.py (1929 of 2030) PASS: lldb-api :: tools/lldb-server/TestAppleSimulatorOSType.py (1930 of 2030) PASS: lldb-api :: functionalities/value_md5_crash/TestValueMD5Crash.py (1931 of 2030) PASS: lldb-shell :: ObjectFile/ELF/PT_TLS-overlap-PT_LOAD.yaml (1932 of 2030) PASS: lldb-api :: macosx/dyld-trie-symbols/TestDyldTrieSymbols.py (1933 of 2030) PASS: lldb-unit :: Utility/./UtilityTests/StringExtractorTest.GetHexU8_Exact (1934 of 2030) PASS: lldb-api :: functionalities/mtc/simple/TestMTCSimple.py (1935 of 2030) PASS: lldb-api :: lang/cpp/signed_types/TestSignedTypes.py (1936 of 2030) PASS: lldb-api :: macosx/add-dsym/TestAddDsymMidExecutionCommand.py (1937 of 2030) PASS: lldb-unit :: SymbolFile/NativePDB/./SymbolFileNativePDBTests/PDBFPOProgramToDWARFExpressionTests.InvalidAssignmentMultiple (1938 of 2030) PASS: lldb-unit :: DataFormatter/./LLDBFormatterTests/StringPrinterTests.SwiftUTF8 (1939 of 2030) PASS: lldb-unit :: Utility/./UtilityTests/StreamTest.PutHex32ByteOrderLittle (1940 of 2030) PASS: lldb-unit :: Process/gdb-remote/./ProcessGdbRemoteTests/GDBRemoteClientBaseTest.InterruptNoResponse (1941 of 2030) PASS: lldb-unit :: Utility/./UtilityTests/StringListTest.AppendListCStringArray (1942 of 2030) UNSUPPORTED: lldb-api :: functionalities/darwin_log/filter/exact_match/category/TestDarwinLogFilterMatchCategory.py (1943 of 2030) PASS: lldb-api :: commands/apropos/basic/TestApropos.py (1944 of 2030) PASS: lldb-api :: python_api/sbdata/TestSBData.py (1945 of 2030) PASS: lldb-unit :: Utility/./UtilityTests/ScalarTest.CastOperations (1946 of 2030) PASS: lldb-unit :: Language/Highlighting/./HighlighterTests/HighlighterTest.ClangTrailingBackslashBeforeNewline (1947 of 2030) PASS: lldb-shell :: SymbolFile/Breakpad/unwind-via-raSearch.test (1948 of 2030) UNSUPPORTED: lldb-shell :: SymbolFile/PDB/udt-layout.test (1949 of 2030) PASS: lldb-unit :: ScriptInterpreter/Python/./ScriptInterpreterPythonTests/PythonDataObjectsTest.TestPythonCallableCheck (1950 of 2030) PASS: lldb-api :: commands/expression/call-function/TestCallStdStringFunction.py (1951 of 2030) PASS: lldb-api :: lang/cpp/scope/TestCppScope.py (1952 of 2030) PASS: lldb-unit :: Utility/./UtilityTests/TimerTest.CategoryTimesStats (1953 of 2030) PASS: lldb-unit :: Utility/./UtilityTests/StringListTest.SetSize (1954 of 2030) PASS: lldb-shell :: SymbolFile/NativePDB/tag-types.cpp (1955 of 2030) UNSUPPORTED: lldb-shell :: Register/aarch64-fp-read.test (1956 of 2030) PASS: lldb-unit :: Utility/./UtilityTests/StringExtractorTest.GetHexU8_Underflow2 (1957 of 2030) PASS: lldb-api :: commands/target/create-no-such-arch/TestNoSuchArch.py (1958 of 2030) PASS: lldb-unit :: Target/./TargetTests/MCBasedABI.MapRegisterName (1959 of 2030) PASS: lldb-api :: lang/cpp/enum_types/TestCPP11EnumTypes.py (1960 of 2030) FAIL: lldb-api :: lang/objc/foundation/TestObjCMethods.py (1961 of 2030) ******************** TEST 'lldb-api :: lang/objc/foundation/TestObjCMethods.py' FAILED ******************** Script: -- /Users/buildslave/jenkins/workspace/lldb-cmake-sanitized/lldb-build/lldb-test-build.noindex/copied-system-python /Users/buildslave/jenkins/workspace/lldb-cmake-sanitized/llvm-project/lldb/test/API/dotest.py --arch x86_64 -s /Users/buildslave/jenkins/workspace/lldb-cmake-sanitized/lldb-build/lldb-test-traces -S nm -u CXXFLAGS -u CFLAGS --codesign-identity lldb_codesign --server /Users/buildslave/jenkins/workspace/lldb-cmake-sanitized/lldb-build/./bin/debugserver --arch x86_64 --build-dir /Users/buildslave/jenkins/workspace/lldb-cmake-sanitized/lldb-build/lldb-test-build.noindex -s=/Users/buildslave/jenkins/workspace/lldb-cmake-sanitized/test/logs -t --env TERM=vt100 --env LLVM_LIBS_DIR=/Users/buildslave/jenkins/workspace/lldb-cmake-sanitized/lldb-build/./lib --inferior-env ASAN_OPTIONS=detect_stack_use_after_return=1 --inferior-env DYLD_INSERT_LIBRARIES=/Users/buildslave/jenkins/workspace/lldb-cmake-sanitized/host-compiler/lib/clang/11.0.0/lib/darwin/libclang_rt.asan_osx_dynamic.dylib --build-dir /Users/buildslave/jenkins/workspace/lldb-cmake-sanitized/lldb-build/lldb-test-build.noindex --lldb-module-cache-dir /Users/buildslave/jenkins/workspace/lldb-cmake-sanitized/lldb-build/lldb-test-build.noindex/module-cache-lldb/lldb-api --clang-module-cache-dir /Users/buildslave/jenkins/workspace/lldb-cmake-sanitized/lldb-build/lldb-test-build.noindex/module-cache-clang/lldb-api --executable /Users/buildslave/jenkins/workspace/lldb-cmake-sanitized/lldb-build/./bin/lldb --compiler /Users/buildslave/jenkins/workspace/lldb-cmake-sanitized/lldb-build/./bin/clang --dsymutil /Users/buildslave/jenkins/workspace/lldb-cmake-sanitized/lldb-build/./bin/dsymutil --filecheck /Users/buildslave/jenkins/workspace/lldb-cmake-sanitized/lldb-build/./bin/FileCheck --lldb-libs-dir /Users/buildslave/jenkins/workspace/lldb-cmake-sanitized/lldb-build/./lib /Users/buildslave/jenkins/workspace/lldb-cmake-sanitized/llvm-project/lldb/test/API/lang/objc/foundation -p TestObjCMethods.py -- Exit Code: -6

Hide Details

Command Output (stdout): -- lldb version 11.0.99 clang revision c2e27ac1ce3e3141f9cf0c4f6982cd56347bc323 llvm revision c2e27ac1ce3e3141f9cf0c4f6982cd56347bc323

Hide Details

-- Command Output (stderr): --

Hide Details

Session logs for test failures/errors/unexpected successes will go into directory '/Users/buildslave/jenkins/workspace/lldb-cmake-sanitized/test/logs' Change dir to: /Users/buildslave/jenkins/workspace/lldb-cmake-sanitized/llvm-project/lldb/test/API/lang/objc/foundation runCmd: settings clear -all output:

Hide Details

runCmd: settings set symbols.enable-external-lookup false output:

Hide Details

runCmd: settings set target.auto-apply-fixits false output:

Hide Details

runCmd: settings set plugin.process.gdb-remote.packet-timeout 60 output:

Hide Details

runCmd: settings set symbols.clang-modules-cache-path "/Users/buildslave/jenkins/workspace/lldb-cmake-sanitized/lldb-build/lldb-test-build.noindex/module-cache-lldb/lldb-api" output:

Hide Details

runCmd: settings set use-color false output:

Hide Details

runCmd: setting set target.prefer-dynamic-value no-dynamic-values output:

Hide Details

runCmd: settings set target.env-vars ASAN_OPTIONS=detect_stack_use_after_return=1 DYLD_INSERT_LIBRARIES=/Users/buildslave/jenkins/workspace/lldb-cmake-sanitized/host-compiler/lib/clang/11.0.0/lib/darwin/libclang_rt.asan_osx_dynamic.dylib output:

Hide Details

runCmd: file /Users/buildslave/jenkins/workspace/lldb-cmake-sanitized/lldb-build/lldb-test-build.noindex/lang/objc/foundation/TestObjCMethods.test_break_dsym/a.out output: Current executable set to '/Users/buildslave/jenkins/workspace/lldb-cmake-sanitized/lldb-build/lldb-test-build.noindex/lang/objc/foundation/TestObjCMethods.test_break_dsym/a.out' (x86_64).

Hide Details

Hide Details

runCmd: _regexp-break +[NSString stringWithFormat:] output: Breakpoint 1: where = Foundation`+[NSString stringWithFormat:], address = 0x0000000000004708

Hide Details

Hide Details

Expecting pattern: ^Breakpoint (?P<bpno>[0-9]+): (?P<num_locations>[0-9]+) locations\.$ Not matched

Hide Details

Expecting pattern: ^Breakpoint (?P<bpno>[0-9]+): (?P<num_locations>no) locations \(pending\)\. Not matched

Hide Details

Expecting pattern: ^Breakpoint (?P<bpno>[0-9]+): where = (?P<module>.*)`(?P<symbol>[+\-]{0,1}[^+]+)( \+ (?P<offset>[0-9]+)){0,1}( \[inlined\] (?P<inline_symbol>.*)){0,1} at (?P<file>[^:]+):(?P<line_no>[0-9]+)(?P<column>(:[0-9]+)?), address = (?P<address>0x[0-9a-fA-F]+)$ Not matched

Hide Details

Expecting pattern: ^Breakpoint (?P<bpno>[0-9]+): where = (?P<module>.*)`(?P<symbol>.*)( \+ (?P<offset>[0-9]+)){0,1}, address = (?P<address>0x[0-9a-fA-F]+)$ Matched

Hide Details

runCmd: breakpoint set -n "-[MyString initWithNSString:]" output: Breakpoint 2: where = a.out`-[MyString initWithNSString:] + 20 at main.m:23:16, address = 0x00000001000014b4

Hide Details

Hide Details

Expecting pattern: ^Breakpoint (?P<bpno>[0-9]+): (?P<num_locations>[0-9]+) locations\.$ Not matched

Hide Details

Expecting pattern: ^Breakpoint (?P<bpno>[0-9]+): (?P<num_locations>no) locations \(pending\)\. Not matched

Hide Details

Expecting pattern: ^Breakpoint (?P<bpno>[0-9]+): where = (?P<module>.*)`(?P<symbol>[+\-]{0,1}[^+]+)( \+ (?P<offset>[0-9]+)){0,1}( \[inlined\] (?P<inline_symbol>.*)){0,1} at (?P<file>[^:]+):(?P<line_no>[0-9]+)(?P<column>(:[0-9]+)?), address = (?P<address>0x[0-9a-fA-F]+)$ Matched

Hide Details

runCmd: breakpoint set -S "description" --shlib "a.out" output: Breakpoint 3: where = a.out`-[MyString description] + 16 at main.m:43:7, address = 0x00000001000015e0

Hide Details

Hide Details

Expecting pattern: ^Breakpoint (?P<bpno>[0-9]+): (?P<num_locations>[0-9]+) locations\.$ Not matched

Hide Details

Expecting pattern: ^Breakpoint (?P<bpno>[0-9]+): (?P<num_locations>no) locations \(pending\)\. Not matched

Hide Details

Expecting pattern: ^Breakpoint (?P<bpno>[0-9]+): where = (?P<module>.*)`(?P<symbol>[+\-]{0,1}[^+]+)( \+ (?P<offset>[0-9]+)){0,1}( \[inlined\] (?P<inline_symbol>.*)){0,1} at (?P<file>[^:]+):(?P<line_no>[0-9]+)(?P<column>(:[0-9]+)?), address = (?P<address>0x[0-9a-fA-F]+)$ Matched

Hide Details

runCmd: _regexp-break -[NSAutoreleasePool release] output: Breakpoint 4: where = Foundation`-[NSAutoreleasePool release], address = 0x0000000000003cee

Hide Details

Hide Details

Expecting pattern: ^Breakpoint (?P<bpno>[0-9]+): (?P<num_locations>[0-9]+) locations\.$ Not matched

Hide Details

Expecting pattern: ^Breakpoint (?P<bpno>[0-9]+): (?P<num_locations>no) locations \(pending\)\. Not matched

Hide Details

Expecting pattern: ^Breakpoint (?P<bpno>[0-9]+): where = (?P<module>.*)`(?P<symbol>[+\-]{0,1}[^+]+)( \+ (?P<offset>[0-9]+)){0,1}( \[inlined\] (?P<inline_symbol>.*)){0,1} at (?P<file>[^:]+):(?P<line_no>[0-9]+)(?P<column>(:[0-9]+)?), address = (?P<address>0x[0-9a-fA-F]+)$ Not matched

Hide Details

Expecting pattern: ^Breakpoint (?P<bpno>[0-9]+): where = (?P<module>.*)`(?P<symbol>.*)( \+ (?P<offset>[0-9]+)){0,1}, address = (?P<address>0x[0-9a-fA-F]+)$ Matched

Hide Details

runCmd: run output: Process 10835 stopped * thread #1, queue = 'com.apple.main-thread', stop reason = breakpoint 1.1 frame #0: 0x00007fff5298a708 Foundation`+[NSString stringWithFormat:] Foundation`+[NSString stringWithFormat:]: -> 0x7fff5298a708 <+0>: pushq %rbp 0x7fff5298a709 <+1>: movq %rsp, %rbp 0x7fff5298a70c <+4>: pushq %r15 0x7fff5298a70e <+6>: pushq %r14

Hide Details

Process 10835 launched: '/Users/buildslave/jenkins/workspace/lldb-cmake-sanitized/lldb-build/lldb-test-build.noindex/lang/objc/foundation/TestObjCMethods.test_break_dsym/a.out' (x86_64)

Hide Details

Hide Details

runCmd: thread backtrace output: * thread #1, queue = 'com.apple.main-thread', stop reason = breakpoint 1.1 * frame #0: 0x00007fff5298a708 Foundation`+[NSString stringWithFormat:] frame #1: 0x000000010000179b a.out`Test_NSString(program="/Users/buildslave/jenkins/workspace/lldb-cmake-sanitized/lldb-build/lldb-test-build.noindex/lang/objc/foundation/TestObjCMethods.test_break_dsym/a.out") at main.m:69:21 frame #2: 0x0000000100001b45 a.out`main(argc=1, argv=0x00007ffeefbff6f0) at main.m:132:5 frame #3: 0x00007fff7d757085 libdyld.dylib`start + 1

Hide Details

Hide Details

Expecting sub string: Foundation`+[NSString stringWithFormat:] Matched

Hide Details

runCmd: process continue output: Process 10835 resuming Process 10835 stopped * thread #1, queue = 'com.apple.main-thread', stop reason = breakpoint 1.1 frame #0: 0x00007fff5298a708 Foundation`+[NSString stringWithFormat:] Foundation`+[NSString stringWithFormat:]: -> 0x7fff5298a708 <+0>: pushq %rbp 0x7fff5298a709 <+1>: movq %rsp, %rbp 0x7fff5298a70c <+4>: pushq %r15 0x7fff5298a70e <+6>: pushq %r14

Hide Details

Hide Details

Hide Details

runCmd: thread backtrace output: * thread #1, queue = 'com.apple.main-thread', stop reason = breakpoint 1.1 * frame #0: 0x00007fff5298a708 Foundation`+[NSString stringWithFormat:] frame #1: 0x00000001000018c9 a.out`Test_MyString(program="/Users/buildslave/jenkins/workspace/lldb-cmake-sanitized/lldb-build/lldb-test-build.noindex/lang/objc/foundation/TestObjCMethods.test_break_dsym/a.out") at main.m:94:21 frame #2: 0x0000000100001b54 a.out`main(argc=1, argv=0x00007ffeefbff6f0) at main.m:133:5 frame #3: 0x00007fff7d757085 libdyld.dylib`start + 1

Hide Details

Hide Details

Expecting sub string: Foundation`+[NSString stringWithFormat:] Matched

Hide Details

runCmd: process continue output: Process 10835 resuming Process 10835 stopped * thread #1, queue = 'com.apple.main-thread', stop reason = breakpoint 2.1 frame #0: 0x00000001000014b4 a.out`-[MyString initWithNSString:](self=0x0000604000001cd0, _cmd="initWithNSString:", string=@"Hello from '/Users/buildslave/jenkins/workspace/lldb-cmake-sanitized/lldb-build/lldb-test-build.noindex/lang/objc/foundation/TestObjCMethods.test_break_dsym/a.out'") at main.m:23:16 20 21 - (id)initWithNSString:(NSString *)string 22 { -> 23 if (self = [super init]) ^ 24 { 25 str = [NSString stringWithString:string]; 26 date = [NSDate date];

Hide Details

Hide Details

Hide Details

runCmd: thread backtrace output: * thread #1, queue = 'com.apple.main-thread', stop reason = breakpoint 2.1 * frame #0: 0x00000001000014b4 a.out`-[MyString initWithNSString:](self=0x0000604000001cd0, _cmd="initWithNSString:", string=@"Hello from '/Users/buildslave/jenkins/workspace/lldb-cmake-sanitized/lldb-build/lldb-test-build.noindex/lang/objc/foundation/TestObjCMethods.test_break_dsym/a.out'") at main.m:23:16 frame #1: 0x00000001000018f0 a.out`Test_MyString(program="/Users/buildslave/jenkins/workspace/lldb-cmake-sanitized/lldb-build/lldb-test-build.noindex/lang/objc/foundation/TestObjCMethods.test_break_dsym/a.out") at main.m:95:20 frame #2: 0x0000000100001b54 a.out`main(argc=1, argv=0x00007ffeefbff6f0) at main.m:133:5 frame #3: 0x00007fff7d757085 libdyld.dylib`start + 1

Hide Details

Hide Details

Expecting sub string: a.out`-[MyString initWithNSString:] Matched

Hide Details

runCmd: process continue output: Process 10835 resuming Process 10835 stopped * thread #1, queue = 'com.apple.main-thread', stop reason = breakpoint 3.1 frame #0: 0x00000001000015e0 a.out`-[MyString description](self=0x0000604000001cd0, _cmd="description") at main.m:43:7 40 { 41 // Set a breakpoint on '-[MyString description]' and test expressions: 42 // expression (char *)sel_getName(_cmd) -> 43 if (self.descriptionPauses) // Break here for description test ^ 44 { 45 printf ("\nAbout to sleep.\n"); 46 usleep(100000);

Hide Details

Hide Details

Hide Details

runCmd: thread backtrace output: * thread #1, queue = 'com.apple.main-thread', stop reason = breakpoint 3.1 * frame #0: 0x00000001000015e0 a.out`-[MyString description](self=0x0000604000001cd0, _cmd="description") at main.m:43:7 frame #1: 0x0000000100001908 a.out`Test_MyString(program="/Users/buildslave/jenkins/workspace/lldb-cmake-sanitized/lldb-build/lldb-test-build.noindex/lang/objc/foundation/TestObjCMethods.test_break_dsym/a.out") at main.m:96:37 frame #2: 0x0000000100001b54 a.out`main(argc=1, argv=0x00007ffeefbff6f0) at main.m:133:5 frame #3: 0x00007fff7d757085 libdyld.dylib`start + 1

Hide Details

Hide Details

Expecting sub string: a.out`-[MyString description] Matched

Hide Details

runCmd: process continue output: Process 10835 resuming Process 10835 stopped * thread #1, queue = 'com.apple.main-thread', stop reason = breakpoint 3.1 frame #0: 0x00000001000015e0 a.out`-[MyString description](self=0x0000604000001cd0, _cmd="description") at main.m:43:7 40 { 41 // Set a breakpoint on '-[MyString description]' and test expressions: 42 // expression (char *)sel_getName(_cmd) -> 43 if (self.descriptionPauses) // Break here for description test ^ 44 { 45 printf ("\nAbout to sleep.\n"); 46 usleep(100000);

Hide Details

Hide Details

Hide Details

runCmd: thread backtrace output: * thread #1, queue = 'com.apple.main-thread', stop reason = breakpoint 3.1 * frame #0: 0x00000001000015e0 a.out`-[MyString description](self=0x0000604000001cd0, _cmd="description") at main.m:43:7 frame #1: 0x0000000100001949 a.out`Test_MyString(program="/Users/buildslave/jenkins/workspace/lldb-cmake-sanitized/lldb-build/lldb-test-build.noindex/lang/objc/foundation/TestObjCMethods.test_break_dsym/a.out") at main.m:98:37 frame #2: 0x0000000100001b54 a.out`main(argc=1, argv=0x00007ffeefbff6f0) at main.m:133:5 frame #3: 0x00007fff7d757085 libdyld.dylib`start + 1

Hide Details

Hide Details

Expecting sub string: a.out`-[MyString description] Matched

Hide Details

runCmd: process continue output: Process 10835 resuming Process 10835 stopped * thread #1, queue = 'com.apple.main-thread', stop reason = breakpoint 4.1 frame #0: 0x00007fff52989cee Foundation`-[NSAutoreleasePool release] Foundation`-[NSAutoreleasePool release]: -> 0x7fff52989cee <+0>: pushq %rbp 0x7fff52989cef <+1>: movq %rsp, %rbp 0x7fff52989cf2 <+4>: pushq %r15 0x7fff52989cf4 <+6>: pushq %r14

Hide Details

Hide Details

Hide Details

runCmd: thread backtrace output: * thread #1, queue = 'com.apple.main-thread', stop reason = breakpoint 4.1 * frame #0: 0x00007fff52989cee Foundation`-[NSAutoreleasePool release] frame #1: 0x0000000100001ba3 a.out`main(argc=1, argv=0x00007ffeefbff6f0) at main.m:139:5 frame #2: 0x00007fff7d757085 libdyld.dylib`start + 1

Hide Details

Hide Details

Expecting sub string: Foundation`-[NSAutoreleasePool release] Matched

Hide Details

<bound method SBProcess.Kill of <lldb.SBProcess; proxy of <Swig Object of type 'lldb::SBProcess *' at 0x10d21ac00> >>: success

Hide Details

PASS: LLDB (/Users/buildslave/jenkins/workspace/lldb-cmake-sanitized/lldb-build/bin/clang-11-x86_64) :: test_break_dsym (TestObjCMethods.FoundationTestCase) runCmd: settings clear -all output:

Hide Details

runCmd: settings set symbols.enable-external-lookup false output:

Hide Details

runCmd: settings set target.auto-apply-fixits false output:

Hide Details

runCmd: settings set plugin.process.gdb-remote.packet-timeout 60 output:

Hide Details

runCmd: settings set symbols.clang-modules-cache-path "/Users/buildslave/jenkins/workspace/lldb-cmake-sanitized/lldb-build/lldb-test-build.noindex/module-cache-lldb/lldb-api" output:

Hide Details

runCmd: settings set use-color false output:

Hide Details

runCmd: setting set target.prefer-dynamic-value no-dynamic-values output:

Hide Details

runCmd: settings set target.env-vars ASAN_OPTIONS=detect_stack_use_after_return=1 DYLD_INSERT_LIBRARIES=/Users/buildslave/jenkins/workspace/lldb-cmake-sanitized/host-compiler/lib/clang/11.0.0/lib/darwin/libclang_rt.asan_osx_dynamic.dylib output:

Hide Details

runCmd: file /Users/buildslave/jenkins/workspace/lldb-cmake-sanitized/lldb-build/lldb-test-build.noindex/lang/objc/foundation/TestObjCMethods.test_break_dwarf/a.out output: Current executable set to '/Users/buildslave/jenkins/workspace/lldb-cmake-sanitized/lldb-build/lldb-test-build.noindex/lang/objc/foundation/TestObjCMethods.test_break_dwarf/a.out' (x86_64).

Hide Details

Hide Details

runCmd: _regexp-break +[NSString stringWithFormat:] output: Breakpoint 1: where = Foundation`+[NSString stringWithFormat:], address = 0x0000000000004708

Hide Details

Hide Details

Expecting pattern: ^Breakpoint (?P<bpno>[0-9]+): (?P<num_locations>[0-9]+) locations\.$ Not matched

Hide Details

Expecting pattern: ^Breakpoint (?P<bpno>[0-9]+): (?P<num_locations>no) locations \(pending\)\. Not matched

Hide Details

Expecting pattern: ^Breakpoint (?P<bpno>[0-9]+): where = (?P<module>.*)`(?P<symbol>[+\-]{0,1}[^+]+)( \+ (?P<offset>[0-9]+)){0,1}( \[inlined\] (?P<inline_symbol>.*)){0,1} at (?P<file>[^:]+):(?P<line_no>[0-9]+)(?P<column>(:[0-9]+)?), address = (?P<address>0x[0-9a-fA-F]+)$ Not matched

Hide Details

Expecting pattern: ^Breakpoint (?P<bpno>[0-9]+): where = (?P<module>.*)`(?P<symbol>.*)( \+ (?P<offset>[0-9]+)){0,1}, address = (?P<address>0x[0-9a-fA-F]+)$ Matched

Hide Details

runCmd: breakpoint set -n "-[MyString initWithNSString:]" output: Breakpoint 2: where = a.out`-[MyString initWithNSString:] + 20 at main.m:23:16, address = 0x00000001000014b4

Hide Details

Hide Details

Expecting pattern: ^Breakpoint (?P<bpno>[0-9]+): (?P<num_locations>[0-9]+) locations\.$ Not matched

Hide Details

Expecting pattern: ^Breakpoint (?P<bpno>[0-9]+): (?P<num_locations>no) locations \(pending\)\. Not matched

Hide Details

Expecting pattern: ^Breakpoint (?P<bpno>[0-9]+): where = (?P<module>.*)`(?P<symbol>[+\-]{0,1}[^+]+)( \+ (?P<offset>[0-9]+)){0,1}( \[inlined\] (?P<inline_symbol>.*)){0,1} at (?P<file>[^:]+):(?P<line_no>[0-9]+)(?P<column>(:[0-9]+)?), address = (?P<address>0x[0-9a-fA-F]+)$ Matched

Hide Details

runCmd: breakpoint set -S "description" --shlib "a.out" output: Breakpoint 3: where = a.out`-[MyString description] + 16 at main.m:43:7, address = 0x00000001000015e0

Hide Details

Hide Details

Expecting pattern: ^Breakpoint (?P<bpno>[0-9]+): (?P<num_locations>[0-9]+) locations\.$ Not matched

Hide Details

Expecting pattern: ^Breakpoint (?P<bpno>[0-9]+): (?P<num_locations>no) locations \(pending\)\. Not matched

Hide Details

Expecting pattern: ^Breakpoint (?P<bpno>[0-9]+): where = (?P<module>.*)`(?P<symbol>[+\-]{0,1}[^+]+)( \+ (?P<offset>[0-9]+)){0,1}( \[inlined\] (?P<inline_symbol>.*)){0,1} at (?P<file>[^:]+):(?P<line_no>[0-9]+)(?P<column>(:[0-9]+)?), address = (?P<address>0x[0-9a-fA-F]+)$ Matched

Hide Details

runCmd: _regexp-break -[NSAutoreleasePool release] output: Breakpoint 4: where = Foundation`-[NSAutoreleasePool release], address = 0x0000000000003cee

Hide Details

Hide Details

Expecting pattern: ^Breakpoint (?P<bpno>[0-9]+): (?P<num_locations>[0-9]+) locations\.$ Not matched

Hide Details

Expecting pattern: ^Breakpoint (?P<bpno>[0-9]+): (?P<num_locations>no) locations \(pending\)\. Not matched

Hide Details

Expecting pattern: ^Breakpoint (?P<bpno>[0-9]+): where = (?P<module>.*)`(?P<symbol>[+\-]{0,1}[^+]+)( \+ (?P<offset>[0-9]+)){0,1}( \[inlined\] (?P<inline_symbol>.*)){0,1} at (?P<file>[^:]+):(?P<line_no>[0-9]+)(?P<column>(:[0-9]+)?), address = (?P<address>0x[0-9a-fA-F]+)$ Not matched

Hide Details

Expecting pattern: ^Breakpoint (?P<bpno>[0-9]+): where = (?P<module>.*)`(?P<symbol>.*)( \+ (?P<offset>[0-9]+)){0,1}, address = (?P<address>0x[0-9a-fA-F]+)$ Matched

Hide Details

runCmd: run output: Process 11376 stopped * thread #1, queue = 'com.apple.main-thread', stop reason = breakpoint 1.1 frame #0: 0x00007fff5298a708 Foundation`+[NSString stringWithFormat:] Foundation`+[NSString stringWithFormat:]: -> 0x7fff5298a708 <+0>: pushq %rbp 0x7fff5298a709 <+1>: movq %rsp, %rbp 0x7fff5298a70c <+4>: pushq %r15 0x7fff5298a70e <+6>: pushq %r14

Hide Details

Process 11376 launched: '/Users/buildslave/jenkins/workspace/lldb-cmake-sanitized/lldb-build/lldb-test-build.noindex/lang/objc/foundation/TestObjCMethods.test_break_dwarf/a.out' (x86_64)

Hide Details

Hide Details

runCmd: thread backtrace output: * thread #1, queue = 'com.apple.main-thread', stop reason = breakpoint 1.1 * frame #0: 0x00007fff5298a708 Foundation`+[NSString stringWithFormat:] frame #1: 0x000000010000179b a.out`Test_NSString(program="/Users/buildslave/jenkins/workspace/lldb-cmake-sanitized/lldb-build/lldb-test-build.noindex/lang/objc/foundation/TestObjCMethods.test_break_dwarf/a.out") at main.m:69:21 frame #2: 0x0000000100001b45 a.out`main(argc=1, argv=0x00007ffeefbff6f0) at main.m:132:5 frame #3: 0x00007fff7d757085 libdyld.dylib`start + 1

Hide Details

Hide Details

Expecting sub string: Foundation`+[NSString stringWithFormat:] Matched

Hide Details

runCmd: process continue output: Process 11376 resuming Process 11376 stopped * thread #1, queue = 'com.apple.main-thread', stop reason = breakpoint 1.1 frame #0: 0x00007fff5298a708 Foundation`+[NSString stringWithFormat:] Foundation`+[NSString stringWithFormat:]: -> 0x7fff5298a708 <+0>: pushq %rbp 0x7fff5298a709 <+1>: movq %rsp, %rbp 0x7fff5298a70c <+4>: pushq %r15 0x7fff5298a70e <+6>: pushq %r14

Hide Details

Hide Details

Hide Details

runCmd: thread backtrace output: * thread #1, queue = 'com.apple.main-thread', stop reason = breakpoint 1.1 * frame #0: 0x00007fff5298a708 Foundation`+[NSString stringWithFormat:] frame #1: 0x00000001000018c9 a.out`Test_MyString(program="/Users/buildslave/jenkins/workspace/lldb-cmake-sanitized/lldb-build/lldb-test-build.noindex/lang/objc/foundation/TestObjCMethods.test_break_dwarf/a.out") at main.m:94:21 frame #2: 0x0000000100001b54 a.out`main(argc=1, argv=0x00007ffeefbff6f0) at main.m:133:5 frame #3: 0x00007fff7d757085 libdyld.dylib`start + 1

Hide Details

Hide Details

Expecting sub string: Foundation`+[NSString stringWithFormat:] Matched

Hide Details

runCmd: process continue output: Process 11376 resuming Process 11376 stopped * thread #1, queue = 'com.apple.main-thread', stop reason = breakpoint 2.1 frame #0: 0x00000001000014b4 a.out`-[MyString initWithNSString:](self=0x0000604000001cd0, _cmd="initWithNSString:", string=@"Hello from '/Users/buildslave/jenkins/workspace/lldb-cmake-sanitized/lldb-build/lldb-test-build.noindex/lang/objc/foundation/TestObjCMethods.test_break_dwarf/a.out'") at main.m:23:16 20 21 - (id)initWithNSString:(NSString *)string 22 { -> 23 if (self = [super init]) ^ 24 { 25 str = [NSString stringWithString:string]; 26 date = [NSDate date];

Hide Details

Hide Details

Hide Details

runCmd: thread backtrace output: * thread #1, queue = 'com.apple.main-thread', stop reason = breakpoint 2.1 * frame #0: 0x00000001000014b4 a.out`-[MyString initWithNSString:](self=0x0000604000001cd0, _cmd="initWithNSString:", string=@"Hello from '/Users/buildslave/jenkins/workspace/lldb-cmake-sanitized/lldb-build/lldb-test-build.noindex/lang/objc/foundation/TestObjCMethods.test_break_dwarf/a.out'") at main.m:23:16 frame #1: 0x00000001000018f0 a.out`Test_MyString(program="/Users/buildslave/jenkins/workspace/lldb-cmake-sanitized/lldb-build/lldb-test-build.noindex/lang/objc/foundation/TestObjCMethods.test_break_dwarf/a.out") at main.m:95:20 frame #2: 0x0000000100001b54 a.out`main(argc=1, argv=0x00007ffeefbff6f0) at main.m:133:5 frame #3: 0x00007fff7d757085 libdyld.dylib`start + 1

Hide Details

Hide Details

Expecting sub string: a.out`-[MyString initWithNSString:] Matched

Hide Details

runCmd: process continue output: Process 11376 resuming Process 11376 stopped * thread #1, queue = 'com.apple.main-thread', stop reason = breakpoint 3.1 frame #0: 0x00000001000015e0 a.out`-[MyString description](self=0x0000604000001cd0, _cmd="description") at main.m:43:7 40 { 41 // Set a breakpoint on '-[MyString description]' and test expressions: 42 // expression (char *)sel_getName(_cmd) -> 43 if (self.descriptionPauses) // Break here for description test ^ 44 { 45 printf ("\nAbout to sleep.\n"); 46 usleep(100000);

Hide Details

Hide Details

Hide Details

runCmd: thread backtrace output: * thread #1, queue = 'com.apple.main-thread', stop reason = breakpoint 3.1 * frame #0: 0x00000001000015e0 a.out`-[MyString description](self=0x0000604000001cd0, _cmd="description") at main.m:43:7 frame #1: 0x0000000100001908 a.out`Test_MyString(program="/Users/buildslave/jenkins/workspace/lldb-cmake-sanitized/lldb-build/lldb-test-build.noindex/lang/objc/foundation/TestObjCMethods.test_break_dwarf/a.out") at main.m:96:37 frame #2: 0x0000000100001b54 a.out`main(argc=1, argv=0x00007ffeefbff6f0) at main.m:133:5 frame #3: 0x00007fff7d757085 libdyld.dylib`start + 1

Hide Details

Hide Details

Expecting sub string: a.out`-[MyString description] Matched

Hide Details

runCmd: process continue output: Process 11376 resuming Process 11376 stopped * thread #1, queue = 'com.apple.main-thread', stop reason = breakpoint 3.1 frame #0: 0x00000001000015e0 a.out`-[MyString description](self=0x0000604000001cd0, _cmd="description") at main.m:43:7 40 { 41 // Set a breakpoint on '-[MyString description]' and test expressions: 42 // expression (char *)sel_getName(_cmd) -> 43 if (self.descriptionPauses) // Break here for description test ^ 44 { 45 printf ("\nAbout to sleep.\n"); 46 usleep(100000);

Hide Details

Hide Details

Hide Details

runCmd: thread backtrace output: * thread #1, queue = 'com.apple.main-thread', stop reason = breakpoint 3.1 * frame #0: 0x00000001000015e0 a.out`-[MyString description](self=0x0000604000001cd0, _cmd="description") at main.m:43:7 frame #1: 0x0000000100001949 a.out`Test_MyString(program="/Users/buildslave/jenkins/workspace/lldb-cmake-sanitized/lldb-build/lldb-test-build.noindex/lang/objc/foundation/TestObjCMethods.test_break_dwarf/a.out") at main.m:98:37 frame #2: 0x0000000100001b54 a.out`main(argc=1, argv=0x00007ffeefbff6f0) at main.m:133:5 frame #3: 0x00007fff7d757085 libdyld.dylib`start + 1

Hide Details

Hide Details

Expecting sub string: a.out`-[MyString description] Matched

Hide Details

runCmd: process continue output: Process 11376 resuming Process 11376 stopped * thread #1, queue = 'com.apple.main-thread', stop reason = breakpoint 4.1 frame #0: 0x00007fff52989cee Foundation`-[NSAutoreleasePool release] Foundation`-[NSAutoreleasePool release]: -> 0x7fff52989cee <+0>: pushq %rbp 0x7fff52989cef <+1>: movq %rsp, %rbp 0x7fff52989cf2 <+4>: pushq %r15 0x7fff52989cf4 <+6>: pushq %r14

Hide Details

Hide Details

Hide Details

runCmd: thread backtrace output: * thread #1, queue = 'com.apple.main-thread', stop reason = breakpoint 4.1 * frame #0: 0x00007fff52989cee Foundation`-[NSAutoreleasePool release] frame #1: 0x0000000100001ba3 a.out`main(argc=1, argv=0x00007ffeefbff6f0) at main.m:139:5 frame #2: 0x00007fff7d757085 libdyld.dylib`start + 1

Hide Details

Hide Details

Expecting sub string: Foundation`-[NSAutoreleasePool release] Matched

Hide Details

<bound method SBProcess.Kill of <lldb.SBProcess; proxy of <Swig Object of type 'lldb::SBProcess *' at 0x10cd44bd0> >>: success

Hide Details

PASS: LLDB (/Users/buildslave/jenkins/workspace/lldb-cmake-sanitized/lldb-build/bin/clang-11-x86_64) :: test_break_dwarf (TestObjCMethods.FoundationTestCase) UNSUPPORTED: LLDB (/Users/buildslave/jenkins/workspace/lldb-cmake-sanitized/lldb-build/bin/clang-11-x86_64) :: test_break_dwo (TestObjCMethods.FoundationTestCase) (test case does not fall in any category of interest for this run) runCmd: settings clear -all output:

Hide Details

runCmd: settings set symbols.enable-external-lookup false output:

Hide Details

runCmd: settings set target.auto-apply-fixits false output:

Hide Details

runCmd: settings set plugin.process.gdb-remote.packet-timeout 60 output:

Hide Details

runCmd: settings set symbols.clang-modules-cache-path "/Users/buildslave/jenkins/workspace/lldb-cmake-sanitized/lldb-build/lldb-test-build.noindex/module-cache-lldb/lldb-api" output:

Hide Details

runCmd: settings set use-color false output:

Hide Details

runCmd: setting set target.prefer-dynamic-value no-dynamic-values output:

Hide Details

runCmd: settings set target.env-vars ASAN_OPTIONS=detect_stack_use_after_return=1 DYLD_INSERT_LIBRARIES=/Users/buildslave/jenkins/workspace/lldb-cmake-sanitized/host-compiler/lib/clang/11.0.0/lib/darwin/libclang_rt.asan_osx_dynamic.dylib output:

Hide Details

runCmd: file /Users/buildslave/jenkins/workspace/lldb-cmake-sanitized/lldb-build/lldb-test-build.noindex/lang/objc/foundation/TestObjCMethods.test_break_gmodules/a.out output: Current executable set to '/Users/buildslave/jenkins/workspace/lldb-cmake-sanitized/lldb-build/lldb-test-build.noindex/lang/objc/foundation/TestObjCMethods.test_break_gmodules/a.out' (x86_64).

Hide Details

Hide Details

runCmd: _regexp-break +[NSString stringWithFormat:] output: Breakpoint 1: where = Foundation`+[NSString stringWithFormat:], address = 0x0000000000004708

Hide Details

Hide Details

Expecting pattern: ^Breakpoint (?P<bpno>[0-9]+): (?P<num_locations>[0-9]+) locations\.$ Not matched

Hide Details

Expecting pattern: ^Breakpoint (?P<bpno>[0-9]+): (?P<num_locations>no) locations \(pending\)\. Not matched

Hide Details

Expecting pattern: ^Breakpoint (?P<bpno>[0-9]+): where = (?P<module>.*)`(?P<symbol>[+\-]{0,1}[^+]+)( \+ (?P<offset>[0-9]+)){0,1}( \[inlined\] (?P<inline_symbol>.*)){0,1} at (?P<file>[^:]+):(?P<line_no>[0-9]+)(?P<column>(:[0-9]+)?), address = (?P<address>0x[0-9a-fA-F]+)$ Not matched

Hide Details

Expecting pattern: ^Breakpoint (?P<bpno>[0-9]+): where = (?P<module>.*)`(?P<symbol>.*)( \+ (?P<offset>[0-9]+)){0,1}, address = (?P<address>0x[0-9a-fA-F]+)$ Matched

Hide Details

runCmd: breakpoint set -n "-[MyString initWithNSString:]" output: Breakpoint 2: where = a.out`-[MyString initWithNSString:] + 20 at main.m:23:16, address = 0x00000001000014b4

Hide Details

Hide Details

Expecting pattern: ^Breakpoint (?P<bpno>[0-9]+): (?P<num_locations>[0-9]+) locations\.$ Not matched

Hide Details

Expecting pattern: ^Breakpoint (?P<bpno>[0-9]+): (?P<num_locations>no) locations \(pending\)\. Not matched

Hide Details

Expecting pattern: ^Breakpoint (?P<bpno>[0-9]+): where = (?P<module>.*)`(?P<symbol>[+\-]{0,1}[^+]+)( \+ (?P<offset>[0-9]+)){0,1}( \[inlined\] (?P<inline_symbol>.*)){0,1} at (?P<file>[^:]+):(?P<line_no>[0-9]+)(?P<column>(:[0-9]+)?), address = (?P<address>0x[0-9a-fA-F]+)$ Matched

Hide Details

runCmd: breakpoint set -S "description" --shlib "a.out" output: Breakpoint 3: where = a.out`-[MyString description] + 16 at main.m:43:7, address = 0x00000001000015e0

Hide Details

Hide Details

Expecting pattern: ^Breakpoint (?P<bpno>[0-9]+): (?P<num_locations>[0-9]+) locations\.$ Not matched

Hide Details

Expecting pattern: ^Breakpoint (?P<bpno>[0-9]+): (?P<num_locations>no) locations \(pending\)\. Not matched

Hide Details

Expecting pattern: ^Breakpoint (?P<bpno>[0-9]+): where = (?P<module>.*)`(?P<symbol>[+\-]{0,1}[^+]+)( \+ (?P<offset>[0-9]+)){0,1}( \[inlined\] (?P<inline_symbol>.*)){0,1} at (?P<file>[^:]+):(?P<line_no>[0-9]+)(?P<column>(:[0-9]+)?), address = (?P<address>0x[0-9a-fA-F]+)$ Matched

Hide Details

runCmd: _regexp-break -[NSAutoreleasePool release] output: Breakpoint 4: where = Foundation`-[NSAutoreleasePool release], address = 0x0000000000003cee

Hide Details

Hide Details

Expecting pattern: ^Breakpoint (?P<bpno>[0-9]+): (?P<num_locations>[0-9]+) locations\.$ Not matched

Hide Details

Expecting pattern: ^Breakpoint (?P<bpno>[0-9]+): (?P<num_locations>no) locations \(pending\)\. Not matched

Hide Details

Expecting pattern: ^Breakpoint (?P<bpno>[0-9]+): where = (?P<module>.*)`(?P<symbol>[+\-]{0,1}[^+]+)( \+ (?P<offset>[0-9]+)){0,1}( \[inlined\] (?P<inline_symbol>.*)){0,1} at (?P<file>[^:]+):(?P<line_no>[0-9]+)(?P<column>(:[0-9]+)?), address = (?P<address>0x[0-9a-fA-F]+)$ Not matched

Hide Details

Expecting pattern: ^Breakpoint (?P<bpno>[0-9]+): where = (?P<module>.*)`(?P<symbol>.*)( \+ (?P<offset>[0-9]+)){0,1}, address = (?P<address>0x[0-9a-fA-F]+)$ Matched

Hide Details

runCmd: run output: Process 11459 stopped * thread #1, queue = 'com.apple.main-thread', stop reason = breakpoint 1.1 frame #0: 0x00007fff5298a708 Foundation`+[NSString stringWithFormat:] Foundation`+[NSString stringWithFormat:]: -> 0x7fff5298a708 <+0>: pushq %rbp 0x7fff5298a709 <+1>: movq %rsp, %rbp 0x7fff5298a70c <+4>: pushq %r15 0x7fff5298a70e <+6>: pushq %r14

Hide Details

Process 11459 launched: '/Users/buildslave/jenkins/workspace/lldb-cmake-sanitized/lldb-build/lldb-test-build.noindex/lang/objc/foundation/TestObjCMethods.test_break_gmodules/a.out' (x86_64)

Hide Details

Hide Details

runCmd: thread backtrace output: * thread #1, queue = 'com.apple.main-thread', stop reason = breakpoint 1.1 * frame #0: 0x00007fff5298a708 Foundation`+[NSString stringWithFormat:] frame #1: 0x000000010000179b a.out`Test_NSString(program="/Users/buildslave/jenkins/workspace/lldb-cmake-sanitized/lldb-build/lldb-test-build.noindex/lang/objc/foundation/TestObjCMethods.test_break_gmodules/a.out") at main.m:69:21 frame #2: 0x0000000100001b45 a.out`main(argc=1, argv=0x00007ffeefbff6e0) at main.m:132:5 frame #3: 0x00007fff7d757085 libdyld.dylib`start + 1

Hide Details

Hide Details

Expecting sub string: Foundation`+[NSString stringWithFormat:] Matched

Hide Details

runCmd: process continue output: Process 11459 resuming Process 11459 stopped * thread #1, queue = 'com.apple.main-thread', stop reason = breakpoint 1.1 frame #0: 0x00007fff5298a708 Foundation`+[NSString stringWithFormat:] Foundation`+[NSString stringWithFormat:]: -> 0x7fff5298a708 <+0>: pushq %rbp 0x7fff5298a709 <+1>: movq %rsp, %rbp 0x7fff5298a70c <+4>: pushq %r15 0x7fff5298a70e <+6>: pushq %r14

Hide Details

Hide Details

Hide Details

runCmd: thread backtrace output: * thread #1, queue = 'com.apple.main-thread', stop reason = breakpoint 1.1 * frame #0: 0x00007fff5298a708 Foundation`+[NSString stringWithFormat:] frame #1: 0x00000001000018c9 a.out`Test_MyString(program="/Users/buildslave/jenkins/workspace/lldb-cmake-sanitized/lldb-build/lldb-test-build.noindex/lang/objc/foundation/TestObjCMethods.test_break_gmodules/a.out") at main.m:94:21 frame #2: 0x0000000100001b54 a.out`main(argc=1, argv=0x00007ffeefbff6e0) at main.m:133:5 frame #3: 0x00007fff7d757085 libdyld.dylib`start + 1

Hide Details

Hide Details

Expecting sub string: Foundation`+[NSString stringWithFormat:] Matched

Hide Details

runCmd: process continue output: Process 11459 resuming Process 11459 stopped * thread #1, queue = 'com.apple.main-thread', stop reason = breakpoint 2.1 frame #0: 0x00000001000014b4 a.out`-[MyString initWithNSString:](self=0x0000604000001cd0, _cmd="initWithNSString:", string=@"Hello from '/Users/buildslave/jenkins/workspace/lldb-cmake-sanitized/lldb-build/lldb-test-build.noindex/lang/objc/foundation/TestObjCMethods.test_break_gmodules/a.out'") at main.m:23:16 20 21 - (id)initWithNSString:(NSString *)string 22 { -> 23 if (self = [super init]) ^ 24 { 25 str = [NSString stringWithString:string]; 26 date = [NSDate date];

Hide Details

Hide Details

Hide Details

runCmd: thread backtrace output: * thread #1, queue = 'com.apple.main-thread', stop reason = breakpoint 2.1 * frame #0: 0x00000001000014b4 a.out`-[MyString initWithNSString:](self=0x0000604000001cd0, _cmd="initWithNSString:", string=@"Hello from '/Users/buildslave/jenkins/workspace/lldb-cmake-sanitized/lldb-build/lldb-test-build.noindex/lang/objc/foundation/TestObjCMethods.test_break_gmodules/a.out'") at main.m:23:16 frame #1: 0x00000001000018f0 a.out`Test_MyString(program="/Users/buildslave/jenkins/workspace/lldb-cmake-sanitized/lldb-build/lldb-test-build.noindex/lang/objc/foundation/TestObjCMethods.test_break_gmodules/a.out") at main.m:95:20 frame #2: 0x0000000100001b54 a.out`main(argc=1, argv=0x00007ffeefbff6e0) at main.m:133:5 frame #3: 0x00007fff7d757085 libdyld.dylib`start + 1

Hide Details

Hide Details

Expecting sub string: a.out`-[MyString initWithNSString:] Matched

Hide Details

runCmd: process continue output: Process 11459 resuming Process 11459 stopped * thread #1, queue = 'com.apple.main-thread', stop reason = breakpoint 3.1 frame #0: 0x00000001000015e0 a.out`-[MyString description](self=0x0000604000001cd0, _cmd="description") at main.m:43:7 40 { 41 // Set a breakpoint on '-[MyString description]' and test expressions: 42 // expression (char *)sel_getName(_cmd) -> 43 if (self.descriptionPauses) // Break here for description test ^ 44 { 45 printf ("\nAbout to sleep.\n"); 46 usleep(100000);

Hide Details

Hide Details

Hide Details

runCmd: thread backtrace output: * thread #1, queue = 'com.apple.main-thread', stop reason = breakpoint 3.1 * frame #0: 0x00000001000015e0 a.out`-[MyString description](self=0x0000604000001cd0, _cmd="description") at main.m:43:7 frame #1: 0x0000000100001908 a.out`Test_MyString(program="/Users/buildslave/jenkins/workspace/lldb-cmake-sanitized/lldb-build/lldb-test-build.noindex/lang/objc/foundation/TestObjCMethods.test_break_gmodules/a.out") at main.m:96:37 frame #2: 0x0000000100001b54 a.out`main(argc=1, argv=0x00007ffeefbff6e0) at main.m:133:5 frame #3: 0x00007fff7d757085 libdyld.dylib`start + 1

Hide Details

Hide Details

Expecting sub string: a.out`-[MyString description] Matched

Hide Details

runCmd: process continue output: Process 11459 resuming Process 11459 stopped * thread #1, queue = 'com.apple.main-thread', stop reason = breakpoint 3.1 frame #0: 0x00000001000015e0 a.out`-[MyString description](self=0x0000604000001cd0, _cmd="description") at main.m:43:7 40 { 41 // Set a breakpoint on '-[MyString description]' and test expressions: 42 // expression (char *)sel_getName(_cmd) -> 43 if (self.descriptionPauses) // Break here for description test ^ 44 { 45 printf ("\nAbout to sleep.\n"); 46 usleep(100000);

Hide Details

Hide Details

Hide Details

runCmd: thread backtrace output: * thread #1, queue = 'com.apple.main-thread', stop reason = breakpoint 3.1 * frame #0: 0x00000001000015e0 a.out`-[MyString description](self=0x0000604000001cd0, _cmd="description") at main.m:43:7 frame #1: 0x0000000100001949 a.out`Test_MyString(program="/Users/buildslave/jenkins/workspace/lldb-cmake-sanitized/lldb-build/lldb-test-build.noindex/lang/objc/foundation/TestObjCMethods.test_break_gmodules/a.out") at main.m:98:37 frame #2: 0x0000000100001b54 a.out`main(argc=1, argv=0x00007ffeefbff6e0) at main.m:133:5 frame #3: 0x00007fff7d757085 libdyld.dylib`start + 1

Hide Details

Hide Details

Expecting sub string: a.out`-[MyString description] Matched

Hide Details

runCmd: process continue output: Process 11459 resuming Process 11459 stopped * thread #1, queue = 'com.apple.main-thread', stop reason = breakpoint 4.1 frame #0: 0x00007fff52989cee Foundation`-[NSAutoreleasePool release] Foundation`-[NSAutoreleasePool release]: -> 0x7fff52989cee <+0>: pushq %rbp 0x7fff52989cef <+1>: movq %rsp, %rbp 0x7fff52989cf2 <+4>: pushq %r15 0x7fff52989cf4 <+6>: pushq %r14

Hide Details

Hide Details

Hide Details

runCmd: thread backtrace output: * thread #1, queue = 'com.apple.main-thread', stop reason = breakpoint 4.1 * frame #0: 0x00007fff52989cee Foundation`-[NSAutoreleasePool release] frame #1: 0x0000000100001ba3 a.out`main(argc=1, argv=0x00007ffeefbff6e0) at main.m:139:5 frame #2: 0x00007fff7d757085 libdyld.dylib`start + 1

Hide Details

Hide Details

Expecting sub string: Foundation`-[NSAutoreleasePool release] Matched

Hide Details

<bound method SBProcess.Kill of <lldb.SBProcess; proxy of <Swig Object of type 'lldb::SBProcess *' at 0x10cd44540> >>: success

Hide Details

PASS: LLDB (/Users/buildslave/jenkins/workspace/lldb-cmake-sanitized/lldb-build/bin/clang-11-x86_64) :: test_break_gmodules (TestObjCMethods.FoundationTestCase) runCmd: settings clear -all output:

Hide Details

runCmd: settings set symbols.enable-external-lookup false output:

Hide Details

runCmd: settings set target.auto-apply-fixits false output:

Hide Details

runCmd: settings set plugin.process.gdb-remote.packet-timeout 60 output:

Hide Details

runCmd: settings set symbols.clang-modules-cache-path "/Users/buildslave/jenkins/workspace/lldb-cmake-sanitized/lldb-build/lldb-test-build.noindex/module-cache-lldb/lldb-api" output:

Hide Details

runCmd: settings set use-color false output:

Hide Details

runCmd: setting set target.prefer-dynamic-value no-dynamic-values output:

Hide Details

runCmd: settings set target.env-vars ASAN_OPTIONS=detect_stack_use_after_return=1 DYLD_INSERT_LIBRARIES=/Users/buildslave/jenkins/workspace/lldb-cmake-sanitized/host-compiler/lib/clang/11.0.0/lib/darwin/libclang_rt.asan_osx_dynamic.dylib output:

Hide Details

runCmd: file /Users/buildslave/jenkins/workspace/lldb-cmake-sanitized/lldb-build/lldb-test-build.noindex/lang/objc/foundation/TestObjCMethods.test_data_type_and_expr_dsym/a.out output: Current executable set to '/Users/buildslave/jenkins/workspace/lldb-cmake-sanitized/lldb-build/lldb-test-build.noindex/lang/objc/foundation/TestObjCMethods.test_data_type_and_expr_dsym/a.out' (x86_64).

Hide Details

Hide Details

runCmd: breakpoint set -n "-[MyString description]" output: Breakpoint 1: where = a.out`-[MyString description] + 16 at main.m:43:7, address = 0x00000001000015e0

Hide Details

Hide Details

Expecting pattern: ^Breakpoint (?P<bpno>[0-9]+): (?P<num_locations>[0-9]+) locations\.$ Not matched

Hide Details

Expecting pattern: ^Breakpoint (?P<bpno>[0-9]+): (?P<num_locations>no) locations \(pending\)\. Not matched

Hide Details

Expecting pattern: ^Breakpoint (?P<bpno>[0-9]+): where = (?P<module>.*)`(?P<symbol>[+\-]{0,1}[^+]+)( \+ (?P<offset>[0-9]+)){0,1}( \[inlined\] (?P<inline_symbol>.*)){0,1} at (?P<file>[^:]+):(?P<line_no>[0-9]+)(?P<column>(:[0-9]+)?), address = (?P<address>0x[0-9a-fA-F]+)$ Matched

Hide Details

runCmd: run output: Process 12123 stopped * thread #1, queue = 'com.apple.main-thread', stop reason = breakpoint 1.1 frame #0: 0x00000001000015e0 a.out`-[MyString description](self=0x0000604000001cd0, _cmd="description") at main.m:43:7 40 { 41 // Set a breakpoint on '-[MyString description]' and test expressions: 42 // expression (char *)sel_getName(_cmd) -> 43 if (self.descriptionPauses) // Break here for description test ^ 44 { 45 printf ("\nAbout to sleep.\n"); 46 usleep(100000);

Hide Details

Process 12123 launched: '/Users/buildslave/jenkins/workspace/lldb-cmake-sanitized/lldb-build/lldb-test-build.noindex/lang/objc/foundation/TestObjCMethods.test_data_type_and_expr_dsym/a.out' (x86_64)

Hide Details

Hide Details

runCmd: thread backtrace output: * thread #1, queue = 'com.apple.main-thread', stop reason = breakpoint 1.1 * frame #0: 0x00000001000015e0 a.out`-[MyString description](self=0x0000604000001cd0, _cmd="description") at main.m:43:7 frame #1: 0x0000000100001908 a.out`Test_MyString(program="/Users/buildslave/jenkins/workspace/lldb-cmake-sanitized/lldb-build/lldb-test-build.noindex/lang/objc/foundation/TestObjCMethods.test_data_type_and_expr_dsym/a.out") at main.m:96:37 frame #2: 0x0000000100001b54 a.out`main(argc=1, argv=0x00007ffeefbff6d0) at main.m:133:5 frame #3: 0x00007fff7d757085 libdyld.dylib`start + 1

Hide Details

Hide Details

Expecting sub string: a.out`-[MyString description] Matched

Hide Details

runCmd: image lookup -t NSString output: Best match found in /Users/buildslave/jenkins/workspace/lldb-cmake-sanitized/lldb-build/lldb-test-build.noindex/lang/objc/foundation/TestObjCMethods.test_data_type_and_expr_dsym/a.out: id = {0x7fffffff0000004d}, name = "NSString", byte-size = 8, decl = NSString.h:99, compiler_type = "@interface NSString : NSObject @property(readonly, getter = length, setter = <null selector>) NSUInteger length; @end"

Hide Details

Hide Details

Hide Details

Expecting sub string: name = "NSString" Matched

Hide Details

Expecting sub string: compiler_type = "@interface NSString Matched

Hide Details

runCmd: image lookup -t MyString output: Best match found in /Users/buildslave/jenkins/workspace/lldb-cmake-sanitized/lldb-build/lldb-test-build.noindex/lang/objc/foundation/TestObjCMethods.test_data_type_and_expr_dsym/a.out: id = {0x7fffffff000000a9}, name = "MyString", byte-size = 32, decl = main.m:5, compiler_type = "@interface MyString : MyBase{ NSString * str; NSDate * date; BOOL _desc_pauses; } @property(retain, readwrite, getter = str_property, setter = setStr_property:) NSString *str_property; @property(assign, readwrite, getter = descriptionPauses, setter = setDescriptionPauses:) BOOL descriptionPauses; @end"

Hide Details

Hide Details

Hide Details

Expecting sub string: name = "MyString" Matched

Hide Details

Expecting sub string: compiler_type = "@interface MyString Matched

Hide Details

Expecting sub string: NSString * str; Matched

Hide Details

Expecting sub string: NSDate * date; Matched

Hide Details

runCmd: frame variable --show-types --scope output: ARG: (MyString *) self = 0x0000604000001cd0 ARG: (SEL) _cmd = "description"

Hide Details

Hide Details

Expecting sub string: ARG: (MyString *) self Matched

Hide Details

Expecting pattern: ARG: \(.*\) _cmd Matched

Hide Details

Expecting pattern: (objc_selector *)|(SEL) Matched

Hide Details

runCmd: frame variable *_cmd output: (SEL) *_cmd = ""

Hide Details

Hide Details

runCmd: frame variable --show-types self->str output: (NSString *) self->str = 0x0000611000002980 @"Hello from '/Users/buildslave/jenkins/workspace/lldb-cmake-sanitized/lldb-build/lldb-test-build.noindex/lang/objc/foundation/TestObjCMethods.test_data_type_and_expr_dsym/a.out'"

Hide Details

Hide Details

Expecting start string: (NSString *) self->str Matched

Hide Details

runCmd: frame variable --show-types self->date output: (NSDate *) self->date = 0x00006020000024d0 2020-06-03 21:11:02 UTC

Hide Details

Hide Details

Expecting start string: (NSDate *) self->date Matched

Hide Details

runCmd: frame variable --show-types *self output: (MyString) *self = { (MyBase) MyBase = { (NSObject) NSObject = { (Class) isa = MyString } (int) propertyMovesThings = 0 } (NSString *) str = 0x0000611000002980 @"Hello from '/Users/buildslave/jenkins/workspace/lldb-cmake-sanitized/lldb-build/lldb-test-build.noindex/lang/objc/foundation/TestObjCMethods.test_data_type_and_expr_dsym/a.out'" (NSDate *) date = 0x00006020000024d0 2020-06-03 21:11:02 UTC (BOOL) _desc_pauses = NO }

Hide Details

Hide Details

Expecting sub string: (MyString) *self Matched

Hide Details

Expecting sub string: (NSString *) str Matched

Hide Details

Expecting sub string: (NSDate *) date Matched

Hide Details

runCmd: expression self->isa output: (Class) $0 = MyString

Hide Details

Hide Details

Expecting sub string: Class) Matched

Hide Details

runCmd: expression self->non_existent_member check of return status not required runCmd failed! error: <user expression 1>:1:7: 'MyString' does not have a member named 'non_existent_member' self->non_existent_member ~~~~ ^

Hide Details

Hide Details

Expecting sub string: error: Matched

Hide Details

Expecting sub string: 'MyString' does not have a member named 'non_existent_member' Matched

Hide Details

runCmd: expression self->str output: (NSString *) $1 = 0x0000611000002980 @"Hello from '/Users/buildslave/jenkins/workspace/lldb-cmake-sanitized/lldb-build/lldb-test-build.noindex/lang/objc/foundation/TestObjCMethods.test_data_type_and_expr_dsym/a.out'"

Hide Details

Hide Details

runCmd: expression self->date output: (NSDate *) $2 = 0x00006020000024d0 2020-06-03 21:11:02 UTC

Hide Details

Hide Details

runCmd: breakpoint delete 1 output: 1 breakpoints deleted; 0 breakpoint locations disabled.

Hide Details

Hide Details

runCmd: breakpoint set -f "main.m" -l 97 output: Breakpoint 2: where = a.out`Test_MyString + 156 at main.m:97:5, address = 0x000000010000191c

Hide Details

Hide Details

Expecting pattern: ^Breakpoint (?P<bpno>[0-9]+): (?P<num_locations>[0-9]+) locations\.$ Not matched

Hide Details

Expecting pattern: ^Breakpoint (?P<bpno>[0-9]+): (?P<num_locations>no) locations \(pending\)\. Not matched

Hide Details

Expecting pattern: ^Breakpoint (?P<bpno>[0-9]+): where = (?P<module>.*)`(?P<symbol>[+\-]{0,1}[^+]+)( \+ (?P<offset>[0-9]+)){0,1}( \[inlined\] (?P<inline_symbol>.*)){0,1} at (?P<file>[^:]+):(?P<line_no>[0-9]+)(?P<column>(:[0-9]+)?), address = (?P<address>0x[0-9a-fA-F]+)$ Matched

Hide Details

runCmd: process continue output: Process 12123 resuming Process 12123 stopped * thread #1, queue = 'com.apple.main-thread', stop reason = breakpoint 2.1 frame #0: 0x000000010000191c a.out`Test_MyString(program="/Users/buildslave/jenkins/workspace/lldb-cmake-sanitized/lldb-build/lldb-test-build.noindex/lang/objc/foundation/TestObjCMethods.test_data_type_and_expr_dsym/a.out") at main.m:97:5 94 NSString *str = [NSString stringWithFormat:@"Hello from '%s'", program]; 95 MyString *my = [[MyString alloc] initWithNSString:str]; 96 NSLog(@"MyString instance: %@", [my description]); -> 97 my.descriptionPauses = YES; // Set break point at this line. Test 'expression -o -- my'. ^ 98 NSLog(@"MyString instance: %@", [my description]); 99 } 100

Hide Details

Hide Details

Hide Details

runCmd: expression --object-description -- my output: Hello from '/Users/buildslave/jenkins/workspace/lldb-cmake-sanitized/lldb-build/lldb-test-build.noindex/lang/objc/foundation/TestObjCMethods.test_data_type_and_expr_dsym/a.out' with timestamp: 2020-06-03 21:11:02 +0000

Hide Details

Hide Details

Hide Details

Expecting pattern: Hello from.*a.out.*with timestamp: Matched

Hide Details

<bound method SBProcess.Kill of <lldb.SBProcess; proxy of <Swig Object of type 'lldb::SBProcess *' at 0x10cd44c00> >>: success

Hide Details

PASS: LLDB (/Users/buildslave/jenkins/workspace/lldb-cmake-sanitized/lldb-build/bin/clang-11-x86_64) :: test_data_type_and_expr_dsym (TestObjCMethods.FoundationTestCase) runCmd: settings clear -all output:

Hide Details

runCmd: settings set symbols.enable-external-lookup false output:

Hide Details

runCmd: settings set target.auto-apply-fixits false output:

Hide Details

runCmd: settings set plugin.process.gdb-remote.packet-timeout 60 output:

Hide Details

runCmd: settings set symbols.clang-modules-cache-path "/Users/buildslave/jenkins/workspace/lldb-cmake-sanitized/lldb-build/lldb-test-build.noindex/module-cache-lldb/lldb-api" output:

Hide Details

runCmd: settings set use-color false output:

Hide Details

runCmd: setting set target.prefer-dynamic-value no-dynamic-values output:

Hide Details

runCmd: settings set target.env-vars ASAN_OPTIONS=detect_stack_use_after_return=1 DYLD_INSERT_LIBRARIES=/Users/buildslave/jenkins/workspace/lldb-cmake-sanitized/host-compiler/lib/clang/11.0.0/lib/darwin/libclang_rt.asan_osx_dynamic.dylib output:

Hide Details

runCmd: file /Users/buildslave/jenkins/workspace/lldb-cmake-sanitized/lldb-build/lldb-test-build.noindex/lang/objc/foundation/TestObjCMethods.test_data_type_and_expr_dwarf/a.out output: Current executable set to '/Users/buildslave/jenkins/workspace/lldb-cmake-sanitized/lldb-build/lldb-test-build.noindex/lang/objc/foundation/TestObjCMethods.test_data_type_and_expr_dwarf/a.out' (x86_64).

Hide Details

Hide Details

runCmd: breakpoint set -n "-[MyString description]" output: Breakpoint 1: where = a.out`-[MyString description] + 16 at main.m:43:7, address = 0x00000001000015e0

Hide Details

Hide Details

Expecting pattern: ^Breakpoint (?P<bpno>[0-9]+): (?P<num_locations>[0-9]+) locations\.$ Not matched

Hide Details

Expecting pattern: ^Breakpoint (?P<bpno>[0-9]+): (?P<num_locations>no) locations \(pending\)\. Not matched

Hide Details

Expecting pattern: ^Breakpoint (?P<bpno>[0-9]+): where = (?P<module>.*)`(?P<symbol>[+\-]{0,1}[^+]+)( \+ (?P<offset>[0-9]+)){0,1}( \[inlined\] (?P<inline_symbol>.*)){0,1} at (?P<file>[^:]+):(?P<line_no>[0-9]+)(?P<column>(:[0-9]+)?), address = (?P<address>0x[0-9a-fA-F]+)$ Matched

Hide Details

runCmd: run output: Process 12940 stopped * thread #1, queue = 'com.apple.main-thread', stop reason = breakpoint 1.1 frame #0: 0x00000001000015e0 a.out`-[MyString description](self=0x0000604000001cd0, _cmd="description") at main.m:43:7 40 { 41 // Set a breakpoint on '-[MyString description]' and test expressions: 42 // expression (char *)sel_getName(_cmd) -> 43 if (self.descriptionPauses) // Break here for description test ^ 44 { 45 printf ("\nAbout to sleep.\n"); 46 usleep(100000);

Hide Details

Process 12940 launched: '/Users/buildslave/jenkins/workspace/lldb-cmake-sanitized/lldb-build/lldb-test-build.noindex/lang/objc/foundation/TestObjCMethods.test_data_type_and_expr_dwarf/a.out' (x86_64)

Hide Details

Hide Details

runCmd: thread backtrace output: * thread #1, queue = 'com.apple.main-thread', stop reason = breakpoint 1.1 * frame #0: 0x00000001000015e0 a.out`-[MyString description](self=0x0000604000001cd0, _cmd="description") at main.m:43:7 frame #1: 0x0000000100001908 a.out`Test_MyString(program="/Users/buildslave/jenkins/workspace/lldb-cmake-sanitized/lldb-build/lldb-test-build.noindex/lang/objc/foundation/TestObjCMethods.test_data_type_and_expr_dwarf/a.out") at main.m:96:37 frame #2: 0x0000000100001b54 a.out`main(argc=1, argv=0x00007ffeefbff6d0) at main.m:133:5 frame #3: 0x00007fff7d757085 libdyld.dylib`start + 1

Hide Details

Hide Details

Expecting sub string: a.out`-[MyString description] Matched

Hide Details

runCmd: image lookup -t NSString output: Best match found in /Users/buildslave/jenkins/workspace/lldb-cmake-sanitized/lldb-build/lldb-test-build.noindex/lang/objc/foundation/TestObjCMethods.test_data_type_and_expr_dwarf/a.out: id = {0x10000004d}, name = "NSString", byte-size = 8, decl = NSString.h:99, compiler_type = "@interface NSString : NSObject @property(readonly, getter = length, setter = <null selector>) NSUInteger length; @end"

Hide Details

Hide Details

Hide Details

Expecting sub string: name = "NSString" Matched

Hide Details

Expecting sub string: compiler_type = "@interface NSString Matched

Hide Details

runCmd: image lookup -t MyString output: Best match found in /Users/buildslave/jenkins/workspace/lldb-cmake-sanitized/lldb-build/lldb-test-build.noindex/lang/objc/foundation/TestObjCMethods.test_data_type_and_expr_dwarf/a.out: id = {0x1000000bf}, name = "MyString", byte-size = 32, decl = main.m:5, compiler_type = "@interface MyString : MyBase{ NSString * str; NSDate * date; BOOL _desc_pauses; } @property(retain, readwrite, getter = str_property, setter = setStr_property:) NSString *str_property; @property(assign, readwrite, getter = descriptionPauses, setter = setDescriptionPauses:) BOOL descriptionPauses; @end"

Hide Details

Hide Details

Hide Details

Expecting sub string: name = "MyString" Matched

Hide Details

Expecting sub string: compiler_type = "@interface MyString Matched

Hide Details

Expecting sub string: NSString * str; Matched

Hide Details

Expecting sub string: NSDate * date; Matched

Hide Details

runCmd: frame variable --show-types --scope output: ARG: (MyString *) self = 0x0000604000001cd0 ARG: (SEL) _cmd = "description"

Hide Details

Hide Details

Expecting sub string: ARG: (MyString *) self Matched

Hide Details

Expecting pattern: ARG: \(.*\) _cmd Matched

Hide Details

Expecting pattern: (objc_selector *)|(SEL) Matched

Hide Details

runCmd: frame variable *_cmd output: (SEL) *_cmd = ""

Hide Details

Hide Details

runCmd: frame variable --show-types self->str output: (NSString *) self->str = 0x0000611000002980 @"Hello from '/Users/buildslave/jenkins/workspace/lldb-cmake-sanitized/lldb-build/lldb-test-build.noindex/lang/objc/foundation/TestObjCMethods.test_data_type_and_expr_dwarf/a.out'"

Hide Details

Hide Details

Expecting start string: (NSString *) self->str Matched

Hide Details

runCmd: frame variable --show-types self->date output: (NSDate *) self->date = 0x00006020000024d0 2020-06-03 21:11:24 UTC

Hide Details

Hide Details

Expecting start string: (NSDate *) self->date Matched Assertion failed: (tokenKind == tok::kw___bridge_retain), function ParseParenExpression, file /Users/buildslave/jenkins/workspace/lldb-cmake-sanitized/llvm-project/clang/lib/Parse/ParseExpr.cpp, line 2819.

Hide Details

--

Hide Details

******************** PASS: lldb-api :: tools/lldb-server/inferior-crash/TestGdbRemoteAbort.py (1962 of 2030) PASS: lldb-unit :: Editline/./EditlineTests/EditlineTestFixture.EditlineReceivesSingleLineText (1963 of 2030) PASS: lldb-api :: commands/watchpoints/watchpoint_count/TestWatchpointCount.py (1964 of 2030) PASS: lldb-unit :: ObjectFile/ELF/./ObjectFileELFTests/ObjectFileELFTest.GetModuleSpecifications_EarlySectionHeaders (1965 of 2030) PASS: lldb-unit :: Utility/./UtilityTests/StringExtractorTest.GetHexBytes_OddPair (1966 of 2030) UNSUPPORTED: lldb-shell :: Register/x86-64-ymm16-read.test (1967 of 2030) PASS: lldb-unit :: ObjectFile/Breakpad/./ObjectFileBreakpadTests/FuncRecord.parse (1968 of 2030) PASS: lldb-unit :: UnwindAssembly/x86/./UnwindAssemblyx86Tests/Testx86AssemblyInspectionEngine.TestSubESP (1969 of 2030) PASS: lldb-unit :: ObjectFile/ELF/./ObjectFileELFTests/ObjectFileELFTest.GetSymtab_NoSymEntryPointArmThumbAddressClass (1970 of 2030) PASS: lldb-unit :: Utility/./UtilityTests/ArchSpecTest.TripleComponentsWereSpecified (1971 of 2030) PASS: lldb-unit :: Symbol/./SymbolTests/TestTypeSystemClang.TestNotDeletingUserCopyCstrDueToMoveCStr (1972 of 2030) PASS: lldb-unit :: Utility/./UtilityTests/ArgsTest.Yaml (1973 of 2030) PASS: lldb-unit :: Utility/./UtilityTests/StringListTest.SplitIntoLines (1974 of 2030) PASS: lldb-api :: commands/expression/options/TestExprOptions.py (1975 of 2030) PASS: lldb-unit :: Utility/./UtilityTests/OptionsWithRawTest.SingleWhitespaceInput (1976 of 2030) PASS: lldb-api :: python_api/watchpoint/condition/TestWatchpointConditionAPI.py (1977 of 2030) UNSUPPORTED: lldb-api :: tools/lldb-server/TestGdbRemoteAuxvSupport.py (1978 of 2030) PASS: lldb-api :: commands/expression/import-std-module/deque-basic/TestDequeFromStdModule.py (1979 of 2030) PASS: lldb-unit :: SymbolFile/DWARF/./SymbolFileDWARFTests/SymbolFileDWARFTests.TestAbbrevOrder1Start5 (1980 of 2030) PASS: lldb-unit :: Process/gdb-remote/./ProcessGdbRemoteTests/GDBRemoteClientBaseTest.SendContinueAndInterrupt2PacketBug (1981 of 2030) UNSUPPORTED: lldb-shell :: SymbolFile/DWARF/split-dwarf-expression-eval-bug.cpp (1982 of 2030) PASS: lldb-api :: commands/target/basic/TestTargetCommand.py (1983 of 2030) PASS: lldb-api :: commands/expression/anonymous-struct/TestCallUserAnonTypedef.py (1984 of 2030) PASS: lldb-shell :: SymbolFile/DWARF/debug_rnglists-dwo.s (1985 of 2030) PASS: lldb-api :: functionalities/data-formatter/synthcapping/TestSyntheticCapping.py (1986 of 2030) PASS: lldb-api :: functionalities/data-formatter/data-formatter-synth/TestDataFormatterSynth.py (1987 of 2030) PASS: lldb-api :: python_api/symbol-context/two-files/TestSymbolContextTwoFiles.py (1988 of 2030) PASS: lldb-unit :: Utility/./UtilityTests/AnsiTerminal.Basic (1989 of 2030) PASS: lldb-shell :: SymbolFile/NativePDB/global-classes.cpp (1990 of 2030) UNSUPPORTED: lldb-shell :: Register/x86-64-gp-write.test (1991 of 2030) PASS: lldb-unit :: ScriptInterpreter/Python/./ScriptInterpreterPythonTests/PythonDataObjectsTest.TestPythonTupleToStructuredList (1992 of 2030) PASS: lldb-api :: functionalities/thread/exit_during_expression/TestExitDuringExpression.py (1993 of 2030) UNSUPPORTED: lldb-api :: functionalities/darwin_log/format/TestDarwinLogMessageFormat.py (1994 of 2030) PASS: lldb-api :: commands/expression/test/TestExprs.py (1995 of 2030) UNSUPPORTED: lldb-shell :: SymbolFile/PDB/expressions.test (1996 of 2030) PASS: lldb-api :: macosx/find-dsym/deep-bundle/TestDeepBundle.py (1997 of 2030) PASS: lldb-shell :: ObjectFile/ELF/section-addresses.yaml (1998 of 2030) PASS: lldb-unit :: Interpreter/./InterpreterTests/CompletionTest.DirCompletionAbsolute (1999 of 2030) PASS: lldb-api :: commands/expression/context-object/TestContextObject.py (2000 of 2030) PASS: lldb-unit :: Process/minidump/./LLDBMinidumpTests/MinidumpParserTest.MinidumpModuleOrder (2001 of 2030) PASS: lldb-unit :: ScriptInterpreter/Python/./ScriptInterpreterPythonTests/PythonDataObjectsTest.TestPythonDictionaryToStructuredDictionary (2002 of 2030) PASS: lldb-unit :: UnwindAssembly/x86/./UnwindAssemblyx86Tests/Testx86AssemblyInspectionEngine.TestAddRSP (2003 of 2030) PASS: lldb-unit :: Utility/./UtilityTests/RegularExpression.Invalid (2004 of 2030) PASS: lldb-api :: functionalities/data-formatter/data-formatter-stl/libcxx/queue/TestDataFormatterLibcxxQueue.py (2005 of 2030) PASS: lldb-api :: python_api/process/io/TestProcessIO.py (2006 of 2030) PASS: lldb-unit :: Utility/./UtilityTests/StringExtractorTest.GetHexBytes_OddPair2 (2007 of 2030) PASS: lldb-api :: tools/lldb-vscode/breakpoint-events/TestVSCode_breakpointEvents.py (2008 of 2030) PASS: lldb-shell :: ObjectFile/ELF/PT_LOAD-overlap-PT_TLS.yaml (2009 of 2030) PASS: lldb-unit :: Utility/./UtilityTests/StringExtractorTest.GetHexBytesAvail_OddPair2 (2010 of 2030) PASS: lldb-unit :: Utility/./UtilityTests/SerializationRountripTest.SerializeDeserializeCStringNull (2011 of 2030) PASS: lldb-unit :: Utility/./UtilityTests/ScalarTest.SetValueFromCString (2012 of 2030) PASS: lldb-api :: macosx/queues/TestQueues.py (2013 of 2030) PASS: lldb-api :: lang/mixed/TestMixedLanguages.py (2014 of 2030) PASS: lldb-api :: python_api/sbvalue_persist/TestSBValuePersist.py (2015 of 2030) PASS: lldb-api :: functionalities/thread/concurrent_events/TestConcurrentDelayedCrashWithBreakpointSignal.py (2016 of 2030) PASS: lldb-unit :: ScriptInterpreter/Python/./ScriptInterpreterPythonTests/PythonDataObjectsTest.TestPythonBytes (2017 of 2030) UNSUPPORTED: lldb-api :: functionalities/longjmp/TestLongjmp.py (2018 of 2030) PASS: lldb-api :: functionalities/source-map/TestTargetSourceMap.py (2019 of 2030) PASS: lldb-unit :: Utility/./UtilityTests/ArgsTest.TestInsertArg (2020 of 2030) PASS: lldb-api :: functionalities/thread/exit_during_step/TestExitDuringStep.py (2021 of 2030) PASS: lldb-api :: python_api/get-value-32bit-int/TestGetValue32BitInt.py (2022 of 2030) PASS: lldb-api :: commands/expression/completion-crash-incomplete-record/TestCompletionCrashIncompleteRecord.py (2023 of 2030) PASS: lldb-unit :: Utility/./UtilityTests/NameMatchesTest.Ignore (2024 of 2030) PASS: lldb-unit :: UnwindAssembly/x86/./UnwindAssemblyx86Tests/Testx86AssemblyInspectionEngine.TestSimple64bitFrameFunction (2025 of 2030) PASS: lldb-unit :: Expression/./ExpressionTests/DWARFExpression.DW_OP_pick (2026 of 2030) PASS: lldb-unit :: Language/Highlighting/./HighlighterTests/HighlighterTest.ClangUnterminatedString (2027 of 2030) PASS: lldb-api :: functionalities/type_completion/TestTypeCompletion.py (2028 of 2030) PASS: lldb-api :: functionalities/tail_call_frames/unambiguous_sequence/TestUnambiguousTailCalls.py (2029 of 2030) PASS: lldb-api :: lang/objc/real-definition/TestRealDefinition.py (2030 of 2030) Slowest Tests: -------------------------------------------------------------------------- 350.07s: lldb-api :: tools/lldb-server/TestLldbGdbServer.py 263.39s: lldb-api :: lang/cpp/enum_types/TestCPP11EnumTypes.py 248.34s: lldb-api :: api/multithreaded/TestMultithreaded.py 246.13s: lldb-api :: tools/lldb-server/TestGdbRemoteThreadsInStopReply.py 155.75s: lldb-api :: lang/objc/exceptions/TestObjCExceptions.py 152.76s: lldb-api :: lang/cpp/namespace/TestNamespaceLookup.py 136.92s: lldb-api :: lang/objc/real-definition/TestRealDefinition.py 122.60s: lldb-api :: types/TestLongTypesExpr.py 119.57s: lldb-api :: tools/lldb-server/TestGdbRemote_qThreadStopInfo.py 109.12s: lldb-api :: lang/objc/foundation/TestObjCMethods.py 99.46s: lldb-api :: lang/objc/forward-decl/TestForwardDecl.py 91.91s: lldb-api :: functionalities/gdb_remote_client/TestWasm.py 91.16s: lldb-api :: commands/settings/TestSettings.py 86.92s: lldb-api :: functionalities/data-formatter/compactvectors/TestCompactVectors.py 86.77s: lldb-api :: commands/expression/import-std-module/vector/TestVectorFromStdModule.py 85.10s: lldb-api :: types/TestLongTypes.py 80.19s: lldb-api :: types/TestIntegerTypeExpr.py 80.07s: lldb-api :: python_api/lldbutil/iter/TestLLDBIterator.py 79.16s: lldb-api :: api/check_public_api_headers/TestPublicAPIHeaders.py 75.21s: lldb-api :: commands/expression/import-std-module/stack/TestStackFromStdModule.py

Hide Details

Tests Times: -------------------------------------------------------------------------- [ Range ] :: [ Percentage ] :: [ Count ] -------------------------------------------------------------------------- [340s,360s) :: [ ] :: [ 1/2030] [320s,340s) :: [ ] :: [ 0/2030] [300s,320s) :: [ ] :: [ 0/2030] [280s,300s) :: [ ] :: [ 0/2030] [260s,280s) :: [ ] :: [ 1/2030] [240s,260s) :: [ ] :: [ 2/2030] [220s,240s) :: [ ] :: [ 0/2030] [200s,220s) :: [ ] :: [ 0/2030] [180s,200s) :: [ ] :: [ 0/2030] [160s,180s) :: [ ] :: [ 1/2030] [140s,160s) :: [ ] :: [ 2/2030] [120s,140s) :: [ ] :: [ 2/2030] [100s,120s) :: [ ] :: [ 2/2030] [ 80s,100s) :: [ ] :: [ 8/2030] [ 60s, 80s) :: [ ] :: [ 21/2030] [ 40s, 60s) :: [* ] :: [ 86/2030] [ 20s, 40s) :: [** ] :: [ 127/2030] [ 0s, 20s) :: [*********************************** ] :: [1777/2030] -------------------------------------------------------------------------- ******************** Failing Tests (53): lldb-api :: lang/objc/objc++/TestObjCXX.py lldb-api :: commands/expression/two-files/TestObjCTypeQueryFromOtherCompileUnit.py lldb-api :: lang/objc/forward-decl/TestForwardDecl.py lldb-api :: lang/objc/objc-new-syntax/TestObjCNewSyntaxDictionary.py lldb-api :: lang/objc/objc-ivar-protocols/TestIvarProtocols.py lldb-api :: functionalities/data-formatter/data-formatter-objc/TestDataFormatterObjCCF.py lldb-api :: commands/expression/call-throws/TestCallThatThrows.py lldb-api :: lang/objc/self/TestObjCSelf.py lldb-api :: lang/objc/radar-9691614/TestObjCMethodReturningBOOL.py lldb-api :: commands/expression/import_builtin_fileid/TestImportBuiltinFileID.py lldb-api :: commands/expression/persist_objc_pointeetype/TestPersistObjCPointeeType.py lldb-api :: lang/objc/objc-new-syntax/TestObjCNewSyntaxArray.py lldb-api :: lang/objc/conflicting-definition/TestConflictingDefinition.py lldb-api :: lang/objc/modules-non-objc-target/TestObjCModulesNonObjCTarget.py lldb-api :: lang/objc/modules/TestObjCModules.py lldb-api :: functionalities/data-formatter/synthupdate/TestSyntheticFilterRecompute.py lldb-api :: lang/objc/rdar-11355592/TestRdar11355592.py lldb-api :: functionalities/data-formatter/data-formatter-objc/nsindexpath/TestDataFormatterNSIndexPath.py lldb-api :: lang/objc/foundation/TestRuntimeTypes.py lldb-api :: lang/objc/objc-static-method/TestObjCStaticMethod.py lldb-api :: lang/objc/objc-new-syntax/TestObjCNewSyntaxLiteral.py lldb-api :: functionalities/data-formatter/data-formatter-objc/TestDataFormatterObjCExpr.py lldb-api :: lang/objc/foundation/TestObjCMethodsNSArray.py lldb-api :: lang/objc/foundation/TestConstStrings.py lldb-api :: lang/objc/objc-struct-argument/TestObjCStructArgument.py lldb-api :: lang/objcxx/cxx-bridged-po/TestObjCXXBridgedPO.py lldb-api :: lang/objc/objc_direct-methods/TestObjCDirectMethods.py lldb-api :: functionalities/set-data/TestSetData.py lldb-api :: lang/objc/blocks/TestObjCIvarsInBlocks.py lldb-api :: lang/objc/foundation/TestObjCMethodsNSError.py lldb-api :: python_api/exprpath_synthetic/TestExprPathSynthetic.py lldb-api :: lang/objc/variadic_methods/TestVariadicMethods.py lldb-api :: lang/objc/objc-runtime-ivars/TestRuntimeIvars.py lldb-api :: lang/objc/objc-super/TestObjCSuper.py lldb-api :: commands/expression/diagnostics/TestExprDiagnostics.py lldb-api :: lang/objc/foundation/TestObjCMethodsString.py lldb-api :: lang/objc/objc-property/TestObjCProperty.py lldb-api :: functionalities/data-formatter/data-formatter-objc/TestDataFormatterObjCNSError.py lldb-api :: commands/expression/context-object-objc/TestContextObjectObjc.py lldb-api :: lang/objc/objc-struct-return/TestObjCStructReturn.py lldb-api :: lang/objc/bitfield_ivars/TestBitfieldIvars.py lldb-api :: commands/expression/namespace_local_var_same_name_obj_c/TestNamespaceLocalVarSameNameObjC.py lldb-api :: lang/objc/hidden-ivars/TestHiddenIvars.py lldb-api :: lang/objc/print-obj/TestPrintObj.py lldb-api :: commands/expression/po_verbosity/TestPoVerbosity.py lldb-api :: lang/objc/objc-optimized/TestObjcOptimized.py lldb-api :: lang/objc/orderedset/TestOrderedSet.py lldb-api :: functionalities/data-formatter/data-formatter-objc/TestDataFormatterObjCNSContainer.py lldb-api :: lang/objc/objc-class-method/TestObjCClassMethod.py lldb-api :: lang/objc/unicode-string/TestUnicodeString.py lldb-api :: lang/objcxx/objcxx-ivar-vector/TestIvarVector.py lldb-api :: functionalities/data-formatter/poarray/TestPrintObjectArray.py lldb-api :: lang/objc/foundation/TestObjCMethods.py

Hide Details

Hide Details

Testing Time: 4154.74s Unsupported Tests : 170 Expected Passes : 1801 Expected Failures : 6 Unexpected Failures: 53 FAILED: tools/lldb/test/CMakeFiles/check-lldb-lit cd /Users/buildslave/jenkins/workspace/lldb-cmake-sanitized/lldb-build/tools/lldb/test && /usr/local/Frameworks/Python.framework/Versions/3.7/bin/python3.7 /Users/buildslave/jenkins/workspace/lldb-cmake-sanitized/lldb-build/./bin/llvm-lit -v --time-tests --shuffle --xunit-xml-output=/Users/buildslave/jenkins/workspace/lldb-cmake-sanitized/test/results.xml -v -j 4 --timeout 1200 /Users/buildslave/jenkins/workspace/lldb-cmake-sanitized/lldb-build/tools/lldb/test ninja: build stopped: subcommand failed. Command failed: Command '['/usr/bin/env', 'TERM=vt100', '/usr/local/bin/ninja', '-v', 'check-lldb']' returned non-zero exit status 1. Command: ['/usr/bin/env', 'TERM=vt100', '/usr/local/bin/ninja', '-v', 'check-lldb'] [Pipeline] } [Pipeline] // timeout [Pipeline] } [Pipeline] // stage [Pipeline] stage [Pipeline] { (Declarative: Post Actions) [Pipeline] scanForIssues [Clang (LLVM based)] Sleeping for 5 seconds due to JENKINS-32191... [Clang (LLVM based)] Parsing console log (workspace: '/Users/buildslave/jenkins/workspace/lldb-cmake-sanitized') [Clang (LLVM based)] Successfully parsed console log [Clang (LLVM based)] -> found 2 issues (skipped 0 duplicates) [Clang (LLVM based)] Post processing issues on 'green-dragon-23' with source code encoding 'UTF-8' [Clang (LLVM based)] Creating SCM blamer to obtain author and commit information for affected files [Clang (LLVM based)] Creating SCM miner to obtain statistics for affected repository files [Clang (LLVM based)] Resolving file names for all issues in source directory '/Users/buildslave/jenkins/workspace/lldb-cmake-sanitized' [Clang (LLVM based)] -> resolved paths in source directory (1 found, 0 not found) [Clang (LLVM based)] Resolving module names from module definitions (build.xml, pom.xml, or Manifest.mf files) [Clang (LLVM based)] -> resolved module names for 2 issues [Clang (LLVM based)] Resolving package names (or namespaces) by parsing the affected files [Clang (LLVM based)] -> resolved package names of 1 affected files [Clang (LLVM based)] No filter has been set, publishing all 2 issues [Clang (LLVM based)] Creating fingerprints for all affected code blocks to track issues over different builds [Clang (LLVM based)] -> created fingerprints for 2 issues (skipped 0 issues) [Clang (LLVM based)] Copying affected files to Jenkins' build folder '/Users/Shared/Jenkins/Home/jobs/lldb-cmake-sanitized/builds/1505/files-with-issues' [Clang (LLVM based)] -> 1 copied, 0 not in workspace, 0 not-found, 0 with I/O error [Pipeline] junit Recording test results [Pipeline] } [Pipeline] // stage [Pipeline] } [Pipeline] // withEnv [Pipeline] } [Pipeline] // node [Pipeline] End of Pipeline ERROR: script returned exit code 1 Finished: FAILURE