FailedConsole Output

Skipping 8,363 KB.. Full Log
:: Utility/./UtilityTests/StringListTest.CopyList (593 of 2058)
PASS: lldb-shell :: SymbolFile/DWARF/debug_line-relative_path.s (594 of 2058)
PASS: lldb-unit :: Utility/./UtilityTests/ArgsTest.TestArgv (595 of 2058)
PASS: lldb-unit :: Utility/./UtilityTests/ScalarTest.RightShiftOperator (596 of 2058)
PASS: lldb-shell :: SymbolFile/NativePDB/function-types-calling-conv.cpp (597 of 2058)
PASS: lldb-unit :: Process/minidump/./LLDBMinidumpTests/MinidumpParserTest.GetThreadContext_x86_32 (598 of 2058)
UNSUPPORTED: lldb-api :: functionalities/tsan/basic/TestTsanBasic.py (599 of 2058)
PASS: lldb-unit :: Core/./LLDBCoreTests/SourceFileCache.FindSourceFileNotFound (600 of 2058)
PASS: lldb-unit :: Language/Highlighting/./HighlighterTests/HighlighterTest.ClangSquareBrackets (601 of 2058)
PASS: lldb-api :: python_api/default-constructor/TestDefaultConstructorForAPIObjects.py (602 of 2058)
PASS: lldb-unit :: ObjectFile/PECOFF/./ObjectFilePECOFFTests/PECallFrameInfoTest.Basic_eh (603 of 2058)
UNSUPPORTED: lldb-api :: tools/lldb-server/platform-process-connect/TestPlatformProcessConnect.py (604 of 2058)
PASS: lldb-api :: lang/cpp/rvalue-references/TestRvalueReferences.py (605 of 2058)
PASS: lldb-unit :: Utility/./UtilityTests/StringListTest.JoinMultiCharSeparator (606 of 2058)
PASS: lldb-unit :: Utility/./UtilityTests/DataExtractorTest.GetCStrAtEnd (607 of 2058)
PASS: lldb-api :: lang/cpp/unicode-literals/TestUnicodeLiterals.py (608 of 2058)
PASS: lldb-unit :: Expression/./ExpressionTests/CppModuleConfigurationTest.MissingLibCpp (609 of 2058)
PASS: lldb-api :: macosx/safe-to-func-call/TestSafeFuncCalls.py (610 of 2058)
PASS: lldb-api :: functionalities/data-formatter/data-formatter-skip-summary/TestDataFormatterSkipSummary.py (611 of 2058)
PASS: lldb-api :: commands/expression/call-function/TestCallStopAndContinue.py (612 of 2058)
PASS: lldb-unit :: SymbolFile/DWARF/./SymbolFileDWARFTests/SymbolFileDWARFTests.TestAbbrevMissingTerminator (613 of 2058)
UNSUPPORTED: lldb-api :: functionalities/darwin_log/basic/TestDarwinLogBasic.py (614 of 2058)
PASS: lldb-api :: functionalities/archives/TestBSDArchives.py (615 of 2058)
PASS: lldb-unit :: UnwindAssembly/x86/./UnwindAssemblyx86Tests/Testx86AssemblyInspectionEngine.TestPopR12 (616 of 2058)
PASS: lldb-unit :: Utility/./UtilityTests/IndexToObjectTest.ObjectForIndex (617 of 2058)
PASS: lldb-api :: functionalities/thread/concurrent_events/TestConcurrentBreakpointsDelayedBreakpointOneWatchpoint.py (618 of 2058)
PASS: lldb-unit :: UnwindAssembly/x86/./UnwindAssemblyx86Tests/Testx86AssemblyInspectionEngine.TestPopESI (619 of 2058)
PASS: lldb-unit :: Utility/./UtilityTests/UriParserTest.BracketedHostname (620 of 2058)
PASS: lldb-api :: lang/cpp/this_class_type_mixing/TestThisClassTypeMixing.py (621 of 2058)
PASS: lldb-shell :: Expr/TestMultilineExpr.test (622 of 2058)
PASS: lldb-shell :: SymbolFile/DWARF/find-variable-dwo.cpp (623 of 2058)
PASS: lldb-unit :: Utility/./UtilityTests/CompletionRequest.TestCompletionOwnership (624 of 2058)
PASS: lldb-shell :: Commands/command-thread-select.test (625 of 2058)
PASS: lldb-unit :: Expression/./ExpressionTests/DiagnosticManagerTest.AppendMessageNoDiag (626 of 2058)
PASS: lldb-unit :: Utility/./UtilityTests/StringListTest.ShiftMove (627 of 2058)
PASS: lldb-unit :: Utility/./UtilityTests/FileSpecTest.PrependPathComponent (628 of 2058)
PASS: lldb-api :: functionalities/thread/concurrent_events/TestConcurrentDelaySignalBreak.py (629 of 2058)
PASS: lldb-shell :: Process/TestEnvironment.test (630 of 2058)
PASS: lldb-shell :: Settings/TestSettingsSet.test (631 of 2058)
PASS: lldb-unit :: Process/minidump/./LLDBMinidumpTests/MinidumpParserTest.GetArchitecture (632 of 2058)
PASS: lldb-shell :: Quit/TestQuitExitCodeImplicit0.test (633 of 2058)
PASS: lldb-api :: functionalities/data-formatter/type_summary_list_script/TestTypeSummaryListScript.py (634 of 2058)
PASS: lldb-api :: lang/objc/objc-new-syntax/TestObjCNewSyntaxLiteral.py (635 of 2058)
PASS: lldb-unit :: Utility/./UtilityTests/RangeTest.ContainsAddr (636 of 2058)
PASS: lldb-unit :: Process/gdb-remote/./ProcessGdbRemoteTests/GDBRemoteCommunicationClientTest.GetMemoryRegionInfo (637 of 2058)
PASS: lldb-unit :: Language/Highlighting/./HighlighterTests/HighlighterTest.FallbackHighlighter (638 of 2058)
PASS: lldb-unit :: Utility/./UtilityTests/StatusTest.ErrorConstructor (639 of 2058)
PASS: lldb-unit :: Utility/./UtilityTests/BinaryStreamTest.PutSLEB128FiveBytes (640 of 2058)
PASS: lldb-api :: functionalities/data-formatter/builtin-formats/TestBuiltinFormats.py (641 of 2058)
PASS: lldb-unit :: debugserver/./debugserverTests/RNBSocket.AnyListen (642 of 2058)
PASS: lldb-api :: python_api/lldbutil/frame/TestFrameUtils.py (643 of 2058)
PASS: lldb-api :: functionalities/data-formatter/format-propagation/TestFormatPropagation.py (644 of 2058)
PASS: lldb-unit :: Symbol/./SymbolTests/TestClangASTImporter.DeportDeclTagDecl (645 of 2058)
PASS: lldb-unit :: Utility/./UtilityTests/StringExtractorTest.GetHexBytesAvail_OddPair (646 of 2058)
PASS: lldb-unit :: Interpreter/./InterpreterTests/OptionArgParserTest.toChar (647 of 2058)
PASS: lldb-unit :: Utility/./UtilityTests/ConstStringTest.CompareStringRef (648 of 2058)
UNSUPPORTED: lldb-shell :: ScriptInterpreter/Lua/command_script_import.test (649 of 2058)
PASS: lldb-unit :: Language/Highlighting/./HighlighterTests/HighlighterTest.HighlighterSelectionPath (650 of 2058)
PASS: lldb-unit :: Utility/./UtilityTests/StreamTeeTest.Constructor2Streams (651 of 2058)
PASS: lldb-unit :: Utility/./UtilityTests/BinaryStreamTest.PutULEB128FourBytes (652 of 2058)
PASS: lldb-shell :: SymbolFile/DWARF/debug_rnglists.s (653 of 2058)
PASS: lldb-unit :: Utility/./UtilityTests/ScalarTest.APIntConstructor (654 of 2058)
PASS: lldb-unit :: Utility/./UtilityTests/FileSpecTest.FileAndDirectoryComponents (655 of 2058)
PASS: lldb-unit :: Symbol/./SymbolTests/TestClangASTImporter.ImportInvalidType (656 of 2058)
PASS: lldb-unit :: Utility/./UtilityTests/StringExtractorTest.GetNameColonValueSuccess (657 of 2058)
PASS: lldb-shell :: ObjectFile/MachO/lc_version_min.yaml (658 of 2058)
PASS: lldb-unit :: UnwindAssembly/x86/./UnwindAssemblyx86Tests/Testx86AssemblyInspectionEngine.TestPopR13 (659 of 2058)
PASS: lldb-api :: functionalities/data-formatter/data-formatter-objc/TestDataFormatterObjCKVO.py (660 of 2058)
PASS: lldb-api :: functionalities/data-formatter/data-formatter-stl/libcxx/vbool/TestDataFormatterLibcxxVBool.py (661 of 2058)
PASS: lldb-unit :: Utility/./UtilityTests/DataExtractorTest.GetSLEB128_bit63 (662 of 2058)
PASS: lldb-unit :: Expression/./ExpressionTests/ClangExpressionDeclMapTest.TestUnknownIdentifierLookup (663 of 2058)
PASS: lldb-api :: python_api/sblaunchinfo/TestSBLaunchInfo.py (664 of 2058)
PASS: lldb-unit :: Utility/./UtilityTests/StringListTest.LongestCommonPrefixNoPrefix (665 of 2058)
PASS: lldb-unit :: UnwindAssembly/x86/./UnwindAssemblyx86Tests/Testx86AssemblyInspectionEngine.TestAddRSP (666 of 2058)
PASS: lldb-unit :: Utility/./UtilityTests/ScalarTest.Equality (667 of 2058)
PASS: lldb-unit :: UnwindAssembly/x86/./UnwindAssemblyx86Tests/Testx86AssemblyInspectionEngine.TestPushRBP (668 of 2058)
PASS: lldb-unit :: Expression/./ExpressionTests/DiagnosticManagerTest.PutStringMultiple (669 of 2058)
PASS: lldb-unit :: Language/CPlusPlus/./LanguageCPlusPlusTests/CPlusPlusLanguage.FindAlternateFunctionManglings (670 of 2058)
PASS: lldb-unit :: Utility/./UtilityTests/LogChannelEnabledTest.LLDB_LOG_ERROR (671 of 2058)
PASS: lldb-unit :: Host/./HostTests/SocketTest.DecodeHostAndPort (672 of 2058)
PASS: lldb-api :: lang/c/stepping/TestThreadStepping.py (673 of 2058)
PASS: lldb-unit :: Symbol/./SymbolTests/TestTypeSystemClang.TestBuiltinTypeForEncodingAndBitSize (674 of 2058)
PASS: lldb-api :: functionalities/data-formatter/data-formatter-stl/libstdcpp/unique_ptr/invalid/TestDataFormatterInvalidStdUniquePtr.py (675 of 2058)
PASS: lldb-shell :: Commands/command-source.test (676 of 2058)
PASS: lldb-unit :: SymbolFile/NativePDB/./SymbolFileNativePDBTests/PDBFPOProgramToDWARFExpressionTests.SingleAssignmentRegisterRef (677 of 2058)
PASS: lldb-api :: functionalities/rerun/TestRerun.py (678 of 2058)
UNSUPPORTED: lldb-api :: functionalities/data-formatter/data-formatter-stl/libstdcpp/vector/TestDataFormatterStdVector.py (679 of 2058)
PASS: lldb-api :: functionalities/data-formatter/data-formatter-stl/libcxx/unordered/TestDataFormatterUnordered.py (680 of 2058)
PASS: lldb-unit :: Utility/./UtilityTests/StringExtractorTest.DecodeHexU8_Underflow (681 of 2058)
PASS: lldb-unit :: Host/./HostTests/MainLoopTest.ReadObject (682 of 2058)
PASS: lldb-unit :: Utility/./UtilityTests/StringListTest.InsertStringAtIndexEnd (683 of 2058)
PASS: lldb-unit :: Utility/./UtilityTests/StringListTest.InsertStringAtIndexStdString (684 of 2058)
PASS: lldb-shell :: Commands/command-disassemble.s (685 of 2058)
PASS: lldb-shell :: Commands/command-regex-unalias.test (686 of 2058)
PASS: lldb-unit :: ObjectFile/PECOFF/./ObjectFilePECOFFTests/PECallFrameInfoTest.Frame_reg_eh (687 of 2058)
PASS: lldb-unit :: Utility/./UtilityTests/StringExtractorTest.GetNameColonValueContainsColon (688 of 2058)
PASS: lldb-api :: tools/lldb-server/TestGdbRemote_vCont.py (689 of 2058)
PASS: lldb-api :: lang/cpp/type_lookup/TestCppTypeLookup.py (690 of 2058)
PASS: lldb-api :: lang/cpp/class_types/TestClassTypes.py (691 of 2058)
PASS: lldb-shell :: SymbolFile/symbol-binding.test (692 of 2058)
PASS: lldb-unit :: UnwindAssembly/x86/./UnwindAssemblyx86Tests/Testx86AssemblyInspectionEngine.TestSimple64bitFrameFunction (693 of 2058)
PASS: lldb-api :: lang/objc/objc-ivar-offsets/TestObjCIvarOffsets.py (694 of 2058)
PASS: lldb-shell :: ObjectFile/PECOFF/export-dllfunc.yaml (695 of 2058)
PASS: lldb-unit :: Utility/./UtilityTests/StringListTest.GetSize (696 of 2058)
PASS: lldb-api :: lang/cpp/std-function-step-into-callable/TestStdFunctionStepIntoCallable.py (697 of 2058)
PASS: lldb-api :: commands/expression/timeout/TestCallWithTimeout.py (698 of 2058)
UNSUPPORTED: lldb-api :: commands/expression/multiline-completion/TestMultilineCompletion.py (699 of 2058)
PASS: lldb-unit :: Target/./TargetTests/PathMappingListTest.RemapRoot (700 of 2058)
PASS: lldb-unit :: Utility/./UtilityTests/BroadcasterTest.BroadcastEvent (701 of 2058)
PASS: lldb-unit :: ObjectFile/ELF/./ObjectFileELFTests/ObjectFileELFTest.SectionsResolveConsistently (702 of 2058)
PASS: lldb-api :: functionalities/object-file/TestImageListMultiArchitecture.py (703 of 2058)
UNSUPPORTED: lldb-api :: functionalities/darwin_log/source/debug/TestDarwinLogSourceDebug.py (704 of 2058)
PASS: lldb-unit :: Platform/./LLDBPlatformTests/PlatformDarwinTest.FindComponentInPath (705 of 2058)
PASS: lldb-unit :: Utility/./UtilityTests/BinaryStreamTest.PutSLEB128EightBytes (706 of 2058)
PASS: lldb-unit :: Utility/./UtilityTests/ScalarTest.TruncOrExtendTo (707 of 2058)
UNSUPPORTED: lldb-shell :: Register/x86-64-ymm16-read.test (708 of 2058)
PASS: lldb-api :: functionalities/breakpoint/require_hw_breakpoints/TestRequireHWBreakpoints.py (709 of 2058)
PASS: lldb-unit :: Host/./HostTests/FileSystemTest.GetByteSize (710 of 2058)
PASS: lldb-api :: types/TestIntegerType.py (711 of 2058)
PASS: lldb-api :: commands/frame/select/TestFrameSelect.py (712 of 2058)
PASS: lldb-unit :: Utility/./UtilityTests/StreamTest.PutHex32ByteOrderLittle (713 of 2058)
PASS: lldb-unit :: Utility/./UtilityTests/UriParserTest.BracketedHostnameWithPortIPv4 (714 of 2058)
PASS: lldb-unit :: Utility/./UtilityTests/UriParserTest.Empty (715 of 2058)
PASS: lldb-api :: lang/c/unions/TestUnionMembers.py (716 of 2058)
PASS: lldb-api :: lang/c/complex/TestComplexC99.py (717 of 2058)
PASS: lldb-api :: lang/c/complex_int/TestComplexInt.py (718 of 2058)
PASS: lldb-api :: lang/objc/objc-static-method/TestObjCStaticMethod.py (719 of 2058)
PASS: lldb-api :: lang/cpp/class-template-parameter-pack/TestClassTemplateParameterPack.py (720 of 2058)
PASS: lldb-shell :: SymbolFile/Breakpad/line-table-missing-file.test (721 of 2058)
PASS: lldb-unit :: Utility/./UtilityTests/StringExtractorTest.GetHexU8_Underflow2 (722 of 2058)
PASS: lldb-api :: lang/objc/foundation/TestObjCMethods.py (723 of 2058)
UNSUPPORTED: lldb-api :: tools/lldb-server/signal-filtering/TestGdbRemote_QPassSignals.py (724 of 2058)
UNSUPPORTED: lldb-shell :: Register/x86-64-gp-write.test (725 of 2058)
PASS: lldb-shell :: SymbolFile/DWARF/split-dwarf-inlining.cpp (726 of 2058)
PASS: lldb-api :: commands/watchpoints/hello_watchpoint/TestMyFirstWatchpoint.py (727 of 2058)
PASS: lldb-api :: lang/objc/foundation/TestSymbolTable.py (728 of 2058)
PASS: lldb-unit :: Utility/./UtilityTests/StringExtractorTest.InitEmpty (729 of 2058)
PASS: lldb-api :: functionalities/data-formatter/data-formatter-stl/libcxx/optional/TestDataFormatterLibcxxOptional.py (730 of 2058)
PASS: lldb-unit :: ScriptInterpreter/Python/./ScriptInterpreterPythonTests/PythonDataObjectsTest.TestPythonBoolean (731 of 2058)
PASS: lldb-unit :: Utility/./UtilityTests/StreamTeeTest.Constructor1Stream (732 of 2058)
UNSUPPORTED: lldb-shell :: SymbolFile/PDB/compilands.test (733 of 2058)
PASS: lldb-shell :: SymbolFile/DWARF/gnu-style-compression.cpp (734 of 2058)
PASS: lldb-api :: commands/expression/codegen-crash-typedefdecl-not-in_declcontext/TestCodegenCrashTypedefDeclNotInDeclContext.py (735 of 2058)
PASS: lldb-unit :: Utility/./UtilityTests/UriParserTest.MinimalPortPath (736 of 2058)
PASS: lldb-api :: functionalities/data-formatter/data-formatter-objc/TestDataFormatterObjCNSData.py (737 of 2058)
PASS: lldb-api :: lang/cpp/namespace_definitions/TestNamespaceDefinitions.py (738 of 2058)
PASS: lldb-unit :: UnwindAssembly/x86/./UnwindAssemblyx86Tests/Testx86AssemblyInspectionEngine.TestPopR15 (739 of 2058)
PASS: lldb-shell :: SymbolFile/DWARF/debug-names-compressed.cpp (740 of 2058)
PASS: lldb-unit :: UnwindAssembly/x86/./UnwindAssemblyx86Tests/Testx86AssemblyInspectionEngine.TestDisassemblyMidFunctionEpilogues (741 of 2058)
PASS: lldb-api :: commands/watchpoints/watchpoint_count/TestWatchpointCount.py (742 of 2058)
PASS: lldb-unit :: Process/gdb-remote/./ProcessGdbRemoteTests/GDBRemoteCommunicationClientTest.SendGetDataPacket (743 of 2058)
PASS: lldb-api :: functionalities/gdb_remote_client/TestTargetXMLArch.py (744 of 2058)
PASS: lldb-unit :: Process/gdb-remote/./ProcessGdbRemoteTests/GDBRemoteClientBaseTest.SendContinueAndInterrupt (745 of 2058)
PASS: lldb-api :: lang/objcxx/cxx-bridged-po/TestObjCXXBridgedPO.py (746 of 2058)
PASS: lldb-api :: lang/cpp/class_static/TestStaticVariables.py (747 of 2058)
PASS: lldb-unit :: UnwindAssembly/x86/./UnwindAssemblyx86Tests/Testx86AssemblyInspectionEngine.Test64bitFramelessSmallStackFrame (748 of 2058)
PASS: lldb-shell :: Register/x86-64-gp-read.test (749 of 2058)
PASS: lldb-unit :: Utility/./UtilityTests/StringListTest.AppendStringMove (750 of 2058)
PASS: lldb-api :: lang/cpp/gmodules/TestWithModuleDebugging.py (751 of 2058)
PASS: lldb-unit :: Utility/./UtilityTests/ArgsTest.AppendArguments (752 of 2058)
PASS: lldb-unit :: Utility/./UtilityTests/StreamTest.PutMaxHex64ByteOrderBig (753 of 2058)
PASS: lldb-api :: commands/expression/import-std-module/empty-module/TestEmptyStdModule.py (754 of 2058)
PASS: lldb-api :: tools/lldb-vscode/coreFile/TestVSCode_coreFile.py (755 of 2058)
PASS: lldb-unit :: Utility/./UtilityTests/SubsystemRAIITest.NormalSubsystem (756 of 2058)
PASS: lldb-api :: functionalities/source-map/TestTargetSourceMap.py (757 of 2058)
PASS: lldb-api :: functionalities/data-formatter/data-formatter-categories/TestDataFormatterCategories.py (758 of 2058)
PASS: lldb-unit :: Utility/./UtilityTests/ScalarTest.GetValue (759 of 2058)
PASS: lldb-api :: commands/target/dump-symtab-demangle/TestDumpSymtabDemangle.py (760 of 2058)
PASS: lldb-shell :: Reproducer/Modules/TestModuleCXX.test (761 of 2058)
PASS: lldb-unit :: Platform/./LLDBPlatformTests/PlatformDarwinTest.TestParseVersionBuildDir (762 of 2058)
PASS: lldb-unit :: Utility/./UtilityTests/UriParserTest.MinimalPort (763 of 2058)
PASS: lldb-unit :: Process/gdb-remote/./ProcessGdbRemoteTests/GDBRemoteCommunicationClientTest.GetQOffsets (764 of 2058)
PASS: lldb-unit :: Host/./HostTests/File.GetStreamFromDescriptor (765 of 2058)
PASS: lldb-api :: lang/cpp/accelerator-table/TestCPPAccelerator.py (766 of 2058)
PASS: lldb-shell :: SymbolFile/Breakpad/symtab-macho.test (767 of 2058)
PASS: lldb-shell :: Settings/TestDisassemblyFormat.test (768 of 2058)
PASS: lldb-shell :: SymbolFile/DWARF/DW_TAG_basic_type_DW_ATE_UTF_nonC.ll (769 of 2058)
PASS: lldb-shell :: SymbolFile/NativePDB/break-by-line.cpp (770 of 2058)
PASS: lldb-api :: functionalities/breakpoint/cpp/TestCPPBreakpointLocations.py (771 of 2058)
PASS: lldb-unit :: Core/./LLDBCoreTests/RichManglingContextTest.SwitchProvider (772 of 2058)
PASS: lldb-unit :: Utility/./UtilityTests/ReproducerTest.SetReplay (773 of 2058)
PASS: lldb-unit :: UnwindAssembly/x86/./UnwindAssemblyx86Tests/Testx86AssemblyInspectionEngine.TestPushEAX (774 of 2058)
PASS: lldb-unit :: Utility/./UtilityTests/StatusTest.ErrorCodeConstructor (775 of 2058)
UNSUPPORTED: lldb-shell :: SymbolFile/DWARF/split-dwarf-expression-eval-bug.cpp (776 of 2058)
PASS: lldb-api :: lang/cpp/virtual-overload/TestVirtualOverload.py (777 of 2058)
PASS: lldb-api :: commands/expression/call-function/TestCallBuiltinFunction.py (778 of 2058)
UNSUPPORTED: lldb-api :: functionalities/darwin_log/source/info/TestDarwinLogSourceInfo.py (779 of 2058)
PASS: lldb-api :: commands/expression/import-std-module/basic/TestImportStdModule.py (780 of 2058)
PASS: lldb-unit :: Process/minidump/./LLDBMinidumpTests/MinidumpParserTest.GetMemoryRegionInfoLinuxMaps (781 of 2058)
PASS: lldb-api :: lang/cpp/wchar_t/TestCxxWCharT.py (782 of 2058)
PASS: lldb-api :: commands/expression/import-std-module/unique_ptr-dbg-info-content/TestUniquePtrDbgInfoContent.py (783 of 2058)
UNSUPPORTED: lldb-api :: functionalities/process_save_core/TestProcessSaveCore.py (784 of 2058)
PASS: lldb-unit :: Utility/./UtilityTests/UriParserTest.Minimal (785 of 2058)
PASS: lldb-api :: lang/cpp/exceptions/TestCPPExceptionBreakpoints.py (786 of 2058)
PASS: lldb-unit :: Utility/./UtilityTests/SerializationRountripTest.SerializeDeserializePodPointers (787 of 2058)
UNSUPPORTED: lldb-shell :: SymbolFile/PDB/ast-restore.test (788 of 2058)
PASS: lldb-api :: python_api/symbol-context/TestSymbolContext.py (789 of 2058)
PASS: lldb-unit :: Target/./TargetTests/ModuleCacheTest.GetAndPutUuidExists (790 of 2058)
PASS: lldb-api :: lang/objc/objc-builtin-types/TestObjCBuiltinTypes.py (791 of 2058)
PASS: lldb-api :: lang/objc/objc-ivar-stripped/TestObjCIvarStripped.py (792 of 2058)
PASS: lldb-shell :: ObjectFile/ELF/many-sections.s (793 of 2058)
UNSUPPORTED: lldb-shell :: Register/arm-fp-read.test (794 of 2058)
PASS: lldb-unit :: Utility/./UtilityTests/DataExtractorTest.GetCStr (795 of 2058)
PASS: lldb-unit :: Utility/./UtilityTests/StringListTest.JoinSingle (796 of 2058)
PASS: lldb-api :: commands/expression/formatters/TestFormatters.py (797 of 2058)
PASS: lldb-shell :: SymbolFile/Breakpad/symtab.test (798 of 2058)
PASS: lldb-unit :: Host/./HostTests/MainLoopTest.DetectsEOF (799 of 2058)
PASS: lldb-api :: functionalities/data-formatter/varscript_formatting/TestDataFormatterVarScriptFormatting.py (800 of 2058)
PASS: lldb-shell :: SymbolFile/NativePDB/ast-types.cpp (801 of 2058)
PASS: lldb-unit :: Language/Highlighting/./HighlighterTests/HighlighterTest.ClangCursorPosAfterOtherToken (802 of 2058)
PASS: lldb-api :: tools/lldb-vscode/breakpoint-events/TestVSCode_breakpointEvents.py (803 of 2058)
PASS: lldb-unit :: ScriptInterpreter/Python/./ScriptInterpreterPythonTests/PythonDataObjectsTest.TestPythonStringToStructuredString (804 of 2058)
PASS: lldb-unit :: Host/./HostTests/FileSystemTest.GetPermissions (805 of 2058)
PASS: lldb-shell :: Recognizer/assert.test (806 of 2058)
PASS: lldb-api :: commands/log/invalid-args/TestInvalidArgsLog.py (807 of 2058)
PASS: lldb-unit :: Expression/./ExpressionTests/CppModuleConfigurationTest.AmbiguousCLib (808 of 2058)
PASS: lldb-api :: lang/objcxx/objcxx-ivar-vector/TestIvarVector.py (809 of 2058)
PASS: lldb-shell :: ObjectFile/wasm/unified-debug-sections.yaml (810 of 2058)
PASS: lldb-shell :: ObjectFile/ELF/compressed-sections.yaml (811 of 2058)
PASS: lldb-api :: functionalities/postmortem/minidump-new/TestMiniDumpUUID.py (812 of 2058)
PASS: lldb-api :: functionalities/history/TestHistoryRecall.py (813 of 2058)
PASS: lldb-api :: commands/process/attach-resume/TestAttachResume.py (814 of 2058)
PASS: lldb-api :: macosx/queues/TestQueues.py (815 of 2058)
PASS: lldb-unit :: SymbolFile/NativePDB/./SymbolFileNativePDBTests/PDBFPOProgramToDWARFExpressionTests.InvalidOpBinary (816 of 2058)
PASS: lldb-shell :: Driver/TestCommands.test (817 of 2058)
PASS: lldb-shell :: SymbolFile/NativePDB/tag-types.cpp (818 of 2058)
PASS: lldb-api :: lang/cpp/this/TestCPPThis.py (819 of 2058)
PASS: lldb-shell :: ObjectFile/PECOFF/uuid.yaml (820 of 2058)
UNSUPPORTED: lldb-api :: linux/sepdebugsymlink/TestTargetSymbolsSepDebugSymlink.py (821 of 2058)
PASS: lldb-shell :: ObjectFile/ELF/build-id-case.yaml (822 of 2058)
PASS: lldb-api :: commands/watchpoints/watchpoint_disable/TestWatchpointDisable.py (823 of 2058)
PASS: lldb-api :: types/TestCharTypeExpr.py (824 of 2058)
PASS: lldb-api :: functionalities/thread/thread_specific_break/TestThreadSpecificBreakpoint.py (825 of 2058)
PASS: lldb-unit :: Utility/./UtilityTests/TimeoutTest.Construction (826 of 2058)
UNSUPPORTED: lldb-api :: functionalities/data-formatter/data-formatter-stl/libstdcpp/vbool/TestDataFormatterStdVBool.py (827 of 2058)
PASS: lldb-unit :: ObjectFile/Breakpad/./ObjectFileBreakpadTests/FileRecord.parse (828 of 2058)
UNSUPPORTED: lldb-api :: functionalities/unwind/standard/TestStandardUnwind.py (829 of 2058)
PASS: lldb-shell :: ObjectFile/PECOFF/sections.yaml (830 of 2058)
PASS: lldb-unit :: ScriptInterpreter/Python/./ScriptInterpreterPythonTests/PythonDataObjectsTest.TestScript (831 of 2058)
PASS: lldb-api :: commands/expression/scoped_enums/TestScopedEnumType.py (832 of 2058)
UNSUPPORTED: lldb-api :: benchmarks/frame_variable/TestFrameVariableResponse.py (833 of 2058)
PASS: lldb-api :: lang/cpp/modules-import/TestCXXModulesImport.py (834 of 2058)
PASS: lldb-unit :: Utility/./UtilityTests/ArchSpecTest.OperatorBool (835 of 2058)
PASS: lldb-unit :: Thread/./ThreadTests/ThreadTest.SetStopInfo (836 of 2058)
PASS: lldb-unit :: Utility/./UtilityTests/LogChannelTest.Disable (837 of 2058)
PASS: lldb-unit :: Utility/./UtilityTests/RangeTest.DoesIntersect (838 of 2058)
PASS: lldb-shell :: Driver/LocalLLDBInit.test (839 of 2058)
PASS: lldb-api :: functionalities/target_var/TestTargetVar.py (840 of 2058)
PASS: lldb-unit :: Utility/./UtilityTests/ArchSpecTest.YAML (841 of 2058)
UNSUPPORTED: lldb-api :: functionalities/ptr_refs/TestPtrRefs.py (842 of 2058)
PASS: lldb-api :: commands/expression/import-std-module/vector-dbg-info-content/TestDbgInfoContentVectorFromStdModule.py (843 of 2058)
PASS: lldb-api :: functionalities/pre_run_dylibs/TestPreRunDylibs.py (844 of 2058)
PASS: lldb-unit :: UnwindAssembly/x86/./UnwindAssemblyx86Tests/Testx86AssemblyInspectionEngine.TestPushR14 (845 of 2058)
PASS: lldb-api :: functionalities/plugins/python_os_plugin/stepping_plugin_threads/TestOSPluginStepping.py (846 of 2058)
PASS: lldb-unit :: Utility/./UtilityTests/StreamTeeTest.GetStreamAtIndexOutOfBounds (847 of 2058)
PASS: lldb-unit :: Process/minidump/./LLDBMinidumpTests/RegisterContextMinidump.ConvertMinidumpContext_x86_32 (848 of 2058)
PASS: lldb-unit :: Utility/./UtilityTests/StringListTest.GetMaxStringLengthEqualSize (849 of 2058)
PASS: lldb-unit :: UnwindAssembly/x86/./UnwindAssemblyx86Tests/Testx86AssemblyInspectionEngine.TestLEAVE (850 of 2058)
PASS: lldb-unit :: UnwindAssembly/x86/./UnwindAssemblyx86Tests/Testx86AssemblyInspectionEngine.TestPushECX (851 of 2058)
PASS: lldb-shell :: ObjectFile/ELF/duplicate-section.yaml (852 of 2058)
PASS: lldb-api :: functionalities/deleted-executable/TestDeletedExecutable.py (853 of 2058)
PASS: lldb-api :: macosx/function-starts/TestFunctionStarts.py (854 of 2058)
PASS: lldb-unit :: ObjectFile/PECOFF/./ObjectFilePECOFFTests/PECallFrameInfoTest.Chained_eh (855 of 2058)
PASS: lldb-shell :: Driver/TestSingleQuote.test (856 of 2058)
PASS: lldb-api :: functionalities/data-formatter/ptr_ref_typedef/TestPtrRef2Typedef.py (857 of 2058)
PASS: lldb-unit :: Host/./HostTests/NativeProcessProtocolTest.SetBreakpointFailRead (858 of 2058)
PASS: lldb-shell :: Settings/TestSettingsWrite.test (859 of 2058)
PASS: lldb-api :: commands/process/attach/TestProcessAttach.py (860 of 2058)
PASS: lldb-unit :: Utility/./UtilityTests/OptionsWithRawTest.EmptySuffixSingleWhitespace (861 of 2058)
PASS: lldb-shell :: Unwind/trap_frame_sym_ctx.test (862 of 2058)
PASS: lldb-shell :: Driver/TestProcessAttach.test (863 of 2058)
PASS: lldb-api :: commands/expression/dollar-in-variable/TestDollarInVariable.py (864 of 2058)
PASS: lldb-unit :: Language/Highlighting/./HighlighterTests/HighlighterTest.ClangCursorPosBeforeOtherToken (865 of 2058)
PASS: lldb-api :: commands/expression/diagnostics/TestExprDiagnostics.py (866 of 2058)
PASS: lldb-api :: commands/apropos/basic/TestApropos.py (867 of 2058)
PASS: lldb-shell :: Settings/TestLineMarkerColor.test (868 of 2058)
PASS: lldb-api :: lang/c/conflicting-symbol/TestConflictingSymbol.py (869 of 2058)
PASS: lldb-api :: commands/frame/diagnose/dereference-this/TestDiagnoseDereferenceThis.py (870 of 2058)
PASS: lldb-unit :: Utility/./UtilityTests/StreamTest.PutCStringWithStringRef (871 of 2058)
PASS: lldb-api :: functionalities/breakpoint/serialize/TestBreakpointSerialization.py (872 of 2058)
PASS: lldb-unit :: Utility/./UtilityTests/AnsiTerminal.Twice (873 of 2058)
XFAIL: lldb-shell :: Register/x86-mm-xmm-read.test (874 of 2058)
PASS: lldb-unit :: Host/./HostTests/MainLoopTest.UnmonitoredSignal (875 of 2058)
PASS: lldb-api :: python_api/section/TestSectionAPI.py (876 of 2058)
PASS: lldb-unit :: Utility/./UtilityTests/StringLexerTest.NextIfList (877 of 2058)
PASS: lldb-api :: python_api/objc_type/TestObjCType.py (878 of 2058)
PASS: lldb-unit :: Host/./HostTests/Host.WaitStatusFormat (879 of 2058)
PASS: lldb-unit :: Utility/./UtilityTests/StreamTeeTest.SetStreamAtIndexOverwrite (880 of 2058)
PASS: lldb-api :: lang/objc/objc-class-method/TestObjCClassMethod.py (881 of 2058)
PASS: lldb-unit :: Symbol/./SymbolTests/TestTypeSystemClang.TestGetBasicTypeFromEnum (882 of 2058)
PASS: lldb-api :: python_api/lldbutil/iter/TestRegistersIterator.py (883 of 2058)
UNSUPPORTED: lldb-api :: functionalities/darwin_log/format/TestDarwinLogMessageFormat.py (884 of 2058)
PASS: lldb-unit :: Process/gdb-remote/./ProcessGdbRemoteTests/GDBRemoteClientBaseTest.SendContinueAndWait (885 of 2058)
PASS: lldb-api :: lang/c/register_variables/TestRegisterVariables.py (886 of 2058)
PASS: lldb-unit :: Utility/./UtilityTests/AnsiTerminal.Unknown (887 of 2058)
PASS: lldb-unit :: Utility/./UtilityTests/StringListTest.CopyListSingle (888 of 2058)
PASS: lldb-shell :: Minidump/disassemble-no-module.yaml (889 of 2058)
PASS: lldb-api :: functionalities/breakpoint/dummy_target_breakpoints/TestBreakpointsWithNoTargets.py (890 of 2058)
PASS: lldb-unit :: Utility/./UtilityTests/ArgsTest.ReplaceArgumentAtIndexLonger (891 of 2058)
PASS: lldb-api :: tools/lldb-vscode/attach/TestVSCode_attach.py (892 of 2058)
PASS: lldb-api :: lang/objc/objc-dyn-sbtype/TestObjCDynamicSBType.py (893 of 2058)
PASS: lldb-api :: lang/cpp/char8_t/TestCxxChar8_t.py (894 of 2058)
PASS: lldb-unit :: Symbol/./SymbolTests/LineEntryTest.GetSameLineContiguousAddressRangeNoInlines (895 of 2058)
PASS: lldb-unit :: Target/./TargetTests/MemoryRegionInfoTest.Formatv (896 of 2058)
PASS: lldb-api :: lang/cpp/covariant-return-types/TestCovariantReturnTypes.py (897 of 2058)
PASS: lldb-api :: macosx/add-dsym/TestAddDsymMidExecutionCommand.py (898 of 2058)
PASS: lldb-unit :: ScriptInterpreter/Python/./ScriptInterpreterPythonTests/PythonDataObjectsTest.TestPythonListManipulation (899 of 2058)
PASS: lldb-api :: functionalities/breakpoint/address_breakpoints/TestBadAddressBreakpoints.py (900 of 2058)
PASS: lldb-unit :: UnwindAssembly/x86/./UnwindAssemblyx86Tests/Testx86AssemblyInspectionEngine.TestSpillRegToStackViaMOVi386 (901 of 2058)
PASS: lldb-unit :: UnwindAssembly/x86/./UnwindAssemblyx86Tests/Testx86AssemblyInspectionEngine.TestPushEBP (902 of 2058)
PASS: lldb-shell :: SymbolFile/NativePDB/disassembly.cpp (903 of 2058)
PASS: lldb-unit :: Process/minidump/./LLDBMinidumpTests/MinidumpParserTest.GetMiscInfoWindows (904 of 2058)
PASS: lldb-api :: tools/lldb-server/commandline/TestStubReverseConnect.py (905 of 2058)
PASS: lldb-shell :: SymbolFile/DWARF/debug_loc_and_loclists.s (906 of 2058)
PASS: lldb-api :: functionalities/data-formatter/data-formatter-python-synth/TestDataFormatterPythonSynth.py (907 of 2058)
PASS: lldb-api :: macosx/DBGSourcePathRemapping/TestDSYMSourcePathRemapping.py (908 of 2058)
PASS: lldb-api :: commands/quit/TestQuit.py (909 of 2058)
PASS: lldb-unit :: Utility/./UtilityTests/StringListTest.AppendListCStringArray (910 of 2058)
PASS: lldb-api :: lang/objc/objc-property/TestObjCProperty.py (911 of 2058)
PASS: lldb-api :: functionalities/reproducers/attach/TestReproducerAttach.py (912 of 2058)
PASS: lldb-api :: tools/lldb-server/inferior-crash/TestGdbRemoteSegFault.py (913 of 2058)
PASS: lldb-unit :: Host/./HostTests/FileSystemTest.MakeAbsolute (914 of 2058)
PASS: lldb-api :: functionalities/data-formatter/dump_dynamic/TestDumpDynamic.py (915 of 2058)
PASS: lldb-shell :: ObjectFile/ELF/PT_LOAD-overlap-section.yaml (916 of 2058)
UNSUPPORTED: lldb-api :: functionalities/breakpoint/breakpoint_in_delayslot/TestAvoidBreakpointInDelaySlot.py (917 of 2058)
PASS: lldb-shell :: Reproducer/TestPythonImport.test (918 of 2058)
PASS: lldb-unit :: Utility/./UtilityTests/SerializationRountripTest.SerializeDeserializePodReferences (919 of 2058)
PASS: lldb-api :: functionalities/data-formatter/pyobjsynthprovider/TestPyObjSynthProvider.py (920 of 2058)
PASS: lldb-unit :: Symbol/./SymbolTests/TestTypeSystemClang.TestGetTypeClassTypeOf (921 of 2058)
PASS: lldb-unit :: Utility/./UtilityTests/ArgsTest.TestSingleArg (922 of 2058)
PASS: lldb-shell :: ObjectFile/MachO/symtab.yaml (923 of 2058)
PASS: lldb-unit :: Utility/./UtilityTests/RegularExpression.Match (924 of 2058)
UNSUPPORTED: lldb-shell :: ScriptInterpreter/Lua/persistent_state.test (925 of 2058)
PASS: lldb-unit :: Process/gdb-remote/./ProcessGdbRemoteTests/GDBRemoteCommunicationClientTest.SendGetMetaDataPacket (926 of 2058)
PASS: lldb-shell :: SymbolFile/DWARF/clang-ast-from-dwarf-objc-property.m (927 of 2058)
PASS: lldb-api :: commands/expression/class_template_specialization_empty_pack/TestClassTemplateSpecializationParametersHandling.py (928 of 2058)
PASS: lldb-api :: functionalities/inferior-crashing/TestInferiorCrashing.py (929 of 2058)
PASS: lldb-shell :: Minidump/fb-dump.test (930 of 2058)
PASS: lldb-unit :: Symbol/./SymbolTests/DWARFCallFrameInfoTest.Basic_dwarf4 (931 of 2058)
PASS: lldb-api :: functionalities/plugins/python_os_plugin/TestPythonOSPlugin.py (932 of 2058)
PASS: lldb-unit :: Utility/./UtilityTests/FileSpecTest.AppendPathComponent (933 of 2058)
PASS: lldb-unit :: UnwindAssembly/x86/./UnwindAssemblyx86Tests/Testx86AssemblyInspectionEngine.TestStackRealign8BitDisp_i386 (934 of 2058)
UNSUPPORTED: lldb-api :: functionalities/data-formatter/data-formatter-stl/libstdcpp/smart_ptr/TestDataFormatterStdSmartPtr.py (935 of 2058)
PASS: lldb-api :: lang/cpp/template/TestTemplateArgs.py (936 of 2058)
UNSUPPORTED: lldb-api :: commands/expression/multiline-navigation/TestMultilineNavigation.py (937 of 2058)
PASS: lldb-unit :: ScriptInterpreter/Python/./ScriptInterpreterPythonTests/PythonDataObjectsTest.TestPythonTupleSize (938 of 2058)
PASS: lldb-api :: commands/watchpoints/watchpoint_size/TestWatchpointSizes.py (939 of 2058)
PASS: lldb-shell :: Reproducer/TestFileRepro.test (940 of 2058)
PASS: lldb-shell :: ObjectFile/ELF/basic-info.yaml (941 of 2058)
PASS: lldb-unit :: Utility/./UtilityTests/StringListTest.AppendList (942 of 2058)
PASS: lldb-unit :: tools/lldb-server/tests/./LLDBServerTests/StandardStartupTest.TestStopReplyContainsThreadPcs (943 of 2058)
PASS: lldb-unit :: Utility/./UtilityTests/StringExtractorTest.GetHexBytesAvail_Partial (944 of 2058)
PASS: lldb-unit :: ScriptInterpreter/Python/./ScriptInterpreterPythonTests/PythonDataObjectsTest.TestPythonByteArray (945 of 2058)
PASS: lldb-unit :: ScriptInterpreter/Python/./ScriptInterpreterPythonTests/PythonDataObjectsTest.TestPythonBytes (946 of 2058)
PASS: lldb-unit :: Utility/./UtilityTests/VASprintfTest.BufferResize (947 of 2058)
PASS: lldb-unit :: Utility/./UtilityTests/StreamTest.ShiftOperatorPtr (948 of 2058)
UNSUPPORTED: lldb-api :: lang/objc/ptr_refs/TestPtrRefsObjC.py (949 of 2058)
PASS: lldb-api :: commands/expression/weak_symbols/TestWeakSymbols.py (950 of 2058)
PASS: lldb-api :: commands/expression/invalid-args/TestInvalidArgsExpression.py (951 of 2058)
PASS: lldb-unit :: Utility/./UtilityTests/FileSpecTest.EqualDotsWindows (952 of 2058)
PASS: lldb-api :: functionalities/data-formatter/data-formatter-objc/TestDataFormatterObjCNSURL.py (953 of 2058)
PASS: lldb-api :: macosx/find-dsym/deep-bundle/TestDeepBundle.py (954 of 2058)
PASS: lldb-api :: macosx/version_zero/TestGetVersionZeroVersion.py (955 of 2058)
PASS: lldb-shell :: Driver/TestPositionalArgs.test (956 of 2058)
PASS: lldb-unit :: ScriptInterpreter/Python/./ScriptInterpreterPythonTests/PythonDataObjectsTest.TestPythonIntegerToStr (957 of 2058)
PASS: lldb-api :: lang/objc/objc-struct-argument/TestObjCStructArgument.py (958 of 2058)
PASS: lldb-shell :: ObjectFile/wasm/embedded-debug-sections.yaml (959 of 2058)
PASS: lldb-unit :: Symbol/./SymbolTests/TestClangASTImporter.RecordLayout (960 of 2058)
FAIL: lldb-api :: tools/lldb-vscode/disconnect/TestVSCode_disconnect.py (961 of 2058)
******************** TEST 'lldb-api :: tools/lldb-vscode/disconnect/TestVSCode_disconnect.py' FAILED ********************
Script:
--
/Users/buildslave/jenkins/workspace/lldb-cmake-sanitized/lldb-build/lldb-test-build.noindex/copied-python /Users/buildslave/jenkins/workspace/lldb-cmake-sanitized/llvm-project/lldb/test/API/dotest.py --arch x86_64 -s /Users/buildslave/jenkins/workspace/lldb-cmake-sanitized/lldb-build/lldb-test-traces -S nm -u CXXFLAGS -u CFLAGS --codesign-identity lldb_codesign --server /Users/buildslave/jenkins/workspace/lldb-cmake-sanitized/lldb-build/./bin/debugserver --arch x86_64 --build-dir /Users/buildslave/jenkins/workspace/lldb-cmake-sanitized/lldb-build/lldb-test-build.noindex -s=/Users/buildslave/jenkins/workspace/lldb-cmake-sanitized/test/logs -t --env TERM=vt100 --env LLVM_LIBS_DIR=/Users/buildslave/jenkins/workspace/lldb-cmake-sanitized/lldb-build/./lib --inferior-env ASAN_OPTIONS=detect_stack_use_after_return=1 --inferior-env DYLD_INSERT_LIBRARIES=/Users/buildslave/jenkins/workspace/lldb-cmake-sanitized/host-compiler/lib/clang/11.0.0/lib/darwin/libclang_rt.asan_osx_dynamic.dylib --build-dir /Users/buildslave/jenkins/workspace/lldb-cmake-sanitized/lldb-build/lldb-test-build.noindex --lldb-module-cache-dir /Users/buildslave/jenkins/workspace/lldb-cmake-sanitized/lldb-build/lldb-test-build.noindex/module-cache-lldb/lldb-api --clang-module-cache-dir /Users/buildslave/jenkins/workspace/lldb-cmake-sanitized/lldb-build/lldb-test-build.noindex/module-cache-clang/lldb-api --executable /Users/buildslave/jenkins/workspace/lldb-cmake-sanitized/lldb-build/./bin/lldb --compiler /Users/buildslave/jenkins/workspace/lldb-cmake-sanitized/lldb-build/./bin/clang --dsymutil /Users/buildslave/jenkins/workspace/lldb-cmake-sanitized/lldb-build/./bin/dsymutil --filecheck /Users/buildslave/jenkins/workspace/lldb-cmake-sanitized/lldb-build/./bin/FileCheck --lldb-libs-dir /Users/buildslave/jenkins/workspace/lldb-cmake-sanitized/lldb-build/./lib /Users/buildslave/jenkins/workspace/lldb-cmake-sanitized/llvm-project/lldb/test/API/tools/lldb-vscode/disconnect -p TestVSCode_disconnect.py
--
Exit Code: 1

Hide Details

Command Output (stdout): -- lldb version 11.0.99 clang revision b925ca37a8f28851e110b8f0cd6e7f9a36a15d65 llvm revision b925ca37a8f28851e110b8f0cd6e7f9a36a15d65 LLDB library dir: /Users/buildslave/jenkins/workspace/lldb-cmake-sanitized/lldb-build/bin LLDB import library dir: /Users/buildslave/jenkins/workspace/lldb-cmake-sanitized/lldb-build/./lib libstdcxx tests will not be run because: Don't know how to build with libstdcxx on macosx Skipping following debug info categories: ['dwo']

Hide Details

-- Command Output (stderr): --

Hide Details

Session logs for test failures/errors/unexpected successes will go into directory '/Users/buildslave/jenkins/workspace/lldb-cmake-sanitized/test/logs' Change dir to: /Users/buildslave/jenkins/workspace/lldb-cmake-sanitized/llvm-project/lldb/test/API/tools/lldb-vscode/disconnect runCmd: settings clear -all output:

Hide Details

runCmd: settings set symbols.enable-external-lookup false output:

Hide Details

runCmd: settings set target.auto-apply-fixits false output:

Hide Details

runCmd: settings set plugin.process.gdb-remote.packet-timeout 60 output:

Hide Details

runCmd: settings set symbols.clang-modules-cache-path "/Users/buildslave/jenkins/workspace/lldb-cmake-sanitized/lldb-build/lldb-test-build.noindex/module-cache-lldb/lldb-api" output:

Hide Details

runCmd: settings set use-color false output:

Hide Details

runCmd: setting set target.prefer-dynamic-value no-dynamic-values output:

Hide Details

runCmd: settings set target.env-vars ASAN_OPTIONS=detect_stack_use_after_return=1 DYLD_INSERT_LIBRARIES=/Users/buildslave/jenkins/workspace/lldb-cmake-sanitized/host-compiler/lib/clang/11.0.0/lib/darwin/libclang_rt.asan_osx_dynamic.dylib output:

Hide Details

Adding tearDown hook: lambda: self.run_platform_command( "rm %s" % (sync_file_path)))

Hide Details

Hide Details

Adding tearDown hook: def cleanup(): if disconnectAutomatically: self.vscode.request_disconnect(terminateDebuggee=True) self.vscode.terminate()

Hide Details

Hide Details

FAIL: LLDB (/Users/buildslave/jenkins/workspace/lldb-cmake-sanitized/lldb-build/bin/clang-11-x86_64) :: test_attach (TestVSCode_disconnect.TestVSCode_launch) Executing tearDown hook: def cleanup(): if disconnectAutomatically: self.vscode.request_disconnect(terminateDebuggee=True) self.vscode.terminate()

Hide Details

Hide Details

Executing tearDown hook: lambda: self.run_platform_command( "rm %s" % (sync_file_path)))

Hide Details

Hide Details

runCmd: settings clear -all output:

Hide Details

runCmd: settings set symbols.enable-external-lookup false output:

Hide Details

runCmd: settings set target.auto-apply-fixits false output:

Hide Details

runCmd: settings set plugin.process.gdb-remote.packet-timeout 60 output:

Hide Details

runCmd: settings set symbols.clang-modules-cache-path "/Users/buildslave/jenkins/workspace/lldb-cmake-sanitized/lldb-build/lldb-test-build.noindex/module-cache-lldb/lldb-api" output:

Hide Details

runCmd: settings set use-color false output:

Hide Details

runCmd: setting set target.prefer-dynamic-value no-dynamic-values output:

Hide Details

runCmd: settings set target.env-vars ASAN_OPTIONS=detect_stack_use_after_return=1 DYLD_INSERT_LIBRARIES=/Users/buildslave/jenkins/workspace/lldb-cmake-sanitized/host-compiler/lib/clang/11.0.0/lib/darwin/libclang_rt.asan_osx_dynamic.dylib output:

Hide Details

Adding tearDown hook: def cleanup(): if disconnectAutomatically: self.vscode.request_disconnect(terminateDebuggee=True) self.vscode.terminate()

Hide Details

Hide Details

Executing tearDown hook: def cleanup(): if disconnectAutomatically: self.vscode.request_disconnect(terminateDebuggee=True) self.vscode.terminate()

Hide Details

Hide Details

CLEANUP ERROR: LLDB (/Users/buildslave/jenkins/workspace/lldb-cmake-sanitized/lldb-build/bin/clang-11-x86_64) :: test_launch (TestVSCode_disconnect.TestVSCode_launch) Restore dir to: /Users/buildslave/jenkins/workspace/lldb-cmake-sanitized/lldb-build/tools/lldb/test ====================================================================== ERROR: test_attach (TestVSCode_disconnect.TestVSCode_launch) ---------------------------------------------------------------------- Traceback (most recent call last): File "/Users/buildslave/jenkins/workspace/lldb-cmake-sanitized/llvm-project/lldb/packages/Python/lldbsuite/test/decorators.py", line 140, in wrapper func(*args, **kwargs) File "/Users/buildslave/jenkins/workspace/lldb-cmake-sanitized/llvm-project/lldb/test/API/tools/lldb-vscode/disconnect/TestVSCode_disconnect.py", line 79, in test_attach self.vscode.request_disconnect() File "/Users/buildslave/jenkins/workspace/lldb-cmake-sanitized/llvm-project/lldb/packages/Python/lldbsuite/test/tools/lldb-vscode/vscode.py", line 543, in request_disconnect return self.send_recv(command_dict) File "/Users/buildslave/jenkins/workspace/lldb-cmake-sanitized/llvm-project/lldb/packages/Python/lldbsuite/test/tools/lldb-vscode/vscode.py", line 293, in send_recv raise ValueError(desc) ValueError: no response for "disconnect" Config=x86_64-/Users/buildslave/jenkins/workspace/lldb-cmake-sanitized/lldb-build/bin/clang-11 ---------------------------------------------------------------------- Ran 2 tests in 27.878s

Hide Details

RESULT: FAILED (0 passes, 0 failures, 1 errors, 0 skipped, 0 expected failures, 0 unexpected successes)

Hide Details

--

Hide Details

******************** PASS: lldb-unit :: Utility/./UtilityTests/ArgsTest.StringListConstructor (962 of 2058) PASS: lldb-api :: commands/expression/persistent_ptr_update/TestPersistentPtrUpdate.py (963 of 2058) PASS: lldb-unit :: Symbol/./SymbolTests/TestClangASTImporter.CopyDeclTagDecl (964 of 2058) PASS: lldb-unit :: Expression/./ExpressionTests/DiagnosticManagerTest.AppendMessageSubsequentDiags (965 of 2058) PASS: lldb-unit :: UnwindAssembly/x86/./UnwindAssemblyx86Tests/Testx86AssemblyInspectionEngine.TestReturnDetect (966 of 2058) UNSUPPORTED: lldb-api :: linux/mix-dwo-and-regular-objects/TestMixedDwarfBinary.py (967 of 2058) PASS: lldb-api :: python_api/sbvalue_const_addrof/TestSBValueConstAddrOf.py (968 of 2058) PASS: lldb-api :: lang/c/local_types/TestUseClosestType.py (969 of 2058) PASS: lldb-api :: functionalities/thread/concurrent_events/TestConcurrentSignalWatchBreak.py (970 of 2058) UNSUPPORTED: lldb-api :: functionalities/thread/break_after_join/TestBreakAfterJoin.py (971 of 2058) PASS: lldb-unit :: Utility/./UtilityTests/Flags.Test (972 of 2058) PASS: lldb-unit :: Utility/./UtilityTests/CompletionRequest.ShiftArguments (973 of 2058) PASS: lldb-shell :: SymbolFile/DWARF/dwarf5-partial-index.cpp (974 of 2058) PASS: lldb-api :: lang/objc/foundation/TestObjectDescriptionAPI.py (975 of 2058) PASS: lldb-shell :: SymbolFile/DWARF/debug_ranges_and_rnglists.test (976 of 2058) PASS: lldb-unit :: Host/./HostTests/NativeProcessProtocolTest.ReadCStringFromMemory_CrossPageBoundary (977 of 2058) PASS: lldb-unit :: ScriptInterpreter/Python/./ScriptInterpreterPythonTests/PythonDataObjectsTest.TestPythonString (978 of 2058) PASS: lldb-api :: functionalities/thread/concurrent_events/TestConcurrentSignalBreak.py (979 of 2058) PASS: lldb-unit :: ScriptInterpreter/Python/./ScriptInterpreterPythonTests/PythonDataObjectsTest.TestTypeNameResolutionNoDot (980 of 2058) PASS: lldb-unit :: Utility/./UtilityTests/VMRange.IsValid (981 of 2058) PASS: lldb-unit :: Process/minidump/./LLDBMinidumpTests/MinidumpParserTest.GetMiscInfo_no_stream (982 of 2058) PASS: lldb-unit :: Utility/./UtilityTests/LogTest.Unregister (983 of 2058) PASS: lldb-api :: functionalities/thread/concurrent_events/TestConcurrentTwoBreakpointsOneSignal.py (984 of 2058) UNSUPPORTED: lldb-api :: tools/lldb-server/thread-name/TestGdbRemoteThreadName.py (985 of 2058) PASS: lldb-unit :: Utility/./UtilityTests/StreamTest.AddressSize (986 of 2058) PASS: lldb-shell :: Register/x86-64-read.test (987 of 2058) PASS: lldb-api :: functionalities/data-formatter/data-formatter-advanced/TestDataFormatterAdv.py (988 of 2058) PASS: lldb-api :: functionalities/breakpoint/breakpoint_command/TestBreakpointCommandsFromPython.py (989 of 2058) PASS: lldb-unit :: Host/./HostTests/HostInfoTest.GetAugmentedArchSpec (990 of 2058) PASS: lldb-api :: functionalities/data-formatter/data-formatter-stl/libcxx/bitset/TestDataFormatterLibcxxBitset.py (991 of 2058) PASS: lldb-api :: commands/expression/persistent_variables/TestPersistentVariables.py (992 of 2058) PASS: lldb-api :: commands/expression/regression-access-function-template-in-record/TestRegressionAccessFunctionTemplateInRecord.py (993 of 2058) PASS: lldb-api :: functionalities/step-avoids-no-debug/TestStepNoDebug.py (994 of 2058) PASS: lldb-unit :: Utility/./UtilityTests/SerializationRountripTest.SerializeDeserializePod (995 of 2058) PASS: lldb-api :: python_api/formatters/TestFormattersSBAPI.py (996 of 2058) UNSUPPORTED: lldb-api :: functionalities/darwin_log/filter/regex/message/TestDarwinLogFilterRegexMessage.py (997 of 2058) PASS: lldb-unit :: Utility/./UtilityTests/TimerTest.CategoryTimesStats (998 of 2058) PASS: lldb-api :: lang/cpp/dynamic-value/TestDynamicValue.py (999 of 2058) PASS: lldb-unit :: Utility/./UtilityTests/StreamTest.PutHex8 (1000 of 2058) PASS: lldb-unit :: SymbolFile/DWARF/./SymbolFileDWARFTests/XcodeSDKModuleTests.TestModuleGetXcodeSDK (1001 of 2058) PASS: lldb-unit :: Process/minidump/./LLDBMinidumpTests/RegisterContextMinidump.ConvertMinidumpContext_x86_64 (1002 of 2058) PASS: lldb-unit :: Utility/./UtilityTests/ArgsTest.EscapeLLDBCommandArgument (1003 of 2058) PASS: lldb-unit :: SymbolFile/DWARF/./SymbolFileDWARFTests/DWARFASTParserClangTests.EnsureAllDIEsInDeclContextHaveBeenParsedParsesOnlyMatchingEntries (1004 of 2058) PASS: lldb-api :: functionalities/thread/backtrace_limit/TestBacktraceLimit.py (1005 of 2058) PASS: lldb-unit :: Utility/./UtilityTests/TimerTest.CategoryTimes2 (1006 of 2058) PASS: lldb-shell :: SymbolFile/DWARF/forward-declarations.s (1007 of 2058) XFAIL: lldb-shell :: SymbolFile/DWARF/find-type-in-function.cpp (1008 of 2058) PASS: lldb-api :: functionalities/postmortem/netbsd-core/TestNetBSDCore.py (1009 of 2058) PASS: lldb-api :: types/TestLongTypesExpr.py (1010 of 2058) PASS: lldb-api :: lang/objc/objc-baseclass-sbtype/TestObjCBaseClassSBType.py (1011 of 2058) PASS: lldb-api :: functionalities/data-formatter/data-formatter-objc/TestDataFormatterObjCNSError.py (1012 of 2058) PASS: lldb-unit :: Utility/./UtilityTests/ArgsTest.ReplaceArgumentAtIndexEqual (1013 of 2058) PASS: lldb-api :: functionalities/data-formatter/data-formatter-objc/TestDataFormatterObjCCF.py (1014 of 2058) PASS: lldb-api :: lang/objc/objc-static-method-stripped/TestObjCStaticMethodStripped.py (1015 of 2058) PASS: lldb-unit :: Language/Highlighting/./HighlighterTests/HighlighterTest.ClangStringLiterals (1016 of 2058) PASS: lldb-shell :: SymbolFile/DWARF/parallel-indexing-stress.s (1017 of 2058) PASS: lldb-api :: functionalities/thread/step_out/TestThreadStepOut.py (1018 of 2058) PASS: lldb-unit :: Process/gdb-remote/./ProcessGdbRemoteTests/GDBRemoteCommunicationServerTest.SendErrorResponse_ErrorNumber (1019 of 2058) PASS: lldb-unit :: Utility/./UtilityTests/ArgsTest.TestSingleArgWithQuotedSpace (1020 of 2058) UNSUPPORTED: lldb-api :: benchmarks/startup/TestStartupDelays.py (1021 of 2058) PASS: lldb-unit :: Utility/./UtilityTests/PassiveReplayTest.InstrumentedBar (1022 of 2058) PASS: lldb-unit :: Core/./LLDBCoreTests/MangledTest.ResultForValidName (1023 of 2058) PASS: lldb-api :: functionalities/data-formatter/vector-types/TestVectorTypesFormatting.py (1024 of 2058) PASS: lldb-shell :: ObjectFile/ELF/PT_LOAD-overlap-PT_INTERP.yaml (1025 of 2058) PASS: lldb-unit :: UnwindAssembly/x86/./UnwindAssemblyx86Tests/Testx86AssemblyInspectionEngine.Test32BitOnlyInstruction (1026 of 2058) PASS: lldb-api :: lang/cpp/class_types/TestClassTypesDisassembly.py (1027 of 2058) PASS: lldb-api :: lang/cpp/chained-calls/TestCppChainedCalls.py (1028 of 2058) UNSUPPORTED: lldb-shell :: ScriptInterpreter/Lua/breakpoint_callback.test (1029 of 2058) PASS: lldb-unit :: Utility/./UtilityTests/AnsiTerminal.AtStart (1030 of 2058) PASS: lldb-unit :: Utility/./UtilityTests/EnvironmentTest.EnvpConversion (1031 of 2058) PASS: lldb-shell :: SymbolFile/Breakpad/unwind-via-raSearch.test (1032 of 2058) PASS: lldb-api :: lang/cpp/namespace_conflicts/TestNamespaceConflicts.py (1033 of 2058) PASS: lldb-unit :: ObjectFile/ELF/./ObjectFileELFTests/ObjectFileELFTest.GetSymtab_NoSymEntryPointArmAddressClass (1034 of 2058) PASS: lldb-api :: lang/cpp/unique-types/TestUniqueTypes.py (1035 of 2058) PASS: lldb-unit :: Utility/./UtilityTests/StringLexerTest.NextIf (1036 of 2058) PASS: lldb-api :: python_api/findvalue_duplist/TestSBFrameFindValue.py (1037 of 2058) PASS: lldb-shell :: SymbolFile/DWARF/inline-function-address-shared.test (1038 of 2058) PASS: lldb-unit :: Host/./HostTests/File.GetWaitableHandleFileno (1039 of 2058) PASS: lldb-api :: commands/version/TestVersion.py (1040 of 2058) PASS: lldb-unit :: Utility/./UtilityTests/RegularExpression.Empty (1041 of 2058) PASS: lldb-unit :: Utility/./UtilityTests/AnsiTerminal.Basic (1042 of 2058) PASS: lldb-api :: lang/c/function_types/TestFunctionTypes.py (1043 of 2058) PASS: lldb-api :: lang/cpp/unsigned_types/TestUnsignedTypes.py (1044 of 2058) PASS: lldb-unit :: Host/./HostTests/Host.GetEnvironment (1045 of 2058) PASS: lldb-api :: functionalities/data-formatter/synthupdate/TestSyntheticFilterRecompute.py (1046 of 2058) UNSUPPORTED: lldb-api :: functionalities/darwin_log/filter/exact_match/category/TestDarwinLogFilterMatchCategory.py (1047 of 2058) UNSUPPORTED: lldb-shell :: ScriptInterpreter/Lua/io.test (1048 of 2058) PASS: lldb-unit :: debugserver/./debugserverTests/RNBSocket.LoopBackListenIPv6 (1049 of 2058) PASS: lldb-api :: commands/expression/rdar44436068/Test128BitsInteger.py (1050 of 2058) PASS: lldb-api :: python_api/class_members/TestSBTypeClassMembers.py (1051 of 2058) PASS: lldb-shell :: SymbolFile/NativePDB/globals-fundamental.cpp (1052 of 2058) UNSUPPORTED: lldb-shell :: ScriptInterpreter/Lua/quit.test (1053 of 2058) PASS: lldb-api :: functionalities/data-formatter/hexcaps/TestDataFormatterHexCaps.py (1054 of 2058) PASS: lldb-shell :: ScriptInterpreter/Python/scripted_breakpoint.test (1055 of 2058) PASS: lldb-api :: functionalities/thread/concurrent_events/TestConcurrentDelayedCrashWithBreakpointWatchpoint.py (1056 of 2058) PASS: lldb-shell :: Settings/TestFrameFormatMangling.test (1057 of 2058) PASS: lldb-shell :: SymbolFile/NativePDB/bitfields.cpp (1058 of 2058) PASS: lldb-api :: functionalities/thread/concurrent_events/TestConcurrentNWatchNBreak.py (1059 of 2058) UNSUPPORTED: lldb-shell :: Watchpoint/netbsd-nouserdbregs.test (1060 of 2058) PASS: lldb-unit :: Expression/./ExpressionTests/CppModuleConfigurationTest.LinuxLocalLibCpp (1061 of 2058) PASS: lldb-unit :: Utility/./UtilityTests/OptionsWithRawTest.LeadingSpaceArgs (1062 of 2058) PASS: lldb-api :: commands/gui/invalid-args/TestInvalidArgsGui.py (1063 of 2058) PASS: lldb-unit :: SymbolFile/DWARF/./SymbolFileDWARFTests/SymbolFileDWARFTests.TestAbbrevOrder1Start5 (1064 of 2058) PASS: lldb-api :: functionalities/breakpoint/consecutive_breakpoints/TestConsecutiveBreakpoints.py (1065 of 2058) PASS: lldb-api :: functionalities/gdb_remote_client/TestStopPCs.py (1066 of 2058) PASS: lldb-api :: functionalities/paths/TestPaths.py (1067 of 2058) PASS: lldb-unit :: Utility/./UtilityTests/StringListTest.LongestCommonPrefix (1068 of 2058) PASS: lldb-api :: lang/cpp/breakpoint_in_member_func_w_non_primitive_params/TestBreakpointInMemberFuncWNonPrimitiveParams.py (1069 of 2058) PASS: lldb-unit :: Target/./TargetTests/ExecutionContextTest.GetByteOrderTarget (1070 of 2058) PASS: lldb-unit :: Target/./TargetTests/PathMappingListTest.AbsoluteTests (1071 of 2058) PASS: lldb-api :: lang/cpp/signed_types/TestSignedTypes.py (1072 of 2058) PASS: lldb-unit :: Utility/./UtilityTests/UserIDResolver.GetGroupName (1073 of 2058) PASS: lldb-api :: commands/frame/diagnose/virtual-method-call/TestDiagnoseDereferenceVirtualMethodCall.py (1074 of 2058) PASS: lldb-unit :: Utility/./UtilityTests/StreamTest.PutPtr (1075 of 2058) PASS: lldb-api :: commands/command/script_alias/TestCommandScriptAlias.py (1076 of 2058) PASS: lldb-api :: commands/expression/radar_8638051/Test8638051.py (1077 of 2058) PASS: lldb-unit :: UnwindAssembly/x86/./UnwindAssemblyx86Tests/Testx86AssemblyInspectionEngine.TestPushEDI (1078 of 2058) PASS: lldb-api :: lang/c/find_struct_type/TestFindStructTypes.py (1079 of 2058) PASS: lldb-api :: commands/frame/diagnose/bad-reference/TestBadReference.py (1080 of 2058) PASS: lldb-shell :: Driver/TestHelp.test (1081 of 2058) PASS: lldb-unit :: Utility/./UtilityTests/DataExtractorTest.PeekData (1082 of 2058) PASS: lldb-unit :: Utility/./UtilityTests/RangeTest.ClearWithStarAddress (1083 of 2058) UNSUPPORTED: lldb-api :: iohandler/resize/TestIOHandlerResize.py (1084 of 2058) PASS: lldb-api :: lang/objc/modules-compile-error/TestModulesCompileError.py (1085 of 2058) PASS: lldb-api :: functionalities/inferior-crashing/recursive-inferior/TestRecursiveInferiorStep.py (1086 of 2058) UNSUPPORTED: lldb-api :: iohandler/completion/TestIOHandlerCompletion.py (1087 of 2058) PASS: lldb-unit :: Utility/./UtilityTests/StreamTest.PutRawBytesToMixedEndian (1088 of 2058) PASS: lldb-api :: functionalities/abbreviation/TestAbbreviations.py (1089 of 2058) PASS: lldb-unit :: Utility/./UtilityTests/ScalarTest.Comparison (1090 of 2058) PASS: lldb-shell :: BuildScript/toolchain-clang.test (1091 of 2058) PASS: lldb-unit :: Utility/./UtilityTests/StringExtractorTest.DecodeHexU8_Underflow2 (1092 of 2058) PASS: lldb-shell :: Reproducer/Functionalities/TestExpressionEvaluation.test (1093 of 2058) PASS: lldb-api :: functionalities/signal/raise/TestRaise.py (1094 of 2058) UNSUPPORTED: lldb-api :: functionalities/breakpoint/breakpoint_callback_command_source/TestBreakpointCallbackCommandSource.py (1095 of 2058) PASS: lldb-unit :: Host/./HostTests/SocketTest.TCPListen0GetPort (1096 of 2058) PASS: lldb-unit :: UnwindAssembly/x86/./UnwindAssemblyx86Tests/Testx86AssemblyInspectionEngine.TestPopRBPWithREX (1097 of 2058) PASS: lldb-unit :: Utility/./UtilityTests/StringListTest.GetMaxStringLengthDecreasingSize (1098 of 2058) PASS: lldb-unit :: Host/./HostTests/MainLoopTest.TerminatesImmediately (1099 of 2058) PASS: lldb-unit :: UnwindAssembly/x86/./UnwindAssemblyx86Tests/Testx86AssemblyInspectionEngine.TestPopRBP (1100 of 2058) PASS: lldb-unit :: Utility/./UtilityTests/StreamTest.PutRawBytesToBigEndian (1101 of 2058) PASS: lldb-unit :: Utility/./UtilityTests/StreamTest.Indent (1102 of 2058) PASS: lldb-api :: commands/expression/import-std-module/conflicts/TestStdModuleWithConflicts.py (1103 of 2058) PASS: lldb-api :: functionalities/thread/state_after_expression/TestStateAfterExpression.py (1104 of 2058) PASS: lldb-unit :: Utility/./UtilityTests/SerializationRountripTest.SerializeDeserializeCStringNull (1105 of 2058) PASS: lldb-shell :: SymbolFile/DWARF/compilercontext.ll (1106 of 2058) PASS: lldb-api :: commands/expression/import-std-module/weak_ptr/TestWeakPtrFromStdModule.py (1107 of 2058) PASS: lldb-unit :: ScriptInterpreter/Python/./ScriptInterpreterPythonTests/PythonDataObjectsTest.TestRun (1108 of 2058) PASS: lldb-api :: lang/objc/objc++/TestObjCXX.py (1109 of 2058) PASS: lldb-unit :: SymbolFile/DWARF/./SymbolFileDWARFTests/SymbolFileDWARFTests.TestAbilitiesForDWARF (1110 of 2058) PASS: lldb-api :: functionalities/tail_call_frames/disambiguate_call_site/TestDisambiguateCallSite.py (1111 of 2058) PASS: lldb-api :: functionalities/dead-strip/TestDeadStrip.py (1112 of 2058) PASS: lldb-api :: functionalities/data-formatter/data-formatter-cpp/TestDataFormatterCpp.py (1113 of 2058) PASS: lldb-unit :: Utility/./UtilityTests/ArgsTest.ReplaceArgumentAtIndexShort (1114 of 2058) PASS: lldb-api :: commands/expression/import-std-module/forward_list-dbg-info-content/TestDbgInfoContentForwardListFromStdModule.py (1115 of 2058) PASS: lldb-unit :: Utility/./UtilityTests/SerializationRountripTest.SerializeDeserializeObjectReference (1116 of 2058) PASS: lldb-shell :: SymbolFile/DWARF/debug_aranges-empty-section.s (1117 of 2058) PASS: lldb-shell :: Reproducer/Functionalities/TestImageList.test (1118 of 2058) PASS: lldb-api :: functionalities/pointer_num_children/TestPointerNumChildren.py (1119 of 2058) PASS: lldb-api :: types/TestCharType.py (1120 of 2058) PASS: lldb-unit :: Utility/./UtilityTests/StringListTest.LongestCommonPrefixEmpty (1121 of 2058) PASS: lldb-unit :: Utility/./UtilityTests/StreamTest.PutHex64ByteOrderLittle (1122 of 2058) PASS: lldb-unit :: Symbol/./SymbolTests/TestTypeSystemClang.TestDeletingImplicitCopyCstrDueToMoveCStr (1123 of 2058) PASS: lldb-unit :: ScriptInterpreter/Python/./ScriptInterpreterPythonTests/PythonDataObjectsTest.TestResetting (1124 of 2058) PASS: lldb-api :: lang/objc/objc-new-syntax/TestObjCNewSyntaxArray.py (1125 of 2058) PASS: lldb-shell :: ObjectFile/ELF/PT_LOAD-overlap-PT_TLS.yaml (1126 of 2058) PASS: lldb-api :: commands/expression/import-std-module/deque-dbg-info-content/TestDbgInfoContentDequeFromStdModule.py (1127 of 2058) PASS: lldb-unit :: Utility/./UtilityTests/BinaryStreamTest.PutULEB128SevenBytes (1128 of 2058) PASS: lldb-api :: commands/command/history/TestCommandHistory.py (1129 of 2058) PASS: lldb-unit :: Utility/./UtilityTests/CompletionRequest.TryCompleteCurrentArgGood (1130 of 2058) PASS: lldb-api :: commands/settings/use_source_cache/TestUseSourceCache.py (1131 of 2058) PASS: lldb-api :: python_api/symbol-context/two-files/TestSymbolContextTwoFiles.py (1132 of 2058) PASS: lldb-unit :: Utility/./UtilityTests/FileSpecTest.IsRelative (1133 of 2058) PASS: lldb-unit :: ObjectFile/Breakpad/./ObjectFileBreakpadTests/ModuleRecord.parse (1134 of 2058) UNSUPPORTED: lldb-shell :: ExecControl/StopHook/stop-hook-threads.test (1135 of 2058) PASS: lldb-api :: functionalities/breakpoint/breakpoint_by_line_and_column/TestBreakpointByLineAndColumn.py (1136 of 2058) PASS: lldb-api :: commands/watchpoints/watchpoint_commands/command/TestWatchpointCommandLLDB.py (1137 of 2058) PASS: lldb-api :: commands/watchpoints/multiple_threads/TestWatchpointMultipleThreads.py (1138 of 2058) PASS: lldb-api :: functionalities/data-formatter/data-formatter-named-summaries/TestDataFormatterNamedSummaries.py (1139 of 2058) UNSUPPORTED: lldb-api :: tools/intel-features/intel-pt/test/TestIntelPTSimpleBinary.py (1140 of 2058) PASS: lldb-api :: functionalities/multidebugger_commands/TestMultipleDebuggersCommands.py (1141 of 2058) UNSUPPORTED: lldb-shell :: Register/x86-64-ymm16-write.test (1142 of 2058) PASS: lldb-unit :: Utility/./UtilityTests/ScalarTest.LongLongAssigmentOperator (1143 of 2058) PASS: lldb-shell :: Driver/TestFile.test (1144 of 2058) PASS: lldb-shell :: ObjectFile/Breakpad/uuid-matching-mac.test (1145 of 2058) PASS: lldb-unit :: Utility/./UtilityTests/RangeTest.SetRangeBase (1146 of 2058) PASS: lldb-unit :: Utility/./UtilityTests/StringLexerTest.GetUnlexed (1147 of 2058) UNSUPPORTED: lldb-api :: functionalities/darwin_log/filter/regex/category/TestDarwinLogFilterRegexCategory.py (1148 of 2058) UNSUPPORTED: lldb-api :: tools/lldb-server/TestGdbRemoteModuleInfo.py (1149 of 2058) PASS: lldb-api :: commands/expression/context-object/TestContextObject.py (1150 of 2058) PASS: lldb-unit :: Symbol/./SymbolTests/TestTypeSystemClang.TestGetEnumIntegerTypeUnexpectedType (1151 of 2058) PASS: lldb-api :: lang/cpp/multiple-inheritance/TestCppMultipleInheritance.py (1152 of 2058) PASS: lldb-unit :: Utility/./UtilityTests/DataExtractorTest.GetMaxU64_unchecked (1153 of 2058) PASS: lldb-api :: functionalities/thread/concurrent_events/TestConcurrentCrashWithWatchpointBreakpointSignal.py (1154 of 2058) PASS: lldb-shell :: Driver/TestTarget.test (1155 of 2058) PASS: lldb-api :: api/check_public_api_headers/TestPublicAPIHeaders.py (1156 of 2058) PASS: lldb-unit :: Utility/./UtilityTests/ConstStringTest.CompareConstString (1157 of 2058) PASS: lldb-unit :: ScriptInterpreter/Python/./ScriptInterpreterPythonTests/PythonDataObjectsTest.TestCallable (1158 of 2058) PASS: lldb-unit :: Utility/./UtilityTests/UriParserTest.BracketedHostnameWithPortIPv6 (1159 of 2058) PASS: lldb-api :: functionalities/gdb_remote_client/TestGDBRemoteClient.py (1160 of 2058) PASS: lldb-unit :: Utility/./UtilityTests/VMRange.CollectionContains (1161 of 2058) PASS: lldb-unit :: Language/Highlighting/./HighlighterTests/HighlighterTest.ClangCursorPosInOtherToken (1162 of 2058) PASS: lldb-api :: lang/cpp/dynamic-value/TestCppValueCast.py (1163 of 2058) PASS: lldb-api :: iohandler/resize/TestIOHandlerResizeNoEditline.py (1164 of 2058) PASS: lldb-api :: types/TestRecursiveTypes.py (1165 of 2058) UNSUPPORTED: lldb-api :: functionalities/data-formatter/data-formatter-stl/libstdcpp/unique_ptr/TestDataFormatterStdUniquePtr.py (1166 of 2058) UNSUPPORTED: lldb-api :: macosx/macabi/TestMacABImacOSFramework.py (1167 of 2058) PASS: lldb-unit :: Host/./HostTests/NativeProcessProtocolTest.SetBreakpointFailVerify (1168 of 2058) PASS: lldb-api :: functionalities/thread/concurrent_events/TestConcurrentTwoWatchpointsOneBreakpoint.py (1169 of 2058) PASS: lldb-api :: commands/expression/radar_9531204/TestPrintfAfterUp.py (1170 of 2058) PASS: lldb-api :: functionalities/optimized_code/TestNoASanExceptionAfterEvalOP_piece.py (1171 of 2058) PASS: lldb-api :: functionalities/memory-region/TestMemoryRegion.py (1172 of 2058) PASS: lldb-shell :: Quit/TestQuitExitCodeNonInt.test (1173 of 2058) PASS: lldb-api :: lang/objc/objc-ivar-protocols/TestIvarProtocols.py (1174 of 2058) PASS: lldb-unit :: Utility/./UtilityTests/ArgsTest.TestInsertArg (1175 of 2058) PASS: lldb-api :: python_api/interpreter/TestCommandInterpreterAPI.py (1176 of 2058) UNSUPPORTED: lldb-shell :: SymbolFile/PDB/pointers.test (1177 of 2058) PASS: lldb-api :: commands/target/create-deps/TestTargetCreateDeps.py (1178 of 2058) PASS: lldb-unit :: Target/./TargetTests/RemoteAwarePlatformTest.TestResolveExecutabelOnClientByPlatform (1179 of 2058) PASS: lldb-unit :: Utility/./UtilityTests/PassiveReplayTest.InstrumentedBarRef (1180 of 2058) PASS: lldb-api :: functionalities/data-formatter/data-formatter-globals/TestDataFormatterGlobals.py (1181 of 2058) PASS: lldb-api :: lang/cpp/function_refs/TestFunctionRefs.py (1182 of 2058) PASS: lldb-api :: python_api/frame/TestFrames.py (1183 of 2058) PASS: lldb-api :: commands/frame/diagnose/inheritance/TestDiagnoseInheritance.py (1184 of 2058) PASS: lldb-api :: commands/expression/import-std-module/list/TestListFromStdModule.py (1185 of 2058) PASS: lldb-shell :: SymbolFile/NativePDB/ast-functions.cpp (1186 of 2058) UNSUPPORTED: lldb-api :: functionalities/darwin_log/filter/exact_match/activity-chain/TestDarwinLogFilterMatchActivityChain.py (1187 of 2058) PASS: lldb-shell :: BuildScript/modes.test (1188 of 2058) PASS: lldb-unit :: Language/Highlighting/./HighlighterTests/HighlighterTest.ClangCursorPosEndOfLine (1189 of 2058) PASS: lldb-api :: functionalities/data-formatter/frameformat_smallstruct/TestFrameFormatSmallStruct.py (1190 of 2058) PASS: lldb-unit :: DataFormatter/./LLDBFormatterTests/FormatManagerTests.CompatibleLangs (1191 of 2058) PASS: lldb-unit :: Utility/./UtilityTests/StreamTest.PutBytesAsRawHex8ToMixedEndian (1192 of 2058) PASS: lldb-api :: commands/expression/issue_11588/Test11588.py (1193 of 2058) PASS: lldb-api :: commands/expression/call-function/TestCallStdStringFunction.py (1194 of 2058) PASS: lldb-api :: functionalities/recursion/TestValueObjectRecursion.py (1195 of 2058) UNSUPPORTED: lldb-api :: functionalities/thread/thread_specific_break_plus_condition/TestThreadSpecificBpPlusCondition.py (1196 of 2058) PASS: lldb-unit :: Utility/./UtilityTests/RecordReplayTest.InstrumentedFoo (1197 of 2058) PASS: lldb-unit :: Language/Highlighting/./HighlighterTests/HighlighterTest.ClangOperators (1198 of 2058) PASS: lldb-shell :: ObjectFile/PECOFF/section-types.yaml (1199 of 2058) PASS: lldb-shell :: Settings/TestEchoCommands.test (1200 of 2058) PASS: lldb-unit :: ScriptInterpreter/Python/./ScriptInterpreterPythonTests/PythonDataObjectsTest.TestPythonListToStructuredList (1201 of 2058) PASS: lldb-api :: functionalities/gdb_remote_client/TestWriteMemory.py (1202 of 2058) PASS: lldb-unit :: Utility/./UtilityTests/StringListTest.GetMaxStringLengthEmpty (1203 of 2058) PASS: lldb-shell :: Breakpoint/split-dwarf-5-addrbase.test (1204 of 2058) UNSUPPORTED: lldb-api :: functionalities/darwin_log/filter/exact_match/subsystem/TestDarwinLogFilterMatchSubsystem.py (1205 of 2058) PASS: lldb-shell :: Commands/command-backtrace.test (1206 of 2058) PASS: lldb-unit :: Language/Highlighting/./HighlighterTests/HighlighterTest.DefaultHighlighterWithCursor (1207 of 2058) PASS: lldb-api :: lang/cpp/nested-class-other-compilation-unit/TestNestedClassWithParentInAnotherCU.py (1208 of 2058) PASS: lldb-api :: commands/expression/import-std-module/vector-of-vectors/TestVectorOfVectorsFromStdModule.py (1209 of 2058) PASS: lldb-shell :: ObjectFile/ELF/minidebuginfo-find-symbols.yaml (1210 of 2058) PASS: lldb-api :: functionalities/breakpoint/global_constructor/TestBreakpointInGlobalConstructor.py (1211 of 2058) PASS: lldb-api :: commands/process/attach/attach_denied/TestAttachDenied.py (1212 of 2058) PASS: lldb-api :: functionalities/thread/ignore_suspended/TestIgnoreSuspendedThread.py (1213 of 2058) PASS: lldb-api :: commands/expression/import-std-module/deque-basic/TestDequeFromStdModule.py (1214 of 2058) PASS: lldb-unit :: Expression/./ExpressionTests/DiagnosticManagerTest.GetStringMultiline (1215 of 2058) PASS: lldb-unit :: Language/Highlighting/./HighlighterTests/HighlighterTest.ClangTrailingBackslashMissingNewLine (1216 of 2058) PASS: lldb-unit :: Utility/./UtilityTests/StringExtractorTest.GetU32LittleEndian (1217 of 2058) PASS: lldb-unit :: Utility/./UtilityTests/BinaryStreamTest.PutSLEB128SevenBytes (1218 of 2058) PASS: lldb-shell :: SymbolFile/DWARF/debug-types-basic.test (1219 of 2058) PASS: lldb-api :: types/TestFloatTypesExpr.py (1220 of 2058) PASS: lldb-api :: commands/expression/call-function/TestCallUserDefinedFunction.py (1221 of 2058) PASS: lldb-unit :: Utility/./UtilityTests/BinaryStreamTest.PutULEB128SixBytes (1222 of 2058) PASS: lldb-api :: functionalities/data-formatter/data-formatter-stl/libcxx/map/TestDataFormatterLibccMap.py (1223 of 2058) PASS: lldb-api :: lang/cpp/global_variables/TestCPPGlobalVariables.py (1224 of 2058) PASS: lldb-unit :: ScriptInterpreter/Python/./ScriptInterpreterPythonTests/PythonDataObjectsTest.TestPythonCallableCheck (1225 of 2058) PASS: lldb-unit :: SymbolFile/DWARF/./SymbolFileDWARFTests/SymbolFileDWARFTests.TestAbbrevValidAttrNullForm (1226 of 2058) PASS: lldb-unit :: Utility/./UtilityTests/StreamTest.AddressRangeInvalidRange (1227 of 2058) PASS: lldb-api :: commands/expression/persistent_types/TestPersistentTypes.py (1228 of 2058) PASS: lldb-unit :: Utility/./UtilityTests/LogTest.Register (1229 of 2058) PASS: lldb-unit :: Symbol/./SymbolTests/TestTypeSystemClang.TestGetTypeClassDeclType (1230 of 2058) PASS: lldb-api :: functionalities/data-formatter/synthcapping/TestSyntheticCapping.py (1231 of 2058) PASS: lldb-unit :: Editline/./EditlineTests/EditlineTestFixture.EditlineReceivesMultiLineText (1232 of 2058) PASS: lldb-shell :: SymbolFile/NativePDB/break-by-function.cpp (1233 of 2058) UNSUPPORTED: lldb-api :: functionalities/asan/TestReportData.py (1234 of 2058) PASS: lldb-unit :: Core/./LLDBCoreTests/MangledTest.EmptyForInvalidName (1235 of 2058) PASS: lldb-unit :: tools/lldb-server/tests/./LLDBServerTests/TestBase.LaunchModePreservesEnvironment (1236 of 2058) PASS: lldb-api :: commands/expression/expr-in-syscall/TestExpressionInSyscall.py (1237 of 2058) PASS: lldb-api :: commands/expression/unicode-in-variable/TestUnicodeInVariable.py (1238 of 2058) PASS: lldb-unit :: Utility/./UtilityTests/StreamTeeTest.Write (1239 of 2058) PASS: lldb-unit :: Utility/./UtilityTests/ArgsTest.BareSingleQuote (1240 of 2058) PASS: lldb-unit :: Utility/./UtilityTests/UriParserTest.SchemeHostSeparator (1241 of 2058) UNSUPPORTED: lldb-shell :: Minidump/Windows/arm-fp-unwind.test (1242 of 2058) PASS: lldb-unit :: Utility/./UtilityTests/PassiveReplayTest.InstrumentedFoo (1243 of 2058) PASS: lldb-shell :: Reproducer/TestDSYM.test (1244 of 2058) PASS: lldb-unit :: Utility/./UtilityTests/StringListTest.InsertStringAtIndexStart (1245 of 2058) PASS: lldb-unit :: ObjectFile/Breakpad/./ObjectFileBreakpadTests/LineRecord.parse (1246 of 2058) UNSUPPORTED: lldb-api :: commands/expression/macros/TestMacros.py (1247 of 2058) PASS: lldb-unit :: Process/minidump/./LLDBMinidumpTests/MinidumpParserTest.FindMemoryRangeWithFullMemoryMinidump (1248 of 2058) PASS: lldb-api :: commands/command/invalid-args/TestInvalidArgsCommand.py (1249 of 2058) PASS: lldb-unit :: UnwindAssembly/x86/./UnwindAssemblyx86Tests/Testx86AssemblyInspectionEngine.TestPopEBP (1250 of 2058) PASS: lldb-api :: macosx/save_crashlog/TestSaveCrashlog.py (1251 of 2058) PASS: lldb-api :: commands/expression/persistent_types/TestNestedPersistentTypes.py (1252 of 2058) PASS: lldb-api :: functionalities/data-formatter/data-formatter-objc/TestDataFormatterObjCNSBundle.py (1253 of 2058) PASS: lldb-unit :: debugserver/./debugserverTests/RNBSocket.LoopBackListenIPv4 (1254 of 2058) PASS: lldb-unit :: ScriptInterpreter/Python/./ScriptInterpreterPythonTests/PythonDataObjectsTest.TestPythonIntegerToStructuredInteger (1255 of 2058) PASS: lldb-unit :: Utility/./UtilityTests/RangeTest.ContainsAddrInvalid (1256 of 2058) PASS: lldb-unit :: Utility/./UtilityTests/StringListTest.AppendStringStdString (1257 of 2058) PASS: lldb-shell :: Process/UnsupportedLanguage.test (1258 of 2058) PASS: lldb-unit :: Host/./HostTests/MainLoopTest.Signal (1259 of 2058) PASS: lldb-shell :: SymbolFile/NativePDB/global-classes.cpp (1260 of 2058) PASS: lldb-unit :: ScriptInterpreter/Python/./ScriptInterpreterPythonTests/PythonDataObjectsTest.TestDictionaryResolutionWithDot (1261 of 2058) PASS: lldb-api :: types/TestDoubleTypes.py (1262 of 2058) PASS: lldb-unit :: Utility/./UtilityTests/StreamTeeTest.AppendStream (1263 of 2058) PASS: lldb-shell :: ObjectFile/ELF/section-permissions.yaml (1264 of 2058) PASS: lldb-unit :: Expression/./ExpressionTests/DWARFExpression.DW_OP_piece (1265 of 2058) PASS: lldb-unit :: ObjectFile/ELF/./ObjectFileELFTests/ObjectFileELFTest.GetModuleSpecifications_EarlySectionHeaders (1266 of 2058) PASS: lldb-api :: types/TestIntegerTypeExpr.py (1267 of 2058) PASS: lldb-api :: lang/objc/objc-checker/TestObjCCheckers.py (1268 of 2058) PASS: lldb-unit :: Utility/./UtilityTests/StringListTest.SplitIntoLinesSingleTrailingCR (1269 of 2058) PASS: lldb-unit :: UnwindAssembly/x86/./UnwindAssemblyx86Tests/Testx86AssemblyInspectionEngine.TestSimple32bitFrameFunction (1270 of 2058) PASS: lldb-unit :: API/./APITests/SBCommandInterpreterTest.MultiWordCommand (1271 of 2058) PASS: lldb-unit :: Utility/./UtilityTests/FileSpecTest.RemoveLastPathComponent (1272 of 2058) UNSUPPORTED: lldb-shell :: Expr/TestIRMemoryMapWindows.test (1273 of 2058) PASS: lldb-unit :: SymbolFile/NativePDB/./SymbolFileNativePDBTests/PDBFPOProgramToDWARFExpressionTests.UnresolvedDependentCyclicRegisterAssignmentReference (1274 of 2058) PASS: lldb-api :: functionalities/data-formatter/user-format-vs-summary/TestUserFormatVsSummary.py (1275 of 2058) UNSUPPORTED: lldb-api :: lang/objc/rdar-12408181/TestRdar12408181.py (1276 of 2058) PASS: lldb-unit :: Expression/./ExpressionTests/DiagnosticManagerTest.GetStringNoDiags (1277 of 2058) PASS: lldb-unit :: Utility/./UtilityTests/ListenerTest.GetEventImmediate (1278 of 2058) UNSUPPORTED: lldb-shell :: SymbolFile/PDB/function-level-linking.test (1279 of 2058) PASS: lldb-unit :: Utility/./UtilityTests/StreamTeeTest.Flush (1280 of 2058) PASS: lldb-shell :: Minidump/no-process-id.yaml (1281 of 2058) PASS: lldb-api :: functionalities/thread/concurrent_events/TestConcurrentTwoWatchpointThreads.py (1282 of 2058) PASS: lldb-shell :: Breakpoint/debug_addrx.test (1283 of 2058) PASS: lldb-shell :: Expr/TestTypeOfDeclTypeExpr.test (1284 of 2058) PASS: lldb-unit :: Utility/./UtilityTests/StreamTest.AddressPrefix (1285 of 2058) PASS: lldb-shell :: SymbolFile/DWARF/debug-types-dwo-cross-reference.cpp (1286 of 2058) PASS: lldb-api :: functionalities/type_completion/TestTypeCompletion.py (1287 of 2058) PASS: lldb-unit :: Language/Highlighting/./HighlighterTests/HighlighterTest.ClangCursorOutOfBounds (1288 of 2058) PASS: lldb-unit :: Utility/./UtilityTests/StringListTest.ForRange (1289 of 2058) PASS: lldb-api :: functionalities/signal/handle-abrt/TestHandleAbort.py (1290 of 2058) PASS: lldb-unit :: Utility/./UtilityTests/ScalarTest.Promotion (1291 of 2058) PASS: lldb-api :: python_api/file_handle/TestFileHandle.py (1292 of 2058) PASS: lldb-unit :: Utility/./UtilityTests/StringListTest.PopBack (1293 of 2058) PASS: lldb-api :: functionalities/data-formatter/data-formatter-stl/libcxx/vector/TestDataFormatterLibcxxVector.py (1294 of 2058) PASS: lldb-unit :: Core/./LLDBCoreTests/StreamCallbackTest.Callback (1295 of 2058) PASS: lldb-shell :: SymbolFile/DWARF/DW_OP_piece-struct.s (1296 of 2058) PASS: lldb-unit :: Utility/./UtilityTests/BinaryStreamTest.PutSLEB128FourBytes (1297 of 2058) PASS: lldb-shell :: SymbolFile/DWARF/dwo-type-in-main-file.s (1298 of 2058) PASS: lldb-shell :: Reproducer/TestReuseDirectory.test (1299 of 2058) PASS: lldb-api :: functionalities/breakpoint/breakpoint_command/TestBreakpointCommand.py (1300 of 2058) PASS: lldb-unit :: Language/Highlighting/./HighlighterTests/HighlighterTest.ClangEmptyInput (1301 of 2058) PASS: lldb-unit :: Utility/./UtilityTests/ProcessInstanceInfoMatch.Name (1302 of 2058) PASS: lldb-api :: commands/expression/function_template_specialization_temp_args/TestFunctionTemplateSpecializationTempArgs.py (1303 of 2058) PASS: lldb-api :: functionalities/gdb_remote_client/TestArmRegisterDefinition.py (1304 of 2058) PASS: lldb-shell :: ObjectFile/PECOFF/basic-info-arm.yaml (1305 of 2058) PASS: lldb-unit :: Symbol/./SymbolTests/TestTypeSystemClang.TemplateArguments (1306 of 2058) PASS: lldb-shell :: ScriptInterpreter/None/none.test (1307 of 2058) PASS: lldb-api :: functionalities/thread/thread_exit/TestThreadExit.py (1308 of 2058) PASS: lldb-shell :: Reproducer/TestDiscard.test (1309 of 2058) PASS: lldb-unit :: Utility/./UtilityTests/UriParserTest.LongPath (1310 of 2058) PASS: lldb-shell :: SymbolFile/Breakpad/unwind-via-stack-win-no-memory-info.yaml (1311 of 2058) PASS: lldb-unit :: Process/minidump/./LLDBMinidumpTests/MinidumpParserTest.GetLinuxProcStatus (1312 of 2058) PASS: lldb-api :: tools/lldb-server/register-reading/TestGdbRemoteGPacket.py (1313 of 2058) PASS: lldb-api :: functionalities/breakpoint/scripted_bkpt/TestScriptedResolver.py (1314 of 2058) PASS: lldb-api :: commands/expression/pr35310/TestExprsBug35310.py (1315 of 2058) PASS: lldb-unit :: SymbolFile/NativePDB/./SymbolFileNativePDBTests/PDBFPOProgramToDWARFExpressionTests.DependencyChain (1316 of 2058) PASS: lldb-unit :: Process/gdb-remote/./ProcessGdbRemoteTests/GDBRemoteClientBaseTest.SendPacketAndReceiveResponseWithOutputSupport (1317 of 2058) PASS: lldb-unit :: Host/./HostTests/SocketTest.DomainListenConnectAccept (1318 of 2058) PASS: lldb-api :: functionalities/thread/num_threads/TestNumThreads.py (1319 of 2058) PASS: lldb-shell :: SymbolFile/DWARF/debug-types-line-tables.s (1320 of 2058) PASS: lldb-shell :: SymbolFile/DWARF/debug_ranges-missing-section.s (1321 of 2058) UNSUPPORTED: lldb-shell :: SymbolFile/PDB/calling-conventions.test (1322 of 2058) UNSUPPORTED: lldb-api :: commands/watchpoints/variable_out_of_scope/TestWatchedVarHitWhenInScope.py (1323 of 2058) PASS: lldb-unit :: Utility/./UtilityTests/ArchSpecTest.TestParseMachCPUDashSubtypeTripleExtra (1324 of 2058) PASS: lldb-unit :: Utility/./UtilityTests/ConstStringTest.YAML (1325 of 2058) PASS: lldb-api :: functionalities/breakpoint/source_regexp/TestSourceRegexBreakpoints.py (1326 of 2058) PASS: lldb-unit :: Utility/./UtilityTests/BinaryStreamTest.PutSLEB128TwoBytes (1327 of 2058) PASS: lldb-shell :: ObjectFile/PECOFF/sections-names.yaml (1328 of 2058) PASS: lldb-api :: functionalities/data-formatter/data-formatter-objc/TestDataFormatterObjCPlain.py (1329 of 2058) PASS: lldb-api :: commands/breakpoint/set/func-regex/TestBreakpointRegexError.py (1330 of 2058) UNSUPPORTED: lldb-api :: commands/gui/basic/TestGuiBasic.py (1331 of 2058) PASS: lldb-unit :: ScriptInterpreter/Python/./ScriptInterpreterPythonTests/PythonDataObjectsTest.TestPythonFile (1332 of 2058) PASS: lldb-api :: functionalities/thread/concurrent_events/TestConcurrentWatchpointWithDelayWatchpointThreads.py (1333 of 2058) PASS: lldb-api :: tools/lldb-server/TestLldbGdbServer.py (1334 of 2058) UNSUPPORTED: lldb-api :: functionalities/data-formatter/data-formatter-stl/libstdcpp/tuple/TestDataFormatterStdTuple.py (1335 of 2058) PASS: lldb-api :: functionalities/data-formatter/type_summary_list_arg/TestTypeSummaryListArg.py (1336 of 2058) PASS: lldb-shell :: Settings/TestDisableColor.test (1337 of 2058) PASS: lldb-unit :: Utility/./UtilityTests/StreamTest.PutULEB128 (1338 of 2058) PASS: lldb-unit :: Utility/./UtilityTests/ArchSpecTest.MergeFromMachOUnknown (1339 of 2058) PASS: lldb-api :: commands/disassemble/basic/TestDisassembleBreakpoint.py (1340 of 2058) UNSUPPORTED: lldb-api :: android/platform/TestDefaultCacheLineSize.py (1341 of 2058) PASS: lldb-unit :: ScriptInterpreter/Python/./ScriptInterpreterPythonTests/PythonDataObjectsTest.TestPythonTupleInitializerList (1342 of 2058) PASS: lldb-api :: lang/c/stepping/TestStepAndBreakpoints.py (1343 of 2058) PASS: lldb-api :: commands/command/nested_alias/TestNestedAlias.py (1344 of 2058) PASS: lldb-unit :: Utility/./UtilityTests/UriParserTest.SchemeHostSeparator2 (1345 of 2058) PASS: lldb-api :: functionalities/completion/TestCompletion.py (1346 of 2058) PASS: lldb-api :: functionalities/set-data/TestSetData.py (1347 of 2058) PASS: lldb-shell :: VSCode/TestOptions.test (1348 of 2058) PASS: lldb-shell :: SymbolFile/DWARF/dwp.s (1349 of 2058) PASS: lldb-api :: functionalities/data-formatter/nsdictionarysynth/TestNSDictionarySynthetic.py (1350 of 2058) PASS: lldb-unit :: Utility/./UtilityTests/SubsystemRAIITest.SubsystemWithErrorFailure (1351 of 2058) PASS: lldb-api :: commands/frame/language/TestGuessLanguage.py (1352 of 2058) PASS: lldb-api :: lang/c/modules/TestCModules.py (1353 of 2058) PASS: lldb-unit :: DataFormatter/./LLDBFormatterTests/StringPrinterTests.CxxUTF8 (1354 of 2058) PASS: lldb-unit :: Process/minidump/./LLDBMinidumpTests/MinidumpParserTest.GetMemory (1355 of 2058) UNSUPPORTED: lldb-shell :: ScriptInterpreter/Lua/lua.test (1356 of 2058) PASS: lldb-unit :: UnwindAssembly/x86/./UnwindAssemblyx86Tests/Testx86AssemblyInspectionEngine.TestDisassemblyJunkBytes (1357 of 2058) PASS: lldb-api :: python_api/watchpoint/TestSetWatchpoint.py (1358 of 2058) PASS: lldb-api :: functionalities/breakpoint/breakpoint_conditions/TestBreakpointConditions.py (1359 of 2058) PASS: lldb-unit :: Utility/./UtilityTests/GeneratorTest.Create (1360 of 2058) PASS: lldb-api :: functionalities/memory/read/TestMemoryRead.py (1361 of 2058) PASS: lldb-shell :: Quit/TestQuitExitCode-30.test (1362 of 2058) PASS: lldb-unit :: Utility/./UtilityTests/SharedCluster.ClusterManager (1363 of 2058) PASS: lldb-unit :: SymbolFile/DWARF/./SymbolFileDWARFTests/SymbolFileDWARFTests.TestAbbrevOutOfOrder (1364 of 2058) UNSUPPORTED: lldb-shell :: Register/x86-zmm-write.test (1365 of 2058) PASS: lldb-api :: commands/command/script/import/rdar-12586188/TestRdar12586188.py (1366 of 2058) PASS: lldb-unit :: Core/./LLDBCoreTests/RichManglingContextTest.Basic (1367 of 2058) PASS: lldb-unit :: Symbol/./SymbolTests/TestTypeSystemClang.TestFunctionTemplateInRecordConstruction (1368 of 2058) PASS: lldb-unit :: Expression/./ExpressionTests/ClangHostTest.ComputeClangResourceDirectory (1369 of 2058) PASS: lldb-shell :: SymbolFile/DWARF/find-method.cpp (1370 of 2058) PASS: lldb-shell :: SymbolFile/DWARF/DW_TAG_variable-invalid_location.s (1371 of 2058) PASS: lldb-shell :: SymbolFile/Breakpad/line-table-discontinuous-file-ids.test (1372 of 2058) PASS: lldb-shell :: Breakpoint/debug_rnglist_offset_pair.test (1373 of 2058) UNSUPPORTED: lldb-api :: functionalities/unwind/ehframe/TestEhFrameUnwind.py (1374 of 2058) PASS: lldb-unit :: Utility/./UtilityTests/EventTest.DumpEventDataBytes (1375 of 2058) PASS: lldb-unit :: Target/./TargetTests/MCBasedABI.MapRegisterName (1376 of 2058) UNSUPPORTED: lldb-shell :: Breakpoint/ppc64-localentry.test (1377 of 2058) PASS: lldb-unit :: ObjectFile/Breakpad/./ObjectFileBreakpadTests/InfoRecord.parse (1378 of 2058) PASS: lldb-unit :: ScriptInterpreter/Python/./ScriptInterpreterPythonTests/PythonDataObjectsTest.TestPythonTupleInitializerList2 (1379 of 2058) UNSUPPORTED: lldb-shell :: SymbolFile/PDB/variables.test (1380 of 2058) PASS: lldb-unit :: Utility/./UtilityTests/StreamTest.ChangingByteOrder (1381 of 2058) PASS: lldb-unit :: UnwindAssembly/x86/./UnwindAssemblyx86Tests/Testx86AssemblyInspectionEngine.TestAddESP (1382 of 2058) PASS: lldb-unit :: Utility/./UtilityTests/OptionsWithRawTest.QuotedSuffix (1383 of 2058) PASS: lldb-unit :: Utility/./UtilityTests/ConstStringTest.NullAndEmptyStates (1384 of 2058) PASS: lldb-unit :: Utility/./UtilityTests/FileSpecTest.GuessPathStyle (1385 of 2058) PASS: lldb-shell :: ObjectFile/MachO/subsections.yaml (1386 of 2058) PASS: lldb-unit :: Utility/./UtilityTests/StringExtractorTest.GetNameColonValueNoSemicolon (1387 of 2058) PASS: lldb-api :: functionalities/breakpoint/objc/TestObjCBreakpoints.py (1388 of 2058) PASS: lldb-unit :: Symbol/./SymbolTests/Type.CompilerContextPattern (1389 of 2058) PASS: lldb-shell :: Commands/CommandScriptImmediateOutput/CommandScriptImmediateOutputFile.test (1390 of 2058) PASS: lldb-api :: functionalities/breakpoint/move_nearest/TestMoveNearest.py (1391 of 2058) UNSUPPORTED: lldb-api :: functionalities/ubsan/user-expression/TestUbsanUserExpression.py (1392 of 2058) PASS: lldb-unit :: Utility/./UtilityTests/BinaryStreamTest.PutSLEB128OneByte (1393 of 2058) PASS: lldb-api :: commands/register/register/register_command/TestRegisters.py (1394 of 2058) PASS: lldb-unit :: Utility/./UtilityTests/BroadcasterTest.EventTypeHasListeners (1395 of 2058) PASS: lldb-shell :: ObjectFile/ELF/PT_LOAD-overlap.yaml (1396 of 2058) PASS: lldb-api :: functionalities/data-formatter/data-formatter-ptr-to-array/TestPtrToArrayFormatting.py (1397 of 2058) PASS: lldb-unit :: UnwindAssembly/x86/./UnwindAssemblyx86Tests/Testx86AssemblyInspectionEngine.TestPushESI (1398 of 2058) PASS: lldb-api :: functionalities/breakpoint/hardware_breakpoints/hardware_breakpoint_on_multiple_threads/TestHWBreakMultiThread.py (1399 of 2058) PASS: lldb-unit :: Host/./HostTests/NativeProcessProtocolTest.SetBreakpoint (1400 of 2058) UNSUPPORTED: lldb-api :: functionalities/thread/multi_break/TestMultipleBreakpoints.py (1401 of 2058) PASS: lldb-unit :: Symbol/./SymbolTests/DWARFCallFrameInfoTest.Basic_dwarf3 (1402 of 2058) PASS: lldb-unit :: Symbol/./SymbolTests/TestTypeSystemClang.TestGetTypeClassNested (1403 of 2058) PASS: lldb-api :: functionalities/data-formatter/data-formatter-enum-format/TestDataFormatterEnumFormat.py (1404 of 2058) UNSUPPORTED: lldb-shell :: ScriptInterpreter/Lua/independent_state.test (1405 of 2058) PASS: lldb-api :: lang/cpp/call-function/TestCallCPPFunction.py (1406 of 2058) PASS: lldb-shell :: SymbolFile/DWARF/win-i386-line-table.s (1407 of 2058) PASS: lldb-api :: functionalities/data-formatter/data-formatter-caching/TestDataFormatterCaching.py (1408 of 2058) UNSUPPORTED: lldb-api :: commands/expression/completion-crash-invalid-iterator/TestInvalidIteratorCompletionCrash.py (1409 of 2058) PASS: lldb-unit :: Utility/./UtilityTests/UriParserTest.BadPort (1410 of 2058) PASS: lldb-unit :: Utility/./UtilityTests/Flags.AnySet (1411 of 2058) PASS: lldb-api :: commands/frame/diagnose/dereference-function-return/TestDiagnoseDereferenceFunctionReturn.py (1412 of 2058) PASS: lldb-unit :: Utility/./UtilityTests/NameMatchesTest.Contains (1413 of 2058) PASS: lldb-api :: functionalities/data-formatter/refpointer-recursion/TestDataFormatterRefPtrRecursion.py (1414 of 2058) UNSUPPORTED: lldb-shell :: SymbolFile/PDB/variables-locations.test (1415 of 2058) PASS: lldb-unit :: ObjectFile/Breakpad/./ObjectFileBreakpadTests/FuncRecord.parse (1416 of 2058) PASS: lldb-unit :: Utility/./UtilityTests/StringExtractorTest.GetHexBytes_Underflow (1417 of 2058) PASS: lldb-api :: functionalities/thread_plan/TestThreadPlanCommands.py (1418 of 2058) PASS: lldb-api :: functionalities/breakpoint/comp_dir_symlink/TestCompDirSymLink.py (1419 of 2058) PASS: lldb-shell :: SymbolFile/DWARF/debug-types-dwarf5.s (1420 of 2058) PASS: lldb-unit :: Core/./LLDBCoreTests/CommunicationTest.SynchronizeWhileClosing (1421 of 2058) PASS: lldb-shell :: ObjectFile/PECOFF/symbol.yaml (1422 of 2058) PASS: lldb-unit :: tools/lldb-server/tests/./LLDBServerTests/TestBase.DebugserverEnv (1423 of 2058) UNSUPPORTED: lldb-api :: functionalities/exec/TestExec.py (1424 of 2058) PASS: lldb-unit :: Symbol/./SymbolTests/LineEntryTest.GetSameLineContiguousAddressRangeOneInline (1425 of 2058) UNSUPPORTED: lldb-shell :: SymbolFile/NativePDB/ast-functions-msvc.cpp (1426 of 2058) PASS: lldb-api :: lang/objc/unicode-string/TestUnicodeString.py (1427 of 2058) PASS: lldb-shell :: Reproducer/TestGDBRemoteRepro.test (1428 of 2058) PASS: lldb-api :: functionalities/breakpoint/breakpoint_language/TestBreakpointLanguage.py (1429 of 2058) PASS: lldb-api :: lang/objc/exceptions/TestObjCExceptions.py (1430 of 2058) PASS: lldb-api :: lang/c/inlines/TestRedefinitionsInInlines.py (1431 of 2058) PASS: lldb-unit :: UnwindAssembly/x86/./UnwindAssemblyx86Tests/Testx86AssemblyInspectionEngine.TestMovRSPtoRBP (1432 of 2058) PASS: lldb-api :: commands/frame/var-scope/TestFrameVariableScope.py (1433 of 2058) PASS: lldb-api :: lang/cpp/constructors/TestCppConstructors.py (1434 of 2058) PASS: lldb-unit :: Utility/./UtilityTests/StructuredDataTest.ParseJSONFromFile (1435 of 2058) PASS: lldb-unit :: ScriptInterpreter/Python/./ScriptInterpreterPythonTests/PythonDataObjectsTest.TestPythonTupleValues (1436 of 2058) PASS: lldb-api :: commands/target/basic/TestTargetCommand.py (1437 of 2058) PASS: lldb-unit :: Utility/./UtilityTests/RegularExpression.CopyAssignment (1438 of 2058) PASS: lldb-api :: functionalities/tail_call_frames/thread_step_out_or_return/TestSteppingOutWithArtificialFrames.py (1439 of 2058) PASS: lldb-unit :: Expression/./ExpressionTests/DiagnosticManagerTest.PutStringSeverities (1440 of 2058) PASS: lldb-unit :: Utility/./UtilityTests/StringListTest.GetMaxStringLengthMixed (1441 of 2058) PASS: lldb-unit :: Utility/./UtilityTests/RecordReplayTest.InstrumentedBar (1442 of 2058) PASS: lldb-api :: functionalities/data-formatter/compactvectors/TestCompactVectors.py (1443 of 2058) PASS: lldb-shell :: ObjectFile/Breakpad/sections.test (1444 of 2058) PASS: lldb-api :: lang/cpp/inlines/TestInlines.py (1445 of 2058) PASS: lldb-shell :: SymbolFile/DWARF/find-variable-file.cpp (1446 of 2058) PASS: lldb-api :: lang/cpp/trivial_abi/TestTrivialABI.py (1447 of 2058) PASS: lldb-unit :: ScriptInterpreter/Python/./ScriptInterpreterPythonTests/PythonDataObjectsTest.TestBorrowedReferences (1448 of 2058) PASS: lldb-unit :: Utility/./UtilityTests/VMRange.ContainsRange (1449 of 2058) PASS: lldb-unit :: Utility/./UtilityTests/StatusTest.ErrorConversion (1450 of 2058) PASS: lldb-unit :: Utility/./UtilityTests/OptionsWithRawTest.SingleWhitespaceInput (1451 of 2058) PASS: lldb-unit :: Utility/./UtilityTests/RangeTest.SizeTypes (1452 of 2058) PASS: lldb-api :: functionalities/data-formatter/stringprinter/TestStringPrinter.py (1453 of 2058) PASS: lldb-unit :: Expression/./ExpressionTests/CppModuleConfigurationTest.MissingUsrInclude (1454 of 2058) PASS: lldb-unit :: Utility/./UtilityTests/RangeDataVector.FindEntryIndexesThatContain_Overlap (1455 of 2058) PASS: lldb-api :: functionalities/gdb_remote_client/TestPlatformClient.py (1456 of 2058) PASS: lldb-api :: lang/objc/self/TestObjCSelf.py (1457 of 2058) PASS: lldb-unit :: Utility/./UtilityTests/PassiveReplayTest.InstrumentedBarPtr (1458 of 2058) PASS: lldb-unit :: UnwindAssembly/x86/./UnwindAssemblyx86Tests/Testx86AssemblyInspectionEngine.TestPushExtended (1459 of 2058) PASS: lldb-api :: commands/platform/basic/TestPlatformPython.py (1460 of 2058) PASS: lldb-unit :: Host/./HostTests/NativeProcessProtocolTest.ReadCStringFromMemory_MaxSize (1461 of 2058) PASS: lldb-unit :: Utility/./UtilityTests/XcodeSDKTest.ParseTest (1462 of 2058) PASS: lldb-api :: commands/expression/radar_9673664/TestExprHelpExamples.py (1463 of 2058) PASS: lldb-unit :: Utility/./UtilityTests/UUIDTest.RelationalOperators (1464 of 2058) PASS: lldb-unit :: Utility/./UtilityTests/UUIDTest.StringConverion (1465 of 2058) PASS: lldb-unit :: Process/gdb-remote/./ProcessGdbRemoteTests/GDBRemoteCommunicationClientTest.SendStopTracePacket (1466 of 2058) PASS: lldb-api :: functionalities/memory/cache/TestMemoryCache.py (1467 of 2058) PASS: lldb-api :: functionalities/postmortem/elf-core/TestLinuxCore.py (1468 of 2058) UNSUPPORTED: lldb-shell :: SymbolFile/NativePDB/stack_unwinding01.cpp (1469 of 2058) PASS: lldb-api :: python_api/get-value-32bit-int/TestGetValue32BitInt.py (1470 of 2058) PASS: lldb-unit :: SymbolFile/NativePDB/./SymbolFileNativePDBTests/PDBFPOProgramToDWARFExpressionTests.InvalidOpUnary (1471 of 2058) PASS: lldb-unit :: Host/./HostTests/SocketAddressTest.Set (1472 of 2058) PASS: lldb-unit :: Utility/./UtilityTests/RangeTest.DoesAdjoinOrIntersect (1473 of 2058) PASS: lldb-unit :: Expression/./ExpressionTests/ClangExpressionDeclMapTest.TestPersistentDeclLookup (1474 of 2058) PASS: lldb-api :: commands/expression/import-std-module/queue/TestQueueFromStdModule.py (1475 of 2058) PASS: lldb-api :: tools/lldb-server/TestGdbRemoteAttach.py (1476 of 2058) UNSUPPORTED: lldb-api :: functionalities/darwin_log/filter/exact_match/message/TestDarwinLogFilterMatchMessage.py (1477 of 2058) PASS: lldb-api :: lang/objcxx/class-name-clash/TestNameClash.py (1478 of 2058) PASS: lldb-unit :: Process/gdb-remote/./ProcessGdbRemoteTests/GDBRemoteClientBaseTest.SendContinueAndInterrupt2PacketBug (1479 of 2058) PASS: lldb-api :: lang/c/step_over_no_deadlock/TestStepOverDoesntBlock.py (1480 of 2058) UNSUPPORTED: lldb-api :: commands/register/register/intel_xtended_registers/mpx_bound_violation/TestBoundViolation.py (1481 of 2058) UNSUPPORTED: lldb-shell :: ScriptInterpreter/Lua/convenience_variables.test (1482 of 2058) PASS: lldb-shell :: Quit/TestQuitExitCodeTooManyArgs.test (1483 of 2058) PASS: lldb-api :: lang/objc/modules-incomplete/TestIncompleteModules.py (1484 of 2058) PASS: lldb-api :: functionalities/fat_archives/TestFatArchives.py (1485 of 2058) UNSUPPORTED: lldb-shell :: SymbolFile/PDB/vbases.test (1486 of 2058) PASS: lldb-shell :: SymbolFile/DWARF/dwarf5-debug_line.s (1487 of 2058) PASS: lldb-api :: commands/expression/ir-interpreter-phi-nodes/TestIRInterpreterPHINodes.py (1488 of 2058) PASS: lldb-unit :: Process/gdb-remote/./ProcessGdbRemoteTests/GDBRemoteCommunicationClientTest.SendSignalsToIgnore (1489 of 2058) PASS: lldb-shell :: Driver/TestCore.test (1490 of 2058) PASS: lldb-api :: functionalities/data-formatter/data-formatter-objc/TestDataFormatterObjNSException.py (1491 of 2058) PASS: lldb-unit :: Symbol/./SymbolTests/TestTypeSystemClang.TestGetEnumIntegerTypeBasicTypes (1492 of 2058) PASS: lldb-api :: tools/lldb-server/TestGdbRemoteSingleStep.py (1493 of 2058) PASS: lldb-api :: functionalities/load_unload/TestLoadUnload.py (1494 of 2058) PASS: lldb-shell :: SymbolFile/DWARF/find-method-local-struct.cpp (1495 of 2058) PASS: lldb-api :: functionalities/inferior-crashing/recursive-inferior/TestRecursiveInferior.py (1496 of 2058) UNSUPPORTED: lldb-shell :: SymbolFile/DWARF/debug-types-expressions.test (1497 of 2058) PASS: lldb-unit :: Expression/./ExpressionTests/DWARFExpression.DW_OP_stack_value (1498 of 2058) UNSUPPORTED: lldb-api :: functionalities/tsan/multiple/TestTsanMultiple.py (1499 of 2058) PASS: lldb-api :: functionalities/breakpoint/breakpoint_set_restart/TestBreakpointSetRestart.py (1500 of 2058) PASS: lldb-unit :: Language/Highlighting/./HighlighterTests/HighlighterTest.ClangTrailingBackslashBeforeNewline (1501 of 2058) PASS: lldb-api :: python_api/sbtype_typeclass/TestSBTypeTypeClass.py (1502 of 2058) PASS: lldb-api :: tools/lldb-server/TestGdbRemoteHostInfo.py (1503 of 2058) PASS: lldb-shell :: ScriptInterpreter/Python/crashlog.test (1504 of 2058) PASS: lldb-api :: lang/cpp/offsetof/TestOffsetofCpp.py (1505 of 2058) PASS: lldb-api :: functionalities/thread/concurrent_events/TestConcurrentDelaySignalWatch.py (1506 of 2058) PASS: lldb-api :: python_api/sbplatform/TestSBPlatform.py (1507 of 2058) PASS: lldb-api :: functionalities/tail_call_frames/cross_dso/TestCrossDSOTailCalls.py (1508 of 2058) PASS: lldb-unit :: SymbolFile/DWARF/./SymbolFileDWARFTests/SymbolFileDWARFTests.ParseArangesNonzeroSegmentSize (1509 of 2058) PASS: lldb-unit :: Language/Highlighting/./HighlighterTests/HighlighterTest.Keywords (1510 of 2058) PASS: lldb-api :: functionalities/data-formatter/data-formatter-stl/libcxx/tuple/TestDataFormatterLibcxxTuple.py (1511 of 2058) PASS: lldb-unit :: Language/Highlighting/./HighlighterTests/HighlighterTest.ClangScalarLiterals (1512 of 2058) PASS: lldb-unit :: ScriptInterpreter/Python/./ScriptInterpreterPythonTests/PythonDataObjectsTest.TestPythonDictionaryToStructuredDictionary (1513 of 2058) PASS: lldb-shell :: Commands/command-target-modules-dump-sections.yaml (1514 of 2058) PASS: lldb-unit :: Expression/./ExpressionTests/DiagnosticManagerTest.HasFixits (1515 of 2058) PASS: lldb-shell :: ObjectFile/Breakpad/discontiguous-sections.test (1516 of 2058) PASS: lldb-api :: lang/objc/blocks/TestObjCIvarsInBlocks.py (1517 of 2058) PASS: lldb-api :: functionalities/breakpoint/breakpoint_ignore_count/TestBreakpointIgnoreCount.py (1518 of 2058) PASS: lldb-unit :: Utility/./UtilityTests/RangeTest.ContainsEndInclusive (1519 of 2058) PASS: lldb-api :: functionalities/thread/crash_during_step/TestCrashDuringStep.py (1520 of 2058) PASS: lldb-shell :: Reproducer/Functionalities/TestDataFormatter.test (1521 of 2058) PASS: lldb-shell :: ObjectFile/ELF/PT_LOAD-empty.yaml (1522 of 2058) PASS: lldb-unit :: Utility/./UtilityTests/XcodeSDKTest.SDKSupportsModules (1523 of 2058) UNSUPPORTED: lldb-api :: commands/register/register/intel_xtended_registers/TestMPXRegisters.py (1524 of 2058) PASS: lldb-shell :: ScriptInterpreter/Python/eof.test (1525 of 2058) PASS: lldb-unit :: UnwindAssembly/x86/./UnwindAssemblyx86Tests/Testx86AssemblyInspectionEngine.Test32bitFramelessBigStackFrame (1526 of 2058) PASS: lldb-api :: commands/expression/calculator_mode/TestCalculatorMode.py (1527 of 2058) PASS: lldb-api :: functionalities/breakpoint/breakpoint_ids/TestBreakpointIDs.py (1528 of 2058) PASS: lldb-unit :: SymbolFile/NativePDB/./SymbolFileNativePDBTests/PDBFPOProgramToDWARFExpressionTests.UnsupportedRASearch (1529 of 2058) PASS: lldb-unit :: Host/./HostTests/NativeProcessProtocolTest.ReadCStringFromMemory (1530 of 2058) PASS: lldb-api :: lang/cpp/lambdas/TestLambdas.py (1531 of 2058) PASS: lldb-unit :: Utility/./UtilityTests/BinaryStreamTest.PutULEB128EightBytes (1532 of 2058) PASS: lldb-unit :: Expression/./ExpressionTests/DiagnosticManagerTest.AppendMessageAttachToLastDiag (1533 of 2058) PASS: lldb-unit :: Utility/./UtilityTests/StringLexerTest.Next (1534 of 2058) PASS: lldb-api :: functionalities/inline-stepping/TestInlineStepping.py (1535 of 2058) PASS: lldb-unit :: Expression/./ExpressionTests/CppModuleConfigurationTest.UnknownLibCppFile (1536 of 2058) PASS: lldb-api :: tools/lldb-server/commandline/TestStubSetSID.py (1537 of 2058) PASS: lldb-api :: lang/objcxx/hide-runtime-values/TestObjCXXHideRuntimeValues.py (1538 of 2058) PASS: lldb-api :: functionalities/gdb_remote_client/TestJLink6Armv7RegisterDefinition.py (1539 of 2058) PASS: lldb-unit :: Utility/./UtilityTests/StringExtractorTest.GetHexU8_Extra (1540 of 2058) PASS: lldb-api :: lang/objc/foundation/TestObjCMethodsString.py (1541 of 2058) PASS: lldb-api :: macosx/nslog/TestDarwinNSLogOutput.py (1542 of 2058) PASS: lldb-unit :: Utility/./UtilityTests/UriParserTest.SchemeHostSeparator4 (1543 of 2058) PASS: lldb-unit :: Utility/./UtilityTests/RangeTest.NotEqualInvalid (1544 of 2058) UNSUPPORTED: lldb-api :: functionalities/thread/state/TestThreadStates.py (1545 of 2058) PASS: lldb-api :: python_api/process/read-mem-cstring/TestReadMemCString.py (1546 of 2058) PASS: lldb-api :: functionalities/gdb_remote_client/TestqOffsets.py (1547 of 2058) UNSUPPORTED: lldb-api :: lang/cpp/static_members/TestCPPStaticMembers.py (1548 of 2058) PASS: lldb-unit :: UnwindAssembly/x86/./UnwindAssemblyx86Tests/Testx86AssemblyInspectionEngine.TestSubESP (1549 of 2058) PASS: lldb-api :: commands/expression/import_base_class_when_class_has_derived_member/TestImportBaseClassWhenClassHasDerivedMember.py (1550 of 2058) PASS: lldb-shell :: SymbolFile/DWARF/dir-separator-no-comp-dir.s (1551 of 2058) PASS: lldb-unit :: Process/gdb-remote/./ProcessGdbRemoteTests/GDBRemoteCommunicationServerTest.SendErrorResponse_ErrorList (1552 of 2058) PASS: lldb-unit :: ScriptInterpreter/Python/./ScriptInterpreterPythonTests/PythonDataObjectsTest.TestObjectAttributes (1553 of 2058) PASS: lldb-unit :: Utility/./UtilityTests/RangeTest.LessThan (1554 of 2058) PASS: lldb-unit :: Utility/./UtilityTests/BinaryStreamTest.PutULEB128NineBytes (1555 of 2058) PASS: lldb-api :: functionalities/gdb_remote_client/TestIOSSimulator.py (1556 of 2058) PASS: lldb-api :: lang/cpp/dynamic-value-same-basename/TestDynamicValueSameBase.py (1557 of 2058) PASS: lldb-shell :: SymbolFile/NativePDB/function-types-classes.cpp (1558 of 2058) PASS: lldb-unit :: Utility/./UtilityTests/TimerTest.CategoryTimes (1559 of 2058) PASS: lldb-api :: functionalities/data-formatter/data-formatter-stl/libcxx/list/loop/TestDataFormatterLibcxxListLoop.py (1560 of 2058) PASS: lldb-api :: commands/expression/import-std-module/weak_ptr-dbg-info-content/TestDbgInfoContentWeakPtrFromStdModule.py (1561 of 2058) PASS: lldb-api :: lang/c/array_types/TestArrayTypes.py (1562 of 2058) PASS: lldb-shell :: ObjectFile/ELF/netbsd-core-amd64.test (1563 of 2058) PASS: lldb-shell :: Breakpoint/debug_rnglistx_rlex.test (1564 of 2058) PASS: lldb-shell :: ObjectFile/PECOFF/dep-modules.yaml (1565 of 2058) PASS: lldb-api :: commands/watchpoints/watchpoint_events/TestWatchpointEvents.py (1566 of 2058) PASS: lldb-unit :: Utility/./UtilityTests/BinaryStreamTest.PutSLEB128One (1567 of 2058) PASS: lldb-api :: functionalities/target-new-solib-notifications/TestModuleLoadedNotifys.py (1568 of 2058) PASS: lldb-api :: functionalities/data-formatter/data-formatter-stl/libcxx/function/TestLibCxxFunction.py (1569 of 2058) PASS: lldb-unit :: Expression/./ExpressionTests/DiagnosticManagerTest.AddDiagnostic (1570 of 2058) UNSUPPORTED: lldb-shell :: Register/aarch64-fp-read.test (1571 of 2058) PASS: lldb-api :: lang/objc/foundation/TestRuntimeTypes.py (1572 of 2058) PASS: lldb-shell :: ObjectFile/ELF/gnu-debuglink.yaml (1573 of 2058) PASS: lldb-unit :: Utility/./UtilityTests/RangeTest.LessThanInvalid (1574 of 2058) PASS: lldb-unit :: Symbol/./SymbolTests/PostfixExpression.ToDWARF (1575 of 2058) PASS: lldb-api :: functionalities/plugins/command_plugin/TestPluginCommands.py (1576 of 2058) PASS: lldb-api :: functionalities/data-formatter/data-formatter-stl/libcxx/unique_ptr/TestDataFormatterLibcxxUniquePtr.py (1577 of 2058) PASS: lldb-api :: lang/cpp/auto/TestCPPAuto.py (1578 of 2058) PASS: lldb-api :: tools/lldb-vscode/launch/TestVSCode_launch.py (1579 of 2058) PASS: lldb-shell :: SymbolFile/DWARF/inline-function-address.ll (1580 of 2058) PASS: lldb-api :: python_api/module_section/TestModuleAndSection.py (1581 of 2058) PASS: lldb-unit :: Process/gdb-remote/./ProcessGdbRemoteTests/GDBRemoteClientBaseTest.SendContinueDelegateInterface (1582 of 2058) UNSUPPORTED: lldb-api :: commands/watchpoints/multi_watchpoint_slots/TestWatchpointMultipleSlots.py (1583 of 2058) PASS: lldb-unit :: Utility/./UtilityTests/ScalarTest.GetBytes (1584 of 2058) PASS: lldb-unit :: Utility/./UtilityTests/CompletionRequest.DuplicateFilteringWithComments (1585 of 2058) PASS: lldb-unit :: Expression/./ExpressionTests/CppModuleConfigurationTest.AmbiguousLibCpp (1586 of 2058) UNSUPPORTED: lldb-api :: arm/breakpoint-it/TestBreakpointIt.py (1587 of 2058) PASS: lldb-api :: functionalities/gdb_remote_client/TestThreadSelectionBug.py (1588 of 2058) PASS: lldb-api :: lang/c/shared_lib_stripped_symbols/TestSharedLibStrippedSymbols.py (1589 of 2058) PASS: lldb-unit :: Utility/./UtilityTests/GeneratorTest.GetOrCreate (1590 of 2058) PASS: lldb-api :: commands/add-dsym/uuid/TestAddDsymCommand.py (1591 of 2058) PASS: lldb-unit :: Process/minidump/./LLDBMinidumpTests/MinidumpParserTest.GetPidWindows (1592 of 2058) PASS: lldb-shell :: SymbolFile/DWARF/dir-separator-no-comp-dir-relative-name.s (1593 of 2058) PASS: lldb-api :: commands/command/script/TestCommandScript.py (1594 of 2058) PASS: lldb-api :: lang/objc/rdar-11355592/TestRdar11355592.py (1595 of 2058) PASS: lldb-unit :: Language/Highlighting/./HighlighterTests/HighlighterTest.ClangCursorPos (1596 of 2058) PASS: lldb-api :: commands/breakpoint/command/list/TestBreakpointCommandList.py (1597 of 2058) PASS: lldb-unit :: Utility/./UtilityTests/StringListTest.JoinThree (1598 of 2058) PASS: lldb-unit :: Utility/./UtilityTests/RegularExpression.Valid (1599 of 2058) PASS: lldb-unit :: UnwindAssembly/x86/./UnwindAssemblyx86Tests/Testx86AssemblyInspectionEngine.TestPopR14 (1600 of 2058) PASS: lldb-api :: lang/c/strings/TestCStrings.py (1601 of 2058) PASS: lldb-api :: functionalities/float-display/TestFloatDisplay.py (1602 of 2058) PASS: lldb-api :: lang/cpp/stl/TestSTL.py (1603 of 2058) PASS: lldb-api :: functionalities/tail_call_frames/disambiguate_paths_to_common_sink/TestDisambiguatePathsToCommonSink.py (1604 of 2058) PASS: lldb-api :: lang/c/const_variables/TestConstVariables.py (1605 of 2058) PASS: lldb-api :: lang/cpp/template-function/TestTemplateFunctions.py (1606 of 2058) PASS: lldb-shell :: SymbolFile/DWARF/find-basic-type.cpp (1607 of 2058) PASS: lldb-unit :: Language/CPlusPlus/./LanguageCPlusPlusTests/CPlusPlusLanguage.ExtractContextAndIdentifier (1608 of 2058) PASS: lldb-api :: functionalities/tail_call_frames/thread_step_out_message/TestArtificialFrameStepOutMessage.py (1609 of 2058) PASS: lldb-unit :: Utility/./UtilityTests/StringListTest.DefaultConstructor (1610 of 2058) PASS: lldb-api :: lang/objc/modules-hash-mismatch/TestClangModulesHashMismatch.py (1611 of 2058) PASS: lldb-shell :: Reproducer/TestCrash.test (1612 of 2058) PASS: lldb-unit :: Symbol/./SymbolTests/PostfixExpression.ParseOneExpression (1613 of 2058) PASS: lldb-unit :: Host/./HostTests/HostInfoTest.GetXcodeSDK (1614 of 2058) PASS: lldb-shell :: SymbolFile/DWARF/dir-separator-posix.s (1615 of 2058) PASS: lldb-api :: lang/objc/modules-inline-functions/TestModulesInlineFunctions.py (1616 of 2058) PASS: lldb-unit :: ScriptInterpreter/Python/./ScriptInterpreterPythonTests/PythonDataObjectsTest.TestGlobalNameResolutionWithDot (1617 of 2058) PASS: lldb-shell :: Register/x86-64-ymm-read.test (1618 of 2058) PASS: lldb-api :: sanity/TestModuleCacheSanity.py (1619 of 2058) PASS: lldb-api :: tools/lldb-server/TestGdbRemoteThreadsInStopReply.py (1620 of 2058) PASS: lldb-api :: commands/reproducer/invalid-args/TestInvalidArgsReproducer.py (1621 of 2058) PASS: lldb-shell :: Breakpoint/implicit_const_form_support.test (1622 of 2058) PASS: lldb-unit :: Utility/./UtilityTests/StringExtractorTest.GetHexBytesAvail_FullString (1623 of 2058) PASS: lldb-unit :: Utility/./UtilityTests/Flags.AllSet (1624 of 2058) UNSUPPORTED: lldb-api :: benchmarks/continue/TestBenchmarkContinue.py (1625 of 2058) PASS: lldb-shell :: BuildScript/compiler-full-path.test (1626 of 2058) PASS: lldb-unit :: Utility/./UtilityTests/StringListTest.Assignment (1627 of 2058) PASS: lldb-unit :: Host/./HostTests/FileSystemTest.OpenErrno (1628 of 2058) PASS: lldb-unit :: Utility/./UtilityTests/BinaryStreamTest.PutULEB128TwoBytes (1629 of 2058) UNSUPPORTED: lldb-shell :: SymbolFile/NativePDB/typedefs.cpp (1630 of 2058) PASS: lldb-unit :: Language/Highlighting/./HighlighterTests/HighlighterTest.ClangBraces (1631 of 2058) UNSUPPORTED: lldb-shell :: SymbolFile/DWARF/DW_TAG_GNU_call_site-DW_AT_low_pc.s (1632 of 2058) PASS: lldb-unit :: Utility/./UtilityTests/StringListTest.ForRangeEmpty (1633 of 2058) PASS: lldb-unit :: Host/./HostTests/NativeProcessProtocolTest.ReadMemoryWithoutTrap (1634 of 2058) PASS: lldb-unit :: Utility/./UtilityTests/ArgsTest.ReplaceArgumentAtIndexOutOfRange (1635 of 2058) PASS: lldb-shell :: ObjectFile/ELF/section-addresses.yaml (1636 of 2058) PASS: lldb-unit :: Utility/./UtilityTests/BinaryStreamTest.PutULEB128ThreeBytes (1637 of 2058) UNSUPPORTED: lldb-shell :: Register/x86-ymm-write.test (1638 of 2058) PASS: lldb-unit :: Symbol/./SymbolTests/TestTypeSystemClang.TestNotDeletingUserCopyCstrDueToMoveCStr (1639 of 2058) PASS: lldb-unit :: Utility/./UtilityTests/ArgsTest.TestAppendArg (1640 of 2058) PASS: lldb-api :: functionalities/lazy-loading/TestLazyLoading.py (1641 of 2058) PASS: lldb-api :: api/multithreaded/TestMultithreaded.py (1642 of 2058) PASS: lldb-shell :: ObjectFile/ELF/PT_LOAD.yaml (1643 of 2058) PASS: lldb-unit :: Process/gdb-remote/./ProcessGdbRemoteTests/GDBRemoteCommunicationClientTest.SendGetTraceConfigPacket (1644 of 2058) PASS: lldb-unit :: Utility/./UtilityTests/StreamTest.PutBytesAsRawHex8ToBigEndian (1645 of 2058) PASS: lldb-shell :: Minidump/Windows/Sigsegv/sigsegv.test (1646 of 2058) PASS: lldb-api :: commands/expression/argument_passing_restrictions/TestArgumentPassingRestrictions.py (1647 of 2058) UNSUPPORTED: lldb-api :: functionalities/tsan/thread_numbers/TestTsanThreadNumbers.py (1648 of 2058) PASS: lldb-api :: functionalities/data-formatter/array_typedef/TestArrayTypedef.py (1649 of 2058) XFAIL: lldb-shell :: Register/x86-64-write.test (1650 of 2058) PASS: lldb-api :: functionalities/unwind/zeroth_frame/TestZerothFrame.py (1651 of 2058) PASS: lldb-unit :: Utility/./UtilityTests/ArgsTest.TestSingleQuotedArgWithSpace (1652 of 2058) PASS: lldb-api :: commands/expression/import-std-module/forward_list/TestForwardListFromStdModule.py (1653 of 2058) PASS: lldb-unit :: Utility/./UtilityTests/StreamTest.AddressPrefixAndSuffix (1654 of 2058) UNSUPPORTED: lldb-api :: linux/thread/create_during_instruction_step/TestCreateDuringInstructionStep.py (1655 of 2058) PASS: lldb-unit :: Host/./HostTests/FileSystemTest.FileAndDirectoryComponents (1656 of 2058) PASS: lldb-shell :: SymbolFile/DWARF/debug-types-signature-loop.s (1657 of 2058) PASS: lldb-api :: tools/lldb-vscode/breakpoint/TestVSCode_setExceptionBreakpoints.py (1658 of 2058) PASS: lldb-api :: functionalities/thread/concurrent_events/TestConcurrentCrashWithWatchpoint.py (1659 of 2058) PASS: lldb-unit :: Utility/./UtilityTests/OptionsWithRawTest.EmptySuffix (1660 of 2058) PASS: lldb-unit :: Utility/./UtilityTests/BinaryStreamTest.PutULEB128One (1661 of 2058) PASS: lldb-api :: lang/objc/objc-runtime-ivars/TestRuntimeIvars.py (1662 of 2058) PASS: lldb-unit :: Utility/./UtilityTests/ProcessInstanceInfo.DumpTable_invalidUID (1663 of 2058) PASS: lldb-api :: functionalities/data-formatter/data-formatter-stl/libcxx/iterator/TestDataFormatterLibccIterator.py (1664 of 2058) PASS: lldb-unit :: Symbol/./SymbolTests/PostfixExpression.ParseFPOProgram (1665 of 2058) UNSUPPORTED: lldb-api :: benchmarks/stepping/TestSteppingSpeed.py (1666 of 2058) PASS: lldb-shell :: ObjectFile/ELF/aarch64-relocations.yaml (1667 of 2058) PASS: lldb-unit :: Utility/./UtilityTests/DataExtractorTest.GetCStrEmpty (1668 of 2058) UNSUPPORTED: lldb-api :: functionalities/signal/handle-segv/TestHandleSegv.py (1669 of 2058) PASS: lldb-api :: python_api/lldbutil/process/TestPrintStackTraces.py (1670 of 2058) PASS: lldb-unit :: Utility/./UtilityTests/StringExtractorTest.GetHexU8_Underflow2_NoEof (1671 of 2058) PASS: lldb-api :: types/TestLongTypes.py (1672 of 2058) PASS: lldb-unit :: Utility/./UtilityTests/DataExtractorTest.GetMaxS64 (1673 of 2058) PASS: lldb-api :: lang/objc/orderedset/TestOrderedSet.py (1674 of 2058) PASS: lldb-api :: python_api/watchpoint/TestWatchpointIgnoreCount.py (1675 of 2058) PASS: lldb-api :: commands/platform/basic/TestPlatformCommand.py (1676 of 2058) PASS: lldb-api :: tools/lldb-server/TestGdbRemote_qThreadStopInfo.py (1677 of 2058) UNSUPPORTED: lldb-api :: functionalities/tsan/global_location/TestTsanGlobalLocation.py (1678 of 2058) PASS: lldb-api :: commands/frame/recognizer/TestFrameRecognizer.py (1679 of 2058) PASS: lldb-api :: lang/c/struct_types/TestStructTypes.py (1680 of 2058) PASS: lldb-api :: functionalities/thread/exit_during_step/TestExitDuringStep.py (1681 of 2058) PASS: lldb-unit :: Utility/./UtilityTests/RecordReplayTest.InstrumentedBarPtr (1682 of 2058) PASS: lldb-unit :: Language/CPlusPlus/./LanguageCPlusPlusTests/CPlusPlusLanguage.MethodNameParsing (1683 of 2058) UNSUPPORTED: lldb-shell :: Register/x86-ymm-read.test (1684 of 2058) PASS: lldb-unit :: Utility/./UtilityTests/VMRange.Reset (1685 of 2058) PASS: lldb-shell :: ObjectFile/wasm/basic.yaml (1686 of 2058) PASS: lldb-unit :: Utility/./UtilityTests/StreamTest.PutNHex8 (1687 of 2058) PASS: lldb-unit :: Utility/./UtilityTests/FileSpecTest.CopyByAppendingPathComponent (1688 of 2058) PASS: lldb-unit :: Utility/./UtilityTests/StringExtractorTest.GetHexU8_InvalidHex (1689 of 2058) PASS: lldb-unit :: Utility/./UtilityTests/StringLexerTest.HasAtLeast (1690 of 2058) PASS: lldb-unit :: Utility/./UtilityTests/RangeTest.ContainsEndInclusiveInvalid (1691 of 2058) PASS: lldb-unit :: Utility/./UtilityTests/StringExtractorTest.GetHexBytes_OddPair (1692 of 2058) PASS: lldb-unit :: Utility/./UtilityTests/StringExtractorTest.DecodeHexU8_InvalidHex2 (1693 of 2058) PASS: lldb-api :: functionalities/type_lookup/TestTypeLookup.py (1694 of 2058) PASS: lldb-unit :: Utility/./UtilityTests/AnsiTerminal.Empty (1695 of 2058) PASS: lldb-api :: commands/expression/two-files/TestObjCTypeQueryFromOtherCompileUnit.py (1696 of 2058) PASS: lldb-shell :: Reproducer/TestSynchronous.test (1697 of 2058) PASS: lldb-api :: lang/objc/ivar-IMP/TestObjCiVarIMP.py (1698 of 2058) PASS: lldb-unit :: Process/minidump/./LLDBMinidumpTests/MinidumpParserTest.FindMemoryRange (1699 of 2058) PASS: lldb-unit :: Utility/./UtilityTests/FileSpecTest.EqualDotsPosixRoot (1700 of 2058) PASS: lldb-unit :: Utility/./UtilityTests/XcodeSDKTest.MergeTest (1701 of 2058) PASS: lldb-api :: lang/cpp/overloaded-functions/TestOverloadedFunctions.py (1702 of 2058) PASS: lldb-unit :: Host/./HostTests/SocketTest.UDPConnect (1703 of 2058) PASS: lldb-unit :: Utility/./UtilityTests/RangeTest.NotEqual (1704 of 2058) PASS: lldb-api :: lang/cpp/nsimport/TestCppNsImport.py (1705 of 2058) PASS: lldb-shell :: Commands/command-breakpoint-col.test (1706 of 2058) UNSUPPORTED: lldb-api :: lang/c/typedef/Testtypedef.py (1707 of 2058) PASS: lldb-shell :: SymbolFile/DWARF/static_scope.s (1708 of 2058) PASS: lldb-unit :: Utility/./UtilityTests/DataExtractorTest.UncommonAddressSize (1709 of 2058) PASS: lldb-api :: commands/expression/xvalue/TestXValuePrinting.py (1710 of 2058) PASS: lldb-unit :: Utility/./UtilityTests/StringExtractorTest.GetHexU8_InvalidHex_NoEof (1711 of 2058) PASS: lldb-unit :: UnwindAssembly/x86/./UnwindAssemblyx86Tests/Testx86AssemblyInspectionEngine.TestPushR12 (1712 of 2058) PASS: lldb-api :: commands/watchpoints/step_over_watchpoint/TestStepOverWatchpoint.py (1713 of 2058) PASS: lldb-api :: commands/expression/dont_allow_jit/TestAllowJIT.py (1714 of 2058) UNSUPPORTED: lldb-api :: functionalities/darwin_log/filter/regex/activity-chain/TestDarwinLogFilterRegexActivityChain.py (1715 of 2058) PASS: lldb-api :: functionalities/gdb_remote_client/TestGDBRemoteLoad.py (1716 of 2058) PASS: lldb-api :: lang/cpp/const_this/TestConstThis.py (1717 of 2058) PASS: lldb-unit :: Process/gdb-remote/./ProcessGdbRemoteTests/GDBRemoteCommunicationClientTest.ReadRegister (1718 of 2058) PASS: lldb-api :: functionalities/postmortem/wow64_minidump/TestWow64MiniDump.py (1719 of 2058) PASS: lldb-shell :: ObjectFile/ELF/section-types.yaml (1720 of 2058) UNSUPPORTED: lldb-api :: lang/objc/bitfield_ivars/TestBitfieldIvars.py (1721 of 2058) PASS: lldb-unit :: Utility/./UtilityTests/BinaryStreamTest.PutSLEB128MaxValue (1722 of 2058) PASS: lldb-unit :: Utility/./UtilityTests/UriParserTest.BadPort2 (1723 of 2058) PASS: lldb-api :: source-manager/TestSourceManager.py (1724 of 2058) PASS: lldb-api :: lang/c/offsetof/TestOffsetof.py (1725 of 2058) PASS: lldb-api :: python_api/watchpoint/watchlocation/TestSetWatchlocation.py (1726 of 2058) PASS: lldb-api :: commands/expression/entry-bp/TestExprEntryBP.py (1727 of 2058) PASS: lldb-api :: functionalities/data-formatter/data-formatter-synth/TestDataFormatterSynth.py (1728 of 2058) PASS: lldb-unit :: ScriptInterpreter/Python/./ScriptInterpreterPythonTests/PythonDataObjectsTest.TestOwnedReferences (1729 of 2058) PASS: lldb-unit :: API/./APITests/SBCommandInterpreterTest.SingleWordCommand (1730 of 2058) PASS: lldb-shell :: Minidump/breakpad-symbols.test (1731 of 2058) PASS: lldb-api :: python_api/watchpoint/condition/TestWatchpointConditionAPI.py (1732 of 2058) PASS: lldb-shell :: ScriptInterpreter/None/import_module.test (1733 of 2058) PASS: lldb-unit :: Utility/./UtilityTests/ArchSpecTest.TripleComponentsWereSpecified (1734 of 2058) PASS: lldb-api :: commands/expression/import-std-module/no-std-module/TestMissingStdModule.py (1735 of 2058) PASS: lldb-unit :: Utility/./UtilityTests/BinaryStreamTest.PutSLEB128NineBytes (1736 of 2058) PASS: lldb-unit :: Utility/./UtilityTests/NameMatchesTest.RegularExpression (1737 of 2058) PASS: lldb-api :: functionalities/data-formatter/data-formatter-objc/nsstring/TestDataFormatterNSString.py (1738 of 2058) PASS: lldb-unit :: UnwindAssembly/x86/./UnwindAssemblyx86Tests/Testx86AssemblyInspectionEngine.TestPushImm (1739 of 2058) PASS: lldb-shell :: SymbolFile/DWARF/find-qualified-variable.cpp (1740 of 2058) PASS: lldb-shell :: SymbolFile/DWARF/find-basic-namespace.cpp (1741 of 2058) PASS: lldb-api :: commands/watchpoints/watchpoint_set_command/TestWatchLocationWithWatchSet.py (1742 of 2058) PASS: lldb-api :: commands/platform/process/list/TestProcessList.py (1743 of 2058) PASS: lldb-api :: python_api/exprpath_synthetic/TestExprPathSynthetic.py (1744 of 2058) PASS: lldb-shell :: SymbolFile/DWARF/find-inline-method.s (1745 of 2058) PASS: lldb-unit :: Expression/./ExpressionTests/DiagnosticManagerTest.GetStringSeverityLabels (1746 of 2058) PASS: lldb-api :: functionalities/inferior-assert/TestInferiorAssert.py (1747 of 2058) PASS: lldb-api :: functionalities/data-formatter/data-formatter-synthtype/TestDataFormatterSynthType.py (1748 of 2058) PASS: lldb-unit :: Utility/./UtilityTests/StreamTest.AddressRangeSize (1749 of 2058) PASS: lldb-unit :: Utility/./UtilityTests/ArgsTest.TestOverwriteArgs (1750 of 2058) PASS: lldb-unit :: Process/minidump/./LLDBMinidumpTests/MinidumpParserTest.GetThreadContext_x86_64 (1751 of 2058) PASS: lldb-unit :: Symbol/./SymbolTests/SymbolsTest.LocateExecutableSymbolFileForUnknownExecutableAndMissingSymbolFile (1752 of 2058) PASS: lldb-unit :: Utility/./UtilityTests/StreamTest.PutBytesAsRawHex8ToLittleEndian (1753 of 2058) PASS: lldb-api :: macosx/profile_vrs_detach/TestDetachVrsProfile.py (1754 of 2058) PASS: lldb-api :: tools/lldb-server/TestGdbRemoteExitCode.py (1755 of 2058) PASS: lldb-api :: functionalities/backticks/TestBackticksWithoutATarget.py (1756 of 2058) PASS: lldb-unit :: Process/minidump/./LLDBMinidumpTests/MinidumpParserTest.GetMemoryRegionInfoFromMemory64List (1757 of 2058) PASS: lldb-unit :: Process/minidump/./LLDBMinidumpTests/MinidumpParserTest.InvalidMinidump (1758 of 2058) PASS: lldb-unit :: Host/./HostTests/FileSystemTest.Exists (1759 of 2058) PASS: lldb-unit :: Utility/./UtilityTests/OptionsWithRawTest.UnterminatedQuote (1760 of 2058) PASS: lldb-unit :: Language/Highlighting/./HighlighterTests/HighlighterTest.ClangUnterminatedString (1761 of 2058) PASS: lldb-shell :: Process/Optimization.test (1762 of 2058) PASS: lldb-unit :: Utility/./UtilityTests/AnsiTerminal.KnownPrefix (1763 of 2058) PASS: lldb-unit :: Symbol/./SymbolTests/TestTypeSystemClang.TestUnifyAccessSpecifiers (1764 of 2058) PASS: lldb-api :: commands/process/launch/TestProcessLaunch.py (1765 of 2058) PASS: lldb-api :: functionalities/inferior-changed/TestInferiorChanged.py (1766 of 2058) PASS: lldb-unit :: Utility/./UtilityTests/StringListTest.Join (1767 of 2058) PASS: lldb-unit :: Process/./ProcessEventDataTests/ProcessEventDataTest.ShouldStop (1768 of 2058) PASS: lldb-unit :: Language/Highlighting/./HighlighterTests/HighlighterTest.DefaultHighlighterWithCursorOutOfBounds (1769 of 2058) PASS: lldb-api :: tools/lldb-server/inferior-crash/TestGdbRemoteAbort.py (1770 of 2058) PASS: lldb-unit :: Utility/./UtilityTests/StringListTest.InsertStringAtIndexOutOfBounds (1771 of 2058) PASS: lldb-unit :: Process/minidump/./LLDBMinidumpTests/RegisterContextMinidump.CheckRegisterContextMinidump_ARM (1772 of 2058) PASS: lldb-unit :: Symbol/./SymbolTests/TestClangASTImporter.MetadataPropagationIndirectImport (1773 of 2058) PASS: lldb-api :: python_api/function_symbol/TestSymbolAPI.py (1774 of 2058) PASS: lldb-api :: python_api/lldbutil/TestSwigVersion.py (1775 of 2058) UNSUPPORTED: lldb-api :: lang/cpp/printf/TestPrintf.py (1776 of 2058) PASS: lldb-shell :: SymbolFile/DWARF/debug_rnglists-dwo.s (1777 of 2058) PASS: lldb-api :: functionalities/tail_call_frames/disambiguate_tail_call_seq/TestDisambiguateTailCallSeq.py (1778 of 2058) PASS: lldb-shell :: SymbolFile/DWARF/find-function-regex.cpp (1779 of 2058) PASS: lldb-api :: lang/cpp/scope/TestCppScope.py (1780 of 2058) PASS: lldb-api :: api/command-return-object/TestSBCommandReturnObject.py (1781 of 2058) PASS: lldb-api :: functionalities/tail_call_frames/unambiguous_sequence/TestUnambiguousTailCalls.py (1782 of 2058) PASS: lldb-api :: python_api/signals/TestSignalsAPI.py (1783 of 2058) PASS: lldb-unit :: ObjectFile/Breakpad/./ObjectFileBreakpadTests/StackWinRecord.parse (1784 of 2058) PASS: lldb-api :: python_api/name_lookup/TestNameLookup.py (1785 of 2058) PASS: lldb-api :: commands/statistics/basic/TestStats.py (1786 of 2058) PASS: lldb-shell :: SymbolFile/DWARF/DW_AT_low_pc-addrx.s (1787 of 2058) PASS: lldb-unit :: Language/Highlighting/./HighlighterTests/HighlighterTest.ClangTrailingBackslashWithWhitespace (1788 of 2058) UNSUPPORTED: lldb-shell :: ScriptInterpreter/Lua/bindings.test (1789 of 2058) PASS: lldb-api :: functionalities/show_location/TestShowLocationDwarf5.py (1790 of 2058) PASS: lldb-unit :: Utility/./UtilityTests/XcodeSDKTest.FindXcodeContentsDirectoryInPath (1791 of 2058) PASS: lldb-shell :: ObjectFile/ELF/section-overlap.yaml (1792 of 2058) PASS: lldb-api :: functionalities/thread/concurrent_events/TestConcurrentTwoWatchpointsOneSignal.py (1793 of 2058) PASS: lldb-unit :: Process/gdb-remote/./ProcessGdbRemoteTests/GDBRemoteClientBaseTest.SendContinueAndAsyncPacket (1794 of 2058) PASS: lldb-unit :: Utility/./UtilityTests/ScalarTest.CastOperations (1795 of 2058) PASS: lldb-api :: lang/objc/foundation/TestObjCMethodsNSError.py (1796 of 2058) PASS: lldb-unit :: Signals/./SignalsTests/UnixSignalsTest.Iteration (1797 of 2058) PASS: lldb-api :: commands/expression/import-std-module/stack/TestStackFromStdModule.py (1798 of 2058) UNSUPPORTED: lldb-api :: api/multiple-debuggers/TestMultipleDebuggers.py (1799 of 2058) PASS: lldb-unit :: Utility/./UtilityTests/ProcessInstanceInfo.Dump (1800 of 2058) PASS: lldb-unit :: Symbol/./SymbolTests/SymbolsTest.TerminateLocateExecutableSymbolFileForUnknownExecutableAndUnknownSymbolFile (1801 of 2058) PASS: lldb-api :: functionalities/postmortem/elf-core/thread_crash/TestLinuxCoreThreads.py (1802 of 2058) PASS: lldb-unit :: Symbol/./SymbolTests/TestClangASTImporter.CompleteFwdDeclWithOtherOrigin (1803 of 2058) PASS: lldb-api :: lang/cpp/typedef/TestCppTypedef.py (1804 of 2058) PASS: lldb-unit :: Utility/./UtilityTests/StringListTest.ShiftStdString (1805 of 2058) UNSUPPORTED: lldb-api :: tools/lldb-server/TestGdbRemote_vContThreads.py (1806 of 2058) PASS: lldb-api :: functionalities/thread/concurrent_events/TestConcurrentManyWatchpoints.py (1807 of 2058) PASS: lldb-unit :: Utility/./UtilityTests/StreamTest.QuotedCString (1808 of 2058) PASS: lldb-api :: functionalities/jitloader_gdb/TestJITLoaderGDB.py (1809 of 2058) PASS: lldb-api :: commands/expression/no-deadlock/TestExprDoesntBlock.py (1810 of 2058) PASS: lldb-api :: commands/watchpoints/watchpoint_commands/TestWatchpointCommands.py (1811 of 2058) PASS: lldb-unit :: Expression/./ExpressionTests/CppModuleConfigurationTest.Xcode (1812 of 2058) PASS: lldb-unit :: Utility/./UtilityTests/VMRange.SetEndAddress (1813 of 2058) PASS: lldb-unit :: Process/./ProcessEventDataTests/ProcessEventDataTest.DoOnRemoval (1814 of 2058) PASS: lldb-unit :: Utility/./UtilityTests/StringExtractorTest.DecodeHexU8_Exact (1815 of 2058) PASS: lldb-unit :: ScriptInterpreter/Python/./ScriptInterpreterPythonTests/PythonDataObjectsTest.TestModuleNameResolutionNoDot (1816 of 2058) PASS: lldb-unit :: UnwindAssembly/x86/./UnwindAssemblyx86Tests/Testx86AssemblyInspectionEngine.TestSpArithx86_64Augmented (1817 of 2058) PASS: lldb-unit :: Utility/./UtilityTests/VMRange.Comparison (1818 of 2058) PASS: lldb-api :: functionalities/data-formatter/language_category_updates/TestDataFormatterLanguageCategoryUpdates.py (1819 of 2058) PASS: lldb-unit :: Utility/./UtilityTests/BinaryStreamTest.PutSLEB128Zero (1820 of 2058) PASS: lldb-api :: python_api/process/io/TestProcessIO.py (1821 of 2058) PASS: lldb-unit :: Utility/./UtilityTests/BinaryStreamTest.PutULEB128OneByte (1822 of 2058) PASS: lldb-api :: lang/cpp/frame-var-anon-unions/TestFrameVariableAnonymousUnions.py (1823 of 2058) UNSUPPORTED: lldb-api :: lang/cpp/function-template-parameter-pack/TestFunctionTemplateParameterPack.py (1824 of 2058) PASS: lldb-api :: lang/c/global_variables/TestGlobalVariables.py (1825 of 2058) PASS: lldb-unit :: Utility/./UtilityTests/DataExtractorTest.GetBitfield (1826 of 2058) PASS: lldb-unit :: Utility/./UtilityTests/RegisterValueTest.GetSet8 (1827 of 2058) PASS: lldb-unit :: Utility/./UtilityTests/UriParserTest.PortOverflow (1828 of 2058) PASS: lldb-unit :: UnwindAssembly/x86/./UnwindAssemblyx86Tests/Testx86AssemblyInspectionEngine.TestPush0 (1829 of 2058) UNSUPPORTED: lldb-shell :: Register/x86-64-zmm-write.test (1830 of 2058) PASS: lldb-api :: api/log/TestAPILog.py (1831 of 2058) PASS: lldb-unit :: Utility/./UtilityTests/ScalarTest.ExtractBitfield (1832 of 2058) UNSUPPORTED: lldb-api :: commands/watchpoints/hello_watchlocation/TestWatchLocation.py (1833 of 2058) PASS: lldb-unit :: Utility/./UtilityTests/OptionsWithRawTest.EmptyInput (1834 of 2058) PASS: lldb-unit :: Utility/./UtilityTests/DataExtractorTest.GetULEB128_bit63 (1835 of 2058) PASS: lldb-unit :: Thread/./ThreadTests/ThreadTest.GetPrivateStopInfo (1836 of 2058) PASS: lldb-api :: functionalities/postmortem/minidump/TestMiniDump.py (1837 of 2058) PASS: lldb-api :: lang/objc/real-definition/TestRealDefinition.py (1838 of 2058) UNSUPPORTED: lldb-shell :: ScriptInterpreter/Lua/nested_sessions.test (1839 of 2058) PASS: lldb-unit :: Utility/./UtilityTests/StringListTest.JoinEmpty (1840 of 2058) PASS: lldb-unit :: Utility/./UtilityTests/StreamTest.PutHex64ByteOrderBig (1841 of 2058) PASS: lldb-api :: commands/command/script/import/TestImport.py (1842 of 2058) PASS: lldb-api :: lang/objc/global_ptrs/TestGlobalObjects.py (1843 of 2058) PASS: lldb-api :: lang/objc/objc_direct-methods/TestObjCDirectMethods.py (1844 of 2058) PASS: lldb-unit :: Process/gdb-remote/./ProcessGdbRemoteTests/GDBRemoteCommunicationServerTest.SendErrorResponse_StringError (1845 of 2058) UNSUPPORTED: lldb-shell :: SymbolFile/target-symbols-add-unwind.test (1846 of 2058) PASS: lldb-unit :: Process/minidump/./LLDBMinidumpTests/MinidumpParserTest.GetLinuxProcStatus_no_stream (1847 of 2058) PASS: lldb-api :: functionalities/breakpoint/step_over_breakpoint/TestStepOverBreakpoint.py (1848 of 2058) PASS: lldb-api :: lang/objc/modules/TestObjCModules.py (1849 of 2058) PASS: lldb-api :: commands/help/TestHelp.py (1850 of 2058) PASS: lldb-api :: macosx/load-kext/TestLoadKext.py (1851 of 2058) PASS: lldb-unit :: Utility/./UtilityTests/ScalarTest.SetValueFromCString (1852 of 2058) PASS: lldb-shell :: Quit/TestQuitExitCodeHex0.test (1853 of 2058) PASS: lldb-shell :: ObjectFile/MachO/lc_build_version.yaml (1854 of 2058) PASS: lldb-unit :: Utility/./UtilityTests/StreamTest.PutChar (1855 of 2058) PASS: lldb-unit :: Utility/./UtilityTests/Flags.AllClear (1856 of 2058) PASS: lldb-unit :: Process/minidump/./LLDBMinidumpTests/MinidumpParserTest.GetThreadContext_x86_32_wow64 (1857 of 2058) PASS: lldb-api :: lang/objc/rdar-10967107/TestRdar10967107.py (1858 of 2058) PASS: lldb-api :: commands/expression/test/TestExprs.py (1859 of 2058) PASS: lldb-shell :: SymbolFile/DWARF/anon_class_w_and_wo_export_symbols.ll (1860 of 2058) PASS: lldb-api :: functionalities/thread/concurrent_events/TestConcurrentCrashWithBreak.py (1861 of 2058) PASS: lldb-unit :: Utility/./UtilityTests/ArgsTest.ReplaceArgumentAtIndexFarOutOfRange (1862 of 2058) PASS: lldb-unit :: UnwindAssembly/x86/./UnwindAssemblyx86Tests/Testx86AssemblyInspectionEngine.TestSpillRegToStackViaMOVx86_64 (1863 of 2058) UNSUPPORTED: lldb-shell :: Register/aarch64-gp-read.test (1864 of 2058) PASS: lldb-unit :: ObjectFile/Breakpad/./ObjectFileBreakpadTests/PublicRecord.parse (1865 of 2058) PASS: lldb-unit :: Utility/./UtilityTests/RangeTest.SlideZero (1866 of 2058) PASS: lldb-api :: types/TestDoubleTypesExpr.py (1867 of 2058) PASS: lldb-shell :: Expr/TestIRMemoryMap.test (1868 of 2058) UNSUPPORTED: lldb-api :: tools/lldb-server/libraries-svr4/TestGdbRemoteLibrariesSvr4Support.py (1869 of 2058) PASS: lldb-api :: python_api/value/change_values/TestChangeValueAPI.py (1870 of 2058) UNSUPPORTED: lldb-shell :: ObjectFile/ELF/minidebuginfo-no-lzma.yaml (1871 of 2058) PASS: lldb-unit :: Target/./TargetTests/PathMappingListTest.RelativeTests (1872 of 2058) PASS: lldb-unit :: Utility/./UtilityTests/NameMatchesTest.Equals (1873 of 2058) PASS: lldb-api :: macosx/dyld-trie-symbols/TestDyldTrieSymbols.py (1874 of 2058) PASS: lldb-unit :: Host/./HostTests/FileSystemTest.Resolve (1875 of 2058) PASS: lldb-unit :: Utility/./UtilityTests/StringExtractorTest.GetHexBytesAvail_OddPair2 (1876 of 2058) PASS: lldb-unit :: Utility/./UtilityTests/ProcessInstanceInfoList.Yaml (1877 of 2058) PASS: lldb-unit :: Expression/./ExpressionTests/DWARFExpression.DW_OP_convert (1878 of 2058) PASS: lldb-api :: functionalities/breakpoint/inlined_breakpoints/TestInlinedBreakpoints.py (1879 of 2058) PASS: lldb-api :: lang/cpp/stl/TestStdCXXDisassembly.py (1880 of 2058) PASS: lldb-api :: functionalities/thread/concurrent_events/TestConcurrentBreakpointOneDelayBreakpointThreads.py (1881 of 2058) PASS: lldb-api :: functionalities/thread/concurrent_events/TestConcurrentWatchBreak.py (1882 of 2058) PASS: lldb-api :: commands/expression/anonymous-struct/TestCallUserAnonTypedef.py (1883 of 2058) PASS: lldb-unit :: Utility/./UtilityTests/StreamTeeTest.CopyConstructor (1884 of 2058) PASS: lldb-api :: functionalities/unwind/noreturn/module-end/TestNoReturnModuleEnd.py (1885 of 2058) PASS: lldb-unit :: SymbolFile/NativePDB/./SymbolFileNativePDBTests/PDBFPOProgramToDWARFExpressionTests.InvalidAssignmentMultiple (1886 of 2058) PASS: lldb-unit :: Utility/./UtilityTests/StringExtractorTest.GetU64BigEndian (1887 of 2058) PASS: lldb-unit :: Expression/./ExpressionTests/CppModuleConfigurationTest.UnrelatedLibrary (1888 of 2058) PASS: lldb-api :: commands/expression/options/TestExprOptions.py (1889 of 2058) PASS: lldb-api :: python_api/process/TestProcessAPI.py (1890 of 2058) UNSUPPORTED: lldb-api :: functionalities/darwin_log/filter/regex/activity/TestDarwinLogFilterRegexActivity.py (1891 of 2058) UNSUPPORTED: lldb-shell :: Register/x86-gp-read.test (1892 of 2058) PASS: lldb-api :: functionalities/data-formatter/nsarraysynth/TestNSArraySynthetic.py (1893 of 2058) UNSUPPORTED: lldb-shell :: SymbolFile/PDB/enums-layout.test (1894 of 2058) PASS: lldb-unit :: Utility/./UtilityTests/VMRange.ContainsAddr (1895 of 2058) PASS: lldb-unit :: Symbol/./SymbolTests/TestClangASTImporter.MetadataPropagationAfterCopying (1896 of 2058) UNSUPPORTED: lldb-api :: functionalities/thread/create_during_step/TestCreateDuringStep.py (1897 of 2058) PASS: lldb-api :: tools/lldb-server/TestGdbRemoteKill.py (1898 of 2058) PASS: lldb-unit :: Host/./HostTests/FileActionTest.Open (1899 of 2058) PASS: lldb-shell :: ObjectFile/ELF/short-build-id.yaml (1900 of 2058) PASS: lldb-api :: macosx/find-app-in-bundle/TestFindAppInBundle.py (1901 of 2058) PASS: lldb-unit :: Utility/./UtilityTests/StringExtractorTest.GetHexBytes_OddPair2 (1902 of 2058) PASS: lldb-unit :: Utility/./UtilityTests/StringExtractorTest.GetHexBytes (1903 of 2058) PASS: lldb-unit :: Utility/./UtilityTests/DataExtractorTest.GetCStrUnterminated (1904 of 2058) PASS: lldb-api :: commands/expression/rdar42038760/TestScalarURem.py (1905 of 2058) PASS: lldb-shell :: SymbolFile/DWARF/DW_TAG_variable-DW_AT_const_value.s (1906 of 2058) PASS: lldb-unit :: Process/minidump/./LLDBMinidumpTests/MinidumpParserTest.GetMemoryRegionInfo (1907 of 2058) PASS: lldb-api :: functionalities/data-formatter/data-formatter-objc/TestDataFormatterObjCExpr.py (1908 of 2058) PASS: lldb-unit :: Platform/Android/./AdbClientTests/AdbClientTest.CreateByDeviceId (1909 of 2058) PASS: lldb-api :: functionalities/unwind/noreturn/TestNoreturnUnwind.py (1910 of 2058) PASS: lldb-shell :: Breakpoint/dummy-target.test (1911 of 2058) PASS: lldb-shell :: Reproducer/TestMultipleTargets.test (1912 of 2058) UNSUPPORTED: lldb-api :: iohandler/unicode/TestUnicode.py (1913 of 2058) PASS: lldb-unit :: Target/./TargetTests/ModuleCacheTest.GetAndPut (1914 of 2058) PASS: lldb-api :: functionalities/thread/concurrent_events/TestConcurrentDelayedCrashWithBreakpointSignal.py (1915 of 2058) PASS: lldb-unit :: Symbol/./SymbolTests/TestTypeSystemClang.TestConvertAccessTypeToAccessSpecifier (1916 of 2058) PASS: lldb-api :: lang/cpp/global_operators/TestCppGlobalOperators.py (1917 of 2058) PASS: lldb-shell :: Quit/TestQuitExitCode30.test (1918 of 2058) PASS: lldb-unit :: Utility/./UtilityTests/SerializationRountripTest.SerializeDeserializeObjectPointer (1919 of 2058) PASS: lldb-unit :: ScriptInterpreter/Python/./ScriptInterpreterPythonTests/PythonDataObjectsTest.TestPythonCallableInvoke (1920 of 2058) UNSUPPORTED: lldb-shell :: Register/x86-gp-write.test (1921 of 2058) PASS: lldb-unit :: Utility/./UtilityTests/Flags.AnyClear (1922 of 2058) PASS: lldb-api :: python_api/value/TestValueAPI.py (1923 of 2058) PASS: lldb-unit :: Expression/./ExpressionTests/DWARFExpression.DW_OP_unknown (1924 of 2058) PASS: lldb-shell :: Reproducer/TestDump.test (1925 of 2058) PASS: lldb-api :: commands/process/launch-with-shellexpand/TestLaunchWithShellExpand.py (1926 of 2058) PASS: lldb-unit :: Utility/./UtilityTests/StringListTest.AppendStringCString (1927 of 2058) PASS: lldb-unit :: UnwindAssembly/x86/./UnwindAssemblyx86Tests/Testx86AssemblyInspectionEngine.TestPopEDI (1928 of 2058) PASS: lldb-unit :: Process/gdb-remote/./ProcessGdbRemoteTests/GDBRemoteClientBaseTest.SendContinueAndLateInterrupt (1929 of 2058) UNSUPPORTED: lldb-api :: functionalities/data-formatter/data-formatter-stl/libstdcpp/list/TestDataFormatterStdList.py (1930 of 2058) PASS: lldb-api :: lang/cpp/incomplete-types/TestCppIncompleteTypes.py (1931 of 2058) PASS: lldb-unit :: Process/minidump/./LLDBMinidumpTests/MinidumpParserTest.GetPidWow64 (1932 of 2058) PASS: lldb-unit :: Utility/./UtilityTests/StreamTest.PutStringAsRawHex8 (1933 of 2058) PASS: lldb-api :: lang/c/step-target/TestStepTarget.py (1934 of 2058) PASS: lldb-shell :: SymbolFile/NativePDB/globals-bss.cpp (1935 of 2058) PASS: lldb-shell :: ObjectFile/PECOFF/basic-info-arm64.yaml (1936 of 2058) PASS: lldb-api :: functionalities/tail_call_frames/ambiguous_tail_call_seq2/TestAmbiguousTailCallSeq2.py (1937 of 2058) PASS: lldb-api :: functionalities/thread/concurrent_events/TestConcurrentSignalDelayWatch.py (1938 of 2058) PASS: lldb-shell :: Reproducer/TestCaptureEnvOverride.test (1939 of 2058) PASS: lldb-unit :: Utility/./UtilityTests/StreamTest.PutCString (1940 of 2058) PASS: lldb-unit :: Utility/./UtilityTests/OptionsWithRawTest.TerminatedQuote (1941 of 2058) PASS: lldb-unit :: Utility/./UtilityTests/RecordReplayTest.InstrumentedFooSameThis (1942 of 2058) PASS: lldb-unit :: Interpreter/./InterpreterTests/CompletionTest.DirCompletionAbsolute (1943 of 2058) PASS: lldb-shell :: SymbolFile/DWARF/debug_loc-aslr.s (1944 of 2058) PASS: lldb-unit :: Symbol/./SymbolTests/TestTypeSystemClang.TestGetBasicTypeFromName (1945 of 2058) PASS: lldb-unit :: Expression/./ExpressionTests/DiagnosticManagerTest.PutString (1946 of 2058) PASS: lldb-unit :: Language/Highlighting/./HighlighterTests/HighlighterTest.DefaultHighlighter (1947 of 2058) PASS: lldb-unit :: Language/Highlighting/./HighlighterTests/HighlighterTest.Colons (1948 of 2058) PASS: lldb-unit :: Utility/./UtilityTests/StreamTeeTest.GetStreamAtIndexOutOfBoundsEmpty (1949 of 2058) PASS: lldb-unit :: Utility/./UtilityTests/StringLexerTest.Peek (1950 of 2058) PASS: lldb-api :: commands/watchpoints/watchpoint_on_vectors/TestValueOfVectorVariable.py (1951 of 2058) PASS: lldb-unit :: Utility/./UtilityTests/RangeTest.EqualInvalid (1952 of 2058) PASS: lldb-unit :: Utility/./UtilityTests/Flags.Clear (1953 of 2058) PASS: lldb-api :: arm/emulation/TestEmulations.py (1954 of 2058) PASS: lldb-api :: functionalities/breakpoint/auto_continue/TestBreakpointAutoContinue.py (1955 of 2058) PASS: lldb-unit :: Utility/./UtilityTests/UserIDResolver.GetUserName (1956 of 2058) PASS: lldb-unit :: Utility/./UtilityTests/ListenerTest.GetEventWait (1957 of 2058) PASS: lldb-unit :: Utility/./UtilityTests/StringLexerTest.AdvanceIf (1958 of 2058) PASS: lldb-api :: python_api/value_var_update/TestValueVarUpdate.py (1959 of 2058) UNSUPPORTED: lldb-shell :: SymbolFile/PDB/function-nested-block.test (1960 of 2058) PASS: lldb-unit :: Utility/./UtilityTests/LogChannelEnabledTest.LogGetLogThread (1961 of 2058) PASS: lldb-api :: functionalities/data-formatter/var-in-aggregate-misuse/TestVarInAggregateMisuse.py (1962 of 2058) PASS: lldb-api :: functionalities/thread/concurrent_events/TestConcurrentTwoBreakpointsOneDelaySignal.py (1963 of 2058) PASS: lldb-unit :: Utility/./UtilityTests/UriParserTest.TypicalPortPathIPv6 (1964 of 2058) PASS: lldb-unit :: Interpreter/./InterpreterTests/OptionArgParserTest.toBoolean (1965 of 2058) PASS: lldb-shell :: Breakpoint/jitbp_elf.test (1966 of 2058) PASS: lldb-unit :: Utility/./UtilityTests/OptionsWithRawTest.WhitespaceInput (1967 of 2058) PASS: lldb-unit :: Utility/./UtilityTests/ArgsTest.DoubleQuotedItem (1968 of 2058) PASS: lldb-api :: macosx/thread-names/TestInterruptThreadNames.py (1969 of 2058) PASS: lldb-shell :: ObjectFile/ELF/netbsd-exec-8.99.30-amd64.yaml (1970 of 2058) PASS: lldb-api :: python_api/interpreter/TestRunCommandInterpreterAPI.py (1971 of 2058) PASS: lldb-api :: functionalities/breakpoint/breakpoint_options/TestBreakpointOptions.py (1972 of 2058) UNSUPPORTED: lldb-shell :: Breakpoint/case-insensitive.test (1973 of 2058) PASS: lldb-api :: lang/objc/hidden-ivars/TestHiddenIvars.py (1974 of 2058) PASS: lldb-api :: functionalities/gdb_remote_client/TestRecognizeBreakpoint.py (1975 of 2058) PASS: lldb-unit :: Utility/./UtilityTests/StreamTest.AddressRangeEmptyRange (1976 of 2058) PASS: lldb-api :: macosx/find-dsym/bundle-with-dot-in-filename/TestBundleWithDotInFilename.py (1977 of 2058) PASS: lldb-shell :: Driver/TestConvenienceVariables.test (1978 of 2058) PASS: lldb-unit :: Utility/./UtilityTests/StreamTest.AddressNoSuffix (1979 of 2058) PASS: lldb-api :: commands/source/info/TestSourceInfo.py (1980 of 2058) UNSUPPORTED: lldb-api :: arm/breakpoint-thumb-codesection/TestBreakpointThumbCodesection.py (1981 of 2058) PASS: lldb-unit :: Host/./HostTests/HostInfoTest.GetHostname (1982 of 2058) PASS: lldb-api :: commands/expression/ir-interpreter/TestIRInterpreter.py (1983 of 2058) PASS: lldb-shell :: Heap/heap-cstr.test (1984 of 2058) PASS: lldb-unit :: Utility/./UtilityTests/CompletionRequest.DuplicateFiltering (1985 of 2058) PASS: lldb-unit :: Utility/./UtilityTests/RangeTest.Copy (1986 of 2058) PASS: lldb-api :: commands/expression/call-throws/TestCallThatThrows.py (1987 of 2058) PASS: lldb-api :: functionalities/thread/concurrent_events/TestConcurrentTwoWatchpointsOneDelayBreakpoint.py (1988 of 2058) PASS: lldb-unit :: Utility/./UtilityTests/AnsiTerminal.Incomplete (1989 of 2058) PASS: lldb-shell :: SymbolFile/DWARF/dir-separator-windows.s (1990 of 2058) PASS: lldb-api :: functionalities/data-formatter/nssetsynth/TestNSSetSynthetic.py (1991 of 2058) PASS: lldb-api :: python_api/frame/get-variables/TestGetVariables.py (1992 of 2058) PASS: lldb-api :: functionalities/data-formatter/poarray/TestPrintObjectArray.py (1993 of 2058) PASS: lldb-api :: functionalities/data-formatter/summary-string-onfail/Test-rdar-9974002.py (1994 of 2058) PASS: lldb-unit :: Utility/./UtilityTests/BinaryStreamTest.PutSLEB128ThreeBytes (1995 of 2058) UNSUPPORTED: lldb-shell :: Unwind/unwind-plan-dwarf-dump.test (1996 of 2058) PASS: lldb-unit :: Utility/./UtilityTests/ArgsTest.Yaml (1997 of 2058) PASS: lldb-unit :: Process/minidump/./LLDBMinidumpTests/MinidumpParserTest.GetPid (1998 of 2058) PASS: lldb-api :: functionalities/breakpoint/breakpoint_names/TestBreakpointNames.py (1999 of 2058) UNSUPPORTED: lldb-shell :: SymbolFile/PDB/typedefs.test (2000 of 2058) PASS: lldb-api :: lang/objc/single-entry-dictionary/TestObjCSingleEntryDictionary.py (2001 of 2058) PASS: lldb-unit :: Utility/./UtilityTests/ScalarTest.Scalar_512 (2002 of 2058) UNSUPPORTED: lldb-api :: lang/objc/foundation/TestFoundationDisassembly.py (2003 of 2058) PASS: lldb-api :: commands/expression/namespace_local_var_same_name_obj_c/TestNamespaceLocalVarSameNameObjC.py (2004 of 2058) PASS: lldb-api :: lang/cpp/namespace/TestNamespaceLookup.py (2005 of 2058) PASS: lldb-unit :: Utility/./UtilityTests/FileSpecTest.EqualDotsPosix (2006 of 2058) PASS: lldb-shell :: Reproducer/TestWorkingDir.test (2007 of 2058) PASS: lldb-unit :: Utility/./UtilityTests/StringListTest.GetMaxStringLengthIncreasingSize (2008 of 2058) PASS: lldb-unit :: ScriptInterpreter/Python/./ScriptInterpreterPythonTests/PythonDataObjectsTest.TestExtractingUInt64ThroughStructuredData (2009 of 2058) PASS: lldb-api :: commands/expression/import-std-module/sysroot/TestStdModuleSysroot.py (2010 of 2058) PASS: lldb-unit :: ScriptInterpreter/Python/./ScriptInterpreterPythonTests/PythonDataObjectsTest.TestPythonTupleToStructuredList (2011 of 2058) PASS: lldb-shell :: SymbolFile/DWARF/debug_loc.s (2012 of 2058) PASS: lldb-unit :: Utility/./UtilityTests/OptionsWithRawTest.WhitespaceSuffix (2013 of 2058) PASS: lldb-api :: commands/expression/import-std-module/vector-bool/TestVectorBoolFromStdModule.py (2014 of 2058) PASS: lldb-api :: commands/expression/import_builtin_fileid/TestImportBuiltinFileID.py (2015 of 2058) PASS: lldb-api :: functionalities/data-formatter/typedef_array/TestTypedefArray.py (2016 of 2058) PASS: lldb-unit :: Symbol/./SymbolTests/TestTypeSystemClang.TestGetEnumIntegerTypeInvalid (2017 of 2058) PASS: lldb-unit :: Utility/./UtilityTests/PassiveReplayTest.InstrumentedFooInvalid (2018 of 2058) PASS: lldb-api :: functionalities/data-formatter/setvaluefromcstring/TestSetValueFromCString.py (2019 of 2058) PASS: lldb-unit :: Utility/./UtilityTests/DataExtractorTest.GetCStrAtNullOffset (2020 of 2058) PASS: lldb-unit :: Host/./HostTests/FileSystemTest.EmptyTest (2021 of 2058) PASS: lldb-unit :: Utility/./UtilityTests/FileSpecTest.OperatorBool (2022 of 2058) UNSUPPORTED: lldb-api :: functionalities/tty/TestTerminal.py (2023 of 2058) PASS: lldb-unit :: Utility/./UtilityTests/ArgsTest.GetArgumentArrayRef (2024 of 2058) PASS: lldb-unit :: Process/gdb-remote/./ProcessGdbRemoteTests/GDBRemoteClientBaseTest.SendContinueAndAsyncSignal (2025 of 2058) PASS: lldb-unit :: Utility/./UtilityTests/FileSpecTest.GetPath (2026 of 2058) PASS: lldb-unit :: Utility/./UtilityTests/StringExtractorTest.DecodeHexU8_InvalidHex (2027 of 2058) PASS: lldb-shell :: ObjectFile/wasm/stripped-debug-sections.yaml (2028 of 2058) PASS: lldb-shell :: ObjectFile/MachO/lc_build_version_notools.yaml (2029 of 2058) PASS: lldb-api :: functionalities/conditional_break/TestConditionalBreak.py (2030 of 2058) PASS: lldb-unit :: Utility/./UtilityTests/StructuredDataTest.StringDump (2031 of 2058) PASS: lldb-api :: commands/expression/inline-namespace/TestInlineNamespace.py (2032 of 2058) PASS: lldb-unit :: Utility/./UtilityTests/EnvironmentTest.EnvpConstruction (2033 of 2058) PASS: lldb-api :: commands/expression/fixits/TestFixIts.py (2034 of 2058) PASS: lldb-shell :: SymbolFile/Breakpad/unwind-via-stack-cfi.test (2035 of 2058) PASS: lldb-api :: functionalities/data-formatter/data-formatter-synthval/TestDataFormatterSynthVal.py (2036 of 2058) PASS: lldb-api :: functionalities/data-formatter/boolreference/TestFormattersBoolRefPtr.py (2037 of 2058) PASS: lldb-unit :: Utility/./UtilityTests/RangeDataVector.FindEntryThatContains (2038 of 2058) PASS: lldb-unit :: Symbol/./SymbolTests/TestTypeSystemClang.TestOwningModule (2039 of 2058) UNSUPPORTED: lldb-shell :: Register/arm-gp-read.test (2040 of 2058) PASS: lldb-shell :: ObjectFile/ELF/avr-basic-info.yaml (2041 of 2058) PASS: lldb-unit :: Utility/./UtilityTests/CompletionRequest.FakeLastArg (2042 of 2058) PASS: lldb-shell :: Breakpoint/split-dwarf5-debug-stroffsets.test (2043 of 2058) PASS: lldb-unit :: Utility/./UtilityTests/FileSpecTest.Equal (2044 of 2058) PASS: lldb-api :: commands/command/delete/TestCommandDelete.py (2045 of 2058) PASS: lldb-unit :: Utility/./UtilityTests/ArgsTest.GetQuotedCommandString (2046 of 2058) PASS: lldb-unit :: Utility/./UtilityTests/LogTest.LLDB_LOG_nullptr (2047 of 2058) PASS: lldb-unit :: Core/./LLDBCoreTests/RichManglingContextTest.IPDRealloc (2048 of 2058) PASS: lldb-api :: functionalities/data-formatter/data-formatter-stl/libcxx/variant/TestDataFormatterLibcxxVariant.py (2049 of 2058) PASS: lldb-unit :: Utility/./UtilityTests/LogChannelEnabledTest.LogThread (2050 of 2058) UNSUPPORTED: lldb-api :: lang/objc/objc-dynamic-value/TestObjCDynamicValue.py (2051 of 2058) PASS: lldb-unit :: Utility/./UtilityTests/StringExtractorTest.InitMisc (2052 of 2058) PASS: lldb-unit :: Process/gdb-remote/./ProcessGdbRemoteTests/GDBRemoteCommunicationServerTest.SendErrorResponse_UnimplementedError (2053 of 2058) PASS: lldb-api :: functionalities/breakpoint/breakpoint_command/TestRegexpBreakCommand.py (2054 of 2058) PASS: lldb-api :: functionalities/memory/find/TestMemoryFind.py (2055 of 2058) PASS: lldb-api :: functionalities/data-formatter/data-formatter-stl/libcxx/list/TestDataFormatterLibcxxList.py (2056 of 2058) PASS: lldb-api :: lang/c/bitfields/TestBitfields.py (2057 of 2058) PASS: lldb-api :: lang/cpp/enum_types/TestCPP11EnumTypes.py (2058 of 2058) Slowest Tests: -------------------------------------------------------------------------- 351.57s: lldb-api :: tools/lldb-server/TestLldbGdbServer.py 255.75s: lldb-api :: lang/cpp/enum_types/TestCPP11EnumTypes.py 245.69s: lldb-api :: tools/lldb-server/TestGdbRemoteThreadsInStopReply.py 230.79s: lldb-api :: api/multithreaded/TestMultithreaded.py 205.85s: lldb-api :: lang/objc/hidden-ivars/TestHiddenIvars.py 201.95s: lldb-api :: lang/objc/foundation/TestObjCMethods.py 143.64s: lldb-api :: lang/objc/exceptions/TestObjCExceptions.py 141.88s: lldb-api :: lang/cpp/namespace/TestNamespaceLookup.py 138.92s: lldb-api :: lang/objc/objc-new-syntax/TestObjCNewSyntaxLiteral.py 136.55s: lldb-api :: lang/objc/real-definition/TestRealDefinition.py 121.69s: lldb-api :: types/TestLongTypesExpr.py 118.38s: lldb-api :: tools/lldb-server/TestGdbRemote_qThreadStopInfo.py 107.49s: lldb-api :: lang/objc/foundation/TestObjCMethodsString.py 107.06s: lldb-api :: lang/objc/foundation/TestObjCMethodsNSError.py 105.01s: lldb-api :: lang/objc/objc-new-syntax/TestObjCNewSyntaxArray.py 103.33s: lldb-api :: lang/objc/objc-new-syntax/TestObjCNewSyntaxDictionary.py 99.23s: lldb-api :: python_api/lldbutil/iter/TestLLDBIterator.py 91.57s: lldb-api :: functionalities/gdb_remote_client/TestWasm.py 88.03s: lldb-api :: commands/settings/TestSettings.py 86.43s: lldb-api :: lang/objc/conflicting-definition/TestConflictingDefinition.py

Hide Details

Tests Times: -------------------------------------------------------------------------- [ Range ] :: [ Percentage ] :: [ Count ] -------------------------------------------------------------------------- [340s,360s) :: [ ] :: [ 1/2058] [320s,340s) :: [ ] :: [ 0/2058] [300s,320s) :: [ ] :: [ 0/2058] [280s,300s) :: [ ] :: [ 0/2058] [260s,280s) :: [ ] :: [ 1/2058] [240s,260s) :: [ ] :: [ 1/2058] [220s,240s) :: [ ] :: [ 1/2058] [200s,220s) :: [ ] :: [ 2/2058] [180s,200s) :: [ ] :: [ 0/2058] [160s,180s) :: [ ] :: [ 0/2058] [140s,160s) :: [ ] :: [ 3/2058] [120s,140s) :: [ ] :: [ 3/2058] [100s,120s) :: [ ] :: [ 5/2058] [ 80s,100s) :: [ ] :: [ 6/2058] [ 60s, 80s) :: [ ] :: [ 20/2058] [ 40s, 60s) :: [* ] :: [ 55/2058] [ 20s, 40s) :: [** ] :: [ 152/2058] [ 0s, 20s) :: [*********************************** ] :: [1808/2058] -------------------------------------------------------------------------- ******************** Failed Tests (1): lldb-api :: tools/lldb-vscode/disconnect/TestVSCode_disconnect.py

Hide Details

Hide Details

Testing Time: 4159.39s Unsupported : 179 Passed : 1872 Expectedly Failed: 6 Failed : 1 FAILED: tools/lldb/test/CMakeFiles/check-lldb-lit cd /Users/buildslave/jenkins/workspace/lldb-cmake-sanitized/lldb-build/tools/lldb/test && /usr/local/Frameworks/Python.framework/Versions/3.7/bin/python3.7 /Users/buildslave/jenkins/workspace/lldb-cmake-sanitized/lldb-build/./bin/llvm-lit -v --time-tests --shuffle --xunit-xml-output=/Users/buildslave/jenkins/workspace/lldb-cmake-sanitized/test/results.xml -v -j 4 --timeout 1200 /Users/buildslave/jenkins/workspace/lldb-cmake-sanitized/lldb-build/tools/lldb/test ninja: build stopped: subcommand failed. Command failed: Command '['/usr/bin/env', 'TERM=vt100', '/usr/local/bin/ninja', '-v', 'check-lldb']' returned non-zero exit status 1. Command: ['/usr/bin/env', 'TERM=vt100', '/usr/local/bin/ninja', '-v', 'check-lldb'] [Pipeline] } [Pipeline] // timeout [Pipeline] } [Pipeline] // stage [Pipeline] stage [Pipeline] { (Declarative: Post Actions) [Pipeline] scanForIssues [Clang (LLVM based)] Sleeping for 5 seconds due to JENKINS-32191... [Clang (LLVM based)] Parsing console log (workspace: '/Users/buildslave/jenkins/workspace/lldb-cmake-sanitized') [Clang (LLVM based)] Successfully parsed console log [Clang (LLVM based)] -> found 2 issues (skipped 0 duplicates) [Clang (LLVM based)] Post processing issues on 'green-dragon-23' with source code encoding 'UTF-8' [Clang (LLVM based)] Creating SCM blamer to obtain author and commit information for affected files [Clang (LLVM based)] Creating SCM miner to obtain statistics for affected repository files [Clang (LLVM based)] Resolving file names for all issues in source directory '/Users/buildslave/jenkins/workspace/lldb-cmake-sanitized' [Clang (LLVM based)] -> resolved paths in source directory (1 found, 0 not found) [Clang (LLVM based)] Resolving module names from module definitions (build.xml, pom.xml, or Manifest.mf files) [Clang (LLVM based)] -> resolved module names for 2 issues [Clang (LLVM based)] Resolving package names (or namespaces) by parsing the affected files [Clang (LLVM based)] -> resolved package names of 1 affected files [Clang (LLVM based)] No filter has been set, publishing all 2 issues [Clang (LLVM based)] Creating fingerprints for all affected code blocks to track issues over different builds [Clang (LLVM based)] -> created fingerprints for 2 issues (skipped 0 issues) [Clang (LLVM based)] Copying affected files to Jenkins' build folder '/Users/Shared/Jenkins/Home/jobs/lldb-cmake-sanitized/builds/1581/files-with-issues' [Clang (LLVM based)] -> 1 copied, 0 not in workspace, 0 not-found, 0 with I/O error [Pipeline] junit Recording test results [Pipeline] } [Pipeline] // stage [Pipeline] } [Pipeline] // withEnv [Pipeline] } [Pipeline] // node [Pipeline] End of Pipeline ERROR: script returned exit code 1 Finished: FAILURE