FailedConsole Output

Skipping 8,709 KB.. Full Log
                     sys.exc_info()[0]))

Hide Details

Hide Details

Executing tearDown hook: def cleanupSubprocesses(self): # Ensure any subprocesses are cleaned up for p in self.subprocesses: p.terminate() del p del self.subprocesses[:] # Ensure any forked processes are cleaned up for pid in self.forkedProcessPids: try: os.kill(pid, signal.SIGTERM) except OSError: pass

Hide Details

Hide Details

Executing tearDown hook: def shutdown_named_pipe(): # Close the pipe. try: named_pipe.close() except: print("failed to close named pipe") None

Hide Details

# Delete the pipe. try: os.remove(named_pipe_path) except: print("failed to delete named pipe: {}".format(named_pipe_path)) None

Hide Details

# Delete the temp directory. try: os.rmdir(temp_dir) except: print( "failed to delete temp dir: {}, directory contents: '{}'".format( temp_dir, os.listdir(temp_dir))) None

Hide Details

Hide Details

PASS: LLDB (/Users/buildslave/jenkins/workspace/lldb-cmake-sanitized/lldb-build/bin/clang-11-x86_64) :: test_qRegisterInfo_contains_required_generics_debugserver (TestLldbGdbServer.LldbGdbServerTestCase) runCmd: settings clear -all output:

Hide Details

runCmd: settings set symbols.enable-external-lookup false output:

Hide Details

runCmd: settings set target.auto-apply-fixits false output:

Hide Details

runCmd: settings set plugin.process.gdb-remote.packet-timeout 60 output:

Hide Details

runCmd: settings set symbols.clang-modules-cache-path "/Users/buildslave/jenkins/workspace/lldb-cmake-sanitized/lldb-build/lldb-test-build.noindex/module-cache-lldb/lldb-api" output:

Hide Details

runCmd: settings set use-color false output:

Hide Details

runCmd: setting set target.prefer-dynamic-value no-dynamic-values output:

Hide Details

runCmd: settings set target.env-vars ASAN_OPTIONS=detect_stack_use_after_return=1 DYLD_INSERT_LIBRARIES=/Users/buildslave/jenkins/workspace/lldb-cmake-sanitized/host-compiler/lib/clang/11.0.0/lib/darwin/libclang_rt.asan_osx_dynamic.dylib output:

Hide Details

UNSUPPORTED: LLDB (/Users/buildslave/jenkins/workspace/lldb-cmake-sanitized/lldb-build/bin/clang-11-x86_64) :: test_qRegisterInfo_contains_required_generics_llgs (TestLldbGdbServer.LldbGdbServerTestCase) (llgs tests) runCmd: settings clear -all output:

Hide Details

runCmd: settings set symbols.enable-external-lookup false output:

Hide Details

runCmd: settings set target.auto-apply-fixits false output:

Hide Details

runCmd: settings set plugin.process.gdb-remote.packet-timeout 60 output:

Hide Details

runCmd: settings set symbols.clang-modules-cache-path "/Users/buildslave/jenkins/workspace/lldb-cmake-sanitized/lldb-build/lldb-test-build.noindex/module-cache-lldb/lldb-api" output:

Hide Details

runCmd: settings set use-color false output:

Hide Details

runCmd: setting set target.prefer-dynamic-value no-dynamic-values output:

Hide Details

runCmd: settings set target.env-vars ASAN_OPTIONS=detect_stack_use_after_return=1 DYLD_INSERT_LIBRARIES=/Users/buildslave/jenkins/workspace/lldb-cmake-sanitized/host-compiler/lib/clang/11.0.0/lib/darwin/libclang_rt.asan_osx_dynamic.dylib output:

Hide Details

Adding tearDown hook: def shutdown_named_pipe(): # Close the pipe. try: named_pipe.close() except: print("failed to close named pipe") None

Hide Details

# Delete the pipe. try: os.remove(named_pipe_path) except: print("failed to delete named pipe: {}".format(named_pipe_path)) None

Hide Details

# Delete the temp directory. try: os.rmdir(temp_dir) except: print( "failed to delete temp dir: {}, directory contents: '{}'".format( temp_dir, os.listdir(temp_dir))) None

Hide Details

Hide Details

Adding tearDown hook: def cleanupSubprocesses(self): # Ensure any subprocesses are cleaned up for p in self.subprocesses: p.terminate() del p del self.subprocesses[:] # Ensure any forked processes are cleaned up for pid in self.forkedProcessPids: try: os.kill(pid, signal.SIGTERM) except OSError: pass

Hide Details

Hide Details

Adding tearDown hook: def shutdown_debug_monitor(): try: server.terminate() except: logger.warning( "failed to terminate server for debug monitor: {}; ignoring".format( sys.exc_info()[0]))

Hide Details

Hide Details

Adding tearDown hook: def shutdown_socket(): if sock: try: # send the kill packet so lldb-server shuts down gracefully sock.sendall(GdbRemoteTestCaseBase._GDBREMOTE_KILL_PACKET) except: logger.warning( "failed to send kill packet to debug monitor: {}; ignoring".format( sys.exc_info()[0]))

Hide Details

try: sock.close() except: logger.warning( "failed to close socket to debug monitor: {}; ignoring".format( sys.exc_info()[0]))

Hide Details

Hide Details

Executing tearDown hook: def shutdown_socket(): if sock: try: # send the kill packet so lldb-server shuts down gracefully sock.sendall(GdbRemoteTestCaseBase._GDBREMOTE_KILL_PACKET) except: logger.warning( "failed to send kill packet to debug monitor: {}; ignoring".format( sys.exc_info()[0]))

Hide Details

try: sock.close() except: logger.warning( "failed to close socket to debug monitor: {}; ignoring".format( sys.exc_info()[0]))

Hide Details

Hide Details

2020-07-01 00:05:29,846 WARNING failed to send kill packet to debug monitor: <class 'TypeError'>; ignoring Executing tearDown hook: def shutdown_debug_monitor(): try: server.terminate() except: logger.warning( "failed to terminate server for debug monitor: {}; ignoring".format( sys.exc_info()[0]))

Hide Details

Hide Details

Executing tearDown hook: def cleanupSubprocesses(self): # Ensure any subprocesses are cleaned up for p in self.subprocesses: p.terminate() del p del self.subprocesses[:] # Ensure any forked processes are cleaned up for pid in self.forkedProcessPids: try: os.kill(pid, signal.SIGTERM) except OSError: pass

Hide Details

Hide Details

Executing tearDown hook: def shutdown_named_pipe(): # Close the pipe. try: named_pipe.close() except: print("failed to close named pipe") None

Hide Details

# Delete the pipe. try: os.remove(named_pipe_path) except: print("failed to delete named pipe: {}".format(named_pipe_path)) None

Hide Details

# Delete the temp directory. try: os.rmdir(temp_dir) except: print( "failed to delete temp dir: {}, directory contents: '{}'".format( temp_dir, os.listdir(temp_dir))) None

Hide Details

Hide Details

PASS: LLDB (/Users/buildslave/jenkins/workspace/lldb-cmake-sanitized/lldb-build/bin/clang-11-x86_64) :: test_qRegisterInfo_returns_all_valid_results_debugserver (TestLldbGdbServer.LldbGdbServerTestCase) runCmd: settings clear -all output:

Hide Details

runCmd: settings set symbols.enable-external-lookup false output:

Hide Details

runCmd: settings set target.auto-apply-fixits false output:

Hide Details

runCmd: settings set plugin.process.gdb-remote.packet-timeout 60 output:

Hide Details

runCmd: settings set symbols.clang-modules-cache-path "/Users/buildslave/jenkins/workspace/lldb-cmake-sanitized/lldb-build/lldb-test-build.noindex/module-cache-lldb/lldb-api" output:

Hide Details

runCmd: settings set use-color false output:

Hide Details

runCmd: setting set target.prefer-dynamic-value no-dynamic-values output:

Hide Details

runCmd: settings set target.env-vars ASAN_OPTIONS=detect_stack_use_after_return=1 DYLD_INSERT_LIBRARIES=/Users/buildslave/jenkins/workspace/lldb-cmake-sanitized/host-compiler/lib/clang/11.0.0/lib/darwin/libclang_rt.asan_osx_dynamic.dylib output:

Hide Details

UNSUPPORTED: LLDB (/Users/buildslave/jenkins/workspace/lldb-cmake-sanitized/lldb-build/bin/clang-11-x86_64) :: test_qRegisterInfo_returns_all_valid_results_llgs (TestLldbGdbServer.LldbGdbServerTestCase) (llgs tests) runCmd: settings clear -all output:

Hide Details

runCmd: settings set symbols.enable-external-lookup false output:

Hide Details

runCmd: settings set target.auto-apply-fixits false output:

Hide Details

runCmd: settings set plugin.process.gdb-remote.packet-timeout 60 output:

Hide Details

runCmd: settings set symbols.clang-modules-cache-path "/Users/buildslave/jenkins/workspace/lldb-cmake-sanitized/lldb-build/lldb-test-build.noindex/module-cache-lldb/lldb-api" output:

Hide Details

runCmd: settings set use-color false output:

Hide Details

runCmd: setting set target.prefer-dynamic-value no-dynamic-values output:

Hide Details

runCmd: settings set target.env-vars ASAN_OPTIONS=detect_stack_use_after_return=1 DYLD_INSERT_LIBRARIES=/Users/buildslave/jenkins/workspace/lldb-cmake-sanitized/host-compiler/lib/clang/11.0.0/lib/darwin/libclang_rt.asan_osx_dynamic.dylib output:

Hide Details

Adding tearDown hook: def shutdown_named_pipe(): # Close the pipe. try: named_pipe.close() except: print("failed to close named pipe") None

Hide Details

# Delete the pipe. try: os.remove(named_pipe_path) except: print("failed to delete named pipe: {}".format(named_pipe_path)) None

Hide Details

# Delete the temp directory. try: os.rmdir(temp_dir) except: print( "failed to delete temp dir: {}, directory contents: '{}'".format( temp_dir, os.listdir(temp_dir))) None

Hide Details

Hide Details

Adding tearDown hook: def cleanupSubprocesses(self): # Ensure any subprocesses are cleaned up for p in self.subprocesses: p.terminate() del p del self.subprocesses[:] # Ensure any forked processes are cleaned up for pid in self.forkedProcessPids: try: os.kill(pid, signal.SIGTERM) except OSError: pass

Hide Details

Hide Details

Adding tearDown hook: def shutdown_debug_monitor(): try: server.terminate() except: logger.warning( "failed to terminate server for debug monitor: {}; ignoring".format( sys.exc_info()[0]))

Hide Details

Hide Details

Adding tearDown hook: def shutdown_socket(): if sock: try: # send the kill packet so lldb-server shuts down gracefully sock.sendall(GdbRemoteTestCaseBase._GDBREMOTE_KILL_PACKET) except: logger.warning( "failed to send kill packet to debug monitor: {}; ignoring".format( sys.exc_info()[0]))

Hide Details

try: sock.close() except: logger.warning( "failed to close socket to debug monitor: {}; ignoring".format( sys.exc_info()[0]))

Hide Details

Hide Details

Executing tearDown hook: def shutdown_socket(): if sock: try: # send the kill packet so lldb-server shuts down gracefully sock.sendall(GdbRemoteTestCaseBase._GDBREMOTE_KILL_PACKET) except: logger.warning( "failed to send kill packet to debug monitor: {}; ignoring".format( sys.exc_info()[0]))

Hide Details

try: sock.close() except: logger.warning( "failed to close socket to debug monitor: {}; ignoring".format( sys.exc_info()[0]))

Hide Details

Hide Details

2020-07-01 00:05:38,188 WARNING failed to send kill packet to debug monitor: <class 'TypeError'>; ignoring Executing tearDown hook: def shutdown_debug_monitor(): try: server.terminate() except: logger.warning( "failed to terminate server for debug monitor: {}; ignoring".format( sys.exc_info()[0]))

Hide Details

Hide Details

Executing tearDown hook: def cleanupSubprocesses(self): # Ensure any subprocesses are cleaned up for p in self.subprocesses: p.terminate() del p del self.subprocesses[:] # Ensure any forked processes are cleaned up for pid in self.forkedProcessPids: try: os.kill(pid, signal.SIGTERM) except OSError: pass

Hide Details

Hide Details

Executing tearDown hook: def shutdown_named_pipe(): # Close the pipe. try: named_pipe.close() except: print("failed to close named pipe") None

Hide Details

# Delete the pipe. try: os.remove(named_pipe_path) except: print("failed to delete named pipe: {}".format(named_pipe_path)) None

Hide Details

# Delete the temp directory. try: os.rmdir(temp_dir) except: print( "failed to delete temp dir: {}, directory contents: '{}'".format( temp_dir, os.listdir(temp_dir))) None

Hide Details

Hide Details

PASS: LLDB (/Users/buildslave/jenkins/workspace/lldb-cmake-sanitized/lldb-build/bin/clang-11-x86_64) :: test_qRegisterInfo_returns_one_valid_result_debugserver (TestLldbGdbServer.LldbGdbServerTestCase) runCmd: settings clear -all output:

Hide Details

runCmd: settings set symbols.enable-external-lookup false output:

Hide Details

runCmd: settings set target.auto-apply-fixits false output:

Hide Details

runCmd: settings set plugin.process.gdb-remote.packet-timeout 60 output:

Hide Details

runCmd: settings set symbols.clang-modules-cache-path "/Users/buildslave/jenkins/workspace/lldb-cmake-sanitized/lldb-build/lldb-test-build.noindex/module-cache-lldb/lldb-api" output:

Hide Details

runCmd: settings set use-color false output:

Hide Details

runCmd: setting set target.prefer-dynamic-value no-dynamic-values output:

Hide Details

runCmd: settings set target.env-vars ASAN_OPTIONS=detect_stack_use_after_return=1 DYLD_INSERT_LIBRARIES=/Users/buildslave/jenkins/workspace/lldb-cmake-sanitized/host-compiler/lib/clang/11.0.0/lib/darwin/libclang_rt.asan_osx_dynamic.dylib output:

Hide Details

UNSUPPORTED: LLDB (/Users/buildslave/jenkins/workspace/lldb-cmake-sanitized/lldb-build/bin/clang-11-x86_64) :: test_qRegisterInfo_returns_one_valid_result_llgs (TestLldbGdbServer.LldbGdbServerTestCase) (llgs tests) runCmd: settings clear -all output:

Hide Details

runCmd: settings set symbols.enable-external-lookup false output:

Hide Details

runCmd: settings set target.auto-apply-fixits false output:

Hide Details

runCmd: settings set plugin.process.gdb-remote.packet-timeout 60 output:

Hide Details

runCmd: settings set symbols.clang-modules-cache-path "/Users/buildslave/jenkins/workspace/lldb-cmake-sanitized/lldb-build/lldb-test-build.noindex/module-cache-lldb/lldb-api" output:

Hide Details

runCmd: settings set use-color false output:

Hide Details

runCmd: setting set target.prefer-dynamic-value no-dynamic-values output:

Hide Details

runCmd: settings set target.env-vars ASAN_OPTIONS=detect_stack_use_after_return=1 DYLD_INSERT_LIBRARIES=/Users/buildslave/jenkins/workspace/lldb-cmake-sanitized/host-compiler/lib/clang/11.0.0/lib/darwin/libclang_rt.asan_osx_dynamic.dylib output:

Hide Details

Adding tearDown hook: def shutdown_named_pipe(): # Close the pipe. try: named_pipe.close() except: print("failed to close named pipe") None

Hide Details

# Delete the pipe. try: os.remove(named_pipe_path) except: print("failed to delete named pipe: {}".format(named_pipe_path)) None

Hide Details

# Delete the temp directory. try: os.rmdir(temp_dir) except: print( "failed to delete temp dir: {}, directory contents: '{}'".format( temp_dir, os.listdir(temp_dir))) None

Hide Details

Hide Details

Adding tearDown hook: def cleanupSubprocesses(self): # Ensure any subprocesses are cleaned up for p in self.subprocesses: p.terminate() del p del self.subprocesses[:] # Ensure any forked processes are cleaned up for pid in self.forkedProcessPids: try: os.kill(pid, signal.SIGTERM) except OSError: pass

Hide Details

Hide Details

Adding tearDown hook: def shutdown_debug_monitor(): try: server.terminate() except: logger.warning( "failed to terminate server for debug monitor: {}; ignoring".format( sys.exc_info()[0]))

Hide Details

Hide Details

Adding tearDown hook: def shutdown_socket(): if sock: try: # send the kill packet so lldb-server shuts down gracefully sock.sendall(GdbRemoteTestCaseBase._GDBREMOTE_KILL_PACKET) except: logger.warning( "failed to send kill packet to debug monitor: {}; ignoring".format( sys.exc_info()[0]))

Hide Details

try: sock.close() except: logger.warning( "failed to close socket to debug monitor: {}; ignoring".format( sys.exc_info()[0]))

Hide Details

Hide Details

Executing tearDown hook: def shutdown_socket(): if sock: try: # send the kill packet so lldb-server shuts down gracefully sock.sendall(GdbRemoteTestCaseBase._GDBREMOTE_KILL_PACKET) except: logger.warning( "failed to send kill packet to debug monitor: {}; ignoring".format( sys.exc_info()[0]))

Hide Details

try: sock.close() except: logger.warning( "failed to close socket to debug monitor: {}; ignoring".format( sys.exc_info()[0]))

Hide Details

Hide Details

2020-07-01 00:05:47,365 WARNING failed to send kill packet to debug monitor: <class 'TypeError'>; ignoring Executing tearDown hook: def shutdown_debug_monitor(): try: server.terminate() except: logger.warning( "failed to terminate server for debug monitor: {}; ignoring".format( sys.exc_info()[0]))

Hide Details

Hide Details

Executing tearDown hook: def cleanupSubprocesses(self): # Ensure any subprocesses are cleaned up for p in self.subprocesses: p.terminate() del p del self.subprocesses[:] # Ensure any forked processes are cleaned up for pid in self.forkedProcessPids: try: os.kill(pid, signal.SIGTERM) except OSError: pass

Hide Details

Hide Details

Executing tearDown hook: def shutdown_named_pipe(): # Close the pipe. try: named_pipe.close() except: print("failed to close named pipe") None

Hide Details

# Delete the pipe. try: os.remove(named_pipe_path) except: print("failed to delete named pipe: {}".format(named_pipe_path)) None

Hide Details

# Delete the temp directory. try: os.rmdir(temp_dir) except: print( "failed to delete temp dir: {}, directory contents: '{}'".format( temp_dir, os.listdir(temp_dir))) None

Hide Details

Hide Details

PASS: LLDB (/Users/buildslave/jenkins/workspace/lldb-cmake-sanitized/lldb-build/bin/clang-11-x86_64) :: test_qSupported_returns_known_stub_features_debugserver (TestLldbGdbServer.LldbGdbServerTestCase) runCmd: settings clear -all output:

Hide Details

runCmd: settings set symbols.enable-external-lookup false output:

Hide Details

runCmd: settings set target.auto-apply-fixits false output:

Hide Details

runCmd: settings set plugin.process.gdb-remote.packet-timeout 60 output:

Hide Details

runCmd: settings set symbols.clang-modules-cache-path "/Users/buildslave/jenkins/workspace/lldb-cmake-sanitized/lldb-build/lldb-test-build.noindex/module-cache-lldb/lldb-api" output:

Hide Details

runCmd: settings set use-color false output:

Hide Details

runCmd: setting set target.prefer-dynamic-value no-dynamic-values output:

Hide Details

runCmd: settings set target.env-vars ASAN_OPTIONS=detect_stack_use_after_return=1 DYLD_INSERT_LIBRARIES=/Users/buildslave/jenkins/workspace/lldb-cmake-sanitized/host-compiler/lib/clang/11.0.0/lib/darwin/libclang_rt.asan_osx_dynamic.dylib output:

Hide Details

UNSUPPORTED: LLDB (/Users/buildslave/jenkins/workspace/lldb-cmake-sanitized/lldb-build/bin/clang-11-x86_64) :: test_qSupported_returns_known_stub_features_llgs (TestLldbGdbServer.LldbGdbServerTestCase) (llgs tests) runCmd: settings clear -all output:

Hide Details

runCmd: settings set symbols.enable-external-lookup false output:

Hide Details

runCmd: settings set target.auto-apply-fixits false output:

Hide Details

runCmd: settings set plugin.process.gdb-remote.packet-timeout 60 output:

Hide Details

runCmd: settings set symbols.clang-modules-cache-path "/Users/buildslave/jenkins/workspace/lldb-cmake-sanitized/lldb-build/lldb-test-build.noindex/module-cache-lldb/lldb-api" output:

Hide Details

runCmd: settings set use-color false output:

Hide Details

runCmd: setting set target.prefer-dynamic-value no-dynamic-values output:

Hide Details

runCmd: settings set target.env-vars ASAN_OPTIONS=detect_stack_use_after_return=1 DYLD_INSERT_LIBRARIES=/Users/buildslave/jenkins/workspace/lldb-cmake-sanitized/host-compiler/lib/clang/11.0.0/lib/darwin/libclang_rt.asan_osx_dynamic.dylib output:

Hide Details

Adding tearDown hook: def shutdown_named_pipe(): # Close the pipe. try: named_pipe.close() except: print("failed to close named pipe") None

Hide Details

# Delete the pipe. try: os.remove(named_pipe_path) except: print("failed to delete named pipe: {}".format(named_pipe_path)) None

Hide Details

# Delete the temp directory. try: os.rmdir(temp_dir) except: print( "failed to delete temp dir: {}, directory contents: '{}'".format( temp_dir, os.listdir(temp_dir))) None

Hide Details

Hide Details

Adding tearDown hook: def shutdown_process_for_attach(): try: inferior.terminate() except: logger.warning( "failed to terminate inferior process for attach: {}; ignoring".format( sys.exc_info()[0]))

Hide Details

Hide Details

Adding tearDown hook: def cleanupSubprocesses(self): # Ensure any subprocesses are cleaned up for p in self.subprocesses: p.terminate() del p del self.subprocesses[:] # Ensure any forked processes are cleaned up for pid in self.forkedProcessPids: try: os.kill(pid, signal.SIGTERM) except OSError: pass

Hide Details

Hide Details

Adding tearDown hook: def shutdown_debug_monitor(): try: server.terminate() except: logger.warning( "failed to terminate server for debug monitor: {}; ignoring".format( sys.exc_info()[0]))

Hide Details

Hide Details

Adding tearDown hook: def shutdown_socket(): if sock: try: # send the kill packet so lldb-server shuts down gracefully sock.sendall(GdbRemoteTestCaseBase._GDBREMOTE_KILL_PACKET) except: logger.warning( "failed to send kill packet to debug monitor: {}; ignoring".format( sys.exc_info()[0]))

Hide Details

try: sock.close() except: logger.warning( "failed to close socket to debug monitor: {}; ignoring".format( sys.exc_info()[0]))

Hide Details

Hide Details

Executing tearDown hook: def shutdown_socket(): if sock: try: # send the kill packet so lldb-server shuts down gracefully sock.sendall(GdbRemoteTestCaseBase._GDBREMOTE_KILL_PACKET) except: logger.warning( "failed to send kill packet to debug monitor: {}; ignoring".format( sys.exc_info()[0]))

Hide Details

try: sock.close() except: logger.warning( "failed to close socket to debug monitor: {}; ignoring".format( sys.exc_info()[0]))

Hide Details

Hide Details

2020-07-01 00:05:56,716 WARNING failed to send kill packet to debug monitor: <class 'TypeError'>; ignoring Executing tearDown hook: def shutdown_debug_monitor(): try: server.terminate() except: logger.warning( "failed to terminate server for debug monitor: {}; ignoring".format( sys.exc_info()[0]))

Hide Details

Hide Details

Executing tearDown hook: def cleanupSubprocesses(self): # Ensure any subprocesses are cleaned up for p in self.subprocesses: p.terminate() del p del self.subprocesses[:] # Ensure any forked processes are cleaned up for pid in self.forkedProcessPids: try: os.kill(pid, signal.SIGTERM) except OSError: pass

Hide Details

Hide Details

Executing tearDown hook: def shutdown_process_for_attach(): try: inferior.terminate() except: logger.warning( "failed to terminate inferior process for attach: {}; ignoring".format( sys.exc_info()[0]))

Hide Details

Hide Details

Executing tearDown hook: def shutdown_named_pipe(): # Close the pipe. try: named_pipe.close() except: print("failed to close named pipe") None

Hide Details

# Delete the pipe. try: os.remove(named_pipe_path) except: print("failed to delete named pipe: {}".format(named_pipe_path)) None

Hide Details

# Delete the temp directory. try: os.rmdir(temp_dir) except: print( "failed to delete temp dir: {}, directory contents: '{}'".format( temp_dir, os.listdir(temp_dir))) None

Hide Details

Hide Details

PASS: LLDB (/Users/buildslave/jenkins/workspace/lldb-cmake-sanitized/lldb-build/bin/clang-11-x86_64) :: test_qThreadInfo_contains_thread_attach_debugserver (TestLldbGdbServer.LldbGdbServerTestCase) runCmd: settings clear -all output:

Hide Details

runCmd: settings set symbols.enable-external-lookup false output:

Hide Details

runCmd: settings set target.auto-apply-fixits false output:

Hide Details

runCmd: settings set plugin.process.gdb-remote.packet-timeout 60 output:

Hide Details

runCmd: settings set symbols.clang-modules-cache-path "/Users/buildslave/jenkins/workspace/lldb-cmake-sanitized/lldb-build/lldb-test-build.noindex/module-cache-lldb/lldb-api" output:

Hide Details

runCmd: settings set use-color false output:

Hide Details

runCmd: setting set target.prefer-dynamic-value no-dynamic-values output:

Hide Details

runCmd: settings set target.env-vars ASAN_OPTIONS=detect_stack_use_after_return=1 DYLD_INSERT_LIBRARIES=/Users/buildslave/jenkins/workspace/lldb-cmake-sanitized/host-compiler/lib/clang/11.0.0/lib/darwin/libclang_rt.asan_osx_dynamic.dylib output:

Hide Details

UNSUPPORTED: LLDB (/Users/buildslave/jenkins/workspace/lldb-cmake-sanitized/lldb-build/bin/clang-11-x86_64) :: test_qThreadInfo_contains_thread_attach_llgs (TestLldbGdbServer.LldbGdbServerTestCase) (llgs tests) runCmd: settings clear -all output:

Hide Details

runCmd: settings set symbols.enable-external-lookup false output:

Hide Details

runCmd: settings set target.auto-apply-fixits false output:

Hide Details

runCmd: settings set plugin.process.gdb-remote.packet-timeout 60 output:

Hide Details

runCmd: settings set symbols.clang-modules-cache-path "/Users/buildslave/jenkins/workspace/lldb-cmake-sanitized/lldb-build/lldb-test-build.noindex/module-cache-lldb/lldb-api" output:

Hide Details

runCmd: settings set use-color false output:

Hide Details

runCmd: setting set target.prefer-dynamic-value no-dynamic-values output:

Hide Details

runCmd: settings set target.env-vars ASAN_OPTIONS=detect_stack_use_after_return=1 DYLD_INSERT_LIBRARIES=/Users/buildslave/jenkins/workspace/lldb-cmake-sanitized/host-compiler/lib/clang/11.0.0/lib/darwin/libclang_rt.asan_osx_dynamic.dylib output:

Hide Details

Adding tearDown hook: def shutdown_named_pipe(): # Close the pipe. try: named_pipe.close() except: print("failed to close named pipe") None

Hide Details

# Delete the pipe. try: os.remove(named_pipe_path) except: print("failed to delete named pipe: {}".format(named_pipe_path)) None

Hide Details

# Delete the temp directory. try: os.rmdir(temp_dir) except: print( "failed to delete temp dir: {}, directory contents: '{}'".format( temp_dir, os.listdir(temp_dir))) None

Hide Details

Hide Details

Adding tearDown hook: def cleanupSubprocesses(self): # Ensure any subprocesses are cleaned up for p in self.subprocesses: p.terminate() del p del self.subprocesses[:] # Ensure any forked processes are cleaned up for pid in self.forkedProcessPids: try: os.kill(pid, signal.SIGTERM) except OSError: pass

Hide Details

Hide Details

Adding tearDown hook: def shutdown_debug_monitor(): try: server.terminate() except: logger.warning( "failed to terminate server for debug monitor: {}; ignoring".format( sys.exc_info()[0]))

Hide Details

Hide Details

Adding tearDown hook: def shutdown_socket(): if sock: try: # send the kill packet so lldb-server shuts down gracefully sock.sendall(GdbRemoteTestCaseBase._GDBREMOTE_KILL_PACKET) except: logger.warning( "failed to send kill packet to debug monitor: {}; ignoring".format( sys.exc_info()[0]))

Hide Details

try: sock.close() except: logger.warning( "failed to close socket to debug monitor: {}; ignoring".format( sys.exc_info()[0]))

Hide Details

Hide Details

Executing tearDown hook: def shutdown_socket(): if sock: try: # send the kill packet so lldb-server shuts down gracefully sock.sendall(GdbRemoteTestCaseBase._GDBREMOTE_KILL_PACKET) except: logger.warning( "failed to send kill packet to debug monitor: {}; ignoring".format( sys.exc_info()[0]))

Hide Details

try: sock.close() except: logger.warning( "failed to close socket to debug monitor: {}; ignoring".format( sys.exc_info()[0]))

Hide Details

Hide Details

2020-07-01 00:06:05,798 WARNING failed to send kill packet to debug monitor: <class 'TypeError'>; ignoring Executing tearDown hook: def shutdown_debug_monitor(): try: server.terminate() except: logger.warning( "failed to terminate server for debug monitor: {}; ignoring".format( sys.exc_info()[0]))

Hide Details

Hide Details

Executing tearDown hook: def cleanupSubprocesses(self): # Ensure any subprocesses are cleaned up for p in self.subprocesses: p.terminate() del p del self.subprocesses[:] # Ensure any forked processes are cleaned up for pid in self.forkedProcessPids: try: os.kill(pid, signal.SIGTERM) except OSError: pass

Hide Details

Hide Details

Executing tearDown hook: def shutdown_named_pipe(): # Close the pipe. try: named_pipe.close() except: print("failed to close named pipe") None

Hide Details

# Delete the pipe. try: os.remove(named_pipe_path) except: print("failed to delete named pipe: {}".format(named_pipe_path)) None

Hide Details

# Delete the temp directory. try: os.rmdir(temp_dir) except: print( "failed to delete temp dir: {}, directory contents: '{}'".format( temp_dir, os.listdir(temp_dir))) None

Hide Details

Hide Details

PASS: LLDB (/Users/buildslave/jenkins/workspace/lldb-cmake-sanitized/lldb-build/bin/clang-11-x86_64) :: test_qThreadInfo_contains_thread_launch_debugserver (TestLldbGdbServer.LldbGdbServerTestCase) runCmd: settings clear -all output:

Hide Details

runCmd: settings set symbols.enable-external-lookup false output:

Hide Details

runCmd: settings set target.auto-apply-fixits false output:

Hide Details

runCmd: settings set plugin.process.gdb-remote.packet-timeout 60 output:

Hide Details

runCmd: settings set symbols.clang-modules-cache-path "/Users/buildslave/jenkins/workspace/lldb-cmake-sanitized/lldb-build/lldb-test-build.noindex/module-cache-lldb/lldb-api" output:

Hide Details

runCmd: settings set use-color false output:

Hide Details

runCmd: setting set target.prefer-dynamic-value no-dynamic-values output:

Hide Details

runCmd: settings set target.env-vars ASAN_OPTIONS=detect_stack_use_after_return=1 DYLD_INSERT_LIBRARIES=/Users/buildslave/jenkins/workspace/lldb-cmake-sanitized/host-compiler/lib/clang/11.0.0/lib/darwin/libclang_rt.asan_osx_dynamic.dylib output:

Hide Details

UNSUPPORTED: LLDB (/Users/buildslave/jenkins/workspace/lldb-cmake-sanitized/lldb-build/bin/clang-11-x86_64) :: test_qThreadInfo_contains_thread_launch_llgs (TestLldbGdbServer.LldbGdbServerTestCase) (llgs tests) runCmd: settings clear -all output:

Hide Details

runCmd: settings set symbols.enable-external-lookup false output:

Hide Details

runCmd: settings set target.auto-apply-fixits false output:

Hide Details

runCmd: settings set plugin.process.gdb-remote.packet-timeout 60 output:

Hide Details

runCmd: settings set symbols.clang-modules-cache-path "/Users/buildslave/jenkins/workspace/lldb-cmake-sanitized/lldb-build/lldb-test-build.noindex/module-cache-lldb/lldb-api" output:

Hide Details

runCmd: settings set use-color false output:

Hide Details

runCmd: setting set target.prefer-dynamic-value no-dynamic-values output:

Hide Details

runCmd: settings set target.env-vars ASAN_OPTIONS=detect_stack_use_after_return=1 DYLD_INSERT_LIBRARIES=/Users/buildslave/jenkins/workspace/lldb-cmake-sanitized/host-compiler/lib/clang/11.0.0/lib/darwin/libclang_rt.asan_osx_dynamic.dylib output:

Hide Details

Adding tearDown hook: def shutdown_named_pipe(): # Close the pipe. try: named_pipe.close() except: print("failed to close named pipe") None

Hide Details

# Delete the pipe. try: os.remove(named_pipe_path) except: print("failed to delete named pipe: {}".format(named_pipe_path)) None

Hide Details

# Delete the temp directory. try: os.rmdir(temp_dir) except: print( "failed to delete temp dir: {}, directory contents: '{}'".format( temp_dir, os.listdir(temp_dir))) None

Hide Details

Hide Details

Adding tearDown hook: def shutdown_process_for_attach(): try: inferior.terminate() except: logger.warning( "failed to terminate inferior process for attach: {}; ignoring".format( sys.exc_info()[0]))

Hide Details

Hide Details

Adding tearDown hook: def cleanupSubprocesses(self): # Ensure any subprocesses are cleaned up for p in self.subprocesses: p.terminate() del p del self.subprocesses[:] # Ensure any forked processes are cleaned up for pid in self.forkedProcessPids: try: os.kill(pid, signal.SIGTERM) except OSError: pass

Hide Details

Hide Details

Adding tearDown hook: def shutdown_debug_monitor(): try: server.terminate() except: logger.warning( "failed to terminate server for debug monitor: {}; ignoring".format( sys.exc_info()[0]))

Hide Details

Hide Details

Adding tearDown hook: def shutdown_socket(): if sock: try: # send the kill packet so lldb-server shuts down gracefully sock.sendall(GdbRemoteTestCaseBase._GDBREMOTE_KILL_PACKET) except: logger.warning( "failed to send kill packet to debug monitor: {}; ignoring".format( sys.exc_info()[0]))

Hide Details

try: sock.close() except: logger.warning( "failed to close socket to debug monitor: {}; ignoring".format( sys.exc_info()[0]))

Hide Details

Hide Details

Executing tearDown hook: def shutdown_socket(): if sock: try: # send the kill packet so lldb-server shuts down gracefully sock.sendall(GdbRemoteTestCaseBase._GDBREMOTE_KILL_PACKET) except: logger.warning( "failed to send kill packet to debug monitor: {}; ignoring".format( sys.exc_info()[0]))

Hide Details

try: sock.close() except: logger.warning( "failed to close socket to debug monitor: {}; ignoring".format( sys.exc_info()[0]))

Hide Details

Hide Details

2020-07-01 00:06:14,948 WARNING failed to send kill packet to debug monitor: <class 'TypeError'>; ignoring Executing tearDown hook: def shutdown_debug_monitor(): try: server.terminate() except: logger.warning( "failed to terminate server for debug monitor: {}; ignoring".format( sys.exc_info()[0]))

Hide Details

Hide Details

Executing tearDown hook: def cleanupSubprocesses(self): # Ensure any subprocesses are cleaned up for p in self.subprocesses: p.terminate() del p del self.subprocesses[:] # Ensure any forked processes are cleaned up for pid in self.forkedProcessPids: try: os.kill(pid, signal.SIGTERM) except OSError: pass

Hide Details

Hide Details

Executing tearDown hook: def shutdown_process_for_attach(): try: inferior.terminate() except: logger.warning( "failed to terminate inferior process for attach: {}; ignoring".format( sys.exc_info()[0]))

Hide Details

Hide Details

Executing tearDown hook: def shutdown_named_pipe(): # Close the pipe. try: named_pipe.close() except: print("failed to close named pipe") None

Hide Details

# Delete the pipe. try: os.remove(named_pipe_path) except: print("failed to delete named pipe: {}".format(named_pipe_path)) None

Hide Details

# Delete the temp directory. try: os.rmdir(temp_dir) except: print( "failed to delete temp dir: {}, directory contents: '{}'".format( temp_dir, os.listdir(temp_dir))) None

Hide Details

Hide Details

PASS: LLDB (/Users/buildslave/jenkins/workspace/lldb-cmake-sanitized/lldb-build/bin/clang-11-x86_64) :: test_qThreadInfo_matches_qC_attach_debugserver (TestLldbGdbServer.LldbGdbServerTestCase) runCmd: settings clear -all output:

Hide Details

runCmd: settings set symbols.enable-external-lookup false output:

Hide Details

runCmd: settings set target.auto-apply-fixits false output:

Hide Details

runCmd: settings set plugin.process.gdb-remote.packet-timeout 60 output:

Hide Details

runCmd: settings set symbols.clang-modules-cache-path "/Users/buildslave/jenkins/workspace/lldb-cmake-sanitized/lldb-build/lldb-test-build.noindex/module-cache-lldb/lldb-api" output:

Hide Details

runCmd: settings set use-color false output:

Hide Details

runCmd: setting set target.prefer-dynamic-value no-dynamic-values output:

Hide Details

runCmd: settings set target.env-vars ASAN_OPTIONS=detect_stack_use_after_return=1 DYLD_INSERT_LIBRARIES=/Users/buildslave/jenkins/workspace/lldb-cmake-sanitized/host-compiler/lib/clang/11.0.0/lib/darwin/libclang_rt.asan_osx_dynamic.dylib output:

Hide Details

UNSUPPORTED: LLDB (/Users/buildslave/jenkins/workspace/lldb-cmake-sanitized/lldb-build/bin/clang-11-x86_64) :: test_qThreadInfo_matches_qC_attach_llgs (TestLldbGdbServer.LldbGdbServerTestCase) (llgs tests) runCmd: settings clear -all output:

Hide Details

runCmd: settings set symbols.enable-external-lookup false output:

Hide Details

runCmd: settings set target.auto-apply-fixits false output:

Hide Details

runCmd: settings set plugin.process.gdb-remote.packet-timeout 60 output:

Hide Details

runCmd: settings set symbols.clang-modules-cache-path "/Users/buildslave/jenkins/workspace/lldb-cmake-sanitized/lldb-build/lldb-test-build.noindex/module-cache-lldb/lldb-api" output:

Hide Details

runCmd: settings set use-color false output:

Hide Details

runCmd: setting set target.prefer-dynamic-value no-dynamic-values output:

Hide Details

runCmd: settings set target.env-vars ASAN_OPTIONS=detect_stack_use_after_return=1 DYLD_INSERT_LIBRARIES=/Users/buildslave/jenkins/workspace/lldb-cmake-sanitized/host-compiler/lib/clang/11.0.0/lib/darwin/libclang_rt.asan_osx_dynamic.dylib output:

Hide Details

Adding tearDown hook: def shutdown_named_pipe(): # Close the pipe. try: named_pipe.close() except: print("failed to close named pipe") None

Hide Details

# Delete the pipe. try: os.remove(named_pipe_path) except: print("failed to delete named pipe: {}".format(named_pipe_path)) None

Hide Details

# Delete the temp directory. try: os.rmdir(temp_dir) except: print( "failed to delete temp dir: {}, directory contents: '{}'".format( temp_dir, os.listdir(temp_dir))) None

Hide Details

Hide Details

Adding tearDown hook: def cleanupSubprocesses(self): # Ensure any subprocesses are cleaned up for p in self.subprocesses: p.terminate() del p del self.subprocesses[:] # Ensure any forked processes are cleaned up for pid in self.forkedProcessPids: try: os.kill(pid, signal.SIGTERM) except OSError: pass

Hide Details

Hide Details

Adding tearDown hook: def shutdown_debug_monitor(): try: server.terminate() except: logger.warning( "failed to terminate server for debug monitor: {}; ignoring".format( sys.exc_info()[0]))

Hide Details

Hide Details

Adding tearDown hook: def shutdown_socket(): if sock: try: # send the kill packet so lldb-server shuts down gracefully sock.sendall(GdbRemoteTestCaseBase._GDBREMOTE_KILL_PACKET) except: logger.warning( "failed to send kill packet to debug monitor: {}; ignoring".format( sys.exc_info()[0]))

Hide Details

try: sock.close() except: logger.warning( "failed to close socket to debug monitor: {}; ignoring".format( sys.exc_info()[0]))

Hide Details

Hide Details

Executing tearDown hook: def shutdown_socket(): if sock: try: # send the kill packet so lldb-server shuts down gracefully sock.sendall(GdbRemoteTestCaseBase._GDBREMOTE_KILL_PACKET) except: logger.warning( "failed to send kill packet to debug monitor: {}; ignoring".format( sys.exc_info()[0]))

Hide Details

try: sock.close() except: logger.warning( "failed to close socket to debug monitor: {}; ignoring".format( sys.exc_info()[0]))

Hide Details

Hide Details

2020-07-01 00:06:23,954 WARNING failed to send kill packet to debug monitor: <class 'TypeError'>; ignoring Executing tearDown hook: def shutdown_debug_monitor(): try: server.terminate() except: logger.warning( "failed to terminate server for debug monitor: {}; ignoring".format( sys.exc_info()[0]))

Hide Details

Hide Details

Executing tearDown hook: def cleanupSubprocesses(self): # Ensure any subprocesses are cleaned up for p in self.subprocesses: p.terminate() del p del self.subprocesses[:] # Ensure any forked processes are cleaned up for pid in self.forkedProcessPids: try: os.kill(pid, signal.SIGTERM) except OSError: pass

Hide Details

Hide Details

Executing tearDown hook: def shutdown_named_pipe(): # Close the pipe. try: named_pipe.close() except: print("failed to close named pipe") None

Hide Details

# Delete the pipe. try: os.remove(named_pipe_path) except: print("failed to delete named pipe: {}".format(named_pipe_path)) None

Hide Details

# Delete the temp directory. try: os.rmdir(temp_dir) except: print( "failed to delete temp dir: {}, directory contents: '{}'".format( temp_dir, os.listdir(temp_dir))) None

Hide Details

Hide Details

PASS: LLDB (/Users/buildslave/jenkins/workspace/lldb-cmake-sanitized/lldb-build/bin/clang-11-x86_64) :: test_qThreadInfo_matches_qC_launch_debugserver (TestLldbGdbServer.LldbGdbServerTestCase) runCmd: settings clear -all output:

Hide Details

runCmd: settings set symbols.enable-external-lookup false output:

Hide Details

runCmd: settings set target.auto-apply-fixits false output:

Hide Details

runCmd: settings set plugin.process.gdb-remote.packet-timeout 60 output:

Hide Details

runCmd: settings set symbols.clang-modules-cache-path "/Users/buildslave/jenkins/workspace/lldb-cmake-sanitized/lldb-build/lldb-test-build.noindex/module-cache-lldb/lldb-api" output:

Hide Details

runCmd: settings set use-color false output:

Hide Details

runCmd: setting set target.prefer-dynamic-value no-dynamic-values output:

Hide Details

runCmd: settings set target.env-vars ASAN_OPTIONS=detect_stack_use_after_return=1 DYLD_INSERT_LIBRARIES=/Users/buildslave/jenkins/workspace/lldb-cmake-sanitized/host-compiler/lib/clang/11.0.0/lib/darwin/libclang_rt.asan_osx_dynamic.dylib output:

Hide Details

UNSUPPORTED: LLDB (/Users/buildslave/jenkins/workspace/lldb-cmake-sanitized/lldb-build/bin/clang-11-x86_64) :: test_qThreadInfo_matches_qC_launch_llgs (TestLldbGdbServer.LldbGdbServerTestCase) (llgs tests) runCmd: settings clear -all output:

Hide Details

runCmd: settings set symbols.enable-external-lookup false output:

Hide Details

runCmd: settings set target.auto-apply-fixits false output:

Hide Details

runCmd: settings set plugin.process.gdb-remote.packet-timeout 60 output:

Hide Details

runCmd: settings set symbols.clang-modules-cache-path "/Users/buildslave/jenkins/workspace/lldb-cmake-sanitized/lldb-build/lldb-test-build.noindex/module-cache-lldb/lldb-api" output:

Hide Details

runCmd: settings set use-color false output:

Hide Details

runCmd: setting set target.prefer-dynamic-value no-dynamic-values output:

Hide Details

runCmd: settings set target.env-vars ASAN_OPTIONS=detect_stack_use_after_return=1 DYLD_INSERT_LIBRARIES=/Users/buildslave/jenkins/workspace/lldb-cmake-sanitized/host-compiler/lib/clang/11.0.0/lib/darwin/libclang_rt.asan_osx_dynamic.dylib output:

Hide Details

Adding tearDown hook: def shutdown_named_pipe(): # Close the pipe. try: named_pipe.close() except: print("failed to close named pipe") None

Hide Details

# Delete the pipe. try: os.remove(named_pipe_path) except: print("failed to delete named pipe: {}".format(named_pipe_path)) None

Hide Details

# Delete the temp directory. try: os.rmdir(temp_dir) except: print( "failed to delete temp dir: {}, directory contents: '{}'".format( temp_dir, os.listdir(temp_dir))) None

Hide Details

Hide Details

Adding tearDown hook: def cleanupSubprocesses(self): # Ensure any subprocesses are cleaned up for p in self.subprocesses: p.terminate() del p del self.subprocesses[:] # Ensure any forked processes are cleaned up for pid in self.forkedProcessPids: try: os.kill(pid, signal.SIGTERM) except OSError: pass

Hide Details

Hide Details

Adding tearDown hook: def shutdown_debug_monitor(): try: server.terminate() except: logger.warning( "failed to terminate server for debug monitor: {}; ignoring".format( sys.exc_info()[0]))

Hide Details

Hide Details

Adding tearDown hook: def shutdown_socket(): if sock: try: # send the kill packet so lldb-server shuts down gracefully sock.sendall(GdbRemoteTestCaseBase._GDBREMOTE_KILL_PACKET) except: logger.warning( "failed to send kill packet to debug monitor: {}; ignoring".format( sys.exc_info()[0]))

Hide Details

try: sock.close() except: logger.warning( "failed to close socket to debug monitor: {}; ignoring".format( sys.exc_info()[0]))

Hide Details

Hide Details

FAIL: LLDB (/Users/buildslave/jenkins/workspace/lldb-cmake-sanitized/lldb-build/bin/clang-11-x86_64) :: test_software_breakpoint_set_and_remove_work_debugserver (TestLldbGdbServer.LldbGdbServerTestCase) Executing tearDown hook: def shutdown_socket(): if sock: try: # send the kill packet so lldb-server shuts down gracefully sock.sendall(GdbRemoteTestCaseBase._GDBREMOTE_KILL_PACKET) except: logger.warning( "failed to send kill packet to debug monitor: {}; ignoring".format( sys.exc_info()[0]))

Hide Details

try: sock.close() except: logger.warning( "failed to close socket to debug monitor: {}; ignoring".format( sys.exc_info()[0]))

Hide Details

Hide Details

2020-07-01 00:06:32,928 WARNING failed to send kill packet to debug monitor: <class 'TypeError'>; ignoring Executing tearDown hook: def shutdown_debug_monitor(): try: server.terminate() except: logger.warning( "failed to terminate server for debug monitor: {}; ignoring".format( sys.exc_info()[0]))

Hide Details

Hide Details

Executing tearDown hook: def cleanupSubprocesses(self): # Ensure any subprocesses are cleaned up for p in self.subprocesses: p.terminate() del p del self.subprocesses[:] # Ensure any forked processes are cleaned up for pid in self.forkedProcessPids: try: os.kill(pid, signal.SIGTERM) except OSError: pass

Hide Details

Hide Details

Executing tearDown hook: def shutdown_named_pipe(): # Close the pipe. try: named_pipe.close() except: print("failed to close named pipe") None

Hide Details

# Delete the pipe. try: os.remove(named_pipe_path) except: print("failed to delete named pipe: {}".format(named_pipe_path)) None

Hide Details

# Delete the temp directory. try: os.rmdir(temp_dir) except: print( "failed to delete temp dir: {}, directory contents: '{}'".format( temp_dir, os.listdir(temp_dir))) None

Hide Details

Hide Details

runCmd: settings clear -all output:

Hide Details

runCmd: settings set symbols.enable-external-lookup false output:

Hide Details

runCmd: settings set target.auto-apply-fixits false output:

Hide Details

runCmd: settings set plugin.process.gdb-remote.packet-timeout 60 output:

Hide Details

runCmd: settings set symbols.clang-modules-cache-path "/Users/buildslave/jenkins/workspace/lldb-cmake-sanitized/lldb-build/lldb-test-build.noindex/module-cache-lldb/lldb-api" output:

Hide Details

runCmd: settings set use-color false output:

Hide Details

runCmd: setting set target.prefer-dynamic-value no-dynamic-values output:

Hide Details

runCmd: settings set target.env-vars ASAN_OPTIONS=detect_stack_use_after_return=1 DYLD_INSERT_LIBRARIES=/Users/buildslave/jenkins/workspace/lldb-cmake-sanitized/host-compiler/lib/clang/11.0.0/lib/darwin/libclang_rt.asan_osx_dynamic.dylib output:

Hide Details

UNSUPPORTED: LLDB (/Users/buildslave/jenkins/workspace/lldb-cmake-sanitized/lldb-build/bin/clang-11-x86_64) :: test_software_breakpoint_set_and_remove_work_llgs (TestLldbGdbServer.LldbGdbServerTestCase) (llgs tests) runCmd: settings clear -all output:

Hide Details

runCmd: settings set symbols.enable-external-lookup false output:

Hide Details

runCmd: settings set target.auto-apply-fixits false output:

Hide Details

runCmd: settings set plugin.process.gdb-remote.packet-timeout 60 output:

Hide Details

runCmd: settings set symbols.clang-modules-cache-path "/Users/buildslave/jenkins/workspace/lldb-cmake-sanitized/lldb-build/lldb-test-build.noindex/module-cache-lldb/lldb-api" output:

Hide Details

runCmd: settings set use-color false output:

Hide Details

runCmd: setting set target.prefer-dynamic-value no-dynamic-values output:

Hide Details

runCmd: settings set target.env-vars ASAN_OPTIONS=detect_stack_use_after_return=1 DYLD_INSERT_LIBRARIES=/Users/buildslave/jenkins/workspace/lldb-cmake-sanitized/host-compiler/lib/clang/11.0.0/lib/darwin/libclang_rt.asan_osx_dynamic.dylib output:

Hide Details

Adding tearDown hook: def shutdown_named_pipe(): # Close the pipe. try: named_pipe.close() except: print("failed to close named pipe") None

Hide Details

# Delete the pipe. try: os.remove(named_pipe_path) except: print("failed to delete named pipe: {}".format(named_pipe_path)) None

Hide Details

# Delete the temp directory. try: os.rmdir(temp_dir) except: print( "failed to delete temp dir: {}, directory contents: '{}'".format( temp_dir, os.listdir(temp_dir))) None

Hide Details

Hide Details

Adding tearDown hook: def cleanupSubprocesses(self): # Ensure any subprocesses are cleaned up for p in self.subprocesses: p.terminate() del p del self.subprocesses[:] # Ensure any forked processes are cleaned up for pid in self.forkedProcessPids: try: os.kill(pid, signal.SIGTERM) except OSError: pass

Hide Details

Hide Details

Adding tearDown hook: def shutdown_debug_monitor(): try: server.terminate() except: logger.warning( "failed to terminate server for debug monitor: {}; ignoring".format( sys.exc_info()[0]))

Hide Details

Hide Details

Adding tearDown hook: def shutdown_socket(): if sock: try: # send the kill packet so lldb-server shuts down gracefully sock.sendall(GdbRemoteTestCaseBase._GDBREMOTE_KILL_PACKET) except: logger.warning( "failed to send kill packet to debug monitor: {}; ignoring".format( sys.exc_info()[0]))

Hide Details

try: sock.close() except: logger.warning( "failed to close socket to debug monitor: {}; ignoring".format( sys.exc_info()[0]))

Hide Details

Hide Details

Executing tearDown hook: def shutdown_socket(): if sock: try: # send the kill packet so lldb-server shuts down gracefully sock.sendall(GdbRemoteTestCaseBase._GDBREMOTE_KILL_PACKET) except: logger.warning( "failed to send kill packet to debug monitor: {}; ignoring".format( sys.exc_info()[0]))

Hide Details

try: sock.close() except: logger.warning( "failed to close socket to debug monitor: {}; ignoring".format( sys.exc_info()[0]))

Hide Details

Hide Details

2020-07-01 00:06:33,255 WARNING failed to send kill packet to debug monitor: <class 'TypeError'>; ignoring Executing tearDown hook: def shutdown_debug_monitor(): try: server.terminate() except: logger.warning( "failed to terminate server for debug monitor: {}; ignoring".format( sys.exc_info()[0]))

Hide Details

Hide Details

Executing tearDown hook: def cleanupSubprocesses(self): # Ensure any subprocesses are cleaned up for p in self.subprocesses: p.terminate() del p del self.subprocesses[:] # Ensure any forked processes are cleaned up for pid in self.forkedProcessPids: try: os.kill(pid, signal.SIGTERM) except OSError: pass

Hide Details

Hide Details

Executing tearDown hook: def shutdown_named_pipe(): # Close the pipe. try: named_pipe.close() except: print("failed to close named pipe") None

Hide Details

# Delete the pipe. try: os.remove(named_pipe_path) except: print("failed to delete named pipe: {}".format(named_pipe_path)) None

Hide Details

# Delete the temp directory. try: os.rmdir(temp_dir) except: print( "failed to delete temp dir: {}, directory contents: '{}'".format( temp_dir, os.listdir(temp_dir))) None

Hide Details

Hide Details

PASS: LLDB (/Users/buildslave/jenkins/workspace/lldb-cmake-sanitized/lldb-build/bin/clang-11-x86_64) :: test_start_no_ack_mode_debugserver (TestLldbGdbServer.LldbGdbServerTestCase) runCmd: settings clear -all output:

Hide Details

runCmd: settings set symbols.enable-external-lookup false output:

Hide Details

runCmd: settings set target.auto-apply-fixits false output:

Hide Details

runCmd: settings set plugin.process.gdb-remote.packet-timeout 60 output:

Hide Details

runCmd: settings set symbols.clang-modules-cache-path "/Users/buildslave/jenkins/workspace/lldb-cmake-sanitized/lldb-build/lldb-test-build.noindex/module-cache-lldb/lldb-api" output:

Hide Details

runCmd: settings set use-color false output:

Hide Details

runCmd: setting set target.prefer-dynamic-value no-dynamic-values output:

Hide Details

runCmd: settings set target.env-vars ASAN_OPTIONS=detect_stack_use_after_return=1 DYLD_INSERT_LIBRARIES=/Users/buildslave/jenkins/workspace/lldb-cmake-sanitized/host-compiler/lib/clang/11.0.0/lib/darwin/libclang_rt.asan_osx_dynamic.dylib output:

Hide Details

UNSUPPORTED: LLDB (/Users/buildslave/jenkins/workspace/lldb-cmake-sanitized/lldb-build/bin/clang-11-x86_64) :: test_start_no_ack_mode_llgs (TestLldbGdbServer.LldbGdbServerTestCase) (llgs tests) runCmd: settings clear -all output:

Hide Details

runCmd: settings set symbols.enable-external-lookup false output:

Hide Details

runCmd: settings set target.auto-apply-fixits false output:

Hide Details

runCmd: settings set plugin.process.gdb-remote.packet-timeout 60 output:

Hide Details

runCmd: settings set symbols.clang-modules-cache-path "/Users/buildslave/jenkins/workspace/lldb-cmake-sanitized/lldb-build/lldb-test-build.noindex/module-cache-lldb/lldb-api" output:

Hide Details

runCmd: settings set use-color false output:

Hide Details

runCmd: setting set target.prefer-dynamic-value no-dynamic-values output:

Hide Details

runCmd: settings set target.env-vars ASAN_OPTIONS=detect_stack_use_after_return=1 DYLD_INSERT_LIBRARIES=/Users/buildslave/jenkins/workspace/lldb-cmake-sanitized/host-compiler/lib/clang/11.0.0/lib/darwin/libclang_rt.asan_osx_dynamic.dylib output:

Hide Details

Adding tearDown hook: def shutdown_named_pipe(): # Close the pipe. try: named_pipe.close() except: print("failed to close named pipe") None

Hide Details

# Delete the pipe. try: os.remove(named_pipe_path) except: print("failed to delete named pipe: {}".format(named_pipe_path)) None

Hide Details

# Delete the temp directory. try: os.rmdir(temp_dir) except: print( "failed to delete temp dir: {}, directory contents: '{}'".format( temp_dir, os.listdir(temp_dir))) None

Hide Details

Hide Details

Adding tearDown hook: def cleanupSubprocesses(self): # Ensure any subprocesses are cleaned up for p in self.subprocesses: p.terminate() del p del self.subprocesses[:] # Ensure any forked processes are cleaned up for pid in self.forkedProcessPids: try: os.kill(pid, signal.SIGTERM) except OSError: pass

Hide Details

Hide Details

Adding tearDown hook: def shutdown_debug_monitor(): try: server.terminate() except: logger.warning( "failed to terminate server for debug monitor: {}; ignoring".format( sys.exc_info()[0]))

Hide Details

Hide Details

Adding tearDown hook: def shutdown_socket(): if sock: try: # send the kill packet so lldb-server shuts down gracefully sock.sendall(GdbRemoteTestCaseBase._GDBREMOTE_KILL_PACKET) except: logger.warning( "failed to send kill packet to debug monitor: {}; ignoring".format( sys.exc_info()[0]))

Hide Details

try: sock.close() except: logger.warning( "failed to close socket to debug monitor: {}; ignoring".format( sys.exc_info()[0]))

Hide Details

Hide Details

Executing tearDown hook: def shutdown_socket(): if sock: try: # send the kill packet so lldb-server shuts down gracefully sock.sendall(GdbRemoteTestCaseBase._GDBREMOTE_KILL_PACKET) except: logger.warning( "failed to send kill packet to debug monitor: {}; ignoring".format( sys.exc_info()[0]))

Hide Details

try: sock.close() except: logger.warning( "failed to close socket to debug monitor: {}; ignoring".format( sys.exc_info()[0]))

Hide Details

Hide Details

2020-07-01 00:06:33,587 WARNING failed to send kill packet to debug monitor: <class 'TypeError'>; ignoring Executing tearDown hook: def shutdown_debug_monitor(): try: server.terminate() except: logger.warning( "failed to terminate server for debug monitor: {}; ignoring".format( sys.exc_info()[0]))

Hide Details

Hide Details

Executing tearDown hook: def cleanupSubprocesses(self): # Ensure any subprocesses are cleaned up for p in self.subprocesses: p.terminate() del p del self.subprocesses[:] # Ensure any forked processes are cleaned up for pid in self.forkedProcessPids: try: os.kill(pid, signal.SIGTERM) except OSError: pass

Hide Details

Hide Details

Executing tearDown hook: def shutdown_named_pipe(): # Close the pipe. try: named_pipe.close() except: print("failed to close named pipe") None

Hide Details

# Delete the pipe. try: os.remove(named_pipe_path) except: print("failed to delete named pipe: {}".format(named_pipe_path)) None

Hide Details

# Delete the temp directory. try: os.rmdir(temp_dir) except: print( "failed to delete temp dir: {}, directory contents: '{}'".format( temp_dir, os.listdir(temp_dir))) None

Hide Details

Hide Details

PASS: LLDB (/Users/buildslave/jenkins/workspace/lldb-cmake-sanitized/lldb-build/bin/clang-11-x86_64) :: test_thread_suffix_supported_debugserver (TestLldbGdbServer.LldbGdbServerTestCase) runCmd: settings clear -all output:

Hide Details

runCmd: settings set symbols.enable-external-lookup false output:

Hide Details

runCmd: settings set target.auto-apply-fixits false output:

Hide Details

runCmd: settings set plugin.process.gdb-remote.packet-timeout 60 output:

Hide Details

runCmd: settings set symbols.clang-modules-cache-path "/Users/buildslave/jenkins/workspace/lldb-cmake-sanitized/lldb-build/lldb-test-build.noindex/module-cache-lldb/lldb-api" output:

Hide Details

runCmd: settings set use-color false output:

Hide Details

runCmd: setting set target.prefer-dynamic-value no-dynamic-values output:

Hide Details

runCmd: settings set target.env-vars ASAN_OPTIONS=detect_stack_use_after_return=1 DYLD_INSERT_LIBRARIES=/Users/buildslave/jenkins/workspace/lldb-cmake-sanitized/host-compiler/lib/clang/11.0.0/lib/darwin/libclang_rt.asan_osx_dynamic.dylib output:

Hide Details

UNSUPPORTED: LLDB (/Users/buildslave/jenkins/workspace/lldb-cmake-sanitized/lldb-build/bin/clang-11-x86_64) :: test_thread_suffix_supported_llgs (TestLldbGdbServer.LldbGdbServerTestCase) (llgs tests) runCmd: settings clear -all output:

Hide Details

runCmd: settings set symbols.enable-external-lookup false output:

Hide Details

runCmd: settings set target.auto-apply-fixits false output:

Hide Details

runCmd: settings set plugin.process.gdb-remote.packet-timeout 60 output:

Hide Details

runCmd: settings set symbols.clang-modules-cache-path "/Users/buildslave/jenkins/workspace/lldb-cmake-sanitized/lldb-build/lldb-test-build.noindex/module-cache-lldb/lldb-api" output:

Hide Details

runCmd: settings set use-color false output:

Hide Details

runCmd: setting set target.prefer-dynamic-value no-dynamic-values output:

Hide Details

runCmd: settings set target.env-vars ASAN_OPTIONS=detect_stack_use_after_return=1 DYLD_INSERT_LIBRARIES=/Users/buildslave/jenkins/workspace/lldb-cmake-sanitized/host-compiler/lib/clang/11.0.0/lib/darwin/libclang_rt.asan_osx_dynamic.dylib output:

Hide Details

Adding tearDown hook: def shutdown_named_pipe(): # Close the pipe. try: named_pipe.close() except: print("failed to close named pipe") None

Hide Details

# Delete the pipe. try: os.remove(named_pipe_path) except: print("failed to delete named pipe: {}".format(named_pipe_path)) None

Hide Details

# Delete the temp directory. try: os.rmdir(temp_dir) except: print( "failed to delete temp dir: {}, directory contents: '{}'".format( temp_dir, os.listdir(temp_dir))) None

Hide Details

Hide Details

Adding tearDown hook: def cleanupSubprocesses(self): # Ensure any subprocesses are cleaned up for p in self.subprocesses: p.terminate() del p del self.subprocesses[:] # Ensure any forked processes are cleaned up for pid in self.forkedProcessPids: try: os.kill(pid, signal.SIGTERM) except OSError: pass

Hide Details

Hide Details

Adding tearDown hook: def shutdown_debug_monitor(): try: server.terminate() except: logger.warning( "failed to terminate server for debug monitor: {}; ignoring".format( sys.exc_info()[0]))

Hide Details

Hide Details

Adding tearDown hook: def shutdown_socket(): if sock: try: # send the kill packet so lldb-server shuts down gracefully sock.sendall(GdbRemoteTestCaseBase._GDBREMOTE_KILL_PACKET) except: logger.warning( "failed to send kill packet to debug monitor: {}; ignoring".format( sys.exc_info()[0]))

Hide Details

try: sock.close() except: logger.warning( "failed to close socket to debug monitor: {}; ignoring".format( sys.exc_info()[0]))

Hide Details

Hide Details

Executing tearDown hook: def shutdown_socket(): if sock: try: # send the kill packet so lldb-server shuts down gracefully sock.sendall(GdbRemoteTestCaseBase._GDBREMOTE_KILL_PACKET) except: logger.warning( "failed to send kill packet to debug monitor: {}; ignoring".format( sys.exc_info()[0]))

Hide Details

try: sock.close() except: logger.warning( "failed to close socket to debug monitor: {}; ignoring".format( sys.exc_info()[0]))

Hide Details

Hide Details

2020-07-01 00:06:43,442 WARNING failed to send kill packet to debug monitor: <class 'TypeError'>; ignoring Executing tearDown hook: def shutdown_debug_monitor(): try: server.terminate() except: logger.warning( "failed to terminate server for debug monitor: {}; ignoring".format( sys.exc_info()[0]))

Hide Details

Hide Details

Executing tearDown hook: def cleanupSubprocesses(self): # Ensure any subprocesses are cleaned up for p in self.subprocesses: p.terminate() del p del self.subprocesses[:] # Ensure any forked processes are cleaned up for pid in self.forkedProcessPids: try: os.kill(pid, signal.SIGTERM) except OSError: pass

Hide Details

Hide Details

Executing tearDown hook: def shutdown_named_pipe(): # Close the pipe. try: named_pipe.close() except: print("failed to close named pipe") None

Hide Details

# Delete the pipe. try: os.remove(named_pipe_path) except: print("failed to delete named pipe: {}".format(named_pipe_path)) None

Hide Details

# Delete the temp directory. try: os.rmdir(temp_dir) except: print( "failed to delete temp dir: {}, directory contents: '{}'".format( temp_dir, os.listdir(temp_dir))) None

Hide Details

Hide Details

PASS: LLDB (/Users/buildslave/jenkins/workspace/lldb-cmake-sanitized/lldb-build/bin/clang-11-x86_64) :: test_written_M_content_reads_back_correctly_debugserver (TestLldbGdbServer.LldbGdbServerTestCase) runCmd: settings clear -all output:

Hide Details

runCmd: settings set symbols.enable-external-lookup false output:

Hide Details

runCmd: settings set target.auto-apply-fixits false output:

Hide Details

runCmd: settings set plugin.process.gdb-remote.packet-timeout 60 output:

Hide Details

runCmd: settings set symbols.clang-modules-cache-path "/Users/buildslave/jenkins/workspace/lldb-cmake-sanitized/lldb-build/lldb-test-build.noindex/module-cache-lldb/lldb-api" output:

Hide Details

runCmd: settings set use-color false output:

Hide Details

runCmd: setting set target.prefer-dynamic-value no-dynamic-values output:

Hide Details

runCmd: settings set target.env-vars ASAN_OPTIONS=detect_stack_use_after_return=1 DYLD_INSERT_LIBRARIES=/Users/buildslave/jenkins/workspace/lldb-cmake-sanitized/host-compiler/lib/clang/11.0.0/lib/darwin/libclang_rt.asan_osx_dynamic.dylib output:

Hide Details

UNSUPPORTED: LLDB (/Users/buildslave/jenkins/workspace/lldb-cmake-sanitized/lldb-build/bin/clang-11-x86_64) :: test_written_M_content_reads_back_correctly_llgs (TestLldbGdbServer.LldbGdbServerTestCase) (llgs tests) Restore dir to: /Users/buildslave/jenkins/workspace/lldb-cmake-sanitized/lldb-build/tools/lldb/test ====================================================================== FAIL: test_P_and_p_thread_suffix_work_debugserver (TestLldbGdbServer.LldbGdbServerTestCase) ---------------------------------------------------------------------- Traceback (most recent call last): File "/Users/buildslave/jenkins/workspace/lldb-cmake-sanitized/llvm-project/lldb/packages/Python/lldbsuite/test/decorators.py", line 140, in wrapper func(*args, **kwargs) File "/Users/buildslave/jenkins/workspace/lldb-cmake-sanitized/llvm-project/lldb/test/API/tools/lldb-server/TestLldbGdbServer.py", line 1579, in test_P_and_p_thread_suffix_work_debugserver self.P_and_p_thread_suffix_work() File "/Users/buildslave/jenkins/workspace/lldb-cmake-sanitized/llvm-project/lldb/test/API/tools/lldb-server/TestLldbGdbServer.py", line 1474, in P_and_p_thread_suffix_work process_info = self.parse_process_info_response(context) File "/Users/buildslave/jenkins/workspace/lldb-cmake-sanitized/llvm-project/lldb/packages/Python/lldbsuite/test/tools/lldb-server/gdbremote_testcase.py", line 711, in parse_process_info_response self.assertTrue(key in self._KNOWN_PROCESS_INFO_KEYS) AssertionError: False is not True Config=x86_64-/Users/buildslave/jenkins/workspace/lldb-cmake-sanitized/lldb-build/bin/clang-11 ====================================================================== FAIL: test_P_writes_all_gpr_registers_debugserver (TestLldbGdbServer.LldbGdbServerTestCase) ---------------------------------------------------------------------- Traceback (most recent call last): File "/Users/buildslave/jenkins/workspace/lldb-cmake-sanitized/llvm-project/lldb/packages/Python/lldbsuite/test/decorators.py", line 140, in wrapper func(*args, **kwargs) File "/Users/buildslave/jenkins/workspace/lldb-cmake-sanitized/llvm-project/lldb/test/API/tools/lldb-server/TestLldbGdbServer.py", line 1454, in test_P_writes_all_gpr_registers_debugserver self.P_writes_all_gpr_registers() File "/Users/buildslave/jenkins/workspace/lldb-cmake-sanitized/llvm-project/lldb/test/API/tools/lldb-server/TestLldbGdbServer.py", line 1429, in P_writes_all_gpr_registers process_info = self.parse_process_info_response(context) File "/Users/buildslave/jenkins/workspace/lldb-cmake-sanitized/llvm-project/lldb/packages/Python/lldbsuite/test/tools/lldb-server/gdbremote_testcase.py", line 711, in parse_process_info_response self.assertTrue(key in self._KNOWN_PROCESS_INFO_KEYS) AssertionError: False is not True Config=x86_64-/Users/buildslave/jenkins/workspace/lldb-cmake-sanitized/lldb-build/bin/clang-11 ====================================================================== FAIL: test_software_breakpoint_set_and_remove_work_debugserver (TestLldbGdbServer.LldbGdbServerTestCase) ---------------------------------------------------------------------- Traceback (most recent call last): File "/Users/buildslave/jenkins/workspace/lldb-cmake-sanitized/llvm-project/lldb/packages/Python/lldbsuite/test/decorators.py", line 140, in wrapper func(*args, **kwargs) File "/Users/buildslave/jenkins/workspace/lldb-cmake-sanitized/llvm-project/lldb/test/API/tools/lldb-server/TestLldbGdbServer.py", line 1266, in test_software_breakpoint_set_and_remove_work_debugserver self.breakpoint_set_and_remove_work(want_hardware=False) File "/Users/buildslave/jenkins/workspace/lldb-cmake-sanitized/llvm-project/lldb/test/API/tools/lldb-server/TestLldbGdbServer.py", line 1154, in breakpoint_set_and_remove_work process_info = self.parse_process_info_response(context) File "/Users/buildslave/jenkins/workspace/lldb-cmake-sanitized/llvm-project/lldb/packages/Python/lldbsuite/test/tools/lldb-server/gdbremote_testcase.py", line 711, in parse_process_info_response self.assertTrue(key in self._KNOWN_PROCESS_INFO_KEYS) AssertionError: False is not True Config=x86_64-/Users/buildslave/jenkins/workspace/lldb-cmake-sanitized/lldb-build/bin/clang-11 ---------------------------------------------------------------------- Ran 65 tests in 347.390s

Hide Details

RESULT: FAILED (27 passes, 3 failures, 0 errors, 34 skipped, 1 expected failures, 0 unexpected successes)

Hide Details

--

Hide Details

******************** PASS: lldb-unit :: Utility/./UtilityTests/DeserializerTest.HasData (1470 of 2058) UNSUPPORTED: lldb-shell :: ObjectFile/ELF/minidebuginfo-no-lzma.yaml (1471 of 2058) PASS: lldb-unit :: Utility/./UtilityTests/ConstStringTest.UpdateMangledCounterpart (1472 of 2058) PASS: lldb-unit :: Utility/./UtilityTests/StringLexerTest.Next (1473 of 2058) PASS: lldb-unit :: ScriptInterpreter/Python/./ScriptInterpreterPythonTests/PythonDataObjectsTest.TestPythonString (1474 of 2058) PASS: lldb-api :: tools/lldb-server/TestGdbRemoteExitCode.py (1475 of 2058) PASS: lldb-unit :: Utility/./UtilityTests/StreamTeeTest.Write (1476 of 2058) PASS: lldb-api :: python_api/findvalue_duplist/TestSBFrameFindValue.py (1477 of 2058) PASS: lldb-unit :: ScriptInterpreter/Python/./ScriptInterpreterPythonTests/PythonDataObjectsTest.TestPythonTupleToStructuredList (1478 of 2058) PASS: lldb-unit :: Language/Highlighting/./HighlighterTests/HighlighterTest.ClangCursorPosEndOfLine (1479 of 2058) PASS: lldb-api :: functionalities/data-formatter/data-formatter-stl/libcxx/optional/TestDataFormatterLibcxxOptional.py (1480 of 2058) PASS: lldb-unit :: Utility/./UtilityTests/StringExtractorTest.GetHexU8_Extra_NoEof (1481 of 2058) UNSUPPORTED: lldb-api :: functionalities/process_save_core/TestProcessSaveCore.py (1482 of 2058) PASS: lldb-unit :: Utility/./UtilityTests/CompletionRequest.DuplicateFilteringWithComments (1483 of 2058) PASS: lldb-unit :: Utility/./UtilityTests/StringListTest.SplitIntoLines (1484 of 2058) PASS: lldb-api :: functionalities/thread/concurrent_events/TestConcurrentDelaySignalWatch.py (1485 of 2058) PASS: lldb-unit :: Utility/./UtilityTests/FileSpecTest.GetPath (1486 of 2058) PASS: lldb-api :: functionalities/thread/concurrent_events/TestConcurrentTwoBreakpointsOneDelaySignal.py (1487 of 2058) PASS: lldb-api :: functionalities/dynamic_value_child_count/TestDynamicValueChildCount.py (1488 of 2058) PASS: lldb-api :: lang/c/forward/TestForwardDeclaration.py (1489 of 2058) PASS: lldb-unit :: Utility/./UtilityTests/BinaryStreamTest.PutSLEB128Zero (1490 of 2058) UNSUPPORTED: lldb-shell :: SymbolFile/NativePDB/typedefs.cpp (1491 of 2058) PASS: lldb-unit :: Language/Highlighting/./HighlighterTests/HighlighterTest.ClangBraces (1492 of 2058) PASS: lldb-api :: functionalities/data-formatter/dump_dynamic/TestDumpDynamic.py (1493 of 2058) PASS: lldb-shell :: Reproducer/TestDump.test (1494 of 2058) PASS: lldb-unit :: UnwindAssembly/x86/./UnwindAssemblyx86Tests/Testx86AssemblyInspectionEngine.TestLEAVE (1495 of 2058) PASS: lldb-api :: python_api/target/TestTargetAPI.py (1496 of 2058) PASS: lldb-api :: functionalities/unwind/noreturn/module-end/TestNoReturnModuleEnd.py (1497 of 2058) PASS: lldb-api :: functionalities/gdb_remote_client/TestGDBRemoteClient.py (1498 of 2058) PASS: lldb-api :: functionalities/data-formatter/data-formatter-advanced/TestDataFormatterAdv.py (1499 of 2058) PASS: lldb-unit :: ObjectFile/Breakpad/./ObjectFileBreakpadTests/FileRecord.parse (1500 of 2058) PASS: lldb-api :: driver/batch_mode/TestBatchMode.py (1501 of 2058) PASS: lldb-unit :: Utility/./UtilityTests/StreamTest.PutBytesAsRawHex8ToMixedEndian (1502 of 2058) PASS: lldb-unit :: Utility/./UtilityTests/UriParserTest.Empty (1503 of 2058) PASS: lldb-shell :: Expr/TestIRMemoryMap.test (1504 of 2058) UNSUPPORTED: lldb-shell :: ExecControl/StopHook/stop-hook-threads.test (1505 of 2058) UNSUPPORTED: lldb-api :: functionalities/exec/TestExec.py (1506 of 2058) PASS: lldb-api :: lang/objc/objc-static-method/TestObjCStaticMethod.py (1507 of 2058) PASS: lldb-unit :: Utility/./UtilityTests/ConstStringTest.MangledCounterpart (1508 of 2058) PASS: lldb-unit :: Utility/./UtilityTests/StreamTeeTest.Flush (1509 of 2058) PASS: lldb-unit :: Expression/./ExpressionTests/DiagnosticManagerTest.AppendMessageAttachToLastDiag (1510 of 2058) PASS: lldb-unit :: Host/./HostTests/SocketTest.TCPListen0GetPort (1511 of 2058) PASS: lldb-unit :: Utility/./UtilityTests/ProcessInstanceInfo.Dump (1512 of 2058) PASS: lldb-api :: functionalities/postmortem/wow64_minidump/TestWow64MiniDump.py (1513 of 2058) UNSUPPORTED: lldb-api :: functionalities/thread/state/TestThreadStates.py (1514 of 2058) PASS: lldb-api :: commands/gui/invalid-args/TestInvalidArgsGui.py (1515 of 2058) PASS: lldb-unit :: Host/./HostTests/HostInfoTest.GetAugmentedArchSpec (1516 of 2058) PASS: lldb-unit :: Utility/./UtilityTests/NameMatchesTest.EndsWith (1517 of 2058) PASS: lldb-shell :: ObjectFile/ELF/netbsd-core-amd64.test (1518 of 2058) PASS: lldb-unit :: Utility/./UtilityTests/ScalarTest.RightShiftOperator (1519 of 2058) PASS: lldb-unit :: ScriptInterpreter/Python/./ScriptInterpreterPythonTests/PythonDataObjectsTest.TestPythonDictionaryManipulation (1520 of 2058) PASS: lldb-api :: commands/expression/top-level/TestTopLevelExprs.py (1521 of 2058) PASS: lldb-unit :: Utility/./UtilityTests/XcodeSDKTest.SDKSupportsModules (1522 of 2058) PASS: lldb-unit :: UnwindAssembly/x86/./UnwindAssemblyx86Tests/Testx86AssemblyInspectionEngine.TestPushEDI (1523 of 2058) PASS: lldb-api :: functionalities/gdb_remote_client/TestNoWatchpointSupportInfo.py (1524 of 2058) PASS: lldb-api :: commands/expression/import-std-module/unique_ptr-dbg-info-content/TestUniquePtrDbgInfoContent.py (1525 of 2058) PASS: lldb-unit :: SymbolFile/DWARF/./SymbolFileDWARFTests/SymbolFileDWARFTests.ParseArangesNonzeroSegmentSize (1526 of 2058) PASS: lldb-api :: functionalities/tail_call_frames/thread_step_out_message/TestArtificialFrameStepOutMessage.py (1527 of 2058) PASS: lldb-api :: functionalities/process_group/TestChangeProcessGroup.py (1528 of 2058) PASS: lldb-shell :: Commands/CommandScriptImmediateOutput/CommandScriptImmediateOutputConsole.test (1529 of 2058) PASS: lldb-api :: tools/lldb-server/inferior-crash/TestGdbRemoteAbort.py (1530 of 2058) PASS: lldb-unit :: Utility/./UtilityTests/StreamTest.SetIndentLevel (1531 of 2058) PASS: lldb-api :: lang/objc/single-entry-dictionary/TestObjCSingleEntryDictionary.py (1532 of 2058) PASS: lldb-unit :: Process/minidump/./LLDBMinidumpTests/MinidumpParserTest.GetPidWindows (1533 of 2058) PASS: lldb-api :: commands/expression/import-std-module/unique_ptr/TestUniquePtrFromStdModule.py (1534 of 2058) PASS: lldb-api :: commands/frame/diagnose/local-variable/TestLocalVariable.py (1535 of 2058) PASS: lldb-unit :: SymbolFile/DWARF/./SymbolFileDWARFTests/SymbolFileDWARFTests.TestAbilitiesForDWARF (1536 of 2058) PASS: lldb-shell :: ScriptInterpreter/Python/crashlog.test (1537 of 2058) PASS: lldb-api :: lang/c/shared_lib_stripped_symbols/TestSharedLibStrippedSymbols.py (1538 of 2058) UNSUPPORTED: lldb-shell :: ObjectFile/PECOFF/disassemble-thumb.yaml (1539 of 2058) PASS: lldb-unit :: Utility/./UtilityTests/Predicate.WaitForValueNotEqualTo (1540 of 2058) PASS: lldb-api :: functionalities/breakpoint/breakpoint_command/TestRegexpBreakCommand.py (1541 of 2058) PASS: lldb-api :: commands/expression/vector_of_enums/TestVectorOfEnums.py (1542 of 2058) PASS: lldb-api :: python_api/sbvalue_persist/TestSBValuePersist.py (1543 of 2058) PASS: lldb-shell :: ObjectFile/PECOFF/basic-info-arm64.yaml (1544 of 2058) UNSUPPORTED: lldb-api :: lang/objc/ptr_refs/TestPtrRefsObjC.py (1545 of 2058) PASS: lldb-api :: python_api/interpreter/TestRunCommandInterpreterAPI.py (1546 of 2058) PASS: lldb-unit :: Utility/./UtilityTests/StreamTest.ShiftOperatorPtr (1547 of 2058) UNSUPPORTED: lldb-api :: benchmarks/frame_variable/TestFrameVariableResponse.py (1548 of 2058) UNSUPPORTED: lldb-shell :: Register/x86-gp-write.test (1549 of 2058) PASS: lldb-unit :: UnwindAssembly/x86/./UnwindAssemblyx86Tests/Testx86AssemblyInspectionEngine.TestPushEBX (1550 of 2058) PASS: lldb-unit :: Utility/./UtilityTests/ConstStringTest.CompareConstString (1551 of 2058) PASS: lldb-shell :: ObjectFile/ELF/avr-basic-info.yaml (1552 of 2058) PASS: lldb-unit :: Utility/./UtilityTests/XcodeSDKTest.SDKSupportsSwift (1553 of 2058) PASS: lldb-api :: tools/lldb-server/TestGdbRemoteHostInfo.py (1554 of 2058) PASS: lldb-api :: functionalities/gdb_remote_client/TestJLink6Armv7RegisterDefinition.py (1555 of 2058) PASS: lldb-api :: python_api/watchpoint/TestSetWatchpoint.py (1556 of 2058) PASS: lldb-api :: lang/objc/objc-checker/TestObjCCheckers.py (1557 of 2058) PASS: lldb-api :: commands/expression/completion-in-lambda-and-unnamed-class/TestCompletionInLambdaAndUnnamedClass.py (1558 of 2058) PASS: lldb-unit :: Expression/./ExpressionTests/CppModuleConfigurationTest.Linux (1559 of 2058) PASS: lldb-api :: functionalities/thread/state_after_expression/TestStateAfterExpression.py (1560 of 2058) PASS: lldb-api :: commands/command/script/TestCommandScript.py (1561 of 2058) PASS: lldb-shell :: SymbolFile/DWARF/dwp.s (1562 of 2058) PASS: lldb-unit :: Expression/./ExpressionTests/DWARFExpression.DW_OP_convert (1563 of 2058) PASS: lldb-unit :: SymbolFile/DWARF/./SymbolFileDWARFTests/XcodeSDKModuleTests.TestModuleGetXcodeSDK (1564 of 2058) PASS: lldb-shell :: ObjectFile/MachO/subsections.yaml (1565 of 2058) PASS: lldb-unit :: Utility/./UtilityTests/StreamTest.AddressSuffix (1566 of 2058) UNSUPPORTED: lldb-api :: functionalities/breakpoint/breakpoint_in_delayslot/TestAvoidBreakpointInDelaySlot.py (1567 of 2058) PASS: lldb-api :: functionalities/inferior-crashing/TestInferiorCrashingStep.py (1568 of 2058) UNSUPPORTED: lldb-api :: tools/lldb-server/TestGdbRemoteModuleInfo.py (1569 of 2058) PASS: lldb-unit :: Utility/./UtilityTests/StreamTest.PutRawBytesToLittleEndian (1570 of 2058) PASS: lldb-unit :: Utility/./UtilityTests/OptionsWithRawTest.EmptyInput (1571 of 2058) UNSUPPORTED: lldb-api :: functionalities/darwin_log/filter/regex/activity-chain/TestDarwinLogFilterRegexActivityChain.py (1572 of 2058) PASS: lldb-unit :: UnwindAssembly/x86/./UnwindAssemblyx86Tests/Testx86AssemblyInspectionEngine.TestPushImm (1573 of 2058) PASS: lldb-unit :: Expression/./ExpressionTests/CppModuleConfigurationTest.IgnoreLibStdCpp (1574 of 2058) PASS: lldb-unit :: Utility/./UtilityTests/ProcessInstanceInfo.DumpTable (1575 of 2058) PASS: lldb-api :: functionalities/data-formatter/var-in-aggregate-misuse/TestVarInAggregateMisuse.py (1576 of 2058) PASS: lldb-unit :: SymbolFile/NativePDB/./SymbolFileNativePDBTests/PDBFPOProgramToDWARFExpressionTests.UnresolvedRegisterAssignmentReference (1577 of 2058) PASS: lldb-unit :: Target/./TargetTests/ExecutionContextTest.GetByteOrder (1578 of 2058) PASS: lldb-shell :: ScriptInterpreter/None/import_module.test (1579 of 2058) PASS: lldb-shell :: ObjectFile/Breakpad/breakpad-identification.test (1580 of 2058) PASS: lldb-api :: commands/watchpoints/watchpoint_commands/condition/TestWatchpointConditionCmd.py (1581 of 2058) PASS: lldb-api :: tools/lldb-vscode/launch/TestVSCode_launch.py (1582 of 2058) PASS: lldb-api :: lang/objc/foundation/TestSymbolTable.py (1583 of 2058) PASS: lldb-api :: lang/objc/objc-property/TestObjCProperty.py (1584 of 2058) PASS: lldb-api :: lang/cpp/unicode-literals/TestUnicodeLiterals.py (1585 of 2058) UNSUPPORTED: lldb-api :: functionalities/darwin_log/filter/regex/message/TestDarwinLogFilterRegexMessage.py (1586 of 2058) PASS: lldb-shell :: Settings/TestFrameFormatColor.test (1587 of 2058) PASS: lldb-unit :: SymbolFile/DWARF/./SymbolFileDWARFTests/SymbolFileDWARFTests.TestAbbrevOutOfOrder (1588 of 2058) PASS: lldb-api :: macosx/lc-note/kern-ver-str/TestKernVerStrLCNOTE.py (1589 of 2058) PASS: lldb-unit :: Process/gdb-remote/./ProcessGdbRemoteTests/GDBRemoteCommunicationClientTest.GetModulesInfoInvalidResponse (1590 of 2058) PASS: lldb-api :: lang/c/global_variables/TestGlobalVariables.py (1591 of 2058) PASS: lldb-api :: sample_test/TestSampleInlineTest.py (1592 of 2058) UNSUPPORTED: lldb-api :: arm/breakpoint-it/TestBreakpointIt.py (1593 of 2058) UNSUPPORTED: lldb-shell :: SymbolFile/DWARF/split-dwarf-expression-eval-bug.cpp (1594 of 2058) UNSUPPORTED: lldb-shell :: Reproducer/TestLuaImport.test (1595 of 2058) PASS: lldb-api :: commands/register/register/register_command/TestRegisters.py (1596 of 2058) PASS: lldb-unit :: Process/gdb-remote/./ProcessGdbRemoteTests/GDBRemoteClientBaseTest.SendContinueAndWait (1597 of 2058) PASS: lldb-api :: api/command-return-object/TestSBCommandReturnObject.py (1598 of 2058) PASS: lldb-api :: functionalities/data-formatter/data-formatter-stl/libcxx/map/TestDataFormatterLibccMap.py (1599 of 2058) UNSUPPORTED: lldb-shell :: Register/x86-ymm-read.test (1600 of 2058) PASS: lldb-unit :: Language/Highlighting/./HighlighterTests/HighlighterTest.ClangScalarLiterals (1601 of 2058) PASS: lldb-unit :: UnwindAssembly/x86/./UnwindAssemblyx86Tests/Testx86AssemblyInspectionEngine.TestPushEBP (1602 of 2058) PASS: lldb-api :: functionalities/plugins/python_os_plugin/stepping_plugin_threads/TestOSPluginStepping.py (1603 of 2058) PASS: lldb-shell :: ObjectFile/PECOFF/section-types.yaml (1604 of 2058) PASS: lldb-unit :: Utility/./UtilityTests/OptionsWithRawTest.LeadingSpaceArgs (1605 of 2058) PASS: lldb-api :: functionalities/data-formatter/data-formatter-objc/TestDataFormatterObjCKVO.py (1606 of 2058) PASS: lldb-unit :: Utility/./UtilityTests/StreamTeeTest.GetStreamAtIndexOutOfBounds (1607 of 2058) UNSUPPORTED: lldb-api :: functionalities/asan/TestMemoryHistory.py (1608 of 2058) PASS: lldb-shell :: SymbolFile/NativePDB/globals-fundamental.cpp (1609 of 2058) PASS: lldb-unit :: Utility/./UtilityTests/StringExtractorTest.GetHexU8_Exact (1610 of 2058) PASS: lldb-api :: commands/expression/import-std-module/forward_list/TestForwardListFromStdModule.py (1611 of 2058) PASS: lldb-unit :: Utility/./UtilityTests/StringListTest.Join (1612 of 2058) PASS: lldb-api :: functionalities/object-file/TestImageListMultiArchitecture.py (1613 of 2058) PASS: lldb-api :: lang/cpp/offsetof/TestOffsetofCpp.py (1614 of 2058) PASS: lldb-unit :: ScriptInterpreter/Python/./ScriptInterpreterPythonTests/PythonDataObjectsTest.TestPythonByteArray (1615 of 2058) PASS: lldb-api :: lang/cpp/stl/TestStdCXXDisassembly.py (1616 of 2058) UNSUPPORTED: lldb-api :: functionalities/data-formatter/data-formatter-stl/libstdcpp/vector/TestDataFormatterStdVector.py (1617 of 2058) PASS: lldb-api :: api/log/TestAPILog.py (1618 of 2058) PASS: lldb-api :: functionalities/data-formatter/vector-types/TestVectorTypesFormatting.py (1619 of 2058) PASS: lldb-unit :: Utility/./UtilityTests/BinaryStreamTest.PutSLEB128FiveBytes (1620 of 2058) PASS: lldb-unit :: Utility/./UtilityTests/StringExtractorTest.GetHexU8_Underflow (1621 of 2058) PASS: lldb-api :: functionalities/data-formatter/synthupdate/TestSyntheticFilterRecompute.py (1622 of 2058) PASS: lldb-unit :: Utility/./UtilityTests/NameMatchesTest.Contains (1623 of 2058) UNSUPPORTED: lldb-api :: functionalities/data-formatter/data-formatter-stl/libstdcpp/smart_ptr/TestDataFormatterStdSmartPtr.py (1624 of 2058) PASS: lldb-api :: lang/cpp/class_static/TestStaticVariables.py (1625 of 2058) PASS: lldb-unit :: Utility/./UtilityTests/ArgsTest.DoubleQuotedItem (1626 of 2058) UNSUPPORTED: lldb-api :: lang/cpp/function-template-parameter-pack/TestFunctionTemplateParameterPack.py (1627 of 2058) UNSUPPORTED: lldb-shell :: Register/x86-64-xmm16-write.test (1628 of 2058) PASS: lldb-unit :: Interpreter/./InterpreterTests/CompletionTest.FileCompletionAbsolute (1629 of 2058) PASS: lldb-api :: python_api/hello_world/TestHelloWorld.py (1630 of 2058) PASS: lldb-unit :: Utility/./UtilityTests/NameMatchesTest.StartsWith (1631 of 2058) PASS: lldb-unit :: Utility/./UtilityTests/SerializationRountripTest.SerializeDeserializePodPointers (1632 of 2058) PASS: lldb-api :: tools/lldb-server/register-reading/TestGdbRemoteGPacket.py (1633 of 2058) PASS: lldb-unit :: Utility/./UtilityTests/StringListTest.LongestCommonPrefixSingleElement (1634 of 2058) PASS: lldb-api :: functionalities/thread/concurrent_events/TestConcurrentDelayedCrashWithBreakpointWatchpoint.py (1635 of 2058) PASS: lldb-unit :: Utility/./UtilityTests/StringLexerTest.PutBack (1636 of 2058) PASS: lldb-shell :: Reproducer/TestSynchronous.test (1637 of 2058) PASS: lldb-unit :: Utility/./UtilityTests/PassiveReplayTest.InstrumentedFoo (1638 of 2058) PASS: lldb-unit :: Utility/./UtilityTests/StringExtractorTest.GetNameColonValueNoSemicolon (1639 of 2058) UNSUPPORTED: lldb-api :: lang/objc/foundation/TestFoundationDisassembly.py (1640 of 2058) PASS: lldb-api :: functionalities/thread/concurrent_events/TestConcurrentManyWatchpoints.py (1641 of 2058) PASS: lldb-unit :: Utility/./UtilityTests/StringLexerTest.HasAtLeast (1642 of 2058) UNSUPPORTED: lldb-shell :: Expr/TestIRMemoryMapWindows.test (1643 of 2058) PASS: lldb-api :: commands/apropos/with-process/TestAproposWithProcess.py (1644 of 2058) PASS: lldb-api :: commands/expression/test/TestExprs2.py (1645 of 2058) PASS: lldb-shell :: SymbolFile/Breakpad/line-table-discontinuous-file-ids.test (1646 of 2058) PASS: lldb-shell :: SymbolFile/DWARF/debug_loc.s (1647 of 2058) PASS: lldb-api :: commands/expression/codegen-crash-typedefdecl-not-in_declcontext/TestCodegenCrashTypedefDeclNotInDeclContext.py (1648 of 2058) PASS: lldb-unit :: UnwindAssembly/x86/./UnwindAssemblyx86Tests/Testx86AssemblyInspectionEngine.TestSpArithx86_64Augmented (1649 of 2058) PASS: lldb-api :: functionalities/data-formatter/array_typedef/TestArrayTypedef.py (1650 of 2058) PASS: lldb-api :: lang/cpp/thread_local/TestThreadLocal.py (1651 of 2058) PASS: lldb-unit :: Utility/./UtilityTests/ConstStringTest.format_provider (1652 of 2058) UNSUPPORTED: lldb-api :: functionalities/darwin_log/filter/regex/category/TestDarwinLogFilterRegexCategory.py (1653 of 2058) PASS: lldb-shell :: ObjectFile/wasm/basic.yaml (1654 of 2058) PASS: lldb-unit :: Utility/./UtilityTests/ScalarTest.Equality (1655 of 2058) PASS: lldb-api :: functionalities/data-formatter/data-formatter-script/TestDataFormatterScript.py (1656 of 2058) PASS: lldb-shell :: ObjectFile/Breakpad/sections.test (1657 of 2058) PASS: lldb-unit :: Symbol/./SymbolTests/TestClangASTImporter.CanImportInvalidType (1658 of 2058) PASS: lldb-api :: functionalities/gdb_remote_client/TestGDBRemoteLoad.py (1659 of 2058) PASS: lldb-api :: functionalities/data-formatter/stringprinter/TestStringPrinter.py (1660 of 2058) PASS: lldb-api :: functionalities/param_entry_vals/basic_entry_values/TestBasicEntryValues.py (1661 of 2058) PASS: lldb-unit :: Language/Highlighting/./HighlighterTests/HighlighterTest.ClangUnterminatedString (1662 of 2058) PASS: lldb-unit :: Utility/./UtilityTests/ArgsTest.ReplaceArgumentAtIndexOutOfRange (1663 of 2058) UNSUPPORTED: lldb-api :: functionalities/data-formatter/data-formatter-stl/libstdcpp/vbool/TestDataFormatterStdVBool.py (1664 of 2058) PASS: lldb-unit :: UnwindAssembly/x86/./UnwindAssemblyx86Tests/Testx86AssemblyInspectionEngine.TestSimple64bitFrameFunction (1665 of 2058) PASS: lldb-shell :: ObjectFile/ELF/minidebuginfo-corrupt-xz.yaml (1666 of 2058) PASS: lldb-unit :: UnwindAssembly/x86/./UnwindAssemblyx86Tests/Testx86AssemblyInspectionEngine.TestStackRealign8BitDisp_i386 (1667 of 2058) PASS: lldb-unit :: Utility/./UtilityTests/FileSpecTest.IsRelative (1668 of 2058) PASS: lldb-unit :: Host/./HostTests/ProcessLaunchInfoTest.Constructor (1669 of 2058) PASS: lldb-unit :: Expression/./ExpressionTests/CppModuleConfigurationTest.AmbiguousLibCpp (1670 of 2058) PASS: lldb-api :: commands/expression/import-std-module/sysroot/TestStdModuleSysroot.py (1671 of 2058) PASS: lldb-unit :: Utility/./UtilityTests/UriParserTest.LongPath (1672 of 2058) PASS: lldb-api :: commands/watchpoints/watchpoint_set_command/TestWatchLocationWithWatchSet.py (1673 of 2058) PASS: lldb-unit :: UnwindAssembly/x86/./UnwindAssemblyx86Tests/Testx86AssemblyInspectionEngine.TestPopR12 (1674 of 2058) PASS: lldb-api :: functionalities/breakpoint/objc/TestObjCBreakpoints.py (1675 of 2058) PASS: lldb-unit :: Symbol/./SymbolTests/TestClangASTImporter.MetadataPropagation (1676 of 2058) PASS: lldb-api :: functionalities/thread/concurrent_events/TestConcurrentDelaySignalBreak.py (1677 of 2058) PASS: lldb-shell :: ObjectFile/ELF/PT_TLS-overlap-PT_LOAD.yaml (1678 of 2058) PASS: lldb-unit :: Utility/./UtilityTests/StringListTest.InsertStringAtIndexStdString (1679 of 2058) PASS: lldb-unit :: Language/Highlighting/./HighlighterTests/HighlighterTest.ClangEmptyInput (1680 of 2058) PASS: lldb-unit :: UnwindAssembly/x86/./UnwindAssemblyx86Tests/Testx86AssemblyInspectionEngine.TestPopEBX (1681 of 2058) PASS: lldb-shell :: ScriptInterpreter/Python/sb_address_exception.test (1682 of 2058) UNSUPPORTED: lldb-shell :: SymbolFile/NativePDB/stack_unwinding01.cpp (1683 of 2058) PASS: lldb-unit :: Language/CPlusPlus/./LanguageCPlusPlusTests/CPlusPlusLanguage.FindAlternateFunctionManglings (1684 of 2058) UNSUPPORTED: lldb-api :: linux/add-symbols/TestTargetSymbolsAddCommand.py (1685 of 2058) PASS: lldb-unit :: Process/minidump/./LLDBMinidumpTests/RegisterContextMinidump.ConvertMinidumpContext_x86_32 (1686 of 2058) PASS: lldb-unit :: Signals/./SignalsTests/UnixSignalsTest.Iteration (1687 of 2058) PASS: lldb-unit :: Utility/./UtilityTests/BinaryStreamTest.PutULEB128TwoBytes (1688 of 2058) PASS: lldb-unit :: UnwindAssembly/x86/./UnwindAssemblyx86Tests/Testx86AssemblyInspectionEngine.Test32BitOnlyInstruction (1689 of 2058) PASS: lldb-unit :: Expression/./ExpressionTests/DiagnosticManagerTest.GetStringMultiline (1690 of 2058) PASS: lldb-unit :: Symbol/./SymbolTests/PostfixExpression.ToDWARF (1691 of 2058) PASS: lldb-unit :: Host/./HostTests/HostInfoTest.GetHostname (1692 of 2058) PASS: lldb-api :: lang/c/tls_globals/TestTlsGlobals.py (1693 of 2058) PASS: lldb-api :: functionalities/pre_run_dylibs/TestPreRunDylibs.py (1694 of 2058) PASS: lldb-api :: lang/c/conflicting-symbol/TestConflictingSymbol.py (1695 of 2058) PASS: lldb-api :: functionalities/type_completion/TestTypeCompletion.py (1696 of 2058) PASS: lldb-unit :: Utility/./UtilityTests/StreamTest.ShiftOperatorStrings (1697 of 2058) PASS: lldb-api :: lang/cpp/member-and-local-vars-with-same-name/TestMembersAndLocalsWithSameName.py (1698 of 2058) PASS: lldb-api :: functionalities/data-formatter/ptr_ref_typedef/TestPtrRef2Typedef.py (1699 of 2058) PASS: lldb-api :: functionalities/data-formatter/data-formatter-caching/TestDataFormatterCaching.py (1700 of 2058) PASS: lldb-unit :: UnwindAssembly/x86/./UnwindAssemblyx86Tests/Testx86AssemblyInspectionEngine.TestPopRBX (1701 of 2058) PASS: lldb-unit :: Utility/./UtilityTests/VMRange.Clear (1702 of 2058) PASS: lldb-shell :: Commands/command-script-import.test (1703 of 2058) PASS: lldb-api :: functionalities/load_unload/TestLoadUnload.py (1704 of 2058) PASS: lldb-shell :: Quit/TestQuitExitCode-30.test (1705 of 2058) PASS: lldb-api :: lang/c/local_types/TestUseClosestType.py (1706 of 2058) PASS: lldb-unit :: Utility/./UtilityTests/PassiveReplayTest.InstrumentedBarPtr (1707 of 2058) PASS: lldb-api :: python_api/default-constructor/TestDefaultConstructorForAPIObjects.py (1708 of 2058) PASS: lldb-api :: commands/settings/TestSettings.py (1709 of 2058) PASS: lldb-unit :: ScriptInterpreter/Python/./ScriptInterpreterPythonTests/PythonDataObjectsTest.TestPythonDictionaryToStructuredDictionary (1710 of 2058) PASS: lldb-api :: lang/objc/self/TestObjCSelf.py (1711 of 2058) PASS: lldb-api :: functionalities/data-formatter/type_summary_list_arg/TestTypeSummaryListArg.py (1712 of 2058) PASS: lldb-api :: functionalities/inferior-crashing/recursive-inferior/TestRecursiveInferior.py (1713 of 2058) PASS: lldb-shell :: Breakpoint/split-dwarf-5-addrbase.test (1714 of 2058) XFAIL: lldb-shell :: Register/x86-64-write.test (1715 of 2058) UNSUPPORTED: lldb-api :: tools/lldb-server/signal-filtering/TestGdbRemote_QPassSignals.py (1716 of 2058) PASS: lldb-unit :: Target/./TargetTests/ModuleCacheTest.GetAndPutUuidExists (1717 of 2058) PASS: lldb-shell :: SymbolFile/Breakpad/symtab-macho.test (1718 of 2058) PASS: lldb-unit :: ScriptInterpreter/Python/./ScriptInterpreterPythonTests/PythonDataObjectsTest.TestPythonListValueEquality (1719 of 2058) PASS: lldb-unit :: Utility/./UtilityTests/TildeExpressionResolver.ResolveFullPath (1720 of 2058) UNSUPPORTED: lldb-api :: tools/lldb-server/thread-name/TestGdbRemoteThreadName.py (1721 of 2058) PASS: lldb-shell :: Reproducer/TestVersionCheck.test (1722 of 2058) PASS: lldb-api :: commands/expression/regression-access-function-template-in-record/TestRegressionAccessFunctionTemplateInRecord.py (1723 of 2058) PASS: lldb-shell :: Expr/TestMultilineExpr.test (1724 of 2058) PASS: lldb-unit :: Utility/./UtilityTests/TimerTest.CategoryTimesNested (1725 of 2058) PASS: lldb-api :: lang/objc/modules/TestObjCModules.py (1726 of 2058) PASS: lldb-shell :: ScriptInterpreter/Python/eof.test (1727 of 2058) PASS: lldb-unit :: Symbol/./SymbolTests/DWARFCallFrameInfoTest.Basic_dwarf4 (1728 of 2058) UNSUPPORTED: lldb-shell :: Register/x86-64-ymm16-read.test (1729 of 2058) PASS: lldb-unit :: Process/./ProcessEventDataTests/ProcessEventDataTest.DoOnRemoval (1730 of 2058) PASS: lldb-unit :: Utility/./UtilityTests/GeneratorTest.Create (1731 of 2058) PASS: lldb-api :: python_api/file_handle/TestFileHandle.py (1732 of 2058) PASS: lldb-unit :: tools/lldb-server/tests/./LLDBServerTests/StandardStartupTest.TestStopReplyContainsThreadPcs (1733 of 2058) PASS: lldb-api :: commands/frame/diagnose/bad-reference/TestBadReference.py (1734 of 2058) PASS: lldb-shell :: Settings/TestDisassemblyFormat.test (1735 of 2058) PASS: lldb-unit :: Symbol/./SymbolTests/TestTypeSystemClang.TestOwningModule (1736 of 2058) PASS: lldb-unit :: UnwindAssembly/x86/./UnwindAssemblyx86Tests/Testx86AssemblyInspectionEngine.TestPopRBPWithREX (1737 of 2058) PASS: lldb-unit :: Utility/./UtilityTests/StringExtractorTest.GetHexU8_Underflow2_NoEof (1738 of 2058) PASS: lldb-api :: lang/cpp/frame-var-anon-unions/TestFrameVariableAnonymousUnions.py (1739 of 2058) PASS: lldb-unit :: Process/gdb-remote/./ProcessGdbRemoteTests/GDBRemoteCommunicationServerTest.SendErrorResponse_ErrorNumber (1740 of 2058) PASS: lldb-unit :: Utility/./UtilityTests/UriParserTest.SchemeHostSeparator2 (1741 of 2058) PASS: lldb-shell :: SymbolFile/NativePDB/break-by-line.cpp (1742 of 2058) PASS: lldb-shell :: Commands/CommandScriptImmediateOutput/CommandScriptImmediateOutputFile.test (1743 of 2058) PASS: lldb-unit :: Utility/./UtilityTests/StringExtractorTest.GetHexBytesAvail_OddPair (1744 of 2058) PASS: lldb-unit :: Process/gdb-remote/./ProcessGdbRemoteTests/GDBRemoteClientBaseTest.SendContinueAndAsyncPacket (1745 of 2058) UNSUPPORTED: lldb-shell :: Register/x86-zmm-write.test (1746 of 2058) PASS: lldb-shell :: Driver/TestFile.test (1747 of 2058) PASS: lldb-api :: functionalities/postmortem/elf-core/gcore/TestGCore.py (1748 of 2058) PASS: lldb-api :: commands/watchpoints/watchpoint_disable/TestWatchpointDisable.py (1749 of 2058) PASS: lldb-unit :: Utility/./UtilityTests/StringListTest.ShiftMove (1750 of 2058) PASS: lldb-unit :: Utility/./UtilityTests/StringListTest.AppendStringMove (1751 of 2058) PASS: lldb-api :: functionalities/data-formatter/data-formatter-stl/libcxx/variant/TestDataFormatterLibcxxVariant.py (1752 of 2058) PASS: lldb-unit :: Utility/./UtilityTests/AnsiTerminal.WhiteSpace (1753 of 2058) PASS: lldb-shell :: Settings/TestEchoCommands.test (1754 of 2058) PASS: lldb-api :: commands/expression/import-std-module/no-std-module/TestMissingStdModule.py (1755 of 2058) PASS: lldb-shell :: VSCode/TestOptions.test (1756 of 2058) PASS: lldb-unit :: Utility/./UtilityTests/ReproducerTest.SetCapture (1757 of 2058) PASS: lldb-api :: python_api/section/TestSectionAPI.py (1758 of 2058) PASS: lldb-api :: commands/expression/persist_objc_pointeetype/TestPersistObjCPointeeType.py (1759 of 2058) PASS: lldb-unit :: Utility/./UtilityTests/UriParserTest.BracketedHostnameWithColon (1760 of 2058) PASS: lldb-unit :: Symbol/./SymbolTests/LineEntryTest.GetSameLineContiguousAddressRangeNestedInline (1761 of 2058) PASS: lldb-shell :: Reproducer/TestDSYM.test (1762 of 2058) PASS: lldb-unit :: Utility/./UtilityTests/VMRange.ContainsAddr (1763 of 2058) PASS: lldb-unit :: Utility/./UtilityTests/ArgsTest.ReplaceArgumentAtIndexLonger (1764 of 2058) PASS: lldb-unit :: Utility/./UtilityTests/DataExtractorTest.GetCStr (1765 of 2058) PASS: lldb-unit :: Utility/./UtilityTests/StreamTest.PutBytesAsRawHex8ToLittleEndian (1766 of 2058) PASS: lldb-api :: functionalities/data-formatter/ostypeformatting/TestFormattersOsType.py (1767 of 2058) PASS: lldb-shell :: SymbolFile/DWARF/debug-types-dwarf5.s (1768 of 2058) PASS: lldb-unit :: Language/Highlighting/./HighlighterTests/HighlighterTest.ClangTrailingBackslashMissingNewLine (1769 of 2058) PASS: lldb-api :: functionalities/load_using_paths/TestLoadUsingPaths.py (1770 of 2058) PASS: lldb-unit :: Signals/./SignalsTests/UnixSignalsTest.GetFilteredSignals (1771 of 2058) PASS: lldb-unit :: Utility/./UtilityTests/ArchSpecTest.TripleComponentsWereSpecified (1772 of 2058) PASS: lldb-unit :: Utility/./UtilityTests/ProcessInstanceInfo.DumpTable_invalidUID (1773 of 2058) PASS: lldb-api :: lang/cpp/dynamic-value/TestDynamicValue.py (1774 of 2058) UNSUPPORTED: lldb-api :: commands/watchpoints/variable_out_of_scope/TestWatchedVarHitWhenInScope.py (1775 of 2058) PASS: lldb-unit :: Utility/./UtilityTests/LogChannelEnabledTest.LLDB_LOG_ERROR (1776 of 2058) PASS: lldb-unit :: Utility/./UtilityTests/SerializationRountripTest.SerializeDeserializeObjectPointer (1777 of 2058) PASS: lldb-unit :: Utility/./UtilityTests/StringListTest.GetMaxStringLengthEqualSize (1778 of 2058) PASS: lldb-unit :: Utility/./UtilityTests/RangeTest.SlideZero (1779 of 2058) PASS: lldb-unit :: Utility/./UtilityTests/StreamTest.AddressPrefix (1780 of 2058) PASS: lldb-unit :: Process/minidump/./LLDBMinidumpTests/MinidumpParserTest.GetMemory (1781 of 2058) PASS: lldb-shell :: SymbolFile/DWARF/win-i386-line-table.s (1782 of 2058) PASS: lldb-unit :: Target/./TargetTests/PathMappingListTest.RemapRoot (1783 of 2058) PASS: lldb-shell :: Minidump/fb-dump.test (1784 of 2058) UNSUPPORTED: lldb-api :: functionalities/darwin_log/filter/exact_match/activity/TestDarwinLogFilterMatchActivity.py (1785 of 2058) PASS: lldb-api :: functionalities/data-formatter/data-formatter-stl/libcxx/list/TestDataFormatterLibcxxList.py (1786 of 2058) PASS: lldb-unit :: Utility/./UtilityTests/NameMatchesTest.Ignore (1787 of 2058) PASS: lldb-unit :: Utility/./UtilityTests/RangeTest.ContainsRange (1788 of 2058) PASS: lldb-unit :: Symbol/./SymbolTests/TestClangASTImporter.RecordLayout (1789 of 2058) PASS: lldb-api :: lang/c/complex_int/TestComplexInt.py (1790 of 2058) PASS: lldb-unit :: Host/./HostTests/File.GetStreamFromDescriptor (1791 of 2058) PASS: lldb-unit :: UnwindAssembly/x86/./UnwindAssemblyx86Tests/Testx86AssemblyInspectionEngine.TestSubRSP (1792 of 2058) PASS: lldb-api :: lang/objc/rdar-10967107/TestRdar10967107.py (1793 of 2058) UNSUPPORTED: lldb-api :: api/multiple-debuggers/TestMultipleDebuggers.py (1794 of 2058) UNSUPPORTED: lldb-shell :: ScriptInterpreter/Lua/watchpoint_callback.test (1795 of 2058) PASS: lldb-unit :: Utility/./UtilityTests/UriParserTest.Minimal (1796 of 2058) PASS: lldb-unit :: Utility/./UtilityTests/ProcessInstanceInfoList.Yaml (1797 of 2058) PASS: lldb-unit :: Symbol/./SymbolTests/TestClangASTImporter.DeportTypeTagDecl (1798 of 2058) PASS: lldb-shell :: Reproducer/Modules/TestModuleCXX.test (1799 of 2058) PASS: lldb-unit :: Utility/./UtilityTests/SubsystemRAIITest.SubsystemWithErrorSuccess (1800 of 2058) PASS: lldb-unit :: Utility/./UtilityTests/StringExtractorTest.DecodeHexU8_Underflow2 (1801 of 2058) PASS: lldb-api :: functionalities/thread/concurrent_events/TestConcurrentWatchBreakDelay.py (1802 of 2058) PASS: lldb-unit :: Utility/./UtilityTests/XcodeSDKTest.GetCanonicalNameAndConstruct (1803 of 2058) PASS: lldb-api :: lang/objc/objc-runtime-ivars/TestRuntimeIvars.py (1804 of 2058) PASS: lldb-api :: functionalities/gdb_remote_client/TestWriteMemory.py (1805 of 2058) PASS: lldb-unit :: Utility/./UtilityTests/ArgsTest.TestOverwriteArgs (1806 of 2058) PASS: lldb-api :: python_api/watchpoint/condition/TestWatchpointConditionAPI.py (1807 of 2058) PASS: lldb-api :: lang/objc/exceptions/TestObjCExceptions.py (1808 of 2058) PASS: lldb-api :: functionalities/thread/concurrent_events/TestConcurrentTwoWatchpointsOneDelayBreakpoint.py (1809 of 2058) PASS: lldb-unit :: Process/gdb-remote/./ProcessGdbRemoteTests/GDBRemoteCommunicationClientTest.GetModulesInfo_UUID20 (1810 of 2058) PASS: lldb-shell :: SymbolFile/DWARF/dwo-type-in-main-file.s (1811 of 2058) PASS: lldb-unit :: Utility/./UtilityTests/AnsiTerminal.KnownPrefix (1812 of 2058) PASS: lldb-shell :: ObjectFile/ELF/section-types.yaml (1813 of 2058) PASS: lldb-unit :: Utility/./UtilityTests/UriParserTest.SchemeHostSeparator (1814 of 2058) PASS: lldb-unit :: Utility/./UtilityTests/OptionsWithRawTest.SingleWhitespaceInput (1815 of 2058) PASS: lldb-api :: functionalities/memory-region/TestMemoryRegion.py (1816 of 2058) UNSUPPORTED: lldb-shell :: Breakpoint/case-insensitive.test (1817 of 2058) PASS: lldb-api :: functionalities/inferior-crashing/TestInferiorCrashing.py (1818 of 2058) UNSUPPORTED: lldb-shell :: ObjectFile/ELF/minidebuginfo-set-and-hit-breakpoint.test (1819 of 2058) PASS: lldb-unit :: Language/Highlighting/./HighlighterTests/HighlighterTest.ClangTrailingBackslashBeforeNewline (1820 of 2058) PASS: lldb-shell :: Breakpoint/implicit_const_form_support.test (1821 of 2058) PASS: lldb-api :: functionalities/data-formatter/typedef_array/TestTypedefArray.py (1822 of 2058) PASS: lldb-api :: commands/expression/po_verbosity/TestPoVerbosity.py (1823 of 2058) PASS: lldb-unit :: Core/./LLDBCoreTests/CommunicationTest.SynchronizeWhileClosing (1824 of 2058) PASS: lldb-api :: lang/cpp/breakpoint_in_member_func_w_non_primitive_params/TestBreakpointInMemberFuncWNonPrimitiveParams.py (1825 of 2058) PASS: lldb-shell :: BuildScript/script-args.test (1826 of 2058) PASS: lldb-unit :: Utility/./UtilityTests/UriParserTest.BracketedHostnameWithPortIPv6 (1827 of 2058) PASS: lldb-unit :: API/./APITests/SBCommandInterpreterTest.SingleWordCommand (1828 of 2058) PASS: lldb-unit :: Utility/./UtilityTests/RegularExpression.Invalid (1829 of 2058) PASS: lldb-api :: lang/cpp/class_types/TestClassTypes.py (1830 of 2058) PASS: lldb-shell :: SymbolFile/DWARF/array-sizes.s (1831 of 2058) PASS: lldb-api :: functionalities/thread/thread_exit/TestThreadExit.py (1832 of 2058) PASS: lldb-unit :: Utility/./UtilityTests/DataExtractorTest.GetMaxS64 (1833 of 2058) PASS: lldb-unit :: Utility/./UtilityTests/ArgsTest.TestQuotedTrailingBackslash (1834 of 2058) PASS: lldb-api :: lang/cpp/inlines/TestInlines.py (1835 of 2058) UNSUPPORTED: lldb-shell :: ScriptInterpreter/Lua/command_script_import.test (1836 of 2058) PASS: lldb-unit :: Host/./HostTests/SocketTest.TCPListen0ConnectAccept (1837 of 2058) PASS: lldb-unit :: Utility/./UtilityTests/StringListTest.ForRangeEmpty (1838 of 2058) PASS: lldb-shell :: ObjectFile/wasm/unified-debug-sections.yaml (1839 of 2058) PASS: lldb-unit :: Utility/./UtilityTests/ConstStringTest.FromMidOfBufferStringRef (1840 of 2058) PASS: lldb-shell :: ObjectFile/Breakpad/discontiguous-sections.test (1841 of 2058) PASS: lldb-api :: python_api/interpreter/TestCommandInterpreterAPI.py (1842 of 2058) PASS: lldb-shell :: BuildScript/toolchain-clang.test (1843 of 2058) PASS: lldb-api :: functionalities/target_var/TestTargetVar.py (1844 of 2058) PASS: lldb-api :: lang/objc/objc-new-syntax/TestObjCNewSyntaxDictionary.py (1845 of 2058) PASS: lldb-unit :: Expression/./ExpressionTests/DiagnosticManagerTest.GetStringNoDiags (1846 of 2058) UNSUPPORTED: lldb-api :: functionalities/thread/concurrent_events/TestConcurrentManySignals.py (1847 of 2058) PASS: lldb-api :: functionalities/stats_api/TestStatisticsAPI.py (1848 of 2058) PASS: lldb-api :: commands/expression/rdar42038760/TestScalarURem.py (1849 of 2058) PASS: lldb-api :: lang/objc/objc-ivar-protocols/TestIvarProtocols.py (1850 of 2058) PASS: lldb-shell :: SymbolFile/DWARF/DW_OP_piece-struct.s (1851 of 2058) PASS: lldb-shell :: ObjectFile/ELF/base-address.yaml (1852 of 2058) PASS: lldb-api :: lang/objc/foundation/TestObjCMethodsNSArray.py (1853 of 2058) PASS: lldb-unit :: Utility/./UtilityTests/BinaryStreamTest.PutULEB128Zero (1854 of 2058) PASS: lldb-api :: functionalities/data-formatter/data-formatter-proper-plurals/TestFormattersOneIsSingular.py (1855 of 2058) PASS: lldb-unit :: Utility/./UtilityTests/BinaryStreamTest.PutULEB128NineBytes (1856 of 2058) PASS: lldb-unit :: Utility/./UtilityTests/StringExtractorTest.GetHexU8_InvalidHex (1857 of 2058) PASS: lldb-unit :: Utility/./UtilityTests/XcodeSDKTest.MergeTest (1858 of 2058) PASS: lldb-api :: python_api/sbvalue_const_addrof/TestSBValueConstAddrOf.py (1859 of 2058) PASS: lldb-api :: commands/expression/import-std-module/queue/TestQueueFromStdModule.py (1860 of 2058) PASS: lldb-shell :: Recognizer/assert.test (1861 of 2058) PASS: lldb-shell :: SymbolFile/DWARF/DW_AT_low_pc-addrx.s (1862 of 2058) PASS: lldb-api :: commands/expression/import_builtin_fileid/TestImportBuiltinFileID.py (1863 of 2058) PASS: lldb-unit :: Utility/./UtilityTests/ProcessInfoTest.Constructor (1864 of 2058) PASS: lldb-unit :: Language/Highlighting/./HighlighterTests/HighlighterTest.HighlighterSelectionType (1865 of 2058) PASS: lldb-api :: functionalities/data-formatter/data-formatter-stl/libcxx/function/TestLibCxxFunction.py (1866 of 2058) PASS: lldb-unit :: Symbol/./SymbolTests/TestTypeSystemClang.TestGetTypeClassDeclType (1867 of 2058) PASS: lldb-shell :: Reproducer/Functionalities/TestImageList.test (1868 of 2058) PASS: lldb-unit :: ScriptInterpreter/Python/./ScriptInterpreterPythonTests/PythonDataObjectsTest.TestPythonBoolean (1869 of 2058) PASS: lldb-api :: functionalities/breakpoint/auto_continue/TestBreakpointAutoContinue.py (1870 of 2058) PASS: lldb-api :: lang/objcxx/cxx-bridged-po/TestObjCXXBridgedPO.py (1871 of 2058) PASS: lldb-unit :: UnwindAssembly/x86/./UnwindAssemblyx86Tests/Testx86AssemblyInspectionEngine.TestSpillRegToStackViaMOVi386 (1872 of 2058) PASS: lldb-api :: functionalities/abbreviation/TestCommonShortSpellings.py (1873 of 2058) PASS: lldb-unit :: Utility/./UtilityTests/BinaryStreamTest.PutULEB128OneByte (1874 of 2058) PASS: lldb-unit :: Utility/./UtilityTests/ArchSpecTest.TestParseMachCPUDashSubtypeTripleSimple (1875 of 2058) UNSUPPORTED: lldb-api :: linux/sepdebugsymlink/TestTargetSymbolsSepDebugSymlink.py (1876 of 2058) PASS: lldb-unit :: Symbol/./SymbolTests/TestClangASTImporter.CopyDeclTagDecl (1877 of 2058) PASS: lldb-unit :: Language/CPlusPlus/./LanguageCPlusPlusTests/CPlusPlusLanguage.MethodNameParsing (1878 of 2058) PASS: lldb-unit :: Utility/./UtilityTests/StreamTest.PutCharWhitespace (1879 of 2058) PASS: lldb-unit :: Utility/./UtilityTests/StringListTest.ShiftCString (1880 of 2058) PASS: lldb-api :: lang/c/anonymous/TestAnonymous.py (1881 of 2058) PASS: lldb-unit :: UnwindAssembly/x86/./UnwindAssemblyx86Tests/Testx86AssemblyInspectionEngine.Test64bitFramelessSmallStackFrame (1882 of 2058) PASS: lldb-api :: lang/cpp/rvalue-references/TestRvalueReferences.py (1883 of 2058) PASS: lldb-api :: commands/frame/diagnose/array/TestArray.py (1884 of 2058) PASS: lldb-shell :: Commands/command-disassemble-process.yaml (1885 of 2058) UNSUPPORTED: lldb-shell :: SymbolFile/PDB/ast-restore.test (1886 of 2058) PASS: lldb-shell :: ObjectFile/ELF/section-types-edgecases.yaml (1887 of 2058) PASS: lldb-unit :: Utility/./UtilityTests/DataExtractorTest.GetULEB128_bit63 (1888 of 2058) PASS: lldb-api :: commands/platform/process/list/TestProcessList.py (1889 of 2058) PASS: lldb-shell :: SymbolFile/NativePDB/globals-bss.cpp (1890 of 2058) UNSUPPORTED: lldb-api :: benchmarks/startup/TestStartupDelays.py (1891 of 2058) PASS: lldb-api :: commands/watchpoints/watchpoint_commands/command/TestWatchpointCommandPython.py (1892 of 2058) PASS: lldb-unit :: Utility/./UtilityTests/StreamTest.AddressRangeEmptyRange (1893 of 2058) PASS: lldb-api :: commands/expression/function_template_specialization_temp_args/TestFunctionTemplateSpecializationTempArgs.py (1894 of 2058) PASS: lldb-unit :: Utility/./UtilityTests/StringListTest.InsertStringAtIndexEnd (1895 of 2058) PASS: lldb-unit :: Process/minidump/./LLDBMinidumpTests/MinidumpParserTest.FindMemoryRange (1896 of 2058) PASS: lldb-unit :: Utility/./UtilityTests/StringExtractorTest.DecodeHexU8_Extra (1897 of 2058) PASS: lldb-api :: tools/lldb-vscode/breakpoint-events/TestVSCode_breakpointEvents.py (1898 of 2058) PASS: lldb-unit :: Expression/./ExpressionTests/DiagnosticManagerTest.PutStringSeverities (1899 of 2058) PASS: lldb-api :: lang/cpp/signed_types/TestSignedTypes.py (1900 of 2058) PASS: lldb-unit :: Utility/./UtilityTests/RangeTest.Equal (1901 of 2058) UNSUPPORTED: lldb-api :: android/platform/TestDefaultCacheLineSize.py (1902 of 2058) PASS: lldb-unit :: debugserver/./debugserverTests/RNBSocket.LoopBackListenIPv4 (1903 of 2058) PASS: lldb-api :: lang/objc/real-definition/TestRealDefinition.py (1904 of 2058) PASS: lldb-unit :: Host/./HostTests/FileSystemTest.EmptyTest (1905 of 2058) PASS: lldb-api :: commands/process/attach-resume/TestAttachResume.py (1906 of 2058) UNSUPPORTED: lldb-api :: commands/register/register/intel_xtended_registers/mpx_offset_intersection/TestMPXOffsetIntersection.py (1907 of 2058) PASS: lldb-api :: commands/settings/use_source_cache/TestUseSourceCache.py (1908 of 2058) PASS: lldb-api :: functionalities/jitloader_gdb/TestJITLoaderGDB.py (1909 of 2058) PASS: lldb-api :: functionalities/thread/concurrent_events/TestConcurrentCrashWithWatchpoint.py (1910 of 2058) PASS: lldb-api :: lang/cpp/covariant-return-types/TestCovariantReturnTypes.py (1911 of 2058) UNSUPPORTED: lldb-api :: functionalities/longjmp/TestLongjmp.py (1912 of 2058) PASS: lldb-api :: commands/command/script_alias/TestCommandScriptAlias.py (1913 of 2058) PASS: lldb-api :: functionalities/data-formatter/data-formatter-stl/libcxx/tuple/TestDataFormatterLibcxxTuple.py (1914 of 2058) PASS: lldb-api :: lang/c/const_variables/TestConstVariables.py (1915 of 2058) UNSUPPORTED: lldb-api :: arm/breakpoint-thumb-codesection/TestBreakpointThumbCodesection.py (1916 of 2058) UNSUPPORTED: lldb-shell :: Register/aarch64-fp-read.test (1917 of 2058) UNSUPPORTED: lldb-api :: functionalities/darwin_log/source/info/TestDarwinLogSourceInfo.py (1918 of 2058) PASS: lldb-unit :: ScriptInterpreter/Python/./ScriptInterpreterPythonTests/PythonDataObjectsTest.TestPythonStringToStr (1919 of 2058) PASS: lldb-shell :: ObjectFile/ELF/section-addresses.yaml (1920 of 2058) PASS: lldb-shell :: ObjectFile/ELF/build-id-case.yaml (1921 of 2058) PASS: lldb-unit :: UnwindAssembly/x86/./UnwindAssemblyx86Tests/Testx86AssemblyInspectionEngine.TestPushR12 (1922 of 2058) PASS: lldb-api :: functionalities/thread/concurrent_events/TestConcurrentTwoBreakpointsOneWatchpoint.py (1923 of 2058) PASS: lldb-shell :: Reproducer/TestWorkingDir.test (1924 of 2058) PASS: lldb-api :: python_api/type/TestTypeList.py (1925 of 2058) PASS: lldb-unit :: Target/./TargetTests/StackFrameRecognizerTest.NullModuleRegex (1926 of 2058) PASS: lldb-unit :: Host/./HostTests/File.GetWaitableHandleFileno (1927 of 2058) PASS: lldb-unit :: Utility/./UtilityTests/ScalarTest.Promotion (1928 of 2058) PASS: lldb-api :: lang/objc/objc-optimized/TestObjcOptimized.py (1929 of 2058) PASS: lldb-api :: functionalities/data-formatter/data-formatter-stl/libcxx/multimap/TestDataFormatterLibccMultiMap.py (1930 of 2058) PASS: lldb-api :: python_api/sblaunchinfo/TestSBLaunchInfo.py (1931 of 2058) PASS: lldb-unit :: Expression/./ExpressionTests/ClangExpressionDeclMapTest.TestPersistentDeclLookup (1932 of 2058) PASS: lldb-shell :: SymbolFile/DWARF/dwarf5-index-is-used.cpp (1933 of 2058) PASS: lldb-unit :: Host/./HostTests/Host.GetEnvironment (1934 of 2058) PASS: lldb-unit :: Utility/./UtilityTests/StreamTest.AddressEmptyPrefix (1935 of 2058) PASS: lldb-unit :: Expression/./ExpressionTests/DiagnosticManagerTest.HasFixits (1936 of 2058) PASS: lldb-api :: python_api/lldbutil/iter/TestRegistersIterator.py (1937 of 2058) PASS: lldb-api :: functionalities/breakpoint/breakpoint_names/TestBreakpointNames.py (1938 of 2058) PASS: lldb-unit :: Utility/./UtilityTests/LogTest.Register (1939 of 2058) PASS: lldb-api :: python_api/name_lookup/TestNameLookup.py (1940 of 2058) PASS: lldb-api :: commands/frame/diagnose/dereference-argument/TestDiagnoseDereferenceArgument.py (1941 of 2058) PASS: lldb-unit :: Language/Highlighting/./HighlighterTests/HighlighterTest.ClangComments (1942 of 2058) PASS: lldb-unit :: Utility/./UtilityTests/GeneratorTest.GetOrCreate (1943 of 2058) PASS: lldb-unit :: Utility/./UtilityTests/StringExtractorTest.GetNameColonValueNoColon (1944 of 2058) PASS: lldb-unit :: Process/minidump/./LLDBMinidumpTests/MinidumpParserTest.FindMemoryRangeWithFullMemoryMinidump (1945 of 2058) PASS: lldb-unit :: Process/gdb-remote/./ProcessGdbRemoteTests/GDBRemoteClientBaseTest.SendContinueAndInterrupt2PacketBug (1946 of 2058) PASS: lldb-api :: python_api/watchpoint/TestWatchpointIter.py (1947 of 2058) PASS: lldb-api :: macosx/profile_vrs_detach/TestDetachVrsProfile.py (1948 of 2058) PASS: lldb-unit :: Utility/./UtilityTests/RangeDataVector.FindEntryThatContains_Overlap (1949 of 2058) PASS: lldb-api :: functionalities/thread/concurrent_events/TestConcurrentTwoBreakpointThreads.py (1950 of 2058) PASS: lldb-unit :: Utility/./UtilityTests/ScalarTest.Comparison (1951 of 2058) PASS: lldb-unit :: Utility/./UtilityTests/CompletionRequest.DuplicateFiltering (1952 of 2058) XFAIL: lldb-shell :: SymbolFile/DWARF/find-type-in-function.cpp (1953 of 2058) PASS: lldb-api :: macosx/find-dsym/deep-bundle/TestDeepBundle.py (1954 of 2058) PASS: lldb-api :: lang/cpp/virtual-overload/TestVirtualOverload.py (1955 of 2058) PASS: lldb-api :: arm/emulation/TestEmulations.py (1956 of 2058) PASS: lldb-unit :: Expression/./ExpressionTests/ClangHostTest.ComputeClangResourceDirectory (1957 of 2058) PASS: lldb-api :: functionalities/breakpoint/step_over_breakpoint/TestStepOverBreakpoint.py (1958 of 2058) PASS: lldb-unit :: Expression/./ExpressionTests/CppModuleConfigurationTest.Xcode (1959 of 2058) PASS: lldb-shell :: SymbolFile/DWARF/dwarf5-atomic.s (1960 of 2058) PASS: lldb-unit :: Core/./LLDBCoreTests/RichManglingContextTest.FromCxxMethodName (1961 of 2058) PASS: lldb-shell :: ObjectFile/PECOFF/sections-names.yaml (1962 of 2058) PASS: lldb-api :: lang/c/step_over_no_deadlock/TestStepOverDoesntBlock.py (1963 of 2058) PASS: lldb-unit :: Core/./LLDBCoreTests/MangledTest.EmptyForInvalidName (1964 of 2058) PASS: lldb-api :: functionalities/history/TestHistoryRecall.py (1965 of 2058) PASS: lldb-unit :: Target/./TargetTests/PathMappingListTest.RelativeTests (1966 of 2058) PASS: lldb-api :: lang/cpp/class-template-parameter-pack/TestClassTemplateParameterPack.py (1967 of 2058) PASS: lldb-api :: macosx/function-starts/TestFunctionStarts.py (1968 of 2058) PASS: lldb-unit :: Host/./HostTests/NativeProcessProtocolTest.SetBreakpoint (1969 of 2058) PASS: lldb-unit :: ScriptInterpreter/Python/./ScriptInterpreterPythonTests/PythonDataObjectsTest.TestPythonTupleValues (1970 of 2058) PASS: lldb-api :: functionalities/thread/concurrent_events/TestConcurrentSignalWatch.py (1971 of 2058) UNSUPPORTED: lldb-api :: functionalities/tsan/basic/TestTsanBasic.py (1972 of 2058) PASS: lldb-api :: commands/expression/diagnostics/TestExprDiagnostics.py (1973 of 2058) PASS: lldb-unit :: Utility/./UtilityTests/BinaryStreamTest.PutSLEB128SixBytes (1974 of 2058) PASS: lldb-unit :: Utility/./UtilityTests/CompletionRequest.ShiftArguments (1975 of 2058) PASS: lldb-unit :: DataFormatter/./LLDBFormatterTests/StringPrinterTests.SwiftUTF8 (1976 of 2058) PASS: lldb-unit :: Utility/./UtilityTests/StringExtractorTest.GetHexBytes_Underflow (1977 of 2058) PASS: lldb-shell :: SymbolFile/NativePDB/function-types-builtins.cpp (1978 of 2058) PASS: lldb-shell :: SymbolFile/NativePDB/tag-types.cpp (1979 of 2058) PASS: lldb-unit :: Core/./LLDBCoreTests/RichManglingContextTest.SwitchProvider (1980 of 2058) PASS: lldb-unit :: Utility/./UtilityTests/BroadcasterTest.EventTypeHasListeners (1981 of 2058) PASS: lldb-api :: functionalities/thread/concurrent_events/TestConcurrentBreakpointOneDelayBreakpointThreads.py (1982 of 2058) PASS: lldb-unit :: Host/./HostTests/FileSystemTest.OpenErrno (1983 of 2058) UNSUPPORTED: lldb-shell :: Unwind/unwind-plan-dwarf-dump.test (1984 of 2058) UNSUPPORTED: lldb-api :: functionalities/tsan/thread_numbers/TestTsanThreadNumbers.py (1985 of 2058) PASS: lldb-unit :: Utility/./UtilityTests/StreamTest.PutRawBytesToMixedEndian (1986 of 2058) PASS: lldb-api :: lang/cpp/this/TestCPPThis.py (1987 of 2058) PASS: lldb-unit :: Host/./HostTests/NativeProcessProtocolTest.ReadCStringFromMemory (1988 of 2058) PASS: lldb-unit :: Utility/./UtilityTests/StringExtractorTest.GetHexBytesAvail_FullString (1989 of 2058) PASS: lldb-api :: functionalities/breakpoint/dummy_target_breakpoints/TestBreakpointsWithNoTargets.py (1990 of 2058) PASS: lldb-shell :: Reproducer/TestPythonImport.test (1991 of 2058) PASS: lldb-unit :: UnwindAssembly/x86/./UnwindAssemblyx86Tests/Testx86AssemblyInspectionEngine.TestCALLNextInsn (1992 of 2058) PASS: lldb-api :: lang/objc/variadic_methods/TestVariadicMethods.py (1993 of 2058) PASS: lldb-api :: python_api/watchpoint/TestWatchpointIgnoreCount.py (1994 of 2058) PASS: lldb-api :: commands/frame/var/TestFrameVar.py (1995 of 2058) PASS: lldb-api :: tools/lldb-server/TestGdbRemoteExpeditedRegisters.py (1996 of 2058) PASS: lldb-api :: commands/frame/diagnose/virtual-method-call/TestDiagnoseDereferenceVirtualMethodCall.py (1997 of 2058) PASS: lldb-unit :: Utility/./UtilityTests/ArgsTest.TestMultipleArgs (1998 of 2058) PASS: lldb-api :: functionalities/breakpoint/breakpoint_command/TestBreakpointCommand.py (1999 of 2058) PASS: lldb-unit :: ScriptInterpreter/Python/./ScriptInterpreterPythonTests/PythonDataObjectsTest.TestPythonCallableCheck (2000 of 2058) PASS: lldb-shell :: SymbolFile/DWARF/dwp-separate-debug-file.cpp (2001 of 2058) PASS: lldb-api :: lang/cpp/dynamic-value/TestCppValueCast.py (2002 of 2058) PASS: lldb-unit :: Utility/./UtilityTests/PassiveReplayTest.InstrumentedBar (2003 of 2058) PASS: lldb-unit :: Interpreter/./InterpreterTests/CompletionTest.DirCompletionAbsolute (2004 of 2058) PASS: lldb-unit :: Utility/./UtilityTests/ArgsTest.TestSingleQuotedArgWithSpace (2005 of 2058) PASS: lldb-api :: functionalities/postmortem/minidump/TestMiniDump.py (2006 of 2058) PASS: lldb-shell :: SymbolFile/DWARF/DW_TAG_variable-invalid_location.s (2007 of 2058) PASS: lldb-api :: functionalities/breakpoint/serialize/TestBreakpointSerialization.py (2008 of 2058) PASS: lldb-unit :: SymbolFile/DWARF/./SymbolFileDWARFTests/SymbolFileDWARFTests.TestAbbrevOrder1Start1 (2009 of 2058) PASS: lldb-unit :: Symbol/./SymbolTests/TestTypeSystemClang.TestGetBasicTypeFromName (2010 of 2058) PASS: lldb-api :: lang/cpp/trivial_abi/TestTrivialABI.py (2011 of 2058) PASS: lldb-api :: functionalities/data-formatter/data-formatter-objc/TestDataFormatterObjNSException.py (2012 of 2058) PASS: lldb-shell :: SymbolFile/DWARF/module-ownership.mm (2013 of 2058) UNSUPPORTED: lldb-api :: tools/lldb-vscode/completions/TestVSCode_completions.py (2014 of 2058) PASS: lldb-shell :: ObjectFile/ELF/PT_LOAD-overlap.yaml (2015 of 2058) PASS: lldb-api :: tools/lldb-server/inferior-crash/TestGdbRemoteSegFault.py (2016 of 2058) UNSUPPORTED: lldb-api :: benchmarks/stepping/TestSteppingSpeed.py (2017 of 2058) PASS: lldb-api :: lang/objc/objc-struct-argument/TestObjCStructArgument.py (2018 of 2058) PASS: lldb-api :: commands/expression/radar_9673664/TestExprHelpExamples.py (2019 of 2058) PASS: lldb-api :: functionalities/gdb_remote_client/TestPlatformClient.py (2020 of 2058) XFAIL: lldb-shell :: Register/x86-64-ymm-write.test (2021 of 2058) PASS: lldb-api :: functionalities/thread/concurrent_events/TestConcurrentTwoWatchpointsOneSignal.py (2022 of 2058) PASS: lldb-api :: commands/expression/import-std-module/empty-module/TestEmptyStdModule.py (2023 of 2058) PASS: lldb-api :: lang/c/bitfields/TestBitfields.py (2024 of 2058) PASS: lldb-unit :: Process/minidump/./LLDBMinidumpTests/MinidumpParserTest.GetThreadsAndGetThreadContext (2025 of 2058) PASS: lldb-unit :: ObjectFile/ELF/./ObjectFileELFTests/ObjectFileELFTest.GetSymtab_NoSymEntryPointArmThumbAddressClass (2026 of 2058) PASS: lldb-api :: commands/watchpoints/watchpoint_commands/command/TestWatchpointCommandLLDB.py (2027 of 2058) PASS: lldb-unit :: UnwindAssembly/x86/./UnwindAssemblyx86Tests/Testx86AssemblyInspectionEngine.TestPushR15 (2028 of 2058) UNSUPPORTED: lldb-api :: functionalities/signal/handle-segv/TestHandleSegv.py (2029 of 2058) PASS: lldb-unit :: Utility/./UtilityTests/Flags.Clear (2030 of 2058) PASS: lldb-unit :: debugserver/./debugserverTests/RNBSocket.LoopBackConnectIPv4 (2031 of 2058) PASS: lldb-unit :: Utility/./UtilityTests/StreamTeeTest.GetStreamAtIndexOutOfBoundsEmpty (2032 of 2058) PASS: lldb-api :: commands/expression/class_template_specialization_empty_pack/TestClassTemplateSpecializationParametersHandling.py (2033 of 2058) PASS: lldb-api :: functionalities/archives/TestBSDArchives.py (2034 of 2058) PASS: lldb-unit :: Utility/./UtilityTests/XcodeSDKTest.FindXcodeContentsDirectoryInPath (2035 of 2058) PASS: lldb-unit :: Host/./HostTests/NativeProcessProtocolTest.SetBreakpointFailVerify (2036 of 2058) FAIL: lldb-shell :: ObjectFile/PECOFF/export-dllfunc.yaml (2037 of 2058) ******************** TEST 'lldb-shell :: ObjectFile/PECOFF/export-dllfunc.yaml' FAILED ******************** Script: -- : 'RUN: at line 2'; /Users/buildslave/jenkins/workspace/lldb-cmake-sanitized/lldb-build/bin/yaml2obj < /Users/buildslave/jenkins/workspace/lldb-cmake-sanitized/llvm-project/lldb/test/Shell/ObjectFile/PECOFF/export-dllfunc.yaml > /Users/buildslave/jenkins/workspace/lldb-cmake-sanitized/lldb-build/tools/lldb/test/ObjectFile/PECOFF/Output/export-dllfunc.yaml.tmp.obj : 'RUN: at line 4'; /Users/buildslave/jenkins/workspace/lldb-cmake-sanitized/lldb-build/bin/lld-link /machine:x64 /out:/Users/buildslave/jenkins/workspace/lldb-cmake-sanitized/lldb-build/tools/lldb/test/ObjectFile/PECOFF/Output/export-dllfunc.yaml.tmp.dll /noentry /nodefaultlib /debug /dll /Users/buildslave/jenkins/workspace/lldb-cmake-sanitized/lldb-build/tools/lldb/test/ObjectFile/PECOFF/Output/export-dllfunc.yaml.tmp.obj /export:DllFunc : 'RUN: at line 6'; /Users/buildslave/jenkins/workspace/lldb-cmake-sanitized/lldb-build/bin/lldb-test object-file /Users/buildslave/jenkins/workspace/lldb-cmake-sanitized/lldb-build/tools/lldb/test/ObjectFile/PECOFF/Output/export-dllfunc.yaml.tmp.dll | /Users/buildslave/jenkins/workspace/lldb-cmake-sanitized/lldb-build/bin/FileCheck -check-prefix=BASIC-CHECK /Users/buildslave/jenkins/workspace/lldb-cmake-sanitized/llvm-project/lldb/test/Shell/ObjectFile/PECOFF/export-dllfunc.yaml : 'RUN: at line 7'; /Users/buildslave/jenkins/workspace/lldb-cmake-sanitized/lldb-build/bin/lldb-test object-file -dep-modules /Users/buildslave/jenkins/workspace/lldb-cmake-sanitized/lldb-build/tools/lldb/test/ObjectFile/PECOFF/Output/export-dllfunc.yaml.tmp.dll | /Users/buildslave/jenkins/workspace/lldb-cmake-sanitized/lldb-build/bin/FileCheck -check-prefix=DEPS /Users/buildslave/jenkins/workspace/lldb-cmake-sanitized/llvm-project/lldb/test/Shell/ObjectFile/PECOFF/export-dllfunc.yaml -- Exit Code: 134

Hide Details

Command Output (stderr): -- /Users/buildslave/jenkins/workspace/lldb-cmake-sanitized/host-compiler/bin/../include/c++/v1/vector:1553:12: runtime error: reference binding to null pointer of type 'llvm::pdb::PSHashRecord' SUMMARY: UndefinedBehaviorSanitizer: undefined-behavior /Users/buildslave/jenkins/workspace/lldb-cmake-sanitized/host-compiler/bin/../include/c++/v1/vector:1553:12 in /Users/buildslave/jenkins/workspace/lldb-cmake-sanitized/host-compiler/bin/../include/c++/v1/vector:1553: runtime error: reference binding to null pointer of type 'llvm::pdb::PSHashRecord' SUMMARY: UndefinedBehaviorSanitizer: undefined-behavior /Users/buildslave/jenkins/workspace/lldb-cmake-sanitized/host-compiler/bin/../include/c++/v1/vector:1553 in /Users/buildslave/jenkins/workspace/lldb-cmake-sanitized/host-compiler/bin/../include/c++/v1/vector:1553: runtime error: reference binding to null pointer of type 'llvm::pdb::PSHashRecord' PLEASE submit a bug report to https://bugs.llvm.org/ and include the crash backtrace. SUMMARY: UndefinedBehaviorSanitizer: undefined-behavior /Users/buildslave/jenkins/workspace/lldb-cmake-sanitized/host-compiler/bin/../include/c++/v1/vector:1553 in /Users/buildslave/jenkins/workspace/lldb-cmake-sanitized/host-compiler/bin/../include/c++/v1/vector:1553: runtime error: reference binding to null pointer of type 'llvm::pdb::PSHashRecord' SUMMARY: UndefinedBehaviorSanitizer: undefined-behavior /Users/buildslave/jenkins/workspace/lldb-cmake-sanitized/host-compiler/bin/../include/c++/v1/vector:1553 in /Users/buildslave/jenkins/workspace/lldb-cmake-sanitized/host-compiler/bin/../include/c++/v1/vector:1553: runtime error: reference binding to null pointer of type 'llvm::pdb::PSHashRecord' SUMMARY: UndefinedBehaviorSanitizer: undefined-behavior /Users/buildslave/jenkins/workspace/lldb-cmake-sanitized/host-compiler/bin/../include/c++/v1/vector:1553 in /Users/buildslave/jenkins/workspace/lldb-cmake-sanitized/host-compiler/bin/../include/c++/v1/vector:1553: runtime error: reference binding to null pointer of type 'llvm::pdb::PSHashRecord' SUMMARY: UndefinedBehaviorSanitizer: undefined-behavior /Users/buildslave/jenkins/workspace/lldb-cmake-sanitized/host-compiler/bin/../include/c++/v1/vector:1553 in /Users/buildslave/jenkins/workspace/lldb-cmake-sanitized/host-compiler/bin/../include/c++/v1/vector:1553: runtime error: reference binding to null pointer of type 'llvm::pdb::PSHashRecord' SUMMARY: UndefinedBehaviorSanitizer: undefined-behavior /Users/buildslave/jenkins/workspace/lldb-cmake-sanitized/host-compiler/bin/../include/c++/v1/vector:1553 in /Users/buildslave/jenkins/workspace/lldb-cmake-sanitized/host-compiler/bin/../include/c++/v1/vector:1553: runtime error: reference binding to null pointer of type 'llvm::pdb::PSHashRecord' SUMMARY: UndefinedBehaviorSanitizer: undefined-behavior /Users/buildslave/jenkins/workspace/lldb-cmake-sanitized/host-compiler/bin/../include/c++/v1/vector:1553 in /Users/buildslave/jenkins/workspace/lldb-cmake-sanitized/host-compiler/bin/../include/c++/v1/vector:1553: runtime error: reference binding to null pointer of type 'llvm::pdb::PSHashRecord' SUMMARY: UndefinedBehaviorSanitizer: undefined-behavior /Users/buildslave/jenkins/workspace/lldb-cmake-sanitized/host-compiler/bin/../include/c++/v1/vector:1553 in /Users/buildslave/jenkins/workspace/lldb-cmake-sanitized/host-compiler/bin/../include/c++/v1/vector:1553: runtime error: reference binding to null pointer of type 'llvm::pdb::PSHashRecord' SUMMARY: UndefinedBehaviorSanitizer: undefined-behavior /Users/buildslave/jenkins/workspace/lldb-cmake-sanitized/host-compiler/bin/../include/c++/v1/vector:1553 in /Users/buildslave/jenkins/workspace/lldb-cmake-sanitized/host-compiler/bin/../include/c++/v1/vector:1553: runtime error: reference binding to null pointer of type 'llvm::pdb::PSHashRecord' SUMMARY: UndefinedBehaviorSanitizer: undefined-behavior /Users/buildslave/jenkins/workspace/lldb-cmake-sanitized/host-compiler/bin/../include/c++/v1/vector:1553 in /Users/buildslave/jenkins/workspace/lldb-cmake-sanitized/host-compiler/bin/../include/c++/v1/vector:1553: runtime error: reference binding to null pointer of type 'llvm::pdb::PSHashRecord' SUMMARY: UndefinedBehaviorSanitizer: undefined-behavior /Users/buildslave/jenkins/workspace/lldb-cmake-sanitized/host-compiler/bin/../include/c++/v1/vector:1553 in /Users/buildslave/jenkins/workspace/lldb-cmake-sanitized/host-compiler/bin/../include/c++/v1/vector:1553: runtime error: reference binding to null pointer of type 'llvm::pdb::PSHashRecord' SUMMARY: UndefinedBehaviorSanitizer: undefined-behavior /Users/buildslave/jenkins/workspace/lldb-cmake-sanitized/host-compiler/bin/../include/c++/v1/vector:1553 in /Users/buildslave/jenkins/workspace/lldb-cmake-sanitized/host-compiler/bin/../include/c++/v1/vector:1553: runtime error: reference binding to null pointer of type 'llvm::pdb::PSHashRecord' SUMMARY: UndefinedBehaviorSanitizer: undefined-behavior /Users/buildslave/jenkins/workspace/lldb-cmake-sanitized/host-compiler/bin/../include/c++/v1/vector:1553 in /Users/buildslave/jenkins/workspace/lldb-cmake-sanitized/lldb-build/tools/lldb/test/ObjectFile/PECOFF/Output/export-dllfunc.yaml.script: line 4: 10304 Abort trap: 6 /Users/buildslave/jenkins/workspace/lldb-cmake-sanitized/lldb-build/bin/lld-link /machine:x64 /out:/Users/buildslave/jenkins/workspace/lldb-cmake-sanitized/lldb-build/tools/lldb/test/ObjectFile/PECOFF/Output/export-dllfunc.yaml.tmp.dll /noentry /nodefaultlib /debug /dll /Users/buildslave/jenkins/workspace/lldb-cmake-sanitized/lldb-build/tools/lldb/test/ObjectFile/PECOFF/Output/export-dllfunc.yaml.tmp.obj /export:DllFunc

Hide Details

--

Hide Details

******************** PASS: lldb-api :: functionalities/data-formatter/data-formatter-objc/TestDataFormatterObjCExpr.py (2038 of 2058) PASS: lldb-api :: commands/expression/ir-interpreter-phi-nodes/TestIRInterpreterPHINodes.py (2039 of 2058) PASS: lldb-api :: lang/objc/objc-dyn-sbtype/TestObjCDynamicSBType.py (2040 of 2058) PASS: lldb-shell :: Settings/TestFrameFormatMangling.test (2041 of 2058) PASS: lldb-unit :: Utility/./UtilityTests/StringListTest.GetMaxStringLengthDecreasingSize (2042 of 2058) PASS: lldb-shell :: SymbolFile/DWARF/find-inline-method.s (2043 of 2058) PASS: lldb-shell :: SymbolFile/NativePDB/function-types-calling-conv.cpp (2044 of 2058) PASS: lldb-unit :: Expression/./ExpressionTests/DiagnosticManagerTest.GetStringPreserveOrder (2045 of 2058) PASS: lldb-api :: functionalities/data-formatter/setvaluefromcstring/TestSetValueFromCString.py (2046 of 2058) PASS: lldb-unit :: UnwindAssembly/x86/./UnwindAssemblyx86Tests/Testx86AssemblyInspectionEngine.TestStackRealign32BitDisp_x86_64 (2047 of 2058) PASS: lldb-shell :: ObjectFile/wasm/embedded-debug-sections.yaml (2048 of 2058) PASS: lldb-unit :: Process/gdb-remote/./ProcessGdbRemoteTests/GDBRemoteClientBaseTest.SendPacketAndReceiveResponseWithOutputSupport (2049 of 2058) PASS: lldb-api :: functionalities/paths/TestPaths.py (2050 of 2058) PASS: lldb-unit :: ObjectFile/PECOFF/./ObjectFilePECOFFTests/PECallFrameInfoTest.Chained_eh (2051 of 2058) PASS: lldb-unit :: Utility/./UtilityTests/FileSpecTest.EqualDotsPosix (2052 of 2058) PASS: lldb-unit :: Core/./LLDBCoreTests/SourceFileCache.FindSourceFileFound (2053 of 2058) PASS: lldb-unit :: Symbol/./SymbolTests/TestClangASTImporter.MetadataPropagationIndirectImport (2054 of 2058) PASS: lldb-unit :: UnwindAssembly/x86/./UnwindAssemblyx86Tests/Testx86AssemblyInspectionEngine.Test64bitFramelessBigStackFrame (2055 of 2058) PASS: lldb-api :: functionalities/thread/concurrent_events/TestConcurrentTwoWatchpointThreads.py (2056 of 2058) PASS: lldb-api :: functionalities/value_md5_crash/TestValueMD5Crash.py (2057 of 2058) PASS: lldb-api :: lang/objc/foundation/TestObjCMethodsNSError.py (2058 of 2058) Slowest Tests: -------------------------------------------------------------------------- 348.89s: lldb-api :: tools/lldb-server/TestLldbGdbServer.py 248.18s: lldb-api :: lang/cpp/enum_types/TestCPP11EnumTypes.py 246.28s: lldb-api :: api/multithreaded/TestMultithreaded.py 209.67s: lldb-api :: lang/objc/hidden-ivars/TestHiddenIvars.py 204.72s: lldb-api :: lang/objc/foundation/TestObjCMethods.py 145.88s: lldb-api :: lang/cpp/namespace/TestNamespaceLookup.py 144.40s: lldb-api :: lang/objc/exceptions/TestObjCExceptions.py 135.31s: lldb-api :: lang/objc/real-definition/TestRealDefinition.py 132.28s: lldb-api :: lang/objc/objc-new-syntax/TestObjCNewSyntaxLiteral.py 122.10s: lldb-api :: types/TestLongTypesExpr.py 118.10s: lldb-api :: tools/lldb-server/TestGdbRemote_qThreadStopInfo.py 109.14s: lldb-api :: lang/objc/foundation/TestObjCMethodsString.py 104.03s: lldb-api :: lang/objc/objc-new-syntax/TestObjCNewSyntaxDictionary.py 103.86s: lldb-api :: python_api/lldbutil/iter/TestLLDBIterator.py 101.92s: lldb-api :: lang/objc/forward-decl/TestForwardDecl.py 101.03s: lldb-api :: lang/objc/foundation/TestObjCMethodsNSError.py 99.10s: lldb-api :: lang/objc/objc-new-syntax/TestObjCNewSyntaxArray.py 98.99s: lldb-api :: lang/objc/foundation/TestRuntimeTypes.py 91.50s: lldb-api :: functionalities/gdb_remote_client/TestWasm.py 89.74s: lldb-api :: commands/settings/TestSettings.py

Hide Details

Tests Times: -------------------------------------------------------------------------- [ Range ] :: [ Percentage ] :: [ Count ] -------------------------------------------------------------------------- [340s,360s) :: [ ] :: [ 1/2058] [320s,340s) :: [ ] :: [ 0/2058] [300s,320s) :: [ ] :: [ 0/2058] [280s,300s) :: [ ] :: [ 0/2058] [260s,280s) :: [ ] :: [ 0/2058] [240s,260s) :: [ ] :: [ 2/2058] [220s,240s) :: [ ] :: [ 0/2058] [200s,220s) :: [ ] :: [ 2/2058] [180s,200s) :: [ ] :: [ 0/2058] [160s,180s) :: [ ] :: [ 0/2058] [140s,160s) :: [ ] :: [ 2/2058] [120s,140s) :: [ ] :: [ 4/2058] [100s,120s) :: [ ] :: [ 7/2058] [ 80s,100s) :: [ ] :: [ 5/2058] [ 60s, 80s) :: [ ] :: [ 24/2058] [ 40s, 60s) :: [ ] :: [ 49/2058] [ 20s, 40s) :: [*** ] :: [ 155/2058] [ 0s, 20s) :: [*********************************** ] :: [1807/2058] -------------------------------------------------------------------------- ******************** Failed Tests (7): lldb-api :: tools/lldb-server/TestGdbRemoteThreadsInStopReply.py lldb-api :: tools/lldb-server/TestGdbRemoteAttach.py lldb-api :: tools/lldb-server/TestGdbRemoteProcessInfo.py lldb-api :: tools/lldb-server/TestLldbGdbServer.py lldb-api :: tools/lldb-server/TestGdbRemoteRegisterState.py lldb-api :: tools/lldb-server/TestAppleSimulatorOSType.py lldb-shell :: ObjectFile/PECOFF/export-dllfunc.yaml

Hide Details

Hide Details

Testing Time: 4159.76s Unsupported : 180 Passed : 1865 Expectedly Failed: 6 Failed : 7 FAILED: tools/lldb/test/CMakeFiles/check-lldb-lit cd /Users/buildslave/jenkins/workspace/lldb-cmake-sanitized/lldb-build/tools/lldb/test && /usr/local/Frameworks/Python.framework/Versions/3.7/bin/python3.7 /Users/buildslave/jenkins/workspace/lldb-cmake-sanitized/lldb-build/./bin/llvm-lit -v --time-tests --shuffle --xunit-xml-output=/Users/buildslave/jenkins/workspace/lldb-cmake-sanitized/test/results.xml -v -j 4 --timeout 1200 /Users/buildslave/jenkins/workspace/lldb-cmake-sanitized/lldb-build/tools/lldb/test ninja: build stopped: subcommand failed. Command failed: Command '['/usr/bin/env', 'TERM=vt100', '/usr/local/bin/ninja', '-v', 'check-lldb']' returned non-zero exit status 1. Command: ['/usr/bin/env', 'TERM=vt100', '/usr/local/bin/ninja', '-v', 'check-lldb'] [Pipeline] } [Pipeline] // timeout [Pipeline] } [Pipeline] // stage [Pipeline] stage [Pipeline] { (Declarative: Post Actions) [Pipeline] scanForIssues [Clang (LLVM based)] Sleeping for 5 seconds due to JENKINS-32191... [Clang (LLVM based)] Parsing console log (workspace: '/Users/buildslave/jenkins/workspace/lldb-cmake-sanitized') [Clang (LLVM based)] Successfully parsed console log [Clang (LLVM based)] -> found 4 issues (skipped 12 duplicates) [Clang (LLVM based)] Post processing issues on 'green-dragon-23' with source code encoding 'UTF-8' [Clang (LLVM based)] Creating SCM blamer to obtain author and commit information for affected files [Clang (LLVM based)] Creating SCM miner to obtain statistics for affected repository files [Clang (LLVM based)] Resolving file names for all issues in source directory '/Users/buildslave/jenkins/workspace/lldb-cmake-sanitized' [Clang (LLVM based)] -> resolved paths in source directory (2 found, 0 not found) [Clang (LLVM based)] Resolving module names from module definitions (build.xml, pom.xml, or Manifest.mf files) [Clang (LLVM based)] -> resolved module names for 4 issues [Clang (LLVM based)] Resolving package names (or namespaces) by parsing the affected files [Clang (LLVM based)] -> resolved package names of 2 affected files [Clang (LLVM based)] No filter has been set, publishing all 4 issues [Clang (LLVM based)] Creating fingerprints for all affected code blocks to track issues over different builds [Clang (LLVM based)] -> created fingerprints for 4 issues (skipped 0 issues) [Clang (LLVM based)] Copying affected files to Jenkins' build folder '/Users/Shared/Jenkins/Home/jobs/lldb-cmake-sanitized/builds/1590/files-with-issues' [Clang (LLVM based)] -> 2 copied, 0 not in workspace, 0 not-found, 0 with I/O error [Pipeline] junit Recording test results [Pipeline] } [Pipeline] // stage [Pipeline] } [Pipeline] // withEnv [Pipeline] } [Pipeline] // node [Pipeline] End of Pipeline ERROR: script returned exit code 1 Finished: FAILURE