FailedConsole Output

Skipping 33,907 KB.. Full Log
 479]    479     Code            0x00007fff660e6492                    0x0000000000000055 0x001e0080 objc::DenseMapBase<objc::DenseMap<char const*, objc::detail::DenseSetEmpty, objc::DenseMapValueInfo<objc::detail::DenseSetEmpty>, objc::DenseMapInfo<char const*>, objc::detail::DenseSetPair<char const*> >, char const*, objc::detail::DenseSetEmpty, objc::DenseMapValueInfo<objc::detail::DenseSetEmpty>, objc::DenseMapInfo<char const*>, objc::detail::DenseSetPair<char const*> >::FatalCorruptHashTables(objc::detail::DenseSetPair<char const*> const*, unsigned int) const
    [  480]    480     Code            0x00007fff660e64e7                    0x00000000000000a1 0x000e0000 objc_defaultForwardHandler(objc_object*, objc_selector*)
    [  481]    481     Code            0x00007fff660e6588                    0x000000000000001c 0x000e0000 objc_defaultForwardStretHandler(objc_object*, objc_selector*)
    [  482]    482     Code            0x00007fff660e65a4                    0x0000000000000056 0x000e0000 objc::DenseMapBase<objc::DenseMap<void const*, objc::ObjcAssociation, objc::DenseMapValueInfo<objc::ObjcAssociation>, objc::DenseMapInfo<void const*>, objc::detail::DenseMapPair<void const*, objc::ObjcAssociation> >, void const*, objc::ObjcAssociation, objc::DenseMapValueInfo<objc::ObjcAssociation>, objc::DenseMapInfo<void const*>, objc::detail::DenseMapPair<void const*, objc::ObjcAssociation> >::FatalCorruptHashTables(objc::detail::DenseMapPair<void const*, objc::ObjcAssociation> const*, unsigned int) const
    [  483]    483     Code            0x00007fff660e65fa                    0x000000000000005c 0x000e0000 objc::DenseMapBase<objc::DenseMap<DisguisedPtr<objc_object>, objc::DenseMap<void const*, objc::ObjcAssociation, objc::DenseMapValueInfo<objc::ObjcAssociation>, objc::DenseMapInfo<void const*>, objc::detail::DenseMapPair<void const*, objc::ObjcAssociation> >, objc::DenseMapValueInfo<objc::DenseMap<void const*, objc::ObjcAssociation, objc::DenseMapValueInfo<objc::ObjcAssociation>, objc::DenseMapInfo<void const*>, objc::detail::DenseMapPair<void const*, objc::ObjcAssociation> > >, objc::DenseMapInfo<DisguisedPtr<objc_object> >, objc::detail::DenseMapPair<DisguisedPtr<objc_object>, objc::DenseMap<void const*, objc::ObjcAssociation, objc::DenseMapValueInfo<objc::ObjcAssociation>, objc::DenseMapInfo<void const*>, objc::detail::DenseMapPair<void const*, objc::ObjcAssociation> > > >, DisguisedPtr<objc_object>, objc::DenseMap<void const*, objc::ObjcAssociation, objc::DenseMapValueInfo<objc::ObjcAssociation>, objc::DenseMapInfo<void const*>, objc::detail::DenseMapPair<void const*, objc::ObjcAssociation> >, objc::DenseMapValueInfo<objc::DenseMap<void const*, objc::ObjcAssociation, objc::DenseMapValueInfo<objc::ObjcAssociation>, objc::DenseMapInfo<void const*>, objc::detail::DenseMapPair<void const*, objc::ObjcAssociation> > >, objc::DenseMapInfo<DisguisedPtr<objc_object> >, objc::detail::DenseMapPair<DisguisedPtr<objc_object>, objc::DenseMap<void const*, objc::ObjcAssociation, objc::DenseMapValueInfo<objc::ObjcAssociation>, objc::DenseMapInfo<void const*>, objc::detail::DenseMapPair<void const*, objc::ObjcAssociation> > > >::FatalCorruptHashTables(objc::detail::DenseMapPair<DisguisedPtr<objc_object>, objc::DenseMap<void const*, objc::ObjcAssociation, objc::DenseMapValueInfo<objc::ObjcAssociation>, objc::DenseMapInfo<void const*>, objc::detail::DenseMapPair<void const*, objc::ObjcAssociation> > > const*, unsigned int) const
    [  484]    484     Code            0x00007fff660e6656                    0x0000000000000060 0x000e0000 objc::DenseMapBase<objc::DenseMap<DisguisedPtr<objc_object>, unsigned long, (anonymous namespace)::RefcountMapValuePurgeable, objc::DenseMapInfo<DisguisedPtr<objc_object> >, objc::detail::DenseMapPair<DisguisedPtr<objc_object>, unsigned long> >, DisguisedPtr<objc_object>, unsigned long, (anonymous namespace)::RefcountMapValuePurgeable, objc::DenseMapInfo<DisguisedPtr<objc_object> >, objc::detail::DenseMapPair<DisguisedPtr<objc_object>, unsigned long> >::FatalCorruptHashTables(objc::detail::DenseMapPair<DisguisedPtr<objc_object>, unsigned long> const*, unsigned int) const
    [  485]    485     Code            0x00007fff660e66b6                    0x0000000000000012 0x000e0000 AutoreleasePoolPage::busted_die() const
    [  486]    486     Code            0x00007fff660e66c8                    0x000000000000000a 0x000e0000 _objc_callBadAllocHandler
    [  487]    487     Code            0x00007fff660e66d2                    0x000000000000008c 0x000e0000 AutoreleasePoolPage::badPop(void*)
    [  488]    488     Code            0x00007fff660e675e                    0x00000000000000d8 0x000e0000 AutoreleasePoolPage::popPageDebug(void*, AutoreleasePoolPage*, objc_object**)
    [  489]    489     Code            0x00007fff660e6836                    0x000000000000010a 0x000e0000 AutoreleasePoolPage::printHiwat()
    [  490]    490     Code            0x00007fff660e6940                    0x000000000000011c 0x000e0000 AutoreleasePoolPage::printAll()
    [  491]    491     Code            0x00007fff660e6a5c                    0x00000000000001dd 0x000e0000 AutoreleasePoolPage::print()
    [  492]    492     Data            0x00007fff660eb448                    0x000000000000000c 0x000e0000 UnsetLayout
    [  493]    493     Data            0x00007fff660eb454                    0x0000000000000008 0x000e0000 addHeader(mach_header_64 const*, char const*, int&, int&)::emptyInfo
    [  494]    494     Data            0x00007fff660eb510                    0x0000000000001000 0x001e0000 _objc_opt_data
    [  495]    495     Data            0x00007fff660f06c8                    0x0000000000000018 0x000e0000 GCC_except_table138
    [  496]    496     Data            0x00007fff660f06e0                    0x0000000000000010 0x000e0000 GCC_except_table148
    [  497]    497     Data            0x00007fff660f06f0                    0x0000000000000018 0x000e0000 GCC_except_table165
    [  498]    498     Data            0x00007fff660f0708                    0x0000000000000034 0x000e0000 GCC_except_table170
    [  499]    499     Data            0x00007fff660f073c                    0x0000000000000018 0x000e0000 GCC_except_table181
    [  500]    500     Data            0x00007fff660f0754                    0x0000000000000020 0x000e0000 GCC_except_table188
    [  501]    501     Data            0x00007fff660f0774                    0x000000000000001c 0x000e0000 GCC_except_table189
    [  502]    502     Data            0x00007fff660f0790                    0x0000000000000064 0x000e0000 GCC_except_table193
    [  503]    503     Data            0x00007fff660f07f4                    0x0000000000000014 0x000e0000 GCC_except_table195
    [  504]    504     Data            0x00007fff660f0808                    0x000000000000000c 0x000e0000 GCC_except_table196
    [  505]    505     Data            0x00007fff660f0814                    0x000000000000001c 0x000e0000 GCC_except_table218
    [  506]    506     Data            0x00007fff660f0830                    0x0000000000000010 0x000e0000 GCC_except_table271
    [  507]    507     Data            0x00007fff660f0840                    0x0000000000000014 0x000e0000 GCC_except_table286
    [  508]    508     Data            0x00007fff660f0854                    0x0000000000000020 0x000e0000 GCC_except_table293
    [  509]    509     Data            0x00007fff660f0874                    0x0000000000000018 0x000e0000 GCC_except_table297
    [  510]    510     Data            0x00007fff660f088c                    0x000000000000000c 0x000e0000 GCC_except_table298
    [  511]    511     Data            0x00007fff660f0898                    0x0000000000000058 0x000e0000 GCC_except_table299
    [  512]    512     Data            0x00007fff660f08f0                    0x000000000000007c 0x000e0000 GCC_except_table305
    [  513]    513     Data            0x00007fff660f096c                    0x0000000000000010 0x000e0000 GCC_except_table316
    [  514]    514     Data            0x00007fff660f097c                    0x000000000000000c 0x000e0000 GCC_except_table321
    [  515]    515     Data            0x00007fff660f0988                    0x0000000000000010 0x000e0000 GCC_except_table322
    [  516]    516     Data            0x00007fff660f0998                    0x0000000000000010 0x000e0000 GCC_except_table328
    [  517]    517     Data            0x00007fff660f09a8                    0x0000000000000010 0x000e0000 GCC_except_table329
    [  518]    518     Data            0x00007fff660f09b8                    0x0000000000000014 0x000e0000 GCC_except_table330
    [  519]    519     Data            0x00007fff660f09cc                    0x0000000000000010 0x000e0000 GCC_except_table331
    [  520]    520     Data            0x00007fff660f09dc                    0x0000000000000014 0x000e0000 GCC_except_table338
    [  521]    521     Data            0x00007fff660f09f0                    0x000000000000000c 0x000e0000 GCC_except_table341
    [  522]    522     Data            0x00007fff660f09fc                    0x0000000000000010 0x000e0000 GCC_except_table345
    [  523]    523     Data            0x00007fff660f0a0c                    0x0000000000000010 0x000e0000 GCC_except_table349
    [  524]    524     Data            0x00007fff660f0a1c                    0x0000000000000018 0x000e0000 GCC_except_table350
    [  525]    525     Data            0x00007fff660f0a34                    0x0000000000000010 0x000e0000 GCC_except_table351
    [  526]    526     Data            0x00007fff660f0a44                    0x0000000000000010 0x000e0000 GCC_except_table352
    [  527]    527     Data            0x00007fff660f0a54                    0x0000000000000010 0x000e0000 GCC_except_table353
    [  528]    528     Data            0x00007fff660f0a64                    0x0000000000000010 0x000e0000 GCC_except_table355
    [  529]    529     Data            0x00007fff660f0a74                    0x0000000000000010 0x000e0000 GCC_except_table357
    [  530]    530     Data            0x00007fff660f0a84                    0x000000000000000c 0x000e0000 GCC_except_table363
    [  531]    531     Data            0x00007fff660f0a90                    0x000000000000000c 0x000e0000 GCC_except_table369
    [  532]    532     Data            0x00007fff660f0a9c                    0x000000000000003c 0x000e0000 GCC_except_table371
    [  533]    533     Data            0x00007fff660f0ad8                    0x000000000000000c 0x000e0000 GCC_except_table378
    [  534]    534     Data            0x00007fff660f0ae4                    0x0000000000000010 0x000e0000 GCC_except_table381
    [  535]    535     Data            0x00007fff660f0af4                    0x0000000000000018 0x000e0000 GCC_except_table382
    [  536]    536     Data            0x00007fff660f0b0c                    0x000000000000001c 0x000e0000 GCC_except_table383
    [  537]    537     Data            0x00007fff660f0b28                    0x000000000000001c 0x000e0000 GCC_except_table385
    [  538]    538     Data            0x00007fff660f0b44                    0x0000000000000014 0x000e0000 GCC_except_table391
    [  539]    539     Data            0x00007fff660f0b58                    0x0000000000000014 0x000e0000 GCC_except_table392
    [  540]    540     Data            0x00007fff660f0b6c                    0x0000000000000010 0x000e0000 GCC_except_table396
    [  541]    541     Data            0x00007fff660f0b7c                    0x0000000000000020 0x000e0000 GCC_except_table399
    [  542]    542     Data            0x00007fff660f0b9c                    0x0000000000000014 0x000e0000 GCC_except_table400
    [  543]    543     Data            0x00007fff660f0bb0                    0x0000000000000010 0x000e0000 GCC_except_table401
    [  544]    544     Data            0x00007fff660f0bc0                    0x0000000000000020 0x000e0000 GCC_except_table410
    [  545]    545     Data            0x00007fff660f0be0                    0x0000000000000020 0x000e0000 GCC_except_table411
    [  546]    546     Data            0x00007fff660f0c00                    0x0000000000000018 0x000e0000 GCC_except_table414
    [  547]    547     Data            0x00007fff660f0c18                    0x0000000000000010 0x000e0000 GCC_except_table415
    [  548]    548     Data            0x00007fff660f0c28                    0x0000000000000010 0x000e0000 GCC_except_table416
    [  549]    549     Data            0x00007fff660f0c38                    0x0000000000000010 0x000e0000 GCC_except_table417
    [  550]    550     Data            0x00007fff660f0c48                    0x0000000000000010 0x000e0000 GCC_except_table419
    [  551]    551     Data            0x00007fff660f0c58                    0x000000000000002c 0x000e0000 GCC_except_table420
    [  552]    552     Data            0x00007fff660f0c84                    0x0000000000000014 0x000e0000 GCC_except_table421
    [  553]    553     Data            0x00007fff660f0c98                    0x0000000000000028 0x000e0000 GCC_except_table423
    [  554]    554     Data            0x00007fff660f0cc0                    0x0000000000000044 0x000e0000 GCC_except_table426
    [  555]    555     Data            0x00007fff660f0d04                    0x0000000000000014 0x000e0000 GCC_except_table428
    [  556]    556     Data            0x00007fff660f0d18                    0x0000000000000014 0x000e0000 GCC_except_table430
    [  557]    557     Data            0x00007fff660f0d2c                    0x0000000000000010 0x000e0000 GCC_except_table431
    [  558]    558     Data            0x00007fff660f0d3c                    0x0000000000000010 0x000e0000 GCC_except_table432
    [  559]    559     Data            0x00007fff660f0d4c                    0x0000000000000010 0x000e0000 GCC_except_table433
    [  560]    560     Data            0x00007fff660f0d5c                    0x0000000000000010 0x000e0000 GCC_except_table448
    [  561]    561     Data            0x00007fff660f0d6c                    0x0000000000000014 0x000e0000 GCC_except_table487
    [  562]    562     Data            0x00007fff660f0d80                    0x000000000000004c 0x000e0000 GCC_except_table489
    [  563]    563     Data            0x00007fff660f0dcc                    0x0000000000000014 0x000e0000 GCC_except_table499
    [  564]    564     Data            0x00007fff660f0de0                    0x0000000000000014 0x000e0000 GCC_except_table501
    [  565]    565     Data            0x00007fff660f0df4                    0x000000000000001c 0x000e0000 GCC_except_table545
    [  566]    566     Data            0x00007fff660f0e10                    0x0000000000000010 0x000e0000 GCC_except_table547
    [  567]    567     Data            0x00007fff660f0e20                    0x0000000000000040 0x000e0000 GCC_except_table548
    [  568]    568     Data            0x00007fff660f0e60                    0x0000000000000014 0x000e0000 GCC_except_table555
    [  569]    569     Data            0x00007fff660f0e74                    0x0000000000000014 0x000e0000 GCC_except_table558
    [  570]    570     Data            0x00007fff660f0e88                    0x0000000000000014 0x000e0000 GCC_except_table667
    [  571]    571     Data            0x00007fff660f0e9c                    0x0000000000000010 0x000e0000 GCC_except_table670
    [  572]    572     Data            0x00007fff660f0eac                    0x0000000000000010 0x000e0000 GCC_except_table735
    [  573]    573     Data            0x00007fff660f0ebc                    0x0000000000000018 0x000e0000 GCC_except_table741
    [  574]    574     Data            0x00007fff8d7845c0                    0x0000000000000020 0x000e0000 protoPrototype (.2)
    [  575]    575     Data            0x00007fff8d7845e0                    0x0000000000000030 0x000e0000 __block_descriptor_33_e8_32c38_ZTSKZL11flushCachesP10objc_classE3$_2_e8_B16?0#8l
    [  576]    576     Data            0x00007fff8d784610                    0x0000000000000030 0x000e0000 __block_descriptor_33_e8_32c38_ZTSKZL11flushCachesP10objc_classE3$_3_e8_B16?0#8l
    [  577]    577     Data            0x00007fff8d784640                    0x0000000000000030 0x000e0000 __block_descriptor_48_e8_32c148_ZTSKZN4objc7scanner5MixinINS_11CoreScannerELNS_14SelectorBundleE2EL_Z15PrintCustomCoreELNS0_5ScopeE2EE20setCustomRecursivelyEP10objc_classbEUlS7_E__e8_B16?0#8l
    [  578]    578     Data            0x00007fff8d784670                    0x0000000000000018 0x000e0000 objc::scanner::printCustom(objc_class*, objc::SelectorBundle, bool)::SelectorBundleName
    [  579]    579     Data            0x00007fff8d784688                    0x0000000000000030 0x000e0000 __block_descriptor_48_e8_32c143_ZTSKZN4objc7scanner5MixinINS_9RRScannerELNS_14SelectorBundleE1EL_Z13PrintCustomRRELNS0_5ScopeE2EE20setCustomRecursivelyEP10objc_classbEUlS7_E__e8_B16?0#8l
    [  580]    580     Data            0x00007fff8d7846b8                    0x0000000000000030 0x000e0000 __block_descriptor_48_e8_32c146_ZTSKZN4objc7scanner5MixinINS_10AWZScannerELNS_14SelectorBundleE0EL_Z14PrintCustomAWZELNS0_5ScopeE1EE20setCustomRecursivelyEP10objc_classbEUlS7_E__e8_B16?0#8l
    [  581]    581     Data            0x00007fff8d7846e8                    0x0000000000000030 0x000e0000 __block_descriptor_48_e8_32c64_ZTSKZN10objc_class36setInstancesRequireRawIsaRecursivelyEbE3$_0_e8_B16?0#8l
    [  582]    582     Data            0x00007fff8d784718                    0x0000000000000030 0x000e0000 __block_descriptor_48_e8_32c71_ZTSKZL30getMaybeUnrealizedNonMetaClassP10objc_classP11objc_objectE3$_1_e16_v28?0^v8B16^B20l
    [  583]    583     Data            0x00007fff8d784748                    0x0000000000000030 0x000e0000 __block_descriptor_64_e8_32c61_ZTSKZL32objc_getRealizedClassList_nolockPP10objc_classiE3$_5_e8_B16?0#8l
    [  584]    584     Data            0x00007fff8d784778                    0x0000000000000030 0x000e0000 __block_descriptor_40_e8_32c61_ZTSKZL32objc_getRealizedClassList_nolockPP10objc_classiE3$_6_e8_B16?0#8l
    [  585]    585     Data            0x00007fff8d7847a8                    0x0000000000000030 0x000e0000 __block_descriptor_40_e8_32c49_ZTSKZL33objc_copyRealizedClassList_nolockPjE3$_7_e8_B16?0#8l
    [  586]    586     Data            0x00007fff8d7847d8                    0x0000000000000030 0x000e0000 __block_descriptor_48_e8_32c49_ZTSKZL33objc_copyRealizedClassList_nolockPjE3$_8_e8_B16?0#8l
    [  587]    587     Data            0x00007fff8d784808                    0x0000000000000048 0x000e0000 vtable for std::__1::__function::__func<appendHeader::$_1, std::__1::allocator<appendHeader::$_1>, void (segment_command_64 const*, long)>
    [  588]    588     Data            0x00007fff8d784850                    0x0000000000000050 0x000e0000 vtable for std::__1::__function::__func<removeHeader::$_2, std::__1::allocator<removeHeader::$_2>, void (segment_command_64 const*, long)>
    [  589]    589     Data            0x00007fff8d7848a0                    0x00000000000004f8 0x000e0000 Settings
    [  590]    590     Data            0x00007fff8d784d98                    0x0000000000000030 0x000e0000 __block_descriptor_40_e8_32c36_ZTSKZ23getPreoptimizedProtocolE3$_1_e16_v28?0^v8B16^B20l
    [  591]    591     Data            0x00007fff8d784dc8                    0x0000000000000030 0x000e0000 __block_descriptor_40_e8_32c33_ZTSKZ20getPreoptimizedClassE3$_2_e16_v28?0^v8B16^B20l
    [  592]    592     Runtime         0x00007fff8d784df8                    0x0000000000000008 0x000e0000 OBJC_LABEL_CLASS_$
    [  593]    593     Runtime         0x00007fff8d784e00                    0x0000000000000010 0x000e0000 OBJC_LABEL_CLASS_$.409
    [  594]    594     Runtime         0x00007fff8d784e10                    0x0000000000000010 0x000e0000 OBJC_LABEL_CLASS_$.518
    [  595]    595     Runtime         0x00007fff8d784e20                    0x0000000000000010 0x000e0000 OBJC_LABEL_NONLAZY_CLASS_$
    [  596]    596     Runtime         0x00007fff8d784e30                    0x0000000000000010 0x000e0000 OBJC_LABEL_NONLAZY_CLASS_$.519
    [  597]    597     Runtime         0x00007fff8d784e40                    0x0000000000000008 0x001e0080 _OBJC_LABEL_PROTOCOL_$_NSObject
    [  598]    598     Runtime         0x00007fff8d784e50                    0x0000000000000048 0x000e0000 _OBJC_CLASS_RO_$_Object
    [  599]    599     Runtime         0x00007fff8d784e98                    0x0000000000000050 0x000e0000 _OBJC_$_INSTANCE_METHODS_Object
    [  600]    600     Runtime         0x00007fff8d784ee8                    0x0000000000000028 0x000e0000 _OBJC_$_INSTANCE_VARIABLES_Object
    [  601]    601     Runtime         0x00007fff8d784f10                    0x0000000000000048 0x000e0000 _OBJC_METACLASS_RO_$_Object
    [  602]    602     Runtime         0x00007fff8d784f58                    0x0000000000000080 0x000e0000 _OBJC_$_CLASS_METHODS_Object
    [  603]    603     Runtime         0x00007fff8d784fd8                    0x0000000000000048 0x000e0000 _OBJC_METACLASS_RO_$___IncompleteProtocol
    [  604]    604     Runtime         0x00007fff8d785020                    0x0000000000000048 0x000e0000 _OBJC_CLASS_RO_$___IncompleteProtocol
    [  605]    605     Runtime         0x00007fff8d785068                    0x0000000000000048 0x000e0000 _OBJC_METACLASS_RO_$_Protocol
    [  606]    606     Runtime         0x00007fff8d7850b0                    0x0000000000000048 0x000e0000 _OBJC_CLASS_RO_$_Protocol
    [  607]    607     Runtime         0x00007fff8d7850f8                    0x0000000000000098 0x000e0000 _OBJC_$_INSTANCE_METHODS_Protocol
    [  608]    608     Runtime         0x00007fff8d785190                    0x0000000000000048 0x000e0000 _OBJC_METACLASS_RO_$_NSObject
    [  609]    609     Runtime         0x00007fff8d7851d8                    0x0000000000000470 0x000e0000 _OBJC_$_CLASS_METHODS_NSObject
    [  610]    610     Runtime         0x00007fff8d785648                    0x0000000000000018 0x000e0000 _OBJC_CLASS_PROTOCOLS_$_NSObject
    [  611]    611     Runtime         0x00007fff8d785660                    0x00000000000001d0 0x000e0000 _OBJC_$_PROTOCOL_INSTANCE_METHODS_NSObject
    [  612]    612     Runtime         0x00007fff8d785830                    0x0000000000000020 0x000e0000 _OBJC_$_PROTOCOL_INSTANCE_METHODS_OPT_NSObject
    [  613]    613     Runtime         0x00007fff8d785850                    0x0000000000000048 0x000e0000 _OBJC_$_PROP_LIST_NSObject
    [  614]    614     Runtime         0x00007fff8d785898                    0x00000000000000a0 0x000e0000 _OBJC_$_PROTOCOL_METHOD_TYPES_NSObject
    [  615]    615     Runtime         0x00007fff8d785938                    0x0000000000000048 0x000e0000 _OBJC_CLASS_RO_$_NSObject
    [  616]    616     Runtime         0x00007fff8d785980                    0x0000000000000350 0x000e0000 _OBJC_$_INSTANCE_METHODS_NSObject
    [  617]    617     Runtime         0x00007fff8d785cd0                    0x0000000000000028 0x000e0000 _OBJC_$_INSTANCE_VARIABLES_NSObject
    [  618]    618     Runtime         0x00007fff8d785cf8                    0x0000000000000048 0x000e0000 _OBJC_$_PROP_LIST_NSObject.96
    [  619]    619     Runtime         0x00007fff8d785d40                    0x0000000000000048 0x000e0000 _OBJC_METACLASS_RO_$___NSUnrecognizedTaggedPointer
    [  620]    620     Runtime         0x00007fff8d785d88                    0x0000000000000048 0x000e0000 _OBJC_CLASS_RO_$___NSUnrecognizedTaggedPointer
    [  621]    621     Runtime         0x00007fff8d785dd0                    0x0000000000000050 0x000e0000 _OBJC_$_INSTANCE_METHODS___NSUnrecognizedTaggedPointer
    [  622]    622     ObjCMetaClass   0x00007fff8d786050                    0x0000000000000028 0x000e0000 __IncompleteProtocol
    [  623]    623     ObjCClass       0x00007fff8d786078                    0x0000000000000028 0x000e0000 __IncompleteProtocol
    [  624]    624     ObjCMetaClass   0x00007fff8d786140                    0x0000000000000028 0x000e0000 __NSUnrecognizedTaggedPointer
    [  625]    625     ObjCClass       0x00007fff8d786168                    0x0000000000000028 0x001e0000 __NSUnrecognizedTaggedPointer
    [  626]    626     Data            0x00007fff8d786190                    0x0000000000000100 0x001e0000 objc_restartableRanges
    [  627]    627     Data            0x00007fff8d786b10                    0x0000000000000020 0x000e0000 protoPrototype
    [  628]    628     Data            0x00007fff8d786b30                    0x0000000000000008 0x000e0000 objcMsgLogFD
    [  629]    629     Data            0x00007fff8d786b38                    0x0000000000000008 0x000e0000 exception_matcher
    [  630]    630     Data            0x00007fff8d786b40                    0x0000000000000008 0x000e0000 exception_preprocessor
    [  631]    631     Data            0x00007fff8d786b48                    0x0000000000000008 0x000e0000 uncaught_handler
    [  632]    632     Data            0x00007fff8d786b50                    0x0000000000000070 0x000e0000 classInitLock
    [  633]    633     Data            0x00007fff8d786bf8                    0x0000000000000008 0x000e0000 GetClassHook
    [  634]    634     Data            0x00007fff8d786c00                    0x0000000000000008 0x001e0000 _objc_forward_handler
    [  635]    635     Data            0x00007fff8d786c08                    0x0000000000000008 0x001e0000 _objc_forward_stret_handler
    [  636]    636     Data            0x00007fff8d786c10                    0x0000000000000008 0x000e0000 GetImageNameHook
    [  637]    637     Data            0x00007fff8d786c18                    0x0000000000000008 0x000e0000 SetAssocHook
    [  638]    638     Data            0x00007fff8d786c20                    0x0000000000000008 0x000e0000 badAllocHandler
    [  639]    639     Data            0x00007fff8d786c28                    0x0000000000000060 0x001e0080 _OBJC_PROTOCOL_$_NSObject
    [  640]    640     Data            0x00007fff8d786c88                    0x0000000000000008 0x000e0000 opt
    [  641]    641     Data            0x00007fff8d786ca8                    0x0000000000000040 0x001e0000 gCRAnnotations
    [  642]    642     Data            0x00007fff8d786d40                    0x0000000000000008 0x000e0000 prototypes
    [  643]    643     Data            0x00007fff8d786d48                    0x0000000000000008 0x000e0000 prototypes (.1)
    [  644]    644     Data            0x00007fff8d786d50                    0x0000000000000040 0x000e0000 cache_counts
    [  645]    645     Data            0x00007fff8d786d90                    0x0000000000000008 0x000e0000 cache_allocations
    [  646]    646     Data            0x00007fff8d786d98                    0x0000000000000008 0x000e0000 emptyBucketsForCapacity(unsigned int, bool)::emptyBucketsListCount
    [  647]    647     Data            0x00007fff8d786da0                    0x0000000000000008 0x000e0000 emptyBucketsForCapacity(unsigned int, bool)::emptyBucketsList
    [  648]    648     Data            0x00007fff8d786da8                    0x0000000000000008 0x000e0000 _garbage_make_room()::first
    [  649]    649     Data            0x00007fff8d786db0                    0x0000000000000008 0x000e0000 garbage_refs
    [  650]    650     Data            0x00007fff8d786db8                    0x0000000000000008 0x000e0000 garbage_max
    [  651]    651     Data            0x00007fff8d786dc0                    0x0000000000000008 0x000e0000 garbage_count
    [  652]    652     Data            0x00007fff8d786dc8                    0x0000000000000008 0x000e0000 garbage_byte_size
    [  653]    653     Data            0x00007fff8d786dd0                    0x0000000000000008 0x000e0000 cache_collections
    [  654]    654     Data            0x00007fff8d786dd8                    0x0000000000000004 0x000e0000 shouldUseRestartableRanges
    [  655]    655     Data            0x00007fff8d786ddc                    0x0000000000000004 0x000e0000 objcMsgLogLock
    [  656]    656     Data            0x00007fff8d786de0                    0x0000000000000004 0x000e0000 objcMsgLogEnabled
    [  657]    657     Data            0x00007fff8d786de4                    0x0000000000000004 0x000e0000 class_respondsToMethod::warned
    [  658]    658     Data            0x00007fff8d786de8                    0x0000000000000004 0x000e0000 class_lookupMethod::warned
    [  659]    659     Data            0x00007fff8d786dec                    0x0000000000000004 0x000e0000 crashlog_lock
    [  660]    660     Data            0x00007fff8d786df0                    0x0000000000000008 0x000e0000 AltHandlerDebugLock
    [  661]    661     Data            0x00007fff8d786df8                    0x0000000000000008 0x000e0000 DebugLists
    [  662]    662     Data            0x00007fff8d786e00                    0x0000000000000008 0x000e0000 DebugCounter
    [  663]    663     Data            0x00007fff8d786e08                    0x0000000000000008 0x000e0000 objc_addExceptionHandler::warned
    [  664]    664     Data            0x00007fff8d786e10                    0x0000000000000008 0x000e0000 old_terminate
    [  665]    665     Data            0x00007fff8d786e18                    0x0000000000000008 0x000e0000 pendingInitializeMap
    [  666]    666     Data            0x00007fff8d786e20                    0x0000000000000018 0x000e0000 willInitializeFuncs
    [  667]    667     Data            0x00007fff8d786e38                    0x0000000000000004 0x000e0000 loadable_classes_used
    [  668]    668     Data            0x00007fff8d786e3c                    0x0000000000000004 0x000e0000 loadable_classes_allocated
    [  669]    669     Data            0x00007fff8d786e40                    0x0000000000000008 0x000e0000 loadable_classes
    [  670]    670     Data            0x00007fff8d786e48                    0x0000000000000004 0x000e0000 loadable_categories_used
    [  671]    671     Data            0x00007fff8d786e4c                    0x0000000000000004 0x000e0000 loadable_categories_allocated
    [  672]    672     Data            0x00007fff8d786e50                    0x0000000000000008 0x000e0000 loadable_categories
    [  673]    673     Data            0x00007fff8d786e58                    0x0000000000000004 0x000e0000 call_load_methods::loading
    [  674]    674     Data            0x00007fff8d786e5c                    0x0000000000000004 0x000e0000 runtimeLock
    [  675]    675     Data            0x00007fff8d786e60                    0x0000000000000008 0x000e0000 selLock
    [  676]    676     Data            0x00007fff8d786e68                    0x0000000000000008 0x000e0000 loadMethodLock
    [  677]    677     Data            0x00007fff8d786e70                    0x0000000000000004 0x000e0000 didCallDyldNotifyRegister
    [  678]    678     Data            0x00007fff8d786e74                    0x0000000000000004 0x000e0000 DemangleCacheLock
    [  679]    679     Data            0x00007fff8d786e78                    0x0000000000000020 0x000e0000 objc::smallMethodIMPMap
    [  680]    680     Data            0x00007fff8d786e98                    0x0000000000000020 0x000e0000 method_t::getSmallDescription() const::map
    [  681]    681     Data            0x00007fff8d786eb8                    0x0000000000000004 0x000e0000 fixed_up_method_list
    [  682]    682     Data            0x00007fff8d786ebc                    0x0000000000000004 0x000e0000 uniqued_method_list
    [  683]    683     Data            0x00007fff8d786ec0                    0x0000000000000004 0x000e0000 fixed_up_protocol
    [  684]    684     Data            0x00007fff8d786ec4                    0x0000000000000004 0x000e0000 canonical_protocol
    [  685]    685     Data            0x00007fff8d786ec8                    0x0000000000000010 0x000e0000 classCopyFixupHandlers
    [  686]    686     Data            0x00007fff8d786ed8                    0x0000000000000020 0x000e0000 remappedClasses(bool)::remapped_class_map
    [  687]    687     Data            0x00007fff8d786ef8                    0x0000000000000008 0x000e0000 realizeClassWithoutSwift(objc_class*, objc_class*)::hackedDispatch
    [  688]    688     Data            0x00007fff8d786f00                    0x0000000000000008 0x000e0000 _firstRealizedClass
    [  689]    689     Data            0x00007fff8d786f08                    0x0000000000000018 0x000e0000 objc::unattachedCategories
    [  690]    690     Data            0x00007fff8d786f20                    0x0000000000000018 0x000e0000 objc::allocatedClasses
    [  691]    691     Data            0x00007fff8d786f38                    0x0000000000000008 0x000e0000 objc::scanner::NSObjectSwizzledMask
    [  692]    692     Data            0x00007fff8d786f40                    0x0000000000000004 0x000e0000 getMaybeUnrealizedNonMetaClass(objc_class*, objc_object*)::total
    [  693]    693     Data            0x00007fff8d786f44                    0x0000000000000004 0x000e0000 getMaybeUnrealizedNonMetaClass(objc_class*, objc_object*)::named
    [  694]    694     Data            0x00007fff8d786f48                    0x0000000000000004 0x000e0000 getMaybeUnrealizedNonMetaClass(objc_class*, objc_object*)::secondary
    [  695]    695     Data            0x00007fff8d786f4c                    0x0000000000000004 0x000e0000 getMaybeUnrealizedNonMetaClass(objc_class*, objc_object*)::dyld3
    [  696]    696     Data            0x00007fff8d786f50                    0x0000000000000008 0x000e0000 getMaybeUnrealizedNonMetaClass(objc_class*, objc_object*)::sharedcache
    [  697]    697     Data            0x00007fff8d786f58                    0x0000000000000008 0x000e0000 nonmeta_class_map
    [  698]    698     Data            0x00007fff8d786f60                    0x0000000000000008 0x000e0000 future_named_class_map
    [  699]    699     Data            0x00007fff8d786f68                    0x0000000000000001 0x000e0000 didInitialAttachCategories
    [  700]    700     Data            0x00007fff8d786f69                    0x0000000000000007 0x000e0000 _read_images::doneOnce
    [  701]    701     Data            0x00007fff8d786f70                    0x0000000000000008 0x000e0000 _read_images::UnfixedSelectors
    [  702]    702     Data            0x00007fff8d786f78                    0x0000000000000008 0x000e0000 UnfixedProtocolReferences
    [  703]    703     Data            0x00007fff8d786f80                    0x0000000000000004 0x000e0000 _read_images::PreoptTotalClasses
    [  704]    704     Data            0x00007fff8d786f84                    0x0000000000000004 0x000e0000 _read_images::PreoptOptimizedClasses
    [  705]    705     Data            0x00007fff8d786f88                    0x0000000000000004 0x000e0000 _read_images::PreoptTotalMethodLists
    [  706]    706     Data            0x00007fff8d786f8c                    0x0000000000000004 0x000e0000 _read_images::PreoptOptimizedMethodLists
    [  707]    707     Data            0x00007fff8d786f90                    0x0000000000000008 0x000e0000 protocols()::protocol_map
    [  708]    708     Data            0x00007fff8d786f98                    0x0000000000000008 0x000e0000 DemangleCache
    [  709]    709     Data            0x00007fff8d786fa0                    0x0000000000000001 0x000e0000 PrintImages
    [  710]    710     Data            0x00007fff8d786fa1                    0x0000000000000001 0x000e0000 PrintImageTimes
    [  711]    711     Data            0x00007fff8d786fa2                    0x0000000000000001 0x000e0000 PrintLoading
    [  712]    712     Data            0x00007fff8d786fa3                    0x0000000000000001 0x000e0000 PrintInitializing
    [  713]    713     Data            0x00007fff8d786fa4                    0x0000000000000001 0x000e0000 PrintResolving
    [  714]    714     Data            0x00007fff8d786fa5                    0x0000000000000001 0x000e0000 PrintConnecting
    [  715]    715     Data            0x00007fff8d786fa6                    0x0000000000000001 0x000e0000 PrintProtocols
    [  716]    716     Data            0x00007fff8d786fa7                    0x0000000000000001 0x000e0000 PrintIvars
    [  717]    717     Data            0x00007fff8d786fa8                    0x0000000000000001 0x000e0000 PrintVtables
    [  718]    718     Data            0x00007fff8d786fa9                    0x0000000000000001 0x000e0000 PrintVtableImages
    [  719]    719     Data            0x00007fff8d786faa                    0x0000000000000001 0x000e0000 PrintCaches
    [  720]    720     Data            0x00007fff8d786fab                    0x0000000000000001 0x000e0000 PrintFuture
    [  721]    721     Data            0x00007fff8d786fac                    0x0000000000000001 0x000e0000 PrintPreopt
    [  722]    722     Data            0x00007fff8d786fad                    0x0000000000000001 0x000e0000 PrintCxxCtors
    [  723]    723     Data            0x00007fff8d786fae                    0x0000000000000001 0x000e0000 PrintExceptions
    [  724]    724     Data            0x00007fff8d786faf                    0x0000000000000001 0x000e0000 PrintExceptionThrow
    [  725]    725     Data            0x00007fff8d786fb0                    0x0000000000000001 0x000e0000 PrintAltHandlers
    [  726]    726     Data            0x00007fff8d786fb1                    0x0000000000000001 0x000e0000 PrintReplacedMethods
    [  727]    727     Data            0x00007fff8d786fb2                    0x0000000000000001 0x000e0000 PrintDeprecation
    [  728]    728     Data            0x00007fff8d786fb3                    0x0000000000000001 0x000e0000 PrintPoolHiwat
    [  729]    729     Data            0x00007fff8d786fb4                    0x0000000000000001 0x000e0000 PrintCustomCore
    [  730]    730     Data            0x00007fff8d786fb5                    0x0000000000000001 0x000e0000 PrintCustomRR
    [  731]    731     Data            0x00007fff8d786fb6                    0x0000000000000001 0x000e0000 PrintCustomAWZ
    [  732]    732     Data            0x00007fff8d786fb7                    0x0000000000000001 0x000e0000 PrintRawIsa
    [  733]    733     Data            0x00007fff8d786fb8                    0x0000000000000001 0x000e0000 DebugUnload
    [  734]    734     Data            0x00007fff8d786fb9                    0x0000000000000001 0x000e0000 DebugFragileSuperclasses
    [  735]    735     Data            0x00007fff8d786fba                    0x0000000000000001 0x000e0000 DebugNilSync
    [  736]    736     Data            0x00007fff8d786fbb                    0x0000000000000001 0x000e0000 DebugNonFragileIvars
    [  737]    737     Data            0x00007fff8d786fbc                    0x0000000000000001 0x000e0000 DebugAltHandlers
    [  738]    738     Data            0x00007fff8d786fbd                    0x0000000000000001 0x000e0000 DebugMissingPools
    [  739]    739     Data            0x00007fff8d786fbe                    0x0000000000000001 0x000e0000 DebugPoolAllocation
    [  740]    740     Data            0x00007fff8d786fbf                    0x0000000000000001 0x000e0000 DebugDuplicateClasses
    [  741]    741     Data            0x00007fff8d786fc0                    0x0000000000000001 0x000e0000 DebugDontCrash
    [  742]    742     Data            0x00007fff8d786fc1                    0x0000000000000001 0x000e0000 DisableVtables
    [  743]    743     Data            0x00007fff8d786fc2                    0x0000000000000001 0x000e0000 DisablePreopt
    [  744]    744     Data            0x00007fff8d786fc3                    0x0000000000000001 0x000e0000 DisableTaggedPointers
    [  745]    745     Data            0x00007fff8d786fc4                    0x0000000000000001 0x000e0000 DisableTaggedPointerObfuscation
    [  746]    746     Data            0x00007fff8d786fc5                    0x0000000000000001 0x000e0000 DisableNonpointerIsa
    [  747]    747     Data            0x00007fff8d786fc6                    0x0000000000000002 0x000e0000 DisableInitializeForkSafety
    [  748]    748     Data            0x00007fff8d786fc8                    0x0000000000000008 0x000e0000 SEL_cxx_construct
    [  749]    749     Data            0x00007fff8d786fd0                    0x0000000000000008 0x000e0000 SEL_cxx_destruct
    [  750]    750     Data            0x00007fff8d786fd8                    0x0000000000000010 0x000e0000 dataSegmentsRanges
    [  751]    751     Data            0x00007fff8d786fe8                    0x0000000000000008 0x000e0000 FirstHeader
    [  752]    752     Data            0x00007fff8d786ff0                    0x0000000000000008 0x000e0000 LastHeader
    [  753]    753     Data            0x00007fff8d786ff8                    0x0000000000000008 0x000e0000 MultithreadedForkChild
    [  754]    754     Data            0x00007fff8d787000                    0x0000000000000008 0x000e0000 enumerationMutationHandler
    [  755]    755     Data            0x00007fff8d787008                    0x0000000000000038 0x000e0000 namedSelectors
    [  756]    756     Data            0x00007fff8d787040                    0x0000000000001000 0x000e0000 sDataLists
    [  757]    757     Data            0x00007fff8d788040                    0x0000000000001000 0x000e0000 PropertyLocks
    [  758]    758     Data            0x00007fff8d789040                    0x0000000000001000 0x000e0000 StructLocks
    [  759]    759     Data            0x00007fff8d78a040                    0x0000000000001000 0x000e0000 CppObjectLocks
    [  760]    760     Data            0x00007fff8d78b040                    0x0000000000000008 0x000e0000 AssociationsManagerLock
    [  761]    761     Data            0x00007fff8d78b048                    0x0000000000000018 0x000e0000 objc::AssociationsManager::_mapStorage
    [  762]    762     Data            0x00007fff8d78b060                    0x0000000000000028 0x000e0000 loadImageFuncs
    [  763]    763     Data            0x00007fff8d78b088                    0x0000000000000001 0x000e0000 map_images_nolock::firstTime
    [  764]    764     Data            0x00007fff8d78b089                    0x0000000000000001 0x000e0000 ForkIsMultithreaded
    [  765]    765     Data            0x00007fff8d78b08a                    0x0000000000000006 0x000e0000 _objc_init::initialized
    [  766]    766     Data            0x00007fff8d78b090                    0x0000000000000008 0x000e0000 Trampolines
    [  767]    767     Data            0x00007fff8d78b098                    0x0000000000000028 0x000e0000 HeadPageGroup
    [  768]    768     Data            0x00007fff8d78b0c0                    0x0000000000001000 0x000e0000 (anonymous namespace)::SideTablesMap
    [  769]    769     Data            0x00007fff8d78c0c0                    0x0000000000000001 0x000e0000 AutoreleasePoolPage::badPop(void*)::complained
    [  770]    770     Data            0x00007fff8d78c0c1                    0x0000000000000001 0x000e0000 preoptimized
    [  771]    771   X Code            0x00007fff660d598f                    0x0000000000000071 0x000f0000 NXCompareHashTables
    [  772]    772   X Code            0x00007fff660d5b2d                    0x000000000000008c 0x000f0000 NXCompareMapTables
    [  773]    773   X Code            0x00007fff660d5a00                    0x00000000000000b5 0x000f0000 NXCopyHashTable
    [  774]    774   X Code            0x00007fff660d4058                    0x000000000000000d 0x000f0000 NXCountHashTable
    [  775]    775   X Code            0x00007fff660cbb9e                    0x0000000000000011 0x000f0000 NXCountMapTable
    [  776]    776   X Code            0x00007fff660c5756                    0x0000000000000022 0x000f0000 NXCreateHashTable
    [  777]    777   X Code            0x00007fff660c5778                    0x00000000000001a5 0x000f0000 NXCreateHashTableFromZone
    [  778]    778   X Code            0x00007fff660c55a2                    0x0000000000000023 0x000f0000 NXCreateMapTable
    [  779]    779   X Code            0x00007fff660c55c5                    0x0000000000000191 0x000f0000 NXCreateMapTableFromZone
    [  780]    780   X Code            0x00007fff660d5910                    0x0000000000000063 0x000f0000 NXEmptyHashTable
    [  781]    781   X Code            0x00007fff660d4065                    0x0000000000000031 0x000f0000 NXFreeHashTable
    [  782]    782   X Code            0x00007fff660cbbaf                    0x0000000000000029 0x000f0000 NXFreeMapTable
    [  783]    783   X Code            0x00007fff660c591d                    0x00000000000000bc 0x000f0000 NXHashGet
    [  784]    784   X Code            0x00007fff660c5a3b                    0x0000000000000197 0x000f0000 NXHashInsert
    [  785]    785   X Code            0x00007fff660d426a                    0x000000000000019b 0x000f0000 NXHashInsertIfAbsent
    [  786]    786   X Code            0x00007fff660d3d37                    0x00000000000000b4 0x000f0000 NXHashMember
    [  787]    787   X Code            0x00007fff660d3deb                    0x000000000000026d 0x000f0000 NXHashRemove
    [  788]    788   X Code            0x00007fff660d0f9c                    0x0000000000000004 0x000f0000 NXInitHashState
    [  789]    789   X Code            0x00007fff660d5cf9                    0x0000000000000006 0x000f0000 NXInitMapState
    [  790]    790   X Code            0x00007fff660c6102                    0x0000000000000025 0x000f0000 NXMapGet
    [  791]    791   X Code            0x00007fff660c6437                    0x000000000000019f 0x000f0000 NXMapInsert
    [  792]    792   X Code            0x00007fff660d4809                    0x000000000000000c 0x000f0000 NXMapMember
    [  793]    793   X Code            0x00007fff660c6f1a                    0x00000000000002ea 0x000f0000 NXMapRemove
    [  794]    794   X Code            0x00007fff660c5cf6                    0x0000000000000074 0x000f0000 NXNextHashState
    [  795]    795   X Code            0x00007fff660d5cff                    0x000000000000004e 0x000f0000 NXNextMapState
    [  796]    796   X Code            0x00007fff660c5e28                    0x000000000000000c 0x000f0000 NXNoEffectFree
    [  797]    797   X Code            0x00007fff660c5e34                    0x0000000000000012 0x000f0000 NXPtrHash
    [  798]    798   X Code            0x00007fff660c720f                    0x0000000000000016 0x000f0000 NXPtrIsEqual
    [  799]    799   X Data            0x00007fff8d784500                    0x0000000000000020 0x000f0000 NXPtrPrototype
    [  800]    800   X Data            0x00007fff8d784540                    0x0000000000000020 0x000f0000 NXPtrStructKeyPrototype
    [  801]    801   X Data            0x00007fff8d784580                    0x0000000000000020 0x000f0000 NXPtrValueMapPrototype
    [  802]    802   X Code            0x00007fff660d58eb                    0x0000000000000008 0x000f0000 NXReallyFree
    [  803]    803   X Code            0x00007fff660d5973                    0x000000000000001c 0x000f0000 NXResetHashTable
    [  804]    804   X Code            0x00007fff660cbbd8                    0x0000000000000076 0x000f0000 NXResetMapTable
    [  805]    805   X Code            0x00007fff660d5839                    0x0000000000000059 0x000f0000 NXStrHash
    [  806]    806   X Code            0x00007fff660d5892                    0x000000000000003f 0x000f0000 NXStrIsEqual
    [  807]    807   X Data            0x00007fff8d784520                    0x0000000000000020 0x000f0000 NXStrPrototype
    [  808]    808   X Data            0x00007fff8d784560                    0x0000000000000020 0x000f0000 NXStrStructKeyPrototype
    [  809]    809   X Data            0x00007fff8d7845a0                    0x0000000000000020 0x000f0000 NXStrValueMapPrototype
    [  810]    810   X ObjCClass       0x00007fff8d786118                    0x0000000000000028 0x000f0000 NSObject
    [  811]    811   X ObjCClass       0x00007fff8d786000                    0x0000000000000028 0x000f0000 Object
    [  812]    812   X ObjCClass       0x00007fff8d7860c8                    0x0000000000000028 0x000f0000 Protocol
    [  813]    813   X Data            0x00007fff8d784480                    0x0000000000000018 0x000f0000 OBJC_EHTYPE_id
    [  814]    814   X ObjCIVar        0x00007fff8d785f00                    0x0000000000000008 0x000f0000 NSObject.isa
    [  815]    815   X ObjCIVar        0x00007fff8d785ef8                    0x0000000000000008 0x000f0000 Object.isa
    [  816]    816   X ObjCMetaClass   0x00007fff8d7860f0                    0x0000000000000028 0x000f0000 NSObject
    [  817]    817   X ObjCMetaClass   0x00007fff8d786028                    0x0000000000000028 0x000f0000 Object
    [  818]    818   X ObjCMetaClass   0x00007fff8d7860a0                    0x0000000000000028 0x000f0000 Protocol
    [  819]    819   X Code            0x00007fff660d4bd2                    0x00000000000001ec 0x000f0000 __objc_personality_v0
    [  820]    820   X Code            0x00007fff660d5e64                    0x0000000000000022 0x000f0000 _class_getIvarMemoryManagement
    [  821]    821   X Code            0x00007fff660dc6cc                    0x0000000000000022 0x000f0000 _class_isFutureClass
    [  822]    822   X Code            0x00007fff660e1c4d                    0x0000000000000010 0x000f0000 _objcInit
    [  823]    823   X Code            0x00007fff660d7718                    0x000000000000017e 0x000f0000 _objc_addWillInitializeClassFunc
    [  824]    824   X Code            0x00007fff660e3d32                    0x000000000000012d 0x000f0000 _objc_atfork_child
    [  825]    825   X Code            0x00007fff660e3b65                    0x00000000000001cd 0x000f0000 _objc_atfork_parent
    [  826]    826   X Code            0x00007fff660e3952                    0x0000000000000213 0x000f0000 _objc_atfork_prepare
    [  827]    827   X Code            0x00007fff660e5445                    0x0000000000000005 0x000f0000 _objc_autoreleasePoolPop
    [  828]    828   X Code            0x00007fff660e544a                    0x0000000000000008 0x000f0000 _objc_autoreleasePoolPrint
    [  829]    829   X Code            0x00007fff660e5440                    0x0000000000000005 0x000f0000 _objc_autoreleasePoolPush
    [  830]    830   X Code            0x00007fff660e5452                    0x000000000000000d 0x000f0000 _objc_deallocOnMainThreadHelper
    [  831]    831   X Data            0x00007fff660e73f0                    0x0000000000004010 0x000f0000 _objc_empty_cache
    [  832]    832   X Code            0x00007fff660dc6ee                    0x00000000000001a0 0x000f0000 _objc_flush_caches
    [  833]    833   X Code            0x00007fff660e0f22                    0x0000000000000025 0x000f0000 _objc_getClassForTag
    [  834]    834   X Code            0x00007fff660e0ec0                    0x0000000000000008 0x000f0000 _objc_getFreedObjectClass
    [  835]    835   X Code            0x00007fff660c2f4e                    0x00000000000004fb 0x000f0000 _objc_init
    [  836]    836   X Code            0x00007fff660c8bc0                    0x0000000000000040 0x000f0000 _objc_msgForward
    [  837]    837   X Code            0x00007fff660c8c00                    0x0000000000000040 0x000f0000 _objc_msgForward_stret
    [  838]    838   X Code            0x00007fff660dbfa0                    0x000000000000013b 0x000f0000 _objc_realizeClassFromSwift
    [  839]    839   X Code            0x00007fff660ca7b3                    0x00000000000000cb 0x000f0000 _objc_registerTaggedPointerClass
    [  840]    840   X Code            0x00007fff660cad68                    0x000000000000002c 0x000f0000 _objc_rootAlloc
    [  841]    841   X Code            0x00007fff660d1dae                    0x000000000000008a 0x000f0000 _objc_rootAllocWithZone
    [  842]    842   X Code            0x00007fff660ce6cb                    0x000000000000006d 0x000f0000 _objc_rootAutorelease
    [  843]    843   X Code            0x00007fff660c9d48                    0x0000000000000044 0x000f0000 _objc_rootDealloc
    [  844]    844   X Code            0x00007fff660e5277                    0x0000000000000012 0x000f0000 _objc_rootFinalize
    [  845]    845   X Code            0x00007fff660d4a62                    0x0000000000000006 0x000f0000 _objc_rootHash
    [  846]    846   X Code            0x00007fff660e5289                    0x0000000000000011 0x000f0000 _objc_rootInit
    [  847]    847   X Code            0x00007fff660d5759                    0x0000000000000029 0x000f0000 _objc_rootIsDeallocating
    [  848]    848   X Code            0x00007fff660d1ea0                    0x0000000000000082 0x000f0000 _objc_rootRelease
    [  849]    849   X Code            0x00007fff660cdb4a                    0x0000000000000087 0x000f0000 _objc_rootReleaseWasZero
    [  850]    850   X Code            0x00007fff660cdb02                    0x0000000000000048 0x000f0000 _objc_rootRetain
    [  851]    851   X Code            0x00007fff660d3128                    0x00000000000001d9 0x000f0000 _objc_rootRetainCount
    [  852]    852   X Code            0x00007fff660d5782                    0x000000000000007e 0x000f0000 _objc_rootTryRetain
    [  853]    853   X Code            0x00007fff660d459d                    0x000000000000000d 0x000f0000 _objc_rootZone
    [  854]    854   X Code            0x00007fff660ca87e                    0x0000000000000012 0x000f0000 _objc_setBadAllocHandler
    [  855]    855   X Code            0x00007fff660d7d7a                    0x00000000000000cc 0x000f0000 _objc_setClassCopyFixupHandler
    [  856]    856   X Code            0x00007fff660ce3b6                    0x00000000000000cb 0x000f0000 _protocol_getMethodTypeEncoding
    [  857]    857   X Code            0x00007fff660d36bb                    0x0000000000000399 0x000f0000 class_addIvar
    [  858]    858   X Code            0x00007fff660d0972                    0x00000000000000d1 0x000f0000 class_addMethod
    [  859]    859   X Code            0x00007fff660dff39                    0x00000000000000f7 0x000f0000 class_addMethodsBulk
    [  860]    860   X Code            0x00007fff660e03f2                    0x0000000000000011 0x000f0000 class_addProperty
    [  861]    861   X Code            0x00007fff660d415c                    0x000000000000010e 0x000f0000 class_addProtocol
    [  862]    862   X Code            0x00007fff660cd31f                    0x0000000000000269 0x000f0000 class_conformsToProtocol
    [  863]    863   X Code            0x00007fff660de57a                    0x00000000000000f3 0x000f0000 class_copyImpCache
    [  864]    864   X Code            0x00007fff660d12a4                    0x000000000000011d 0x000f0000 class_copyIvarList
    [  865]    865   X Code            0x00007fff660d1975                    0x0000000000000178 0x000f0000 class_copyMethodList
    [  866]    866   X Code            0x00007fff660d13d8                    0x00000000000002a6 0x000f0000 class_copyPropertyList
    [  867]    867   X Code            0x00007fff660d0fa0                    0x00000000000002e0 0x000f0000 class_copyProtocolList
    [  868]    868   X Code            0x00007fff660c7c8e                    0x0000000000000082 0x000f0000 class_createInstance
    [  869]    869   X Code            0x00007fff660d44b4                    0x00000000000000b5 0x000f0000 class_createInstanceFromZone
    [  870]    870   X Code            0x00007fff660e0dd3                    0x00000000000000e6 0x000f0000 class_createInstances
    [  871]    871   X Code            0x00007fff660d01a5                    0x0000000000000035 0x000f0000 class_getClassMethod
    [  872]    872   X Code            0x00007fff660d629d                    0x0000000000000024 0x000f0000 class_getClassVariable
    [  873]    873   X Code            0x00007fff660cd295                    0x0000000000000030 0x000f0000 class_getImageName
    [  874]    874   X Code            0x00007fff660cfde7                    0x00000000000000ae 0x000f0000 class_getInstanceMethod
    [  875]    875   X Code            0x00007fff660d2f83                    0x0000000000000038 0x000f0000 class_getInstanceSize
    [  876]    876   X Code            0x00007fff660d2b8d                    0x000000000000001d 0x000f0000 class_getInstanceVariable
    [  877]    877   X Code            0x00007fff660d2c50                    0x000000000000003a 0x000f0000 class_getIvarLayout
    [  878]    878   X Code            0x00007fff660cc804                    0x000000000000002d 0x000f0000 class_getMethodImplementation
    [  879]    879   X Code            0x00007fff660d5e27                    0x000000000000003d 0x000f0000 class_getMethodImplementation_stret
    [  880]    880   X Code            0x00007fff660cc831                    0x0000000000000021 0x000f0000 class_getName
    [  881]    881   X Code            0x00007fff660d3a66                    0x0000000000000248 0x000f0000 class_getProperty
    [  882]    882   X Code            0x00007fff660cbd64                    0x0000000000000014 0x000f0000 class_getSuperclass
    [  883]    883   X Code            0x00007fff660cd839                    0x000000000000003c 0x000f0000 class_getVersion
    [  884]    884   X Code            0x00007fff660cfd10                    0x0000000000000038 0x000f0000 class_getWeakIvarLayout
    [  885]    885   X Code            0x00007fff660ccd91                    0x0000000000000015 0x000f0000 class_isMetaClass
    [  886]    886   X Code            0x00007fff660d630c                    0x0000000000000066 0x000f0000 class_lookupMethod
    [  887]    887   X Code            0x00007fff660d4096                    0x00000000000000c6 0x000f0000 class_replaceMethod
    [  888]    888   X Code            0x00007fff660e0318                    0x00000000000000da 0x000f0000 class_replaceMethodsBulk
    [  889]    889   X Code            0x00007fff660e05ce                    0x000000000000000b 0x000f0000 class_replaceProperty
    [  890]    890   X Code            0x00007fff660d62c1                    0x000000000000004b 0x000f0000 class_respondsToMethod
    [  891]    891   X Code            0x00007fff660cd242                    0x000000000000000f 0x000f0000 class_respondsToSelector
    [  892]    892   X Code            0x00007fff660dfba0                    0x00000000000001c5 0x000f0000 class_setIvarLayout
    [  893]    893   X Code            0x00007fff660cb5b9                    0x0000000000000105 0x000f0000 class_setSuperclass
    [  894]    894   X Code            0x00007fff660cb710                    0x00000000000000f2 0x000f0000 class_setVersion
    [  895]    895   X Code            0x00007fff660dfd65                    0x00000000000001d4 0x000f0000 class_setWeakIvarLayout
    [  896]    896   X Code            0x00007fff660df5cb                    0x0000000000000020 0x000f0000 gdb_class_getClass
    [  897]    897   X Data            0x00007fff8d786cf8                    0x0000000000000008 0x000f0000 gdb_objc_realized_classes
    [  898]    898   X Code            0x00007fff660df5eb                    0x0000000000000055 0x000f0000 gdb_object_getClass
    [  899]    899   X Code            0x00007fff660e41c0                    0x00000000000000a0 0x000f0000 imp_getBlock
    [  900]    900   X Code            0x00007fff660d0827                    0x000000000000014b 0x000f0000 imp_implementationWithBlock
    [  901]    901   X Code            0x00007fff660e42b0                    0x00000000000000ef 0x000f0000 imp_removeBlock
    [  902]    902   X Code            0x00007fff660d6372                    0x0000000000000050 0x000f0000 instrumentObjcMessageSends
    [  903]    903   X Code            0x00007fff660cfce4                    0x0000000000000011 0x000f0000 ivar_getName
    [  904]    904   X Code            0x00007fff660cfcf5                    0x000000000000001b 0x000f0000 ivar_getOffset
    [  905]    905   X Code            0x00007fff660d13c1                    0x0000000000000017 0x000f0000 ivar_getTypeEncoding
    [  906]    906   X Code            0x00007fff660d1aed                    0x0000000000000098 0x000f0000 method_copyArgumentType
    [  907]    907   X Code            0x00007fff660d04ce                    0x0000000000000073 0x000f0000 method_copyReturnType
    [  908]    908   X Code            0x00007fff660d5607                    0x000000000000013a 0x000f0000 method_exchangeImplementations
    [  909]    909   X Code            0x00007fff660cfeda                    0x00000000000000ab 0x000f0000 method_getArgumentType
    [  910]    910   X Code            0x00007fff660d1b85                    0x00000000000001db 0x000f0000 method_getDescription
    [  911]    911   X Code            0x00007fff660cfe95                    0x0000000000000045 0x000f0000 method_getImplementation
    [  912]    912   X Code            0x00007fff660d04a4                    0x000000000000002a 0x000f0000 method_getName
    [  913]    913   X Code            0x00007fff660d0418                    0x000000000000008c 0x000f0000 method_getNumberOfArguments
    [  914]    914   X Code            0x00007fff660d3cae                    0x0000000000000089 0x000f0000 method_getReturnType
    [  915]    915   X Code            0x00007fff660cff85                    0x000000000000002c 0x000f0000 method_getTypeEncoding
    [  916]    916   X Code            0x00007fff660c8e00                    0x00000000000000c0 0x000f0000 method_invoke
    [  917]    917   X Code            0x00007fff660c8ec0                    0x000000000000009e 0x000f0000 method_invoke_stret
    [  918]    918   X Code            0x00007fff660d0e76                    0x00000000000000af 0x000f0000 method_setImplementation
    [  919]    919   X Code            0x00007fff660d1f51                    0x000000000000081f 0x000f0000 objc_addExceptionHandler
    [  920]    920   X Code            0x00007fff660e380c                    0x000000000000013e 0x000f0000 objc_addLoadImageFunc
    [  921]    921   X Code            0x00007fff660e4fec                    0x000000000000002c 0x000f0000 objc_alloc
    [  922]    922   X Code            0x00007fff660e5018                    0x000000000000002e 0x000f0000 objc_allocWithZone
    [  923]    923   X Code            0x00007fff660e5046                    0x0000000000000045 0x000f0000 objc_alloc_init
    [  924]    924   X Code            0x00007fff660d05ea                    0x0000000000000121 0x000f0000 objc_allocateClassPair
    [  925]    925   X Code            0x00007fff660dd906                    0x0000000000000146 0x000f0000 objc_allocateProtocol
    [  926]    926   X Code            0x00007fff660d5d8c                    0x0000000000000009 0x000f0000 objc_allocate_object
    [  927]    927   X Code            0x00007fff660e21d7                    0x00000000000001a1 0x000f0000 objc_appRequiresGC
    [  928]    928   X Code            0x00007fff660d5d96                    0x0000000000000001 0x000f0000 objc_assertRegisteredThreadWithCollector
    [  929]    929   X Code            0x00007fff660cad9b                    0x0000000000000011 0x000f0000 objc_assign_global
    [  930]    930   X Code            0x00007fff660cbaf9                    0x0000000000000013 0x000f0000 objc_assign_ivar
    [  931]    931   X Code            0x00007fff660cad44                    0x0000000000000010 0x000f0000 objc_assign_strongCast
    [  932]    932   X Code            0x00007fff660d5d72                    0x0000000000000013 0x000f0000 objc_assign_threadlocal
    [  933]    933   X Code            0x00007fff660cdc25                    0x000000000000000c 0x000f0000 objc_assign_weak
    [  934]    934   X Code            0x00007fff660d5d54                    0x000000000000001e 0x000f0000 objc_atomicCompareAndSwapGlobal
    [  935]    935   X Code            0x00007fff660d36a4                    0x0000000000000017 0x000f0000 objc_atomicCompareAndSwapGlobalBarrier
    [  936]    936   X Code            0x00007fff660d4f04                    0x0000000000000014 0x000f0000 objc_atomicCompareAndSwapInstanceVariable
    [  937]    937   X Code            0x00007fff660d3a54                    0x0000000000000012 0x000f0000 objc_atomicCompareAndSwapInstanceVariableBarrier
    [  938]    938   X Code            0x00007fff660d2a84                    0x0000000000000012 0x000f0000 objc_atomicCompareAndSwapPtr
    [  939]    939   X Code            0x00007fff660ccc54                    0x000000000000001b 0x000f0000 objc_atomicCompareAndSwapPtrBarrier
    [  940]    940   X Code            0x00007fff660ccd00                    0x0000000000000091 0x000f0000 objc_autorelease
    [  941]    941   X Code            0x00007fff660ca34d                    0x00000000000000f5 0x000f0000 objc_autoreleasePoolPop
    [  942]    942   X Code            0x00007fff660ca2e6                    0x0000000000000067 0x000f0000 objc_autoreleasePoolPush
    [  943]    943   X Code            0x00007fff660cd119                    0x0000000000000059 0x000f0000 objc_autoreleaseReturnValue
    [  944]    944   X Code            0x00007fff660d4dbe                    0x0000000000000039 0x000f0000 objc_begin_catch
    [  945]    945   X Data            0x00007fff660eb478                    0x0000000000000098 0x000f0000 objc_class_abi_version
    [  946]    946   X Code            0x00007fff660d4405                    0x0000000000000025 0x000f0000 objc_clear_deallocating
    [  947]    947   X Code            0x00007fff660d5d85                    0x0000000000000001 0x000f0000 objc_clear_stack
    [  948]    948   X Code            0x00007fff660d5d4d                    0x0000000000000004 0x000f0000 objc_collect
    [  949]    949   X Code            0x00007fff660d5d97                    0x0000000000000003 0x000f0000 objc_collect_init
    [  950]    950   X Code            0x00007fff660d5d9a                    0x0000000000000003 0x000f0000 objc_collectableZone
    [  951]    951   X Code            0x00007fff660c7c7e                    0x0000000000000010 0x000f0000 objc_collectingEnabled
    [  952]    952   X Code            0x00007fff660d5d86                    0x0000000000000003 0x000f0000 objc_collecting_enabled
    [  953]    953   X Code            0x00007fff660d3646                    0x000000000000005e 0x000f0000 objc_constructInstance
    [  954]    954   X Code            0x00007fff660de4e5                    0x0000000000000095 0x000f0000 objc_copyClassList
    [  955]    955   X Code            0x00007fff660d2e87                    0x00000000000000fc 0x000f0000 objc_copyClassNamesForImage
    [  956]    956   X Code            0x00007fff660df173                    0x00000000000000e5 0x000f0000 objc_copyClassNamesForImageHeader
    [  957]    957   X Code            0x00007fff660e329e                    0x000000000000007e 0x000f0000 objc_copyCppObjectAtomic
    [  958]    958   X Code            0x00007fff660d2cb5                    0x0000000000000141 0x000f0000 objc_copyImageNames
    [  959]    959   X Code            0x00007fff660de66d                    0x000000000000038f 0x000f0000 objc_copyProtocolList
    [  960]    960   X Code            0x00007fff660de349                    0x0000000000000090 0x000f0000 objc_copyRealizedClassList
    [  961]    961   X Code            0x00007fff660d2baa                    0x00000000000000a6 0x000f0000 objc_copyStruct
    [  962]    962   X Code            0x00007fff660cf696                    0x0000000000000033 0x000f0000 objc_copyWeak
    [  963]    963   X Data            0x00007fff660eb46c                    0x0000000000000004 0x000f0000 objc_debug_autoreleasepoolpage_child_offset
    [  964]    964   X Data            0x00007fff660eb470                    0x0000000000000004 0x000f0000 objc_debug_autoreleasepoolpage_depth_offset
    [  965]    965   X Data            0x00007fff660eb474                    0x0000000000000004 0x000f0000 objc_debug_autoreleasepoolpage_hiwat_offset
    [  966]    966   X Data            0x00007fff660eb45c                    0x0000000000000004 0x000f0000 objc_debug_autoreleasepoolpage_magic_offset
    [  967]    967   X Data            0x00007fff660eb460                    0x0000000000000004 0x000f0000 objc_debug_autoreleasepoolpage_next_offset
    [  968]    968   X Data            0x00007fff660eb468                    0x0000000000000004 0x000f0000 objc_debug_autoreleasepoolpage_parent_offset
    [  969]    969   X Data            0x00007fff660eb464                    0x0000000000000004 0x000f0000 objc_debug_autoreleasepoolpage_thread_offset
    [  970]    970   X Code            0x00007fff660df258                    0x0000000000000014 0x000f0000 objc_debug_class_getNameRaw
    [  971]    971   X Data            0x00007fff660eb400                    0x0000000000000008 0x000f0000 objc_debug_class_rw_data_mask
    [  972]    972   X Data            0x00007fff660eb418                    0x0000000000000008 0x000f0000 objc_debug_indexed_isa_index_mask
    [  973]    973   X Data            0x00007fff660eb420                    0x0000000000000008 0x000f0000 objc_debug_indexed_isa_index_shift
    [  974]    974   X Data            0x00007fff660eb408                    0x0000000000000008 0x000f0000 objc_debug_indexed_isa_magic_mask
    [  975]    975   X Data            0x00007fff660eb410                    0x0000000000000008 0x000f0000 objc_debug_indexed_isa_magic_value
    [  976]    976   X Data            0x00007fff660eb428                    0x0000000000000008 0x000f0000 objc_debug_isa_class_mask
    [  977]    977   X Data            0x00007fff660eb430                    0x0000000000000008 0x000f0000 objc_debug_isa_magic_mask
    [  978]    978   X Data            0x00007fff660eb438                    0x0000000000000008 0x000f0000 objc_debug_isa_magic_value
    [  979]    979   X Data            0x00007fff8d786d00                    0x0000000000000008 0x000f0000 objc_debug_realized_class_generation_count
    [  980]    980   X Data            0x00007fff660eb440                    0x0000000000000008 0x000f0000 objc_debug_swift_stable_abi_bit
    [  981]    981   X Data            0x00007fff8d786290                    0x0000000000000080 0x000f0000 objc_debug_taggedpointer_classes
    [  982]    982   X Data            0x00007fff8d786310                    0x0000000000000800 0x000f0000 objc_debug_taggedpointer_ext_classes
    [  983]    983   X Data            0x00007fff8d786bd8                    0x0000000000000008 0x000f0000 objc_debug_taggedpointer_ext_mask
    [  984]    984   X Data            0x00007fff8d786d18                    0x0000000000000004 0x000f0000 objc_debug_taggedpointer_ext_payload_lshift
    [  985]    985   X Data            0x00007fff8d786bf0                    0x0000000000000008 0x000f0000 objc_debug_taggedpointer_ext_payload_rshift
    [  986]    986   X Data            0x00007fff8d786be8                    0x0000000000000008 0x000f0000 objc_debug_taggedpointer_ext_slot_mask
    [  987]    987   X Data            0x00007fff8d786be0                    0x0000000000000008 0x000f0000 objc_debug_taggedpointer_ext_slot_shift
    [  988]    988   X Data            0x00007fff8d786bc0                    0x0000000000000008 0x000f0000 objc_debug_taggedpointer_mask
    [  989]    989   X Data            0x00007fff8d786d08                    0x0000000000000008 0x000f0000 objc_debug_taggedpointer_obfuscator
    [  990]    990   X Data            0x00007fff8d786d14                    0x0000000000000004 0x000f0000 objc_debug_taggedpointer_payload_lshift
    [  991]    991   X Data            0x00007fff8d786bd0                    0x0000000000000008 0x000f0000 objc_debug_taggedpointer_payload_rshift
    [  992]    992   X Data            0x00007fff8d786bc8                    0x0000000000000008 0x000f0000 objc_debug_taggedpointer_slot_mask
    [  993]    993   X Data            0x00007fff8d786d10                    0x0000000000000004 0x000f0000 objc_debug_taggedpointer_slot_shift
    [  994]    994   X Code            0x00007fff660cefe2                    0x00000000000000ba 0x000f0000 objc_destroyWeak
    [  995]    995   X Code            0x00007fff660c9dbe                    0x00000000000000aa 0x000f0000 objc_destructInstance
    [  996]    996   X Code            0x00007fff660e0b39                    0x000000000000029a 0x000f0000 objc_disposeClassPair
    [  997]    997   X Code            0x00007fff660d5da0                    0x0000000000000003 0x000f0000 objc_dumpHeap
    [  998]    998   X Code            0x00007fff660e05ef                    0x0000000000000431 0x000f0000 objc_duplicateClass
    [  999]    999   X Data            0x00007fff8d784498                    0x0000000000000068 0x000f0000 objc_ehtype_vtable
    [ 1000]   1000   X Code            0x00007fff660d4e25                    0x0000000000000027 0x000f0000 objc_end_catch
    [ 1001]   1001   X Code            0x00007fff660e1ca4                    0x0000000000000033 0x000f0000 objc_enumerationMutation
    [ 1002]   1002   X Code            0x00007fff660d4df7                    0x000000000000002e 0x000f0000 objc_exception_rethrow
    [ 1003]   1003   X Code            0x00007fff660d4a6e                    0x0000000000000164 0x000f0000 objc_exception_throw
    [ 1004]   1004   X Code            0x00007fff660cd251                    0x0000000000000007 0x000f0000 objc_finalizeOnMainThread
    [ 1005]   1005   X Code            0x00007fff660d0a43                    0x000000000000014f 0x000f0000 objc_getAssociatedObject
    [ 1006]   1006   X Code            0x00007fff660cbb1b                    0x000000000000000d 0x000f0000 objc_getClass
    [ 1007]   1007   X Code            0x00007fff660d462e                    0x0000000000000133 0x000f0000 objc_getClassList
    [ 1008]   1008   X Code            0x00007fff660ca8f5                    0x000000000000027d 0x000f0000 objc_getFutureClass
    [ 1009]   1009   X Code            0x00007fff660e0f9e                    0x0000000000000048 0x000f0000 objc_getMetaClass
    [ 1010]   1010   X Code            0x00007fff660cd588                    0x00000000000000f4 0x000f0000 objc_getProperty
    [ 1011]   1011   X Code            0x00007fff660cfd55                    0x0000000000000092 0x000f0000 objc_getProtocol
    [ 1012]   1012   X Code            0x00007fff660e0f57                    0x0000000000000047 0x000f0000 objc_getRequiredClass
    [ 1013]   1013   X Data            0x00007fff8d786ce8                    0x0000000000000008 0x000f0000 objc_indexed_classes
    [ 1014]   1014   X Data            0x00007fff8d786cf0                    0x0000000000000008 0x000f0000 objc_indexed_classes_count
    [ 1015]   1015   X Code            0x00007fff660cec11                    0x00000000000001ca 0x000f0000 objc_initWeak
    [ 1016]   1016   X Code            0x00007fff660e4d42                    0x00000000000001c2 0x000f0000 objc_initWeakOrNil
    [ 1017]   1017   X Code            0x00007fff660cadb5                    0x0000000000000105 0x000f0000 objc_initializeClassPair
    [ 1018]   1018   X Code            0x00007fff660d5d9d                    0x0000000000000003 0x000f0000 objc_isAuto
    [ 1019]   1019   X Code            0x00007fff660d0b92                    0x000000000000000c 0x000f0000 objc_is_finalized
    [ 1020]   1020   X Code            0x00007fff660d83d6                    0x0000000000000028 0x000f0000 objc_loadClassref
    [ 1021]   1021   X Code            0x00007fff660d0c7a                    0x0000000000000021 0x000f0000 objc_loadWeak
    [ 1022]   1022   X Code            0x00007fff660ceddb                    0x0000000000000207 0x000f0000 objc_loadWeakRetained
    [ 1023]   1023   X Code            0x00007fff660ca442                    0x000000000000000c 0x000f0000 objc_lookUpClass
    [ 1024]   1024   X Code            0x00007fff660cadac                    0x0000000000000009 0x000f0000 objc_memmove_collectable
    [ 1025]   1025   X Code            0x00007fff660d4952                    0x0000000000000051 0x000f0000 objc_moveWeak
    [ 1026]   1026   X Code            0x00007fff660c7f40                    0x00000000000000c0 0x000f0000 objc_msgLookup
    [ 1027]   1027   X Code            0x00007fff660c8140                    0x0000000000000080 0x000f0000 objc_msgLookupSuper2
    [ 1028]   1028   X Code            0x00007fff660c8900                    0x0000000000000080 0x000f0000 objc_msgLookupSuper2_stret
    [ 1029]   1029   X Code            0x00007fff660c8500                    0x00000000000000c0 0x000f0000 objc_msgLookup_fp2ret
    [ 1030]   1030   X Code            0x00007fff660c8300                    0x00000000000000c0 0x000f0000 objc_msgLookup_fpret
    [ 1031]   1031   X Code            0x00007fff660c8700                    0x00000000000000c0 0x000f0000 objc_msgLookup_stret
    [ 1032]   1032   X Code            0x00007fff660c7e40                    0x0000000000000100 0x000f0000 objc_msgSend
    [ 1033]   1033   X Code            0x00007fff660c8040                    0x0000000000000080 0x000f0000 objc_msgSendSuper
    [ 1034]   1034   X Code            0x00007fff660c80c0                    0x0000000000000080 0x000f0000 objc_msgSendSuper2
    [ 1035]   1035   X Code            0x00007fff660c8c80                    0x0000000000000040 0x000f0000 objc_msgSendSuper2_debug
    [ 1036]   1036   X Code            0x00007fff660c81c0                    0x0000000000000004 0x000f0000 objc_msgSendSuper2_fixup
    [ 1037]   1037   X Code            0x00007fff660c8880                    0x0000000000000080 0x000f0000 objc_msgSendSuper2_stret
    [ 1038]   1038   X Code            0x00007fff660c8d00                    0x0000000000000040 0x000f0000 objc_msgSendSuper2_stret_debug
    [ 1039]   1039   X Code            0x00007fff660c8980                    0x0000000000000004 0x000f0000 objc_msgSendSuper2_stret_fixup
    [ 1040]   1040   X Code            0x00007fff660c8800                    0x0000000000000080 0x000f0000 objc_msgSendSuper_stret
    [ 1041]   1041   X Code            0x00007fff660c8c40                    0x0000000000000040 0x000f0000 objc_msgSend_debug
    [ 1042]   1042   X Code            0x00007fff660c8000                    0x0000000000000004 0x000f0000 objc_msgSend_fixup
    [ 1043]   1043   X Code            0x00007fff660c8400                    0x0000000000000100 0x000f0000 objc_msgSend_fp2ret
    [ 1044]   1044   X Code            0x00007fff660c8d80                    0x0000000000000040 0x000f0000 objc_msgSend_fp2ret_debug
    [ 1045]   1045   X Code            0x00007fff660c85c0                    0x0000000000000004 0x000f0000 objc_msgSend_fp2ret_fixup
    [ 1046]   1046   X Code            0x00007fff660c8200                    0x0000000000000100 0x000f0000 objc_msgSend_fpret
    [ 1047]   1047   X Code            0x00007fff660c8d40                    0x0000000000000040 0x000f0000 objc_msgSend_fpret_debug
    [ 1048]   1048   X Code            0x00007fff660c83c0                    0x0000000000000004 0x000f0000 objc_msgSend_fpret_fixup
    [ 1049]   1049   X Code            0x00007fff660c8dc0                    0x0000000000000040 0x000f0000 objc_msgSend_noarg
    [ 1050]   1050   X Code            0x00007fff660c8600                    0x0000000000000100 0x000f0000 objc_msgSend_stret
    [ 1051]   1051   X Code            0x00007fff660c8cc0                    0x0000000000000040 0x000f0000 objc_msgSend_stret_debug
    [ 1052]   1052   X Code            0x00007fff660c87c0                    0x0000000000000004 0x000f0000 objc_msgSend_stret_fixup
    [ 1053]   1053   X Code            0x00007fff660e5117                    0x0000000000000071 0x000f0000 objc_opt_class
    [ 1054]   1054   X Code            0x00007fff660e5188                    0x000000000000007d 0x000f0000 objc_opt_isKindOfClass
    [ 1055]   1055   X Code            0x00007fff660e508b                    0x000000000000005a 0x000f0000 objc_opt_new
    [ 1056]   1056   X Code            0x00007fff660e5205                    0x0000000000000072 0x000f0000 objc_opt_respondsToSelector
    [ 1057]   1057   X Code            0x00007fff660e50e5                    0x0000000000000032 0x000f0000 objc_opt_self
    [ 1058]   1058   X Code            0x00007fff660e0a20                    0x0000000000000119 0x000f0000 objc_readClassPair
    [ 1059]   1059   X Code            0x00007fff660cdc31                    0x000000000000000d 0x000f0000 objc_read_weak
    [ 1060]   1060   X Code            0x00007fff660cb254                    0x000000000000022a 0x000f0000 objc_registerClassPair
    [ 1061]   1061   X Code            0x00007fff660dda4c                    0x0000000000000230 0x000f0000 objc_registerProtocol
    [ 1062]   1062   X Code            0x00007fff660ce9e4                    0x0000000000000002 0x000f0000 objc_registerThreadWithCollector
    [ 1063]   1063   X Code            0x00007fff660c9ca0                    0x000000000000009f 0x000f0000 objc_release
    [ 1064]   1064   X Code            0x00007fff660cdbfa                    0x000000000000002b 0x000f0000 objc_removeAssociatedObjects
    [ 1065]   1065   X Code            0x00007fff660d2934                    0x0000000000000150 0x000f0000 objc_removeExceptionHandler
    [ 1066]   1066   X Code            0x00007fff660c7d10                    0x0000000000000070 0x000f0000 objc_retain
    [ 1067]   1067   X Code            0x00007fff660ccce0                    0x0000000000000020 0x000f0000 objc_retainAutorelease
    [ 1068]   1068   X Code            0x00007fff660cd172                    0x000000000000004c 0x000f0000 objc_retainAutoreleaseReturnValue
    [ 1069]   1069   X Code            0x00007fff660cbb6a                    0x000000000000002e 0x000f0000 objc_retainAutoreleasedReturnValue
    [ 1070]   1070   X Code            0x00007fff660d0596                    0x0000000000000010 0x000f0000 objc_retainBlock
    [ 1071]   1071   X Code            0x00007fff660e4d21                    0x0000000000000021 0x000f0000 objc_retain_autorelease
    [ 1072]   1072   X Code            0x00007fff660e545f                    0x0000000000000004 0x000f0000 objc_retainedObject
    [ 1073]   1073   X Code            0x00007fff660d0581                    0x0000000000000015 0x000f0000 objc_setAssociatedObject
    [ 1074]   1074   X Code            0x00007fff660d5d52                    0x0000000000000001 0x000f0000 objc_setCollectionRatio
    [ 1075]   1075   X Code            0x00007fff660d5d51                    0x0000000000000001 0x000f0000 objc_setCollectionThreshold
    [ 1076]   1076   X Code            0x00007fff660ca8eb                    0x000000000000000a 0x000f0000 objc_setEnumerationMutationHandler
    [ 1077]   1077   X Code            0x00007fff660ca8a3                    0x000000000000000f 0x000f0000 objc_setExceptionMatcher
    [ 1078]   1078   X Code            0x00007fff660ca890                    0x0000000000000013 0x000f0000 objc_setExceptionPreprocessor
    [ 1079]   1079   X Code            0x00007fff660ca8ce                    0x000000000000001d 0x000f0000 objc_setForwardHandler
    [ 1080]   1080   X Code            0x00007fff660e05d9                    0x0000000000000016 0x000f0000 objc_setHook_getClass
    [ 1081]   1081   X Code            0x00007fff660e1c5d                    0x0000000000000016 0x000f0000 objc_setHook_getImageName
    [ 1082]   1082   X Code            0x00007fff660e1cd7                    0x0000000000000016 0x000f0000 objc_setHook_setAssociatedObject
    [ 1083]   1083   X Code            0x00007fff660cd875                    0x0000000000000106 0x000f0000 objc_setProperty
    [ 1084]   1084   X Code            0x00007fff660cf508                    0x00000000000000d1 0x000f0000 objc_setProperty_atomic
    [ 1085]   1085   X Code            0x00007fff660cf5d9                    0x00000000000000bd 0x000f0000 objc_setProperty_atomic_copy
    [ 1086]   1086   X Code            0x00007fff660d3364                    0x000000000000004a 0x000f0000 objc_setProperty_nonatomic
    [ 1087]   1087   X Code            0x00007fff660d05a6                    0x0000000000000044 0x000f0000 objc_setProperty_nonatomic_copy
    [ 1088]   1088   X Code            0x00007fff660ca8b2                    0x000000000000001c 0x000f0000 objc_setUncaughtExceptionHandler
    [ 1089]   1089   X Code            0x00007fff660d5d8a                    0x0000000000000001 0x000f0000 objc_set_collection_ratio
    [ 1090]   1090   X Code            0x00007fff660d5d89                    0x0000000000000001 0x000f0000 objc_set_collection_threshold
    [ 1091]   1091   X Code            0x00007fff660e4d1b                    0x0000000000000006 0x000f0000 objc_should_deallocate
    [ 1092]   1092   X Code            0x00007fff660d5d53                    0x0000000000000001 0x000f0000 objc_startCollectorThread
    [ 1093]   1093   X Code            0x00007fff660d5d8b                    0x0000000000000001 0x000f0000 objc_start_collector_thread
    [ 1094]   1094   X Code            0x00007fff660cbb28                    0x0000000000000042 0x000f0000 objc_storeStrong
    [ 1095]   1095   X Code            0x00007fff660cbd78                    0x000000000000022f 0x000f0000 objc_storeWeak
    [ 1096]   1096   X Code            0x00007fff660ccda6                    0x000000000000023a 0x000f0000 objc_storeWeakOrNil
    [ 1097]   1097   X Code            0x00007fff660cc424                    0x000000000000003f 0x000f0000 objc_sync_enter
    [ 1098]   1098   X Code            0x00007fff660cc7c1                    0x0000000000000043 0x000f0000 objc_sync_exit
    [ 1099]   1099   X Code            0x00007fff660e3071                    0x0000000000000048 0x000f0000 objc_sync_try_enter
    [ 1100]   1100   X Code            0x00007fff660d6868                    0x000000000000000d 0x000f0000 objc_terminate
    [ 1101]   1101   X Code            0x00007fff660d5d95                    0x0000000000000001 0x000f0000 objc_unregisterThreadWithCollector
    [ 1102]   1102   X Code            0x00007fff660e5463                    0x0000000000000004 0x000f0000 objc_unretainedObject
    [ 1103]   1103   X Code            0x00007fff660e5467                    0x0000000000000005 0x000f0000 objc_unretainedPointer
    [ 1104]   1104   X Code            0x00007fff660e470a                    0x0000000000000038 0x000f0000 objc_unsafeClaimAutoreleasedReturnValue
    [ 1105]   1105   X Code            0x00007fff660cf09c                    0x0000000000000024 0x000f0000 object_copy
    [ 1106]   1106   X Code            0x00007fff660e0eb9                    0x0000000000000007 0x000f0000 object_copyFromZone
    [ 1107]   1107   X Code            0x00007fff660c9d8c                    0x0000000000000032 0x000f0000 object_dispose
    [ 1108]   1108   X Code            0x00007fff660cacf4                    0x0000000000000050 0x000f0000 object_getClass
    [ 1109]   1109   X Code            0x00007fff660d1e38                    0x0000000000000068 0x000f0000 object_getClassName
    [ 1110]   1110   X Code            0x00007fff660cb844                    0x0000000000000065 0x000f0000 object_getIndexedIvars
    [ 1111]   1111   X Code            0x00007fff660d6230                    0x000000000000006d 0x000f0000 object_getInstanceVariable
    [ 1112]   1112   X Code            0x00007fff660d4e98                    0x000000000000006c 0x000f0000 object_getIvar
    [ 1113]   1113   X Code            0x00007fff660cdc6c                    0x000000000000007f 0x000f0000 object_getMethodImplementation
    [ 1114]   1114   X Code            0x00007fff660d5dd1                    0x0000000000000056 0x000f0000 object_getMethodImplementation_stret
    [ 1115]   1115   X Code            0x00007fff660d5da3                    0x000000000000002e 0x000f0000 object_isClass
    [ 1116]   1116   X Code            0x00007fff660cab72                    0x0000000000000182 0x000f0000 object_setClass
    [ 1117]   1117   X Code            0x00007fff660cfa7e                    0x00000000000000bc 0x000f0000 object_setInstanceVariable
    [ 1118]   1118   X Code            0x00007fff660d6177                    0x00000000000000b9 0x000f0000 object_setInstanceVariableWithStrongDefault
    [ 1119]   1119   X Code            0x00007fff660cfc50                    0x0000000000000094 0x000f0000 object_setIvar
    [ 1120]   1120   X Code            0x00007fff660d60dc                    0x000000000000009b 0x000f0000 object_setIvarWithStrongDefault
    [ 1121]   1121   X Code            0x00007fff660d1687                    0x0000000000000156 0x000f0000 property_copyAttributeList
    [ 1122]   1122   X Code            0x00007fff660dd571                    0x00000000000000cd 0x000f0000 property_copyAttributeValue
    [ 1123]   1123   X Code            0x00007fff660d1f22                    0x0000000000000011 0x000f0000 property_getAttributes
    [ 1124]   1124   X Code            0x00007fff660d167e                    0x0000000000000009 0x000f0000 property_getName
    [ 1125]   1125   X Code            0x00007fff660dddad                    0x0000000000000155 0x000f0000 protocol_addMethodDescription
    [ 1126]   1126   X Code            0x00007fff660ddfdf                    0x0000000000000137 0x000f0000 protocol_addProperty
    [ 1127]   1127   X Code            0x00007fff660ddc7c                    0x0000000000000131 0x000f0000 protocol_addProtocol
    [ 1128]   1128   X Code            0x00007fff660d2ae8                    0x0000000000000095 0x000f0000 protocol_conformsToProtocol
    [ 1129]   1129   X Code            0x00007fff660ce198                    0x000000000000016c 0x000f0000 protocol_copyMethodDescriptionList
    [ 1130]   1130   X Code            0x00007fff660dd8f5                    0x0000000000000011 0x000f0000 protocol_copyPropertyList
    [ 1131]   1131   X Code            0x00007fff660dd7f8                    0x00000000000000fd 0x000f0000 protocol_copyPropertyList2
    [ 1132]   1132   X Code            0x00007fff660ce034                    0x0000000000000164 0x000f0000 protocol_copyProtocolList
    [ 1133]   1133   X Code            0x00007fff660ce738                    0x0000000000000053 0x000f0000 protocol_getMethodDescription
    [ 1134]   1134   X Code            0x00007fff660ce647                    0x0000000000000019 0x000f0000 protocol_getName
    [ 1135]   1135   X Code            0x00007fff660dd63e                    0x00000000000000c8 0x000f0000 protocol_getProperty
    [ 1136]   1136   X Code            0x00007fff660d2a9b                    0x000000000000004d 0x000f0000 protocol_isEqual
    [ 1137]   1137   X Code            0x00007fff660cde1c                    0x0000000000000016 0x000f0000 sel_getName
    [ 1138]   1138   X Code            0x00007fff660d2fbb                    0x0000000000000017 0x000f0000 sel_getUid
    [ 1139]   1139   X Code            0x00007fff660d2c8a                    0x0000000000000017 0x000f0000 sel_isEqual
    [ 1140]   1140   X Code            0x00007fff660e2f8b                    0x00000000000000e6 0x000f0000 sel_isMapped
    [ 1141]   1141   X Code            0x00007fff660cb57c                    0x000000000000001d 0x000f0000 sel_registerName
    [ 1142]   1142     Trampoline      0x00007fff660e6c3a                    0x0000000000000006 0x00010300 _Block_copy
    [ 1143]   1143     Trampoline      0x00007fff660e6c40                    0x0000000000000006 0x00010300 _Block_has_signature
    [ 1144]   1144     Trampoline      0x00007fff660e6c46                    0x0000000000000006 0x00010300 _Block_release
    [ 1145]   1145     Trampoline      0x00007fff660e6c4c                    0x0000000000000006 0x00010300 _Block_use_stret
    [ 1146]   1146   X Undefined       0x0000000000000000                    0x0000000000000000 0x00010300 _DefaultRuneLocale
    [ 1147]   1147     Trampoline      0x00007fff660e6c52                    0x0000000000000006 0x00010300 _Exit
    [ 1148]   1148   X Undefined       0x0000000000000000                    0x0000000000000000 0x00010300 _NSConcreteStackBlock
    [ 1149]   1149     Trampoline      0x00007fff660e6c58                    0x0000000000000006 0x00010300 _NSGetEnviron
    [ 1150]   1150     Trampoline      0x00007fff660e6c5e                    0x0000000000000006 0x00010300 _Unwind_GetCFA
    [ 1151]   1151     Trampoline      0x00007fff660e6c64                    0x0000000000000006 0x00010300 _Unwind_GetIP
    [ 1152]   1152     Trampoline      0x00007fff660e6c6a                    0x0000000000000006 0x00010300 _Unwind_Resume
    [ 1153]   1153     Trampoline      0x00007fff660e6c70                    0x0000000000000006 0x00010100 std::set_terminate(void (*)())
    [ 1154]   1154     Trampoline      0x00007fff660e6c76                    0x0000000000000006 0x00010100 std::terminate()
    [ 1155]   1155   X Undefined       0x0000000000000000                    0x0000000000000000 0x00010340 ___chkstk_darwin
    [ 1156]   1156     Trampoline      0x00007fff660e6c7c                    0x0000000000000006 0x00010300 __bzero
    [ 1157]   1157     Trampoline      0x00007fff660e6c82                    0x0000000000000006 0x00010100 __cxa_allocate_exception
    [ 1158]   1158     Trampoline      0x00007fff660e6c88                    0x0000000000000006 0x00010100 __cxa_begin_catch
    [ 1159]   1159     Trampoline      0x00007fff660e6c8e                    0x0000000000000006 0x00010100 __cxa_current_exception_type
    [ 1160]   1160     Trampoline      0x00007fff660e6c94                    0x0000000000000006 0x00010100 __cxa_end_catch
    [ 1161]   1161     Trampoline      0x00007fff660e6c9a                    0x0000000000000006 0x00010100 __cxa_rethrow
    [ 1162]   1162     Trampoline      0x00007fff660e6ca0                    0x0000000000000006 0x00010100 __cxa_throw
    [ 1163]   1163     Trampoline      0x00007fff660e6ca6                    0x0000000000000006 0x00010300 __error
    [ 1164]   1164     Trampoline      0x00007fff660e6cac                    0x0000000000000006 0x00010100 __gxx_personality_v0
    [ 1165]   1165   X Undefined       0x0000000000000000                    0x0000000000000000 0x00010300 __progname
    [ 1166]   1166     Trampoline      0x00007fff660e6cb2                    0x0000000000000006 0x00010300 __stack_chk_fail
    [ 1167]   1167   X Undefined       0x0000000000000000                    0x0000000000000000 0x00010300 __stack_chk_guard
    [ 1168]   1168   X Undefined       0x0000000000000000                    0x0000000000000000 0x00010300 __stderrp
    [ 1169]   1169     Trampoline      0x00007fff660e6cb8                    0x0000000000000006 0x00010300 _dyld_for_each_objc_class
    [ 1170]   1170     Trampoline      0x00007fff660e6cbe                    0x0000000000000006 0x00010300 _dyld_for_each_objc_protocol
    [ 1171]   1171     Trampoline      0x00007fff660e6cc4                    0x0000000000000006 0x00010300 _dyld_get_objc_selector
    [ 1172]   1172     Trampoline      0x00007fff660e6cca                    0x0000000000000006 0x00010300 _dyld_get_shared_cache_range
    [ 1173]   1173     Trampoline      0x00007fff660e6cd0                    0x0000000000000006 0x00010300 _dyld_is_memory_immutable
    [ 1174]   1174     Trampoline      0x00007fff660e6cd6                    0x0000000000000006 0x00010300 _dyld_objc_notify_register
    [ 1175]   1175     Trampoline      0x00007fff660e6cdc                    0x0000000000000006 0x00010300 _simple_asl_log
    [ 1176]   1176     Trampoline      0x00007fff660e6ce2                    0x0000000000000006 0x00010300 abort
    [ 1177]   1177     Trampoline      0x00007fff660e6ce8                    0x0000000000000006 0x00010300 abort_with_reason
    [ 1178]   1178     Trampoline      0x00007fff660e6cee                    0x0000000000000006 0x00010300 arc4random_buf
    [ 1179]   1179     Trampoline      0x00007fff660e6cf4                    0x0000000000000006 0x00010300 asprintf
    [ 1180]   1180     Trampoline      0x00007fff660e6cfa                    0x0000000000000006 0x00010300 backtrace
    [ 1181]   1181     Trampoline      0x00007fff660e6d00                    0x0000000000000006 0x00010300 backtrace_symbols
    [ 1182]   1182     Trampoline      0x00007fff660e6d06                    0x0000000000000006 0x00010300 backtrace_symbols_fd
    [ 1183]   1183     Trampoline      0x00007fff660e6d0c                    0x0000000000000006 0x00010300 bcopy
    [ 1184]   1184     Trampoline      0x00007fff660e6d12                    0x0000000000000006 0x00010300 calloc
    [ 1185]   1185     Trampoline      0x00007fff660e6d18                    0x0000000000000006 0x00010300 clock_gettime_nsec_np
    [ 1186]   1186     Trampoline      0x00007fff660e6d1e                    0x0000000000000006 0x00010300 close
    [ 1187]   1187     Trampoline      0x00007fff660e6d24                    0x0000000000000006 0x00010300 dispatch_queue_get_label
    [ 1188]   1188     Trampoline      0x00007fff660e6d2a                    0x0000000000000006 0x00010300 dladdr
    [ 1189]   1189     Trampoline      0x00007fff660e6d30                    0x0000000000000006 0x00010300 dlerror
    [ 1190]   1190     Trampoline      0x00007fff660e6d36                    0x0000000000000006 0x00010300 dlopen
    [ 1191]   1191     Trampoline      0x00007fff660e6d3c                    0x0000000000000006 0x00010300 dlsym
    [ 1192]   1192     Trampoline      0x00007fff660e6d42                    0x0000000000000006 0x00010300 dyld_get_program_sdk_version
    [ 1193]   1193     Trampoline      0x00007fff660e6d48                    0x0000000000000006 0x00010300 dyld_image_header_containing_address
    [ 1194]   1194     Trampoline      0x00007fff660e6d4e                    0x0000000000000006 0x00010300 dyld_image_path_containing_address
    [ 1195]   1195     Trampoline      0x00007fff660e6d54                    0x0000000000000006 0x00010300 dyld_shared_cache_some_image_overridden
    [ 1196]   1196     Trampoline      0x00007fff660e6d5a                    0x0000000000000006 0x00010300 fileno
    [ 1197]   1197     Trampoline      0x00007fff660e6d60                    0x0000000000000006 0x00010300 fls
    [ 1198]   1198     Trampoline      0x00007fff660e6d66                    0x0000000000000006 0x00010300 free
    [ 1199]   1199     Trampoline      0x00007fff660e6d6c                    0x0000000000000006 0x00010300 fstat$INODE64
    [ 1200]   1200     Trampoline      0x00007fff660e6d72                    0x0000000000000006 0x00010300 fsync
    [ 1201]   1201     Trampoline      0x00007fff660e6d78                    0x0000000000000006 0x00010300 getenv
    [ 1202]   1202     Trampoline      0x00007fff660e6d7e                    0x0000000000000006 0x00010300 geteuid
    [ 1203]   1203     Trampoline      0x00007fff660e6d84                    0x0000000000000006 0x00010300 getpid
    [ 1204]   1204     Trampoline      0x00007fff660e6d8a                    0x0000000000000006 0x00010300 getsectiondata
    [ 1205]   1205     Trampoline      0x00007fff660e6d90                    0x0000000000000006 0x00010300 getsegmentdata
    [ 1206]   1206     Trampoline      0x00007fff660e6d96                    0x0000000000000006 0x00010300 issetugid
    [ 1207]   1207     Trampoline      0x00007fff660e6d9c                    0x0000000000000006 0x00010300 lstat$INODE64
    [ 1208]   1208     Trampoline      0x00007fff660e6da2                    0x0000000000000006 0x00010300 mach_error_string
    [ 1209]   1209     Trampoline      0x00007fff660e6da8                    0x0000000000000006 0x00010300 mach_port_deallocate
    [ 1210]   1210   X Undefined       0x0000000000000000                    0x0000000000000000 0x00010300 mach_task_self_
    [ 1211]   1211     Trampoline      0x00007fff660e6dae                    0x0000000000000006 0x00010300 malloc
    [ 1212]   1212     Trampoline      0x00007fff660e6db4                    0x0000000000000006 0x00010300 malloc_default_zone
    [ 1213]   1213     Trampoline      0x00007fff660e6dba                    0x0000000000000006 0x00010300 malloc_size
    [ 1214]   1214     Trampoline      0x00007fff660e6dc0                    0x0000000000000006 0x00010300 malloc_zone_batch_malloc
    [ 1215]   1215     Trampoline      0x00007fff660e6dc6                    0x0000000000000006 0x00010300 malloc_zone_calloc
    [ 1216]   1216     Trampoline      0x00007fff660e6dcc                    0x0000000000000006 0x00010300 malloc_zone_from_ptr
    [ 1217]   1217     Trampoline      0x00007fff660e6dd2                    0x0000000000000006 0x00010300 malloc_zone_malloc
    [ 1218]   1218     Trampoline      0x00007fff660e6dd8                    0x0000000000000006 0x00010300 malloc_zone_memalign
    [ 1219]   1219     Trampoline      0x00007fff660e6dde                    0x0000000000000006 0x00010300 memcmp
    [ 1220]   1220     Trampoline      0x00007fff660e6de4                    0x0000000000000006 0x00010300 memcpy
    [ 1221]   1221     Trampoline      0x00007fff660e6dea                    0x0000000000000006 0x00010300 memmove
    [ 1222]   1222     Trampoline      0x00007fff660e6df0                    0x0000000000000006 0x00010300 memset_pattern16
    [ 1223]   1223     Trampoline      0x00007fff660e6dfc                    0x0000000000000006 0x00010300 open
    [ 1224]   1224     Trampoline      0x00007fff660e6e02                    0x0000000000000006 0x00010300 os_unfair_lock_lock_with_options
    [ 1225]   1225     Trampoline      0x00007fff660e6e08                    0x0000000000000006 0x00010300 os_unfair_lock_unlock
    [ 1226]   1226     Trampoline      0x00007fff660e6e0e                    0x0000000000000006 0x00010300 os_unfair_recursive_lock_lock_with_options
    [ 1227]   1227     Trampoline      0x00007fff660e6e14                    0x0000000000000006 0x00010300 os_unfair_recursive_lock_trylock
    [ 1228]   1228     Trampoline      0x00007fff660e6e1a                    0x0000000000000006 0x00010300 os_unfair_recursive_lock_tryunlock4objc
    [ 1229]   1229     Trampoline      0x00007fff660e6e20                    0x0000000000000006 0x00010300 os_unfair_recursive_lock_unlock
    [ 1230]   1230     Trampoline      0x00007fff660e6e26                    0x0000000000000006 0x00010300 posix_memalign
    [ 1231]   1231     Trampoline      0x00007fff660e6e2c                    0x0000000000000006 0x00010300 pread
    [ 1232]   1232     Trampoline      0x00007fff660e6e32                    0x0000000000000006 0x00010300 pthread_cond_broadcast
    [ 1233]   1233     Trampoline      0x00007fff660e6e38                    0x0000000000000006 0x00010300 pthread_cond_wait
    [ 1234]   1234     Trampoline      0x00007fff660e6e3e                    0x0000000000000006 0x00010300 pthread_getname_np
    [ 1235]   1235     Trampoline      0x00007fff660e6e44                    0x0000000000000006 0x00010300 pthread_getspecific
    [ 1236]   1236     Trampoline      0x00007fff660e6e4a                    0x0000000000000006 0x00010300 pthread_is_threaded_np
    [ 1237]   1237     Trampoline      0x00007fff660e6e50                    0x0000000000000006 0x00010300 pthread_key_init_np
    [ 1238]   1238     Trampoline      0x00007fff660e6e56                    0x0000000000000006 0x00010300 pthread_mach_thread_np
    [ 1239]   1239     Trampoline      0x00007fff660e6e5c                    0x0000000000000006 0x00010300 pthread_mutex_lock
    [ 1240]   1240     Trampoline      0x00007fff660e6e62                    0x0000000000000006 0x00010300 pthread_mutex_unlock
    [ 1241]   1241     Trampoline      0x00007fff660e6e68                    0x0000000000000006 0x00010300 pthread_setspecific
    [ 1242]   1242     Trampoline      0x00007fff660e6e6e                    0x0000000000000006 0x00010300 realloc
    [ 1243]   1243     Trampoline      0x00007fff660e6e74                    0x0000000000000006 0x00010300 reallocf
    [ 1244]   1244     Trampoline      0x00007fff660e6e7a                    0x0000000000000006 0x00010300 snprintf
    [ 1245]   1245     Trampoline      0x00007fff660e6e80                    0x0000000000000006 0x00010300 sprintf
    [ 1246]   1246     Trampoline      0x00007fff660e6e86                    0x0000000000000006 0x00010300 strcat
    [ 1247]   1247     Trampoline      0x00007fff660e6e8c                    0x0000000000000006 0x00010300 strchr
    [ 1248]   1248     Trampoline      0x00007fff660e6e92                    0x0000000000000006 0x00010300 strcmp
    [ 1249]   1249     Trampoline      0x00007fff660e6e98                    0x0000000000000006 0x00010300 strcspn
    [ 1250]   1250     Trampoline      0x00007fff660e6e9e                    0x0000000000000006 0x00010300 strdup
    [ 1251]   1251     Trampoline      0x00007fff660e6ea4                    0x0000000000000006 0x00010300 strlcpy
    [ 1252]   1252     Trampoline      0x00007fff660e6eaa                    0x0000000000000006 0x00010300 strlen
    [ 1253]   1253     Trampoline      0x00007fff660e6eb0                    0x0000000000000006 0x00010300 strncmp
    [ 1254]   1254     Trampoline      0x00007fff660e6eb6                    0x0000000000000006 0x00010300 strncpy
    [ 1255]   1255     Trampoline      0x00007fff660e6ebc                    0x0000000000000006 0x00010300 strstr
    [ 1256]   1256     Trampoline      0x00007fff660e6ec2                    0x0000000000000006 0x00010300 task_restartable_ranges_register
    [ 1257]   1257     Trampoline      0x00007fff660e6ec8                    0x0000000000000006 0x00010300 task_restartable_ranges_synchronize
    [ 1258]   1258     Trampoline      0x00007fff660e6ece                    0x0000000000000006 0x00010300 task_threads
    [ 1259]   1259     Trampoline      0x00007fff660e6ed4                    0x0000000000000006 0x00010300 thread_get_state
    [ 1260]   1260     Trampoline      0x00007fff660e6eda                    0x0000000000000006 0x00010300 unw_get_proc_info
    [ 1261]   1261     Trampoline      0x00007fff660e6ee0                    0x0000000000000006 0x00010300 unw_get_reg
    [ 1262]   1262     Trampoline      0x00007fff660e6ee6                    0x0000000000000006 0x00010300 unw_getcontext
    [ 1263]   1263     Trampoline      0x00007fff660e6eec                    0x0000000000000006 0x00010300 unw_init_local
    [ 1264]   1264     Trampoline      0x00007fff660e6ef2                    0x0000000000000006 0x00010300 unw_step
    [ 1265]   1265     Trampoline      0x00007fff660e6ef8                    0x0000000000000006 0x00010300 vasprintf
    [ 1266]   1266     Trampoline      0x00007fff660e6efe                    0x0000000000000006 0x00010300 vm_allocate
    [ 1267]   1267     Trampoline      0x00007fff660e6f04                    0x0000000000000006 0x00010300 vm_deallocate
    [ 1268]   1268     Trampoline      0x00007fff660e6f0a                    0x0000000000000006 0x00010300 vm_remap
    [ 1269]   1269     Trampoline      0x00007fff660e6f10                    0x0000000000000006 0x00010300 write
    [ 1270]   1270   X Undefined       0x0000000000000000                    0x0000000000000000 0x00010300 dyld_stub_binder
    [ 1271]   1271  S  Trampoline      0x00007fff660e6df6                    0x0000000000000006 0x00000000 objc_release
0x61b000050c80:   BreakpointList with 0 Breakpoints:
0x61b000050ce0:   BreakpointList with 0 Breakpoints:

Hide Details

Hide Details

Expecting sub string: a.out Matched

Hide Details

Expecting sub string: Target Matched

Hide Details

Expecting sub string: Module Matched

Hide Details

Expecting sub string: Breakpoint Matched

Hide Details

PASS: LLDB (/Users/buildslave/jenkins/workspace/lldb-cmake-sanitized/lldb-build/bin/clang-x86_64) :: test_get_description_gmodules (TestTargetAPI.TargetAPITestCase) runCmd: settings clear -all output:

Hide Details

runCmd: settings set symbols.enable-external-lookup false output:

Hide Details

runCmd: settings set target.inherit-tcc true output:

Hide Details

runCmd: settings set target.auto-apply-fixits false output:

Hide Details

runCmd: settings set plugin.process.gdb-remote.packet-timeout 60 output:

Hide Details

runCmd: settings set symbols.clang-modules-cache-path "/Users/buildslave/jenkins/workspace/lldb-cmake-sanitized/lldb-build/lldb-test-build.noindex/module-cache-lldb/lldb-api" output:

Hide Details

runCmd: settings set use-color false output:

Hide Details

runCmd: setting set target.prefer-dynamic-value no-dynamic-values output:

Hide Details

runCmd: settings set target.env-vars ASAN_OPTIONS=detect_stack_use_after_return=1 DYLD_INSERT_LIBRARIES=/Users/buildslave/jenkins/workspace/lldb-cmake-sanitized/host-compiler/lib/clang/12.0.0/lib/darwin/libclang_rt.asan_osx_dynamic.dylib output:

Hide Details

PASS: LLDB (/Users/buildslave/jenkins/workspace/lldb-cmake-sanitized/lldb-build/bin/clang-x86_64) :: test_get_platform_dsym (TestTargetAPI.TargetAPITestCase) runCmd: settings clear -all output:

Hide Details

runCmd: settings set symbols.enable-external-lookup false output:

Hide Details

runCmd: settings set target.inherit-tcc true output:

Hide Details

runCmd: settings set target.auto-apply-fixits false output:

Hide Details

runCmd: settings set plugin.process.gdb-remote.packet-timeout 60 output:

Hide Details

runCmd: settings set symbols.clang-modules-cache-path "/Users/buildslave/jenkins/workspace/lldb-cmake-sanitized/lldb-build/lldb-test-build.noindex/module-cache-lldb/lldb-api" output:

Hide Details

runCmd: settings set use-color false output:

Hide Details

runCmd: setting set target.prefer-dynamic-value no-dynamic-values output:

Hide Details

runCmd: settings set target.env-vars ASAN_OPTIONS=detect_stack_use_after_return=1 DYLD_INSERT_LIBRARIES=/Users/buildslave/jenkins/workspace/lldb-cmake-sanitized/host-compiler/lib/clang/12.0.0/lib/darwin/libclang_rt.asan_osx_dynamic.dylib output:

Hide Details

PASS: LLDB (/Users/buildslave/jenkins/workspace/lldb-cmake-sanitized/lldb-build/bin/clang-x86_64) :: test_get_platform_dwarf (TestTargetAPI.TargetAPITestCase) UNSUPPORTED: LLDB (/Users/buildslave/jenkins/workspace/lldb-cmake-sanitized/lldb-build/bin/clang-x86_64) :: test_get_platform_dwo (TestTargetAPI.TargetAPITestCase) (test case does not fall in any category of interest for this run) runCmd: settings clear -all output:

Hide Details

runCmd: settings set symbols.enable-external-lookup false output:

Hide Details

runCmd: settings set target.inherit-tcc true output:

Hide Details

runCmd: settings set target.auto-apply-fixits false output:

Hide Details

runCmd: settings set plugin.process.gdb-remote.packet-timeout 60 output:

Hide Details

runCmd: settings set symbols.clang-modules-cache-path "/Users/buildslave/jenkins/workspace/lldb-cmake-sanitized/lldb-build/lldb-test-build.noindex/module-cache-lldb/lldb-api" output:

Hide Details

runCmd: settings set use-color false output:

Hide Details

runCmd: setting set target.prefer-dynamic-value no-dynamic-values output:

Hide Details

runCmd: settings set target.env-vars ASAN_OPTIONS=detect_stack_use_after_return=1 DYLD_INSERT_LIBRARIES=/Users/buildslave/jenkins/workspace/lldb-cmake-sanitized/host-compiler/lib/clang/12.0.0/lib/darwin/libclang_rt.asan_osx_dynamic.dylib output:

Hide Details

PASS: LLDB (/Users/buildslave/jenkins/workspace/lldb-cmake-sanitized/lldb-build/bin/clang-x86_64) :: test_get_platform_gmodules (TestTargetAPI.TargetAPITestCase) runCmd: settings clear -all output:

Hide Details

runCmd: settings set symbols.enable-external-lookup false output:

Hide Details

runCmd: settings set target.inherit-tcc true output:

Hide Details

runCmd: settings set target.auto-apply-fixits false output:

Hide Details

runCmd: settings set plugin.process.gdb-remote.packet-timeout 60 output:

Hide Details

runCmd: settings set symbols.clang-modules-cache-path "/Users/buildslave/jenkins/workspace/lldb-cmake-sanitized/lldb-build/lldb-test-build.noindex/module-cache-lldb/lldb-api" output:

Hide Details

runCmd: settings set use-color false output:

Hide Details

runCmd: setting set target.prefer-dynamic-value no-dynamic-values output:

Hide Details

runCmd: settings set target.env-vars ASAN_OPTIONS=detect_stack_use_after_return=1 DYLD_INSERT_LIBRARIES=/Users/buildslave/jenkins/workspace/lldb-cmake-sanitized/host-compiler/lib/clang/12.0.0/lib/darwin/libclang_rt.asan_osx_dynamic.dylib output:

Hide Details

looking at: a(1) returns 4 b(2) returns 5 a(3) returns 6 env: LLDB_SESSION_DIRNAME=/Users/buildslave/jenkins/workspace/lldb-cmake-sanitized/test/logs env: COLUMNS=80 env: LLVM_LIBS_DIR=/Users/buildslave/jenkins/workspace/lldb-cmake-sanitized/lldb-build/./lib env: LLDB_SRC=/Users/buildslave/jenkins/workspace/lldb-cmake-sanitized/llvm-project/lldb env: LLDBVSCODE_EXEC=/Users/buildslave/jenkins/workspace/lldb-cmake-sanitized/lldb-build/bin/lldb-vscode env: LLDB_DEBUGSERVER_PATH=/Users/buildslave/jenkins/workspace/lldb-cmake-sanitized/lldb-build/./bin/debugserver env: OS_ACTIVITY_DT_MODE=enable env: LLDB_COMMAND_TRACE=YES env: LLDB_FRAMEWORK=/Users/buildslave/jenkins/workspace/lldb-cmake-sanitized/lldb-build/lib env: PATH=/usr/local/bin:/usr/local/sbin:/usr/bin:/bin:/usr/sbin:/sbin:/usr/bin:/usr/local/bin env: ASAN_OPTIONS=detect_stack_use_after_return=1 env: __CF_USER_TEXT_ENCODING=0x1F5:0x0:0x0 env: TMPDIR=/var/folders/09/r4vw4v8n5kb67jl66zvlbljw0000gn/T/ env: LLDB_LIB_DIR=/Users/buildslave/jenkins/workspace/lldb-cmake-sanitized/lldb-build/bin env: LC_CTYPE=UTF-8 env: TERM=vt100 env: LLVM_DISABLE_CRASH_REPORT=1 env: LLDB_IMPLIB_DIR=/Users/buildslave/jenkins/workspace/lldb-cmake-sanitized/lldb-build/./lib env: LINES=24 env: LLDB_TEST=/Users/buildslave/jenkins/workspace/lldb-cmake-sanitized/llvm-project/lldb/packages/Python/lldbsuite/test

Hide Details

Hide Details

Expecting sub string: a(1) Matched

Hide Details

Expecting sub string: b(2) Matched

Hide Details

Expecting sub string: a(3) Matched

Hide Details

<bound method SBProcess.Kill of <lldb.SBProcess; proxy of <Swig Object of type 'lldb::SBProcess *' at 0x10c22f360> >>: success

Hide Details

PASS: LLDB (/Users/buildslave/jenkins/workspace/lldb-cmake-sanitized/lldb-build/bin/clang-x86_64) :: test_launch_new_process_and_redirect_stdout (TestTargetAPI.TargetAPITestCase) runCmd: settings clear -all output:

Hide Details

runCmd: settings set symbols.enable-external-lookup false output:

Hide Details

runCmd: settings set target.inherit-tcc true output:

Hide Details

runCmd: settings set target.auto-apply-fixits false output:

Hide Details

runCmd: settings set plugin.process.gdb-remote.packet-timeout 60 output:

Hide Details

runCmd: settings set symbols.clang-modules-cache-path "/Users/buildslave/jenkins/workspace/lldb-cmake-sanitized/lldb-build/lldb-test-build.noindex/module-cache-lldb/lldb-api" output:

Hide Details

runCmd: settings set use-color false output:

Hide Details

runCmd: setting set target.prefer-dynamic-value no-dynamic-values output:

Hide Details

runCmd: settings set target.env-vars ASAN_OPTIONS=detect_stack_use_after_return=1 DYLD_INSERT_LIBRARIES=/Users/buildslave/jenkins/workspace/lldb-cmake-sanitized/host-compiler/lib/clang/12.0.0/lib/darwin/libclang_rt.asan_osx_dynamic.dylib output:

Hide Details

runCmd: run output: Process 12113 exited with status = 0 (0x00000000)

Hide Details

Process 12113 launched: '/Users/buildslave/jenkins/workspace/lldb-cmake-sanitized/lldb-build/lldb-test-build.noindex/python_api/target/TestTargetAPI.test_launch_simple_dsym/b.out' (x86_64)

Hide Details

Hide Details

FAIL: LLDB (/Users/buildslave/jenkins/workspace/lldb-cmake-sanitized/lldb-build/bin/clang-x86_64) :: test_launch_simple_dsym (TestTargetAPI.TargetAPITestCase) <bound method SBProcess.Kill of <lldb.SBProcess; proxy of <Swig Object of type 'lldb::SBProcess *' at 0x10c70dc90> >>: success

Hide Details

runCmd: settings clear -all output:

Hide Details

runCmd: settings set symbols.enable-external-lookup false output:

Hide Details

runCmd: settings set target.inherit-tcc true output:

Hide Details

runCmd: settings set target.auto-apply-fixits false output:

Hide Details

runCmd: settings set plugin.process.gdb-remote.packet-timeout 60 output:

Hide Details

runCmd: settings set symbols.clang-modules-cache-path "/Users/buildslave/jenkins/workspace/lldb-cmake-sanitized/lldb-build/lldb-test-build.noindex/module-cache-lldb/lldb-api" output:

Hide Details

runCmd: settings set use-color false output:

Hide Details

runCmd: setting set target.prefer-dynamic-value no-dynamic-values output:

Hide Details

runCmd: settings set target.env-vars ASAN_OPTIONS=detect_stack_use_after_return=1 DYLD_INSERT_LIBRARIES=/Users/buildslave/jenkins/workspace/lldb-cmake-sanitized/host-compiler/lib/clang/12.0.0/lib/darwin/libclang_rt.asan_osx_dynamic.dylib output:

Hide Details

runCmd: run output: Process 12225 exited with status = 0 (0x00000000)

Hide Details

Process 12225 launched: '/Users/buildslave/jenkins/workspace/lldb-cmake-sanitized/lldb-build/lldb-test-build.noindex/python_api/target/TestTargetAPI.test_launch_simple_dwarf/b.out' (x86_64)

Hide Details

Hide Details

FAIL: LLDB (/Users/buildslave/jenkins/workspace/lldb-cmake-sanitized/lldb-build/bin/clang-x86_64) :: test_launch_simple_dwarf (TestTargetAPI.TargetAPITestCase) <bound method SBProcess.Kill of <lldb.SBProcess; proxy of <Swig Object of type 'lldb::SBProcess *' at 0x10ce7a360> >>: success

Hide Details

UNSUPPORTED: LLDB (/Users/buildslave/jenkins/workspace/lldb-cmake-sanitized/lldb-build/bin/clang-x86_64) :: test_launch_simple_dwo (TestTargetAPI.TargetAPITestCase) (test case does not fall in any category of interest for this run) runCmd: settings clear -all output:

Hide Details

runCmd: settings set symbols.enable-external-lookup false output:

Hide Details

runCmd: settings set target.inherit-tcc true output:

Hide Details

runCmd: settings set target.auto-apply-fixits false output:

Hide Details

runCmd: settings set plugin.process.gdb-remote.packet-timeout 60 output:

Hide Details

runCmd: settings set symbols.clang-modules-cache-path "/Users/buildslave/jenkins/workspace/lldb-cmake-sanitized/lldb-build/lldb-test-build.noindex/module-cache-lldb/lldb-api" output:

Hide Details

runCmd: settings set use-color false output:

Hide Details

runCmd: setting set target.prefer-dynamic-value no-dynamic-values output:

Hide Details

runCmd: settings set target.env-vars ASAN_OPTIONS=detect_stack_use_after_return=1 DYLD_INSERT_LIBRARIES=/Users/buildslave/jenkins/workspace/lldb-cmake-sanitized/host-compiler/lib/clang/12.0.0/lib/darwin/libclang_rt.asan_osx_dynamic.dylib output:

Hide Details

runCmd: run output: Process 12335 exited with status = 0 (0x00000000)

Hide Details

Process 12335 launched: '/Users/buildslave/jenkins/workspace/lldb-cmake-sanitized/lldb-build/lldb-test-build.noindex/python_api/target/TestTargetAPI.test_launch_simple_gmodules/b.out' (x86_64)

Hide Details

Hide Details

FAIL: LLDB (/Users/buildslave/jenkins/workspace/lldb-cmake-sanitized/lldb-build/bin/clang-x86_64) :: test_launch_simple_gmodules (TestTargetAPI.TargetAPITestCase) <bound method SBProcess.Kill of <lldb.SBProcess; proxy of <Swig Object of type 'lldb::SBProcess *' at 0x10c70d6f0> >>: success

Hide Details

runCmd: settings clear -all output:

Hide Details

runCmd: settings set symbols.enable-external-lookup false output:

Hide Details

runCmd: settings set target.inherit-tcc true output:

Hide Details

runCmd: settings set target.auto-apply-fixits false output:

Hide Details

runCmd: settings set plugin.process.gdb-remote.packet-timeout 60 output:

Hide Details

runCmd: settings set symbols.clang-modules-cache-path "/Users/buildslave/jenkins/workspace/lldb-cmake-sanitized/lldb-build/lldb-test-build.noindex/module-cache-lldb/lldb-api" output:

Hide Details

runCmd: settings set use-color false output:

Hide Details

runCmd: setting set target.prefer-dynamic-value no-dynamic-values output:

Hide Details

runCmd: settings set target.env-vars ASAN_OPTIONS=detect_stack_use_after_return=1 DYLD_INSERT_LIBRARIES=/Users/buildslave/jenkins/workspace/lldb-cmake-sanitized/host-compiler/lib/clang/12.0.0/lib/darwin/libclang_rt.asan_osx_dynamic.dylib output:

Hide Details

<bound method SBProcess.Kill of <lldb.SBProcess; proxy of <Swig Object of type 'lldb::SBProcess *' at 0x10c70d6c0> >>: success

Hide Details

PASS: LLDB (/Users/buildslave/jenkins/workspace/lldb-cmake-sanitized/lldb-build/bin/clang-x86_64) :: test_read_memory_dsym (TestTargetAPI.TargetAPITestCase) runCmd: settings clear -all output:

Hide Details

runCmd: settings set symbols.enable-external-lookup false output:

Hide Details

runCmd: settings set target.inherit-tcc true output:

Hide Details

runCmd: settings set target.auto-apply-fixits false output:

Hide Details

runCmd: settings set plugin.process.gdb-remote.packet-timeout 60 output:

Hide Details

runCmd: settings set symbols.clang-modules-cache-path "/Users/buildslave/jenkins/workspace/lldb-cmake-sanitized/lldb-build/lldb-test-build.noindex/module-cache-lldb/lldb-api" output:

Hide Details

runCmd: settings set use-color false output:

Hide Details

runCmd: setting set target.prefer-dynamic-value no-dynamic-values output:

Hide Details

runCmd: settings set target.env-vars ASAN_OPTIONS=detect_stack_use_after_return=1 DYLD_INSERT_LIBRARIES=/Users/buildslave/jenkins/workspace/lldb-cmake-sanitized/host-compiler/lib/clang/12.0.0/lib/darwin/libclang_rt.asan_osx_dynamic.dylib output:

Hide Details

<bound method SBProcess.Kill of <lldb.SBProcess; proxy of <Swig Object of type 'lldb::SBProcess *' at 0x10c70dc90> >>: success

Hide Details

PASS: LLDB (/Users/buildslave/jenkins/workspace/lldb-cmake-sanitized/lldb-build/bin/clang-x86_64) :: test_read_memory_dwarf (TestTargetAPI.TargetAPITestCase) UNSUPPORTED: LLDB (/Users/buildslave/jenkins/workspace/lldb-cmake-sanitized/lldb-build/bin/clang-x86_64) :: test_read_memory_dwo (TestTargetAPI.TargetAPITestCase) (test case does not fall in any category of interest for this run) runCmd: settings clear -all output:

Hide Details

runCmd: settings set symbols.enable-external-lookup false output:

Hide Details

runCmd: settings set target.inherit-tcc true output:

Hide Details

runCmd: settings set target.auto-apply-fixits false output:

Hide Details

runCmd: settings set plugin.process.gdb-remote.packet-timeout 60 output:

Hide Details

runCmd: settings set symbols.clang-modules-cache-path "/Users/buildslave/jenkins/workspace/lldb-cmake-sanitized/lldb-build/lldb-test-build.noindex/module-cache-lldb/lldb-api" output:

Hide Details

runCmd: settings set use-color false output:

Hide Details

runCmd: setting set target.prefer-dynamic-value no-dynamic-values output:

Hide Details

runCmd: settings set target.env-vars ASAN_OPTIONS=detect_stack_use_after_return=1 DYLD_INSERT_LIBRARIES=/Users/buildslave/jenkins/workspace/lldb-cmake-sanitized/host-compiler/lib/clang/12.0.0/lib/darwin/libclang_rt.asan_osx_dynamic.dylib output:

Hide Details

<bound method SBProcess.Kill of <lldb.SBProcess; proxy of <Swig Object of type 'lldb::SBProcess *' at 0x10c70d6c0> >>: success

Hide Details

PASS: LLDB (/Users/buildslave/jenkins/workspace/lldb-cmake-sanitized/lldb-build/bin/clang-x86_64) :: test_read_memory_gmodules (TestTargetAPI.TargetAPITestCase) runCmd: settings clear -all output:

Hide Details

runCmd: settings set symbols.enable-external-lookup false output:

Hide Details

runCmd: settings set target.inherit-tcc true output:

Hide Details

runCmd: settings set target.auto-apply-fixits false output:

Hide Details

runCmd: settings set plugin.process.gdb-remote.packet-timeout 60 output:

Hide Details

runCmd: settings set symbols.clang-modules-cache-path "/Users/buildslave/jenkins/workspace/lldb-cmake-sanitized/lldb-build/lldb-test-build.noindex/module-cache-lldb/lldb-api" output:

Hide Details

runCmd: settings set use-color false output:

Hide Details

runCmd: setting set target.prefer-dynamic-value no-dynamic-values output:

Hide Details

runCmd: settings set target.env-vars ASAN_OPTIONS=detect_stack_use_after_return=1 DYLD_INSERT_LIBRARIES=/Users/buildslave/jenkins/workspace/lldb-cmake-sanitized/host-compiler/lib/clang/12.0.0/lib/darwin/libclang_rt.asan_osx_dynamic.dylib output:

Hide Details

PASS: LLDB (/Users/buildslave/jenkins/workspace/lldb-cmake-sanitized/lldb-build/bin/clang-x86_64) :: test_resolve_file_address_dsym (TestTargetAPI.TargetAPITestCase) runCmd: settings clear -all output:

Hide Details

runCmd: settings set symbols.enable-external-lookup false output:

Hide Details

runCmd: settings set target.inherit-tcc true output:

Hide Details

runCmd: settings set target.auto-apply-fixits false output:

Hide Details

runCmd: settings set plugin.process.gdb-remote.packet-timeout 60 output:

Hide Details

runCmd: settings set symbols.clang-modules-cache-path "/Users/buildslave/jenkins/workspace/lldb-cmake-sanitized/lldb-build/lldb-test-build.noindex/module-cache-lldb/lldb-api" output:

Hide Details

runCmd: settings set use-color false output:

Hide Details

runCmd: setting set target.prefer-dynamic-value no-dynamic-values output:

Hide Details

runCmd: settings set target.env-vars ASAN_OPTIONS=detect_stack_use_after_return=1 DYLD_INSERT_LIBRARIES=/Users/buildslave/jenkins/workspace/lldb-cmake-sanitized/host-compiler/lib/clang/12.0.0/lib/darwin/libclang_rt.asan_osx_dynamic.dylib output:

Hide Details

PASS: LLDB (/Users/buildslave/jenkins/workspace/lldb-cmake-sanitized/lldb-build/bin/clang-x86_64) :: test_resolve_file_address_dwarf (TestTargetAPI.TargetAPITestCase) UNSUPPORTED: LLDB (/Users/buildslave/jenkins/workspace/lldb-cmake-sanitized/lldb-build/bin/clang-x86_64) :: test_resolve_file_address_dwo (TestTargetAPI.TargetAPITestCase) (test case does not fall in any category of interest for this run) runCmd: settings clear -all output:

Hide Details

runCmd: settings set symbols.enable-external-lookup false output:

Hide Details

runCmd: settings set target.inherit-tcc true output:

Hide Details

runCmd: settings set target.auto-apply-fixits false output:

Hide Details

runCmd: settings set plugin.process.gdb-remote.packet-timeout 60 output:

Hide Details

runCmd: settings set symbols.clang-modules-cache-path "/Users/buildslave/jenkins/workspace/lldb-cmake-sanitized/lldb-build/lldb-test-build.noindex/module-cache-lldb/lldb-api" output:

Hide Details

runCmd: settings set use-color false output:

Hide Details

runCmd: setting set target.prefer-dynamic-value no-dynamic-values output:

Hide Details

runCmd: settings set target.env-vars ASAN_OPTIONS=detect_stack_use_after_return=1 DYLD_INSERT_LIBRARIES=/Users/buildslave/jenkins/workspace/lldb-cmake-sanitized/host-compiler/lib/clang/12.0.0/lib/darwin/libclang_rt.asan_osx_dynamic.dylib output:

Hide Details

PASS: LLDB (/Users/buildslave/jenkins/workspace/lldb-cmake-sanitized/lldb-build/bin/clang-x86_64) :: test_resolve_file_address_gmodules (TestTargetAPI.TargetAPITestCase) runCmd: settings clear -all output:

Hide Details

runCmd: settings set symbols.enable-external-lookup false output:

Hide Details

runCmd: settings set target.inherit-tcc true output:

Hide Details

runCmd: settings set target.auto-apply-fixits false output:

Hide Details

runCmd: settings set plugin.process.gdb-remote.packet-timeout 60 output:

Hide Details

runCmd: settings set symbols.clang-modules-cache-path "/Users/buildslave/jenkins/workspace/lldb-cmake-sanitized/lldb-build/lldb-test-build.noindex/module-cache-lldb/lldb-api" output:

Hide Details

runCmd: settings set use-color false output:

Hide Details

runCmd: setting set target.prefer-dynamic-value no-dynamic-values output:

Hide Details

runCmd: settings set target.env-vars ASAN_OPTIONS=detect_stack_use_after_return=1 DYLD_INSERT_LIBRARIES=/Users/buildslave/jenkins/workspace/lldb-cmake-sanitized/host-compiler/lib/clang/12.0.0/lib/darwin/libclang_rt.asan_osx_dynamic.dylib output:

Hide Details

breakpoint1: SBBreakpoint: id = 1, file = 'main.c', line = 21, exact_match = 0, locations = 1

Hide Details

breakpoint2: SBBreakpoint: id = 2, file = 'main.c', line = 26, exact_match = 0, locations = 1

Hide Details

address1: a.out`a + 11 at main.c:21:13

Hide Details

address2: a.out`a + 63 at main.c:26:12

Hide Details

context1: Module: file = "/Users/buildslave/jenkins/workspace/lldb-cmake-sanitized/lldb-build/lldb-test-build.noindex/python_api/target/TestTargetAPI.test_resolve_symbol_context_with_address_dsym/a.out", arch = "x86_64" CompileUnit: id = {0x00000000}, file = "/Users/buildslave/jenkins/workspace/lldb-cmake-sanitized/llvm-project/lldb/test/API/python_api/target/main.c", language = "c99" Function: id = {0x7fffffff0000004e}, name = "a", range = [0x0000000100000dd0-0x0000000100000e18) FuncType: id = {0x7fffffff0000004e}, byte-size = 0, decl = main.c:19, compiler_type = "int (int)" Blocks: id = {0x7fffffff0000004e}, range = [0x100000dd0-0x100000e18) LineEntry: [0x0000000100000ddb-0x0000000100000ddf): /Users/buildslave/jenkins/workspace/lldb-cmake-sanitized/llvm-project/lldb/test/API/python_api/target/main.c:21:13, is_start_of_statement = TRUE, is_prologue_end = TRUE Symbol: id = {0x00000005}, range = [0x0000000100000dd0-0x0000000100000e20), name="a"

Hide Details

context2: Module: file = "/Users/buildslave/jenkins/workspace/lldb-cmake-sanitized/lldb-build/lldb-test-build.noindex/python_api/target/TestTargetAPI.test_resolve_symbol_context_with_address_dsym/a.out", arch = "x86_64" CompileUnit: id = {0x00000000}, file = "/Users/buildslave/jenkins/workspace/lldb-cmake-sanitized/llvm-project/lldb/test/API/python_api/target/main.c", language = "c99" Function: id = {0x7fffffff0000004e}, name = "a", range = [0x0000000100000dd0-0x0000000100000e18) FuncType: id = {0x7fffffff0000004e}, byte-size = 0, decl = main.c:19, compiler_type = "int (int)" Blocks: id = {0x7fffffff0000004e}, range = [0x100000dd0-0x100000e18) LineEntry: [0x0000000100000e0f-0x0000000100000e12): /Users/buildslave/jenkins/workspace/lldb-cmake-sanitized/llvm-project/lldb/test/API/python_api/target/main.c:26:12, is_start_of_statement = TRUE Symbol: id = {0x00000005}, range = [0x0000000100000dd0-0x0000000100000e20), name="a"

Hide Details

symbol1: id = {0x00000005}, range = [0x0000000100000dd0-0x0000000100000e20), name="a"

Hide Details

symbol2: id = {0x00000005}, range = [0x0000000100000dd0-0x0000000100000e20), name="a"

Hide Details

<bound method SBProcess.Kill of <lldb.SBProcess; proxy of <Swig Object of type 'lldb::SBProcess *' at 0x10c70d6f0> >>: success

Hide Details

PASS: LLDB (/Users/buildslave/jenkins/workspace/lldb-cmake-sanitized/lldb-build/bin/clang-x86_64) :: test_resolve_symbol_context_with_address_dsym (TestTargetAPI.TargetAPITestCase) runCmd: settings clear -all output:

Hide Details

runCmd: settings set symbols.enable-external-lookup false output:

Hide Details

runCmd: settings set target.inherit-tcc true output:

Hide Details

runCmd: settings set target.auto-apply-fixits false output:

Hide Details

runCmd: settings set plugin.process.gdb-remote.packet-timeout 60 output:

Hide Details

runCmd: settings set symbols.clang-modules-cache-path "/Users/buildslave/jenkins/workspace/lldb-cmake-sanitized/lldb-build/lldb-test-build.noindex/module-cache-lldb/lldb-api" output:

Hide Details

runCmd: settings set use-color false output:

Hide Details

runCmd: setting set target.prefer-dynamic-value no-dynamic-values output:

Hide Details

runCmd: settings set target.env-vars ASAN_OPTIONS=detect_stack_use_after_return=1 DYLD_INSERT_LIBRARIES=/Users/buildslave/jenkins/workspace/lldb-cmake-sanitized/host-compiler/lib/clang/12.0.0/lib/darwin/libclang_rt.asan_osx_dynamic.dylib output:

Hide Details

breakpoint1: SBBreakpoint: id = 1, file = 'main.c', line = 21, exact_match = 0, locations = 1

Hide Details

breakpoint2: SBBreakpoint: id = 2, file = 'main.c', line = 26, exact_match = 0, locations = 1

Hide Details

address1: a.out`a + 11 at main.c:21:13

Hide Details

address2: a.out`a + 63 at main.c:26:12

Hide Details

context1: Module: file = "/Users/buildslave/jenkins/workspace/lldb-cmake-sanitized/lldb-build/lldb-test-build.noindex/python_api/target/TestTargetAPI.test_resolve_symbol_context_with_address_dwarf/a.out", arch = "x86_64" CompileUnit: id = {0x00000000}, file = "/Users/buildslave/jenkins/workspace/lldb-cmake-sanitized/llvm-project/lldb/test/API/python_api/target/main.c", language = "unknown" Function: id = {0x10000004e}, name = "a", range = [0x0000000100000dd0-0x0000000100000e18) FuncType: id = {0x10000004e}, byte-size = 0, decl = main.c:19, compiler_type = "int (int)" Blocks: id = {0x10000004e}, range = [0x100000dd0-0x100000e18) LineEntry: [0x0000000100000ddb-0x0000000100000ddf): /Users/buildslave/jenkins/workspace/lldb-cmake-sanitized/llvm-project/lldb/test/API/python_api/target/main.c:21:13, is_start_of_statement = TRUE, is_prologue_end = TRUE Symbol: id = {0x00000005}, range = [0x0000000100000dd0-0x0000000100000e20), name="a"

Hide Details

context2: Module: file = "/Users/buildslave/jenkins/workspace/lldb-cmake-sanitized/lldb-build/lldb-test-build.noindex/python_api/target/TestTargetAPI.test_resolve_symbol_context_with_address_dwarf/a.out", arch = "x86_64" CompileUnit: id = {0x00000000}, file = "/Users/buildslave/jenkins/workspace/lldb-cmake-sanitized/llvm-project/lldb/test/API/python_api/target/main.c", language = "unknown" Function: id = {0x10000004e}, name = "a", range = [0x0000000100000dd0-0x0000000100000e18) FuncType: id = {0x10000004e}, byte-size = 0, decl = main.c:19, compiler_type = "int (int)" Blocks: id = {0x10000004e}, range = [0x100000dd0-0x100000e18) LineEntry: [0x0000000100000e0f-0x0000000100000e12): /Users/buildslave/jenkins/workspace/lldb-cmake-sanitized/llvm-project/lldb/test/API/python_api/target/main.c:26:12, is_start_of_statement = TRUE Symbol: id = {0x00000005}, range = [0x0000000100000dd0-0x0000000100000e20), name="a"

Hide Details

symbol1: id = {0x00000005}, range = [0x0000000100000dd0-0x0000000100000e20), name="a"

Hide Details

symbol2: id = {0x00000005}, range = [0x0000000100000dd0-0x0000000100000e20), name="a"

Hide Details

<bound method SBProcess.Kill of <lldb.SBProcess; proxy of <Swig Object of type 'lldb::SBProcess *' at 0x10ce7a450> >>: success

Hide Details

PASS: LLDB (/Users/buildslave/jenkins/workspace/lldb-cmake-sanitized/lldb-build/bin/clang-x86_64) :: test_resolve_symbol_context_with_address_dwarf (TestTargetAPI.TargetAPITestCase) UNSUPPORTED: LLDB (/Users/buildslave/jenkins/workspace/lldb-cmake-sanitized/lldb-build/bin/clang-x86_64) :: test_resolve_symbol_context_with_address_dwo (TestTargetAPI.TargetAPITestCase) (test case does not fall in any category of interest for this run) runCmd: settings clear -all output:

Hide Details

runCmd: settings set symbols.enable-external-lookup false output:

Hide Details

runCmd: settings set target.inherit-tcc true output:

Hide Details

runCmd: settings set target.auto-apply-fixits false output:

Hide Details

runCmd: settings set plugin.process.gdb-remote.packet-timeout 60 output:

Hide Details

runCmd: settings set symbols.clang-modules-cache-path "/Users/buildslave/jenkins/workspace/lldb-cmake-sanitized/lldb-build/lldb-test-build.noindex/module-cache-lldb/lldb-api" output:

Hide Details

runCmd: settings set use-color false output:

Hide Details

runCmd: setting set target.prefer-dynamic-value no-dynamic-values output:

Hide Details

runCmd: settings set target.env-vars ASAN_OPTIONS=detect_stack_use_after_return=1 DYLD_INSERT_LIBRARIES=/Users/buildslave/jenkins/workspace/lldb-cmake-sanitized/host-compiler/lib/clang/12.0.0/lib/darwin/libclang_rt.asan_osx_dynamic.dylib output:

Hide Details

breakpoint1: SBBreakpoint: id = 1, file = 'main.c', line = 21, exact_match = 0, locations = 1

Hide Details

breakpoint2: SBBreakpoint: id = 2, file = 'main.c', line = 26, exact_match = 0, locations = 1

Hide Details

address1: a.out`a + 11 at main.c:21:13

Hide Details

address2: a.out`a + 63 at main.c:26:12

Hide Details

context1: Module: file = "/Users/buildslave/jenkins/workspace/lldb-cmake-sanitized/lldb-build/lldb-test-build.noindex/python_api/target/TestTargetAPI.test_resolve_symbol_context_with_address_gmodules/a.out", arch = "x86_64" CompileUnit: id = {0x00000000}, file = "/Users/buildslave/jenkins/workspace/lldb-cmake-sanitized/llvm-project/lldb/test/API/python_api/target/main.c", language = "unknown" Function: id = {0x100000072}, name = "a", range = [0x0000000100000dd0-0x0000000100000e18) FuncType: id = {0x100000072}, byte-size = 0, decl = main.c:19, compiler_type = "int (int)" Blocks: id = {0x100000072}, range = [0x100000dd0-0x100000e18) LineEntry: [0x0000000100000ddb-0x0000000100000ddf): /Users/buildslave/jenkins/workspace/lldb-cmake-sanitized/llvm-project/lldb/test/API/python_api/target/main.c:21:13, is_start_of_statement = TRUE, is_prologue_end = TRUE Symbol: id = {0x00000005}, range = [0x0000000100000dd0-0x0000000100000e20), name="a"

Hide Details

context2: Module: file = "/Users/buildslave/jenkins/workspace/lldb-cmake-sanitized/lldb-build/lldb-test-build.noindex/python_api/target/TestTargetAPI.test_resolve_symbol_context_with_address_gmodules/a.out", arch = "x86_64" CompileUnit: id = {0x00000000}, file = "/Users/buildslave/jenkins/workspace/lldb-cmake-sanitized/llvm-project/lldb/test/API/python_api/target/main.c", language = "unknown" Function: id = {0x100000072}, name = "a", range = [0x0000000100000dd0-0x0000000100000e18) FuncType: id = {0x100000072}, byte-size = 0, decl = main.c:19, compiler_type = "int (int)" Blocks: id = {0x100000072}, range = [0x100000dd0-0x100000e18) LineEntry: [0x0000000100000e0f-0x0000000100000e12): /Users/buildslave/jenkins/workspace/lldb-cmake-sanitized/llvm-project/lldb/test/API/python_api/target/main.c:26:12, is_start_of_statement = TRUE Symbol: id = {0x00000005}, range = [0x0000000100000dd0-0x0000000100000e20), name="a"

Hide Details

symbol1: id = {0x00000005}, range = [0x0000000100000dd0-0x0000000100000e20), name="a"

Hide Details

symbol2: id = {0x00000005}, range = [0x0000000100000dd0-0x0000000100000e20), name="a"

Hide Details

<bound method SBProcess.Kill of <lldb.SBProcess; proxy of <Swig Object of type 'lldb::SBProcess *' at 0x10c70d6f0> >>: success

Hide Details

PASS: LLDB (/Users/buildslave/jenkins/workspace/lldb-cmake-sanitized/lldb-build/bin/clang-x86_64) :: test_resolve_symbol_context_with_address_gmodules (TestTargetAPI.TargetAPITestCase) Restore dir to: /Users/buildslave/jenkins/workspace/lldb-cmake-sanitized/lldb-build/tools/lldb/test ====================================================================== FAIL: test_launch_simple_dsym (TestTargetAPI.TargetAPITestCase) ---------------------------------------------------------------------- Traceback (most recent call last): File "/Users/buildslave/jenkins/workspace/lldb-cmake-sanitized/llvm-project/lldb/packages/Python/lldbsuite/test/lldbtest.py", line 1741, in test_method return attrvalue(self) File "/Users/buildslave/jenkins/workspace/lldb-cmake-sanitized/llvm-project/lldb/test/API/python_api/target/TestTargetAPI.py", line 166, in test_launch_simple self.assertIn('arg: foo', output) AssertionError: 'arg: foo' not found in '' Config=x86_64-/Users/buildslave/jenkins/workspace/lldb-cmake-sanitized/lldb-build/bin/clang ====================================================================== FAIL: test_launch_simple_dwarf (TestTargetAPI.TargetAPITestCase) ---------------------------------------------------------------------- Traceback (most recent call last): File "/Users/buildslave/jenkins/workspace/lldb-cmake-sanitized/llvm-project/lldb/packages/Python/lldbsuite/test/lldbtest.py", line 1741, in test_method return attrvalue(self) File "/Users/buildslave/jenkins/workspace/lldb-cmake-sanitized/llvm-project/lldb/test/API/python_api/target/TestTargetAPI.py", line 166, in test_launch_simple self.assertIn('arg: foo', output) AssertionError: 'arg: foo' not found in '' Config=x86_64-/Users/buildslave/jenkins/workspace/lldb-cmake-sanitized/lldb-build/bin/clang ====================================================================== FAIL: test_launch_simple_gmodules (TestTargetAPI.TargetAPITestCase) ---------------------------------------------------------------------- Traceback (most recent call last): File "/Users/buildslave/jenkins/workspace/lldb-cmake-sanitized/llvm-project/lldb/packages/Python/lldbsuite/test/lldbtest.py", line 1741, in test_method return attrvalue(self) File "/Users/buildslave/jenkins/workspace/lldb-cmake-sanitized/llvm-project/lldb/test/API/python_api/target/TestTargetAPI.py", line 166, in test_launch_simple self.assertIn('arg: foo', output) AssertionError: 'arg: foo' not found in '' Config=x86_64-/Users/buildslave/jenkins/workspace/lldb-cmake-sanitized/lldb-build/bin/clang ---------------------------------------------------------------------- Ran 45 tests in 65.087s

Hide Details

RESULT: FAILED (31 passes, 3 failures, 0 errors, 11 skipped, 0 expected failures, 0 unexpected successes)

Hide Details

--

Hide Details

******************** PASS: lldb-unit :: Symbol/./SymbolTests/TestClangASTImporter.CopyTypeTagDecl (2057 of 2107) UNSUPPORTED: lldb-api :: functionalities/breakpoint/hardware_breakpoints/write_memory_with_hw_breakpoint/TestWriteMemoryWithHWBreakpoint.py (2058 of 2107) UNSUPPORTED: lldb-shell :: Register/x86-gp-write.test (2059 of 2107) PASS: lldb-unit :: Utility/./UtilityTests/FileSpecTest.Match (2060 of 2107) PASS: lldb-api :: macosx/DBGSourcePathRemapping/TestDSYMSourcePathRemapping.py (2061 of 2107) PASS: lldb-api :: commands/expression/call-function/TestCallUserDefinedFunction.py (2062 of 2107) PASS: lldb-api :: functionalities/data-formatter/data-formatter-stl/libcxx/iterator/TestDataFormatterLibccIterator.py (2063 of 2107) PASS: lldb-unit :: Expression/./ExpressionTests/DiagnosticManagerTest.AppendMessageAttachToLastDiag (2064 of 2107) UNSUPPORTED: lldb-api :: functionalities/data-formatter/data-formatter-stl/libstdcpp/vector/TestDataFormatterStdVector.py (2065 of 2107) PASS: lldb-api :: tools/lldb-server/TestGdbRemoteProcessInfo.py (2066 of 2107) PASS: lldb-shell :: Quit/TestQuitExitCodeTooManyArgs.test (2067 of 2107) PASS: lldb-shell :: SymbolFile/DWARF/DW_TAG_basic_type_DW_ATE_UTF_nonC.ll (2068 of 2107) PASS: lldb-shell :: ScriptInterpreter/Python/scripted_breakpoint.test (2069 of 2107) PASS: lldb-api :: functionalities/postmortem/minidump-new/TestMiniDumpUUID.py (2070 of 2107) PASS: lldb-api :: macosx/save_crashlog/TestSaveCrashlog.py (2071 of 2107) PASS: lldb-api :: commands/frame/var/TestFrameVar.py (2072 of 2107) PASS: lldb-api :: commands/command/script/import/rdar-12586188/TestRdar12586188.py (2073 of 2107) PASS: lldb-shell :: Minidump/Windows/broken-unwind.test (2074 of 2107) PASS: lldb-api :: commands/expression/import-std-module/sysroot/TestStdModuleSysroot.py (2075 of 2107) PASS: lldb-unit :: Utility/./UtilityTests/DataExtractorTest.GetCStrAtNullOffset (2076 of 2107) PASS: lldb-api :: commands/target/stop-hook/enable/TestTargetStopHookEnable.py (2077 of 2107) PASS: lldb-unit :: Utility/./UtilityTests/BinaryStreamTest.PutULEB128SevenBytes (2078 of 2107) UNSUPPORTED: lldb-shell :: Register/x86-64-ymm16-read.test (2079 of 2107) PASS: lldb-api :: functionalities/thread/concurrent_events/TestConcurrentCrashWithWatchpoint.py (2080 of 2107) PASS: lldb-api :: python_api/module_section/TestModuleAndSection.py (2081 of 2107) PASS: lldb-unit :: UnwindAssembly/x86/./UnwindAssemblyx86Tests/Testx86AssemblyInspectionEngine.TestPushEBX (2082 of 2107) UNSUPPORTED: lldb-api :: commands/expression/call-restarts/TestCallThatRestarts.py (2083 of 2107) PASS: lldb-unit :: Utility/./UtilityTests/AnsiTerminal.KnownPrefix (2084 of 2107) PASS: lldb-api :: commands/expression/scoped_enums/TestScopedEnumType.py (2085 of 2107) PASS: lldb-unit :: Utility/./UtilityTests/BinaryStreamTest.PutSLEB128SevenBytes (2086 of 2107) PASS: lldb-unit :: UnwindAssembly/x86/./UnwindAssemblyx86Tests/Testx86AssemblyInspectionEngine.TestStackRealign32BitDisp_x86_64 (2087 of 2107) PASS: lldb-api :: functionalities/data-formatter/array_typedef/TestArrayTypedef.py (2088 of 2107) PASS: lldb-unit :: Utility/./UtilityTests/BinaryStreamTest.PutSLEB128TwoBytes (2089 of 2107) PASS: lldb-unit :: Utility/./UtilityTests/FileSpecTest.GetPath (2090 of 2107) PASS: lldb-shell :: ObjectFile/PECOFF/basic-info-arm64.yaml (2091 of 2107) PASS: lldb-unit :: Utility/./UtilityTests/RegularExpression.Match (2092 of 2107) PASS: lldb-api :: commands/apropos/with-process/TestAproposWithProcess.py (2093 of 2107) PASS: lldb-unit :: Utility/./UtilityTests/StreamTest.PutHex64ByteOrderBig (2094 of 2107) PASS: lldb-api :: lang/c/shared_lib/TestSharedLib.py (2095 of 2107) PASS: lldb-unit :: UnwindAssembly/x86/./UnwindAssemblyx86Tests/Testx86AssemblyInspectionEngine.TestReturnDetect (2096 of 2107) PASS: lldb-unit :: API/./APITests/SBCommandInterpreterTest.MultiWordCommand (2097 of 2107) PASS: lldb-unit :: Utility/./UtilityTests/OptionsWithRawTest.EmptyInput (2098 of 2107) PASS: lldb-api :: commands/expression/rdar42038760/TestScalarURem.py (2099 of 2107) PASS: lldb-unit :: Utility/./UtilityTests/LogChannelEnabledTest.log_options (2100 of 2107) PASS: lldb-unit :: ObjectFile/Breakpad/./ObjectFileBreakpadTests/FileRecord.parse (2101 of 2107) PASS: lldb-unit :: Target/./TargetTests/StackFrameRecognizerTest.NullModuleRegex (2102 of 2107) PASS: lldb-unit :: Expression/./ExpressionTests/DiagnosticManagerTest.GetStringBasic (2103 of 2107) PASS: lldb-unit :: ScriptInterpreter/Python/./ScriptInterpreterPythonTests/PythonDataObjectsTest.TestPythonDictionaryValueEquality (2104 of 2107) PASS: lldb-api :: functionalities/data-formatter/data-formatter-synthval/TestDataFormatterSynthVal.py (2105 of 2107) PASS: lldb-api :: functionalities/data-formatter/data-formatter-objc/TestDataFormatterObjCNSURL.py (2106 of 2107) PASS: lldb-api :: functionalities/data-formatter/data-formatter-objc/TestDataFormatterObjCNSError.py (2107 of 2107) Slowest Tests: -------------------------------------------------------------------------- 349.51s: lldb-api :: tools/lldb-server/TestLldbGdbServer.py 261.87s: lldb-api :: lang/cpp/enum_types/TestCPP11EnumTypes.py 243.07s: lldb-api :: api/multithreaded/TestMultithreaded.py 204.34s: lldb-api :: lang/objc/hidden-ivars/TestHiddenIvars.py 202.30s: lldb-api :: lang/objc/foundation/TestObjCMethods.py 144.81s: lldb-api :: lang/cpp/namespace/TestNamespaceLookup.py 140.00s: lldb-api :: lang/objc/exceptions/TestObjCExceptions.py 138.11s: lldb-api :: lang/objc/objc-new-syntax/TestObjCNewSyntaxLiteral.py 134.69s: lldb-api :: lang/objc/real-definition/TestRealDefinition.py 121.25s: lldb-api :: types/TestLongTypesExpr.py 108.96s: lldb-api :: lang/objc/foundation/TestObjCMethodsString.py 104.65s: lldb-api :: lang/objc/objc-new-syntax/TestObjCNewSyntaxDictionary.py 104.02s: lldb-api :: lang/objc/foundation/TestObjCMethodsNSError.py 103.62s: lldb-api :: lang/objc/objc-new-syntax/TestObjCNewSyntaxArray.py 91.48s: lldb-api :: functionalities/gdb_remote_client/TestWasm.py 90.24s: lldb-api :: types/TestLongTypes.py 88.62s: lldb-api :: commands/settings/TestSettings.py 87.46s: lldb-api :: functionalities/data-formatter/compactvectors/TestCompactVectors.py 86.85s: lldb-api :: lang/objc/conflicting-definition/TestConflictingDefinition.py 85.27s: lldb-api :: tools/lldb-server/TestGdbRemoteThreadsInStopReply.py

Hide Details

Tests Times: -------------------------------------------------------------------------- [ Range ] :: [ Percentage ] :: [ Count ] -------------------------------------------------------------------------- [340s,360s) :: [ ] :: [ 1/2107] [320s,340s) :: [ ] :: [ 0/2107] [300s,320s) :: [ ] :: [ 0/2107] [280s,300s) :: [ ] :: [ 0/2107] [260s,280s) :: [ ] :: [ 1/2107] [240s,260s) :: [ ] :: [ 1/2107] [220s,240s) :: [ ] :: [ 0/2107] [200s,220s) :: [ ] :: [ 2/2107] [180s,200s) :: [ ] :: [ 0/2107] [160s,180s) :: [ ] :: [ 0/2107] [140s,160s) :: [ ] :: [ 3/2107] [120s,140s) :: [ ] :: [ 2/2107] [100s,120s) :: [ ] :: [ 4/2107] [ 80s,100s) :: [ ] :: [ 9/2107] [ 60s, 80s) :: [ ] :: [ 20/2107] [ 40s, 60s) :: [* ] :: [ 57/2107] [ 20s, 40s) :: [** ] :: [ 147/2107] [ 0s, 20s) :: [*********************************** ] :: [1860/2107] -------------------------------------------------------------------------- ******************** Failed Tests (3): lldb-shell :: SymbolFile/DWARF/debug-line-basic.s lldb-api :: macosx/macCatalyst/TestMacCatalyst.py lldb-api :: python_api/target/TestTargetAPI.py

Hide Details

Hide Details

Testing Time: 4143.60s Unsupported : 182 Passed : 1916 Expectedly Failed: 6 Failed : 3 FAILED: tools/lldb/test/CMakeFiles/check-lldb-lit cd /Users/buildslave/jenkins/workspace/lldb-cmake-sanitized/lldb-build/tools/lldb/test && /usr/local/Frameworks/Python.framework/Versions/3.7/bin/python3.7 /Users/buildslave/jenkins/workspace/lldb-cmake-sanitized/lldb-build/./bin/llvm-lit -v --time-tests --shuffle --xunit-xml-output=/Users/buildslave/jenkins/workspace/lldb-cmake-sanitized/test/results.xml -v -j 4 --timeout 1200 /Users/buildslave/jenkins/workspace/lldb-cmake-sanitized/lldb-build/tools/lldb/test ninja: build stopped: subcommand failed. Command failed: Command '['/usr/bin/env', 'TERM=vt100', '/usr/local/bin/ninja', '-v', 'check-lldb']' returned non-zero exit status 1. Command: ['/usr/bin/env', 'TERM=vt100', '/usr/local/bin/ninja', '-v', 'check-lldb'] [Pipeline] } [Pipeline] // timeout [Pipeline] } [Pipeline] // stage [Pipeline] stage [Pipeline] { (Declarative: Post Actions) [Pipeline] scanForIssues [Clang (LLVM based)] Sleeping for 5 seconds due to JENKINS-32191... [Clang (LLVM based)] Parsing console log (workspace: '/Users/buildslave/jenkins/workspace/lldb-cmake-sanitized') [Clang (LLVM based)] Successfully parsed console log [Clang (LLVM based)] -> found 4 issues (skipped 0 duplicates) [Clang (LLVM based)] Post processing issues on 'green-dragon-23' with source code encoding 'UTF-8' [Clang (LLVM based)] Creating SCM blamer to obtain author and commit information for affected files [Clang (LLVM based)] Creating SCM miner to obtain statistics for affected repository files [Clang (LLVM based)] Resolving file names for all issues in source directory '/Users/buildslave/jenkins/workspace/lldb-cmake-sanitized' [Clang (LLVM based)] -> resolved paths in source directory (3 found, 0 not found) [Clang (LLVM based)] Resolving module names from module definitions (build.xml, pom.xml, or Manifest.mf files) [Clang (LLVM based)] -> resolved module names for 4 issues [Clang (LLVM based)] Resolving package names (or namespaces) by parsing the affected files [Clang (LLVM based)] -> resolved package names of 3 affected files [Clang (LLVM based)] No filter has been set, publishing all 4 issues [Clang (LLVM based)] Creating fingerprints for all affected code blocks to track issues over different builds [Clang (LLVM based)] -> created fingerprints for 4 issues (skipped 0 issues) [Clang (LLVM based)] Copying affected files to Jenkins' build folder '/Users/Shared/Jenkins/Home/jobs/lldb-cmake-sanitized/builds/1691/files-with-issues' [Clang (LLVM based)] -> 3 copied, 0 not in workspace, 0 not-found, 0 with I/O error [Pipeline] junit Recording test results [Pipeline] } [Pipeline] // stage [Pipeline] } [Pipeline] // withEnv [Pipeline] } [Pipeline] // node [Pipeline] End of Pipeline ERROR: script returned exit code 1 Finished: FAILURE