FailedConsole Output

Skipping 34,408 KB.. Full Log
 2108)
PASS: lldb-unit :: Signals/./SignalsTests/UnixSignalsTest.GetInfo (1079 of 2108)
PASS: lldb-unit :: Utility/./UtilityTests/GeneratorTest.GetOrCreate (1080 of 2108)
PASS: lldb-unit :: Expression/./ExpressionTests/CppModuleConfigurationTest.Sysroot (1081 of 2108)
PASS: lldb-api :: tools/lldb-server/TestGdbRemoteAttach.py (1082 of 2108)
PASS: lldb-api :: lang/c/function_types/TestFunctionTypes.py (1083 of 2108)
PASS: lldb-unit :: Utility/./UtilityTests/RangeTest.DoesAdjoinOrIntersect (1084 of 2108)
PASS: lldb-unit :: Process/gdb-remote/./ProcessGdbRemoteTests/GDBRemoteClientBaseTest.SendContinueAndAsyncSignal (1085 of 2108)
PASS: lldb-unit :: Utility/./UtilityTests/DataExtractorTest.GetCStrAtEnd (1086 of 2108)
PASS: lldb-api :: functionalities/data-formatter/array_typedef/TestArrayTypedef.py (1087 of 2108)
PASS: lldb-unit :: Utility/./UtilityTests/ArgsTest.ReplaceArgumentAtIndexLonger (1088 of 2108)
PASS: lldb-api :: types/TestFloatTypesExpr.py (1089 of 2108)
PASS: lldb-api :: lang/objc/objc-static-method-stripped/TestObjCStaticMethodStripped.py (1090 of 2108)
PASS: lldb-unit :: Utility/./UtilityTests/StringExtractorTest.GetU64BigEndian (1091 of 2108)
PASS: lldb-unit :: SymbolFile/NativePDB/./SymbolFileNativePDBTests/PDBFPOProgramToDWARFExpressionTests.MissingTargetRegister (1092 of 2108)
UNSUPPORTED: lldb-shell :: SymbolFile/DWARF/DW_TAG_GNU_call_site-DW_AT_low_pc.s (1093 of 2108)
PASS: lldb-unit :: Utility/./UtilityTests/RangeTest.Constructor (1094 of 2108)
PASS: lldb-api :: functionalities/history/TestHistoryRecall.py (1095 of 2108)
PASS: lldb-unit :: Utility/./UtilityTests/FileSpecTest.PrependPathComponent (1096 of 2108)
PASS: lldb-unit :: Utility/./UtilityTests/TildeExpressionResolver.ResolveFullPath (1097 of 2108)
PASS: lldb-shell :: SymbolFile/Breakpad/symtab.test (1098 of 2108)
PASS: lldb-shell :: Reproducer/Functionalities/TestStepping.test (1099 of 2108)
PASS: lldb-api :: functionalities/data-formatter/language_category_updates/TestDataFormatterLanguageCategoryUpdates.py (1100 of 2108)
PASS: lldb-api :: functionalities/data-formatter/data-formatter-stl/libcxx/multimap/TestDataFormatterLibccMultiMap.py (1101 of 2108)
PASS: lldb-api :: functionalities/inferior-assert/TestInferiorAssert.py (1102 of 2108)
PASS: lldb-unit :: Utility/./UtilityTests/RangeTest.ContainsAddr (1103 of 2108)
PASS: lldb-shell :: SymbolFile/DWARF/inline-function-address-shared.test (1104 of 2108)
PASS: lldb-shell :: SymbolFile/Breakpad/stack-cfi-parsing.test (1105 of 2108)
PASS: lldb-api :: api/multiple-targets/TestMultipleTargets.py (1106 of 2108)
PASS: lldb-unit :: ObjectFile/Breakpad/./ObjectFileBreakpadTests/Record.classify (1107 of 2108)
PASS: lldb-unit :: Process/minidump/./LLDBMinidumpTests/RegisterContextMinidump.ConvertMinidumpContext_x86_64 (1108 of 2108)
UNSUPPORTED: lldb-shell :: Register/x86-64-xmm16-read.test (1109 of 2108)
PASS: lldb-shell :: ObjectFile/wasm/stripped-debug-sections.yaml (1110 of 2108)
PASS: lldb-unit :: Utility/./UtilityTests/TimerTest.CategoryTimesStats (1111 of 2108)
PASS: lldb-api :: lang/cpp/namespace_conflicts/TestNamespaceConflicts.py (1112 of 2108)
PASS: lldb-api :: functionalities/data-formatter/data-formatter-caching/TestDataFormatterCaching.py (1113 of 2108)
PASS: lldb-unit :: Utility/./UtilityTests/RangeTest.DefaultConstructor (1114 of 2108)
PASS: lldb-api :: commands/expression/char/TestExprsChar.py (1115 of 2108)
PASS: lldb-unit :: Utility/./UtilityTests/CompletionRequest.TryCompleteCurrentArgGood (1116 of 2108)
PASS: lldb-unit :: UnwindAssembly/x86/./UnwindAssemblyx86Tests/Testx86AssemblyInspectionEngine.TestPushESI (1117 of 2108)
PASS: lldb-api :: lang/objc/direct-dispatch-step/TestObjCDirectDispatchStepping.py (1118 of 2108)
PASS: lldb-shell :: Quit/TestQuitExitCodeTooManyArgs.test (1119 of 2108)
PASS: lldb-unit :: Utility/./UtilityTests/FileSpecTest.FormatFileSpec (1120 of 2108)
PASS: lldb-api :: macosx/DBGSourcePathRemapping/TestDSYMSourcePathRemapping.py (1121 of 2108)
UNSUPPORTED: lldb-shell :: Register/x86-64-xmm16-write.test (1122 of 2108)
PASS: lldb-api :: types/TestShortTypeExpr.py (1123 of 2108)
PASS: lldb-shell :: Quit/TestQuitExitCodeHexA.test (1124 of 2108)
PASS: lldb-api :: commands/session/history/TestSessionHistory.py (1125 of 2108)
PASS: lldb-unit :: Expression/./ExpressionTests/DiagnosticManagerTest.GetStringMultiline (1126 of 2108)
PASS: lldb-api :: macosx/lc-note/kern-ver-str/TestKernVerStrLCNOTE.py (1127 of 2108)
PASS: lldb-api :: commands/expression/call-function/TestCallBuiltinFunction.py (1128 of 2108)
PASS: lldb-api :: lang/cpp/bool/TestCPPBool.py (1129 of 2108)
PASS: lldb-unit :: SymbolFile/NativePDB/./SymbolFileNativePDBTests/PDBFPOProgramToDWARFExpressionTests.InvalidAssignmentSingle (1130 of 2108)
PASS: lldb-unit :: Utility/./UtilityTests/StringLexerTest.PutBack (1131 of 2108)
PASS: lldb-unit :: Utility/./UtilityTests/OptionsWithRawTest.WhitespaceSuffix (1132 of 2108)
PASS: lldb-unit :: debugserver/./debugserverTests/RNBSocket.LoopBackListenIPv4 (1133 of 2108)
PASS: lldb-api :: functionalities/data-formatter/data-formatter-stl/libcxx/set/TestDataFormatterLibcxxSet.py (1134 of 2108)
PASS: lldb-unit :: Host/./HostTests/MainLoopTest.TerminatesImmediately (1135 of 2108)
PASS: lldb-shell :: Settings/TestLineMarkerColor.test (1136 of 2108)
PASS: lldb-api :: commands/expression/import-std-module/vector/TestVectorFromStdModule.py (1137 of 2108)
PASS: lldb-unit :: Language/Highlighting/./HighlighterTests/HighlighterTest.HighlighterSelectionType (1138 of 2108)
PASS: lldb-api :: functionalities/archives/TestBSDArchives.py (1139 of 2108)
PASS: lldb-api :: macosx/nslog/TestDarwinNSLogOutput.py (1140 of 2108)
PASS: lldb-unit :: Utility/./UtilityTests/StreamTest.PutChar (1141 of 2108)
UNSUPPORTED: lldb-shell :: Register/x86-zmm-read.test (1142 of 2108)
PASS: lldb-unit :: Utility/./UtilityTests/ListenerTest.GetEventImmediate (1143 of 2108)
PASS: lldb-api :: lang/c/shared_lib/TestSharedLib.py (1144 of 2108)
PASS: lldb-unit :: Utility/./UtilityTests/StreamTest.PutRawBytesToBigEndian (1145 of 2108)
PASS: lldb-unit :: Language/Highlighting/./HighlighterTests/HighlighterTest.ClangScalarLiterals (1146 of 2108)
PASS: lldb-shell :: Breakpoint/case-sensitive.test (1147 of 2108)
UNSUPPORTED: lldb-api :: linux/sepdebugsymlink/TestTargetSymbolsSepDebugSymlink.py (1148 of 2108)
PASS: lldb-api :: lang/cpp/multiple-inheritance/TestCppMultipleInheritance.py (1149 of 2108)
PASS: lldb-unit :: Host/./HostTests/HostInfoTest.GetXcodeSDK (1150 of 2108)
PASS: lldb-api :: python_api/value/change_values/TestChangeValueAPI.py (1151 of 2108)
PASS: lldb-unit :: ScriptInterpreter/Python/./ScriptInterpreterPythonTests/PythonDataObjectsTest.TestObjectAttributes (1152 of 2108)
PASS: lldb-unit :: Utility/./UtilityTests/DataExtractorTest.GetMaxU64 (1153 of 2108)
PASS: lldb-api :: python_api/watchpoint/TestSetWatchpoint.py (1154 of 2108)
PASS: lldb-unit :: DataFormatter/./LLDBFormatterTests/StringPrinterTests.CxxASCII (1155 of 2108)
PASS: lldb-unit :: ScriptInterpreter/Python/./ScriptInterpreterPythonTests/PythonDataObjectsTest.TestInstanceNameResolutionNoDot (1156 of 2108)
PASS: lldb-api :: python_api/sbenvironment/TestSBEnvironment.py (1157 of 2108)
PASS: lldb-unit :: SymbolFile/NativePDB/./SymbolFileNativePDBTests/PDBFPOProgramToDWARFExpressionTests.UnresolvedRegisterAssignmentReference (1158 of 2108)
PASS: lldb-api :: lang/c/inlines/TestRedefinitionsInInlines.py (1159 of 2108)
PASS: lldb-api :: functionalities/tail_call_frames/cross_object/TestCrossObjectTailCalls.py (1160 of 2108)
PASS: lldb-unit :: Utility/./UtilityTests/StringExtractorTest.DecodeHexU8_InvalidHex (1161 of 2108)
PASS: lldb-unit :: ObjectFile/Breakpad/./ObjectFileBreakpadTests/StackCFIRecord.parse (1162 of 2108)
PASS: lldb-unit :: Utility/./UtilityTests/ScalarTest.Promotion (1163 of 2108)
PASS: lldb-unit :: Host/./HostTests/SocketTest.TCPListen0ConnectAccept (1164 of 2108)
PASS: lldb-api :: python_api/module_section/TestModuleAndSection.py (1165 of 2108)
PASS: lldb-unit :: Utility/./UtilityTests/StringExtractorTest.GetHexBytesAvail (1166 of 2108)
UNSUPPORTED: lldb-shell :: ObjectFile/PECOFF/disassemble-thumb.yaml (1167 of 2108)
PASS: lldb-unit :: Utility/./UtilityTests/OptionsWithRawTest.LeadingSpaceArgs (1168 of 2108)
UNSUPPORTED: lldb-shell :: SymbolFile/PDB/func-symbols.test (1169 of 2108)
PASS: lldb-unit :: Utility/./UtilityTests/NameMatchesTest.Equals (1170 of 2108)
PASS: lldb-api :: commands/expression/vector_of_enums/TestVectorOfEnums.py (1171 of 2108)
PASS: lldb-unit :: Host/./HostTests/SocketTest.TCPGetConnectURI (1172 of 2108)
PASS: lldb-unit :: Utility/./UtilityTests/ArgsTest.TestQuotedTrailingBackslash (1173 of 2108)
PASS: lldb-unit :: Process/minidump/./LLDBMinidumpTests/MinidumpParserTest.GetLinuxProcStatus_no_stream (1174 of 2108)
PASS: lldb-unit :: Core/./LLDBCoreTests/StreamCallbackTest.Callback (1175 of 2108)
UNSUPPORTED: lldb-shell :: SymbolFile/PDB/compilands.test (1176 of 2108)
PASS: lldb-api :: lang/objc/objc-super/TestObjCSuper.py (1177 of 2108)
PASS: lldb-unit :: Utility/./UtilityTests/RecordReplayTest.InstrumentedBarRef (1178 of 2108)
PASS: lldb-api :: functionalities/source-map/TestTargetSourceMap.py (1179 of 2108)
PASS: lldb-unit :: Utility/./UtilityTests/FileSpecTest.RemoveLastPathComponent (1180 of 2108)
PASS: lldb-unit :: Process/gdb-remote/./ProcessGdbRemoteTests/GDBRemoteCommunicationClientTest.SendStartTracePacket (1181 of 2108)
PASS: lldb-unit :: Host/./HostTests/FileSystemTest.GetPermissions (1182 of 2108)
PASS: lldb-api :: lang/cpp/breakpoint-commands/TestCPPBreakpointCommands.py (1183 of 2108)
UNSUPPORTED: lldb-api :: commands/watchpoints/variable_out_of_scope/TestWatchedVarHitWhenInScope.py (1184 of 2108)
UNSUPPORTED: lldb-api :: commands/expression/multiline-completion/TestMultilineCompletion.py (1185 of 2108)
PASS: lldb-unit :: Utility/./UtilityTests/StringListTest.SetSize (1186 of 2108)
PASS: lldb-unit :: UnwindAssembly/x86/./UnwindAssemblyx86Tests/Testx86AssemblyInspectionEngine.Test64bitFramelessSmallStackFrame (1187 of 2108)
PASS: lldb-unit :: Symbol/./SymbolTests/PostfixExpression.ParseOneExpression (1188 of 2108)
PASS: lldb-api :: functionalities/data-formatter/poarray/TestPrintObjectArray.py (1189 of 2108)
PASS: lldb-api :: lang/objc/conflicting-definition/TestConflictingDefinition.py (1190 of 2108)
PASS: lldb-unit :: Process/minidump/./LLDBMinidumpTests/MinidumpParserTest.GetPidWow64 (1191 of 2108)
PASS: lldb-api :: api/check_public_api_headers/TestPublicAPIHeaders.py (1192 of 2108)
PASS: lldb-api :: lang/cpp/this/TestCPPThis.py (1193 of 2108)
PASS: lldb-shell :: ObjectFile/Breakpad/uuid-matching-mac.test (1194 of 2108)
PASS: lldb-api :: lang/cpp/unsigned_types/TestUnsignedTypes.py (1195 of 2108)
PASS: lldb-shell :: SymbolFile/DWARF/dir-separator-no-comp-dir.s (1196 of 2108)
PASS: lldb-unit :: Utility/./UtilityTests/StringLexerTest.NextIf (1197 of 2108)
PASS: lldb-api :: lang/cpp/nested-class-other-compilation-unit/TestNestedClassWithParentInAnotherCU.py (1198 of 2108)
PASS: lldb-api :: python_api/lldbutil/process/TestPrintStackTraces.py (1199 of 2108)
PASS: lldb-unit :: Utility/./UtilityTests/Flags.AnyClear (1200 of 2108)
UNSUPPORTED: lldb-api :: commands/target/auto-install-main-executable/TestAutoInstallMainExecutable.py (1201 of 2108)
PASS: lldb-api :: lang/objcxx/cxx-bridged-po/TestObjCXXBridgedPO.py (1202 of 2108)
PASS: lldb-unit :: DataFormatter/./LLDBFormatterTests/TypeMatcherTests.RegexName (1203 of 2108)
PASS: lldb-api :: python_api/lldbutil/iter/TestLLDBIterator.py (1204 of 2108)
PASS: lldb-shell :: SymbolFile/NativePDB/function-types-classes.cpp (1205 of 2108)
PASS: lldb-api :: functionalities/inferior-crashing/TestInferiorCrashingStep.py (1206 of 2108)
PASS: lldb-api :: commands/settings/use_source_cache/TestUseSourceCache.py (1207 of 2108)
PASS: lldb-api :: python_api/thread/TestThreadAPI.py (1208 of 2108)
PASS: lldb-shell :: SymbolFile/DWARF/dwp-separate-debug-file.cpp (1209 of 2108)
PASS: lldb-unit :: Utility/./UtilityTests/RangeTest.NotEqual (1210 of 2108)
PASS: lldb-unit :: Language/Highlighting/./HighlighterTests/HighlighterTest.ClangPPDirectives (1211 of 2108)
XFAIL: lldb-shell :: SymbolFile/DWARF/find-type-in-function.cpp (1212 of 2108)
PASS: lldb-api :: commands/expression/test/TestExprs2.py (1213 of 2108)
PASS: lldb-unit :: Utility/./UtilityTests/ArgsTest.TestInsertArg (1214 of 2108)
PASS: lldb-unit :: Utility/./UtilityTests/ArgsTest.EscapeLLDBCommandArgument (1215 of 2108)
PASS: lldb-unit :: Expression/./ExpressionTests/CppModuleConfigurationTest.UnrelatedLibrary (1216 of 2108)
PASS: lldb-unit :: Utility/./UtilityTests/BinaryStreamTest.PutSLEB128FourBytes (1217 of 2108)
PASS: lldb-shell :: SymbolFile/DWARF/DW_TAG_basic_type_DW_ATE_UTF_nonC.ll (1218 of 2108)
UNSUPPORTED: lldb-api :: lang/cpp/function-template-parameter-pack/TestFunctionTemplateParameterPack.py (1219 of 2108)
PASS: lldb-unit :: Utility/./UtilityTests/BinaryStreamTest.PutSLEB128NineBytes (1220 of 2108)
PASS: lldb-unit :: Utility/./UtilityTests/StreamTeeTest.Assignment (1221 of 2108)
PASS: lldb-api :: python_api/lldbutil/frame/TestFrameUtils.py (1222 of 2108)
PASS: lldb-api :: tools/lldb-server/TestGdbRemoteSingleStep.py (1223 of 2108)
PASS: lldb-shell :: SymbolFile/NativePDB/disassembly.cpp (1224 of 2108)
PASS: lldb-api :: functionalities/thread/exit_during_step/TestExitDuringStep.py (1225 of 2108)
PASS: lldb-unit :: Core/./LLDBCoreTests/SourceFileCache.FindSourceFileFound (1226 of 2108)
PASS: lldb-unit :: Utility/./UtilityTests/StreamTest.ChangingByteOrder (1227 of 2108)
PASS: lldb-unit :: ScriptInterpreter/Python/./ScriptInterpreterPythonTests/PythonDataObjectsTest.TestScript (1228 of 2108)
PASS: lldb-unit :: Utility/./UtilityTests/LogChannelTest.EnableOptions (1229 of 2108)
PASS: lldb-api :: commands/expression/invalid-args/TestInvalidArgsExpression.py (1230 of 2108)
UNSUPPORTED: lldb-api :: functionalities/tsan/global_location/TestTsanGlobalLocation.py (1231 of 2108)
PASS: lldb-unit :: ScriptInterpreter/Python/./ScriptInterpreterPythonTests/PythonDataObjectsTest.TestPythonInteger (1232 of 2108)
PASS: lldb-unit :: Utility/./UtilityTests/ArgsTest.TestSingleQuotedArgWithSpace (1233 of 2108)
PASS: lldb-unit :: Utility/./UtilityTests/StreamTest.PutHex8 (1234 of 2108)
PASS: lldb-unit :: Utility/./UtilityTests/DataExtractorTest.GetCStrEmpty (1235 of 2108)
PASS: lldb-unit :: Language/CPlusPlus/./LanguageCPlusPlusTests/CPlusPlusLanguage.FindAlternateFunctionManglings (1236 of 2108)
PASS: lldb-unit :: Utility/./UtilityTests/StringExtractorTest.GetHexU8_Underflow2 (1237 of 2108)
PASS: lldb-shell :: SymbolFile/DWARF/dwp-debug-types.s (1238 of 2108)
PASS: lldb-unit :: ScriptInterpreter/Python/./ScriptInterpreterPythonTests/PythonDataObjectsTest.TestGlobalNameResolutionWithDot (1239 of 2108)
PASS: lldb-api :: commands/expression/import-std-module/forward_list/TestForwardListFromStdModule.py (1240 of 2108)
PASS: lldb-unit :: Language/Highlighting/./HighlighterTests/HighlighterTest.ClangSquareBrackets (1241 of 2108)
PASS: lldb-unit :: Utility/./UtilityTests/StringExtractorTest.GetHexBytes_OddPair2 (1242 of 2108)
PASS: lldb-api :: functionalities/step_scripted/TestStepScripted.py (1243 of 2108)
PASS: lldb-unit :: Utility/./UtilityTests/StringListTest.AppendListCStringArrayEmpty (1244 of 2108)
PASS: lldb-api :: functionalities/thread/step_out/TestThreadStepOut.py (1245 of 2108)
PASS: lldb-api :: functionalities/data-formatter/parray/TestPrintArray.py (1246 of 2108)
PASS: lldb-api :: lang/cpp/extern_c/TestExternCSymbols.py (1247 of 2108)
PASS: lldb-api :: functionalities/data-formatter/format-propagation/TestFormatPropagation.py (1248 of 2108)
PASS: lldb-unit :: Language/Highlighting/./HighlighterTests/HighlighterTest.ClangUnterminatedString (1249 of 2108)
PASS: lldb-api :: lang/objc/modules-auto-import/TestModulesAutoImport.py (1250 of 2108)
PASS: lldb-unit :: Language/Highlighting/./HighlighterTests/HighlighterTest.ClangCursorOutOfBounds (1251 of 2108)
UNSUPPORTED: lldb-api :: functionalities/tsan/thread_numbers/TestTsanThreadNumbers.py (1252 of 2108)
PASS: lldb-api :: lang/objc/foundation/TestRuntimeTypes.py (1253 of 2108)
PASS: lldb-unit :: ObjectFile/PECOFF/./ObjectFilePECOFFTests/PECallFrameInfoTest.Basic_eh (1254 of 2108)
PASS: lldb-shell :: Reproducer/Modules/TestModuleCXX.test (1255 of 2108)
PASS: lldb-unit :: Utility/./UtilityTests/StringExtractorTest.GetNameColonValueSuccess (1256 of 2108)
PASS: lldb-unit :: Utility/./UtilityTests/RangeDataVector.CustomSort (1257 of 2108)
PASS: lldb-unit :: Utility/./UtilityTests/ProcessInstanceInfo.DumpTable (1258 of 2108)
PASS: lldb-api :: functionalities/fat_archives/TestFatArchives.py (1259 of 2108)
PASS: lldb-api :: commands/frame/var/TestFrameVar.py (1260 of 2108)
PASS: lldb-unit :: Utility/./UtilityTests/LogChannelTest.List (1261 of 2108)
PASS: lldb-unit :: Utility/./UtilityTests/LogChannelEnabledTest.LogVerboseThread (1262 of 2108)
PASS: lldb-unit :: UnwindAssembly/x86/./UnwindAssemblyx86Tests/Testx86AssemblyInspectionEngine.TestPush0 (1263 of 2108)
PASS: lldb-unit :: Utility/./UtilityTests/AnsiTerminal.Incomplete (1264 of 2108)
PASS: lldb-unit :: Symbol/./SymbolTests/TestTypeSystemClang.TestGetTypeClassTypeOfExpr (1265 of 2108)
PASS: lldb-api :: tools/lldb-server/TestGdbRemoteKill.py (1266 of 2108)
PASS: lldb-unit :: Host/./HostTests/NativeProcessProtocolTest.ReadMemoryWithoutTrap (1267 of 2108)
PASS: lldb-api :: lang/objc/modules-update/TestClangModulesUpdate.py (1268 of 2108)
PASS: lldb-api :: commands/platform/process/list/TestProcessList.py (1269 of 2108)
PASS: lldb-api :: functionalities/optimized_code/TestNoASanExceptionAfterEvalOP_piece.py (1270 of 2108)
PASS: lldb-api :: commands/watchpoints/multiple_threads/TestWatchpointMultipleThreads.py (1271 of 2108)
PASS: lldb-api :: types/TestCharType.py (1272 of 2108)
PASS: lldb-shell :: ObjectFile/PECOFF/basic-info-arm64.yaml (1273 of 2108)
PASS: lldb-api :: python_api/lldbutil/TestSwigVersion.py (1274 of 2108)
PASS: lldb-unit :: Utility/./UtilityTests/StringExtractorTest.GetHexBytesAvail_FullString (1275 of 2108)
PASS: lldb-unit :: ObjectFile/MachO/./ObjectFileMachOTests/ObjectFileMachOTest.ModuleFromSharedCacheInfo (1276 of 2108)
UNSUPPORTED: lldb-api :: benchmarks/libcxxmap/TestBenchmarkLibcxxMap.py (1277 of 2108)
PASS: lldb-api :: commands/expression/context-object/TestContextObject.py (1278 of 2108)
PASS: lldb-unit :: Utility/./UtilityTests/DataExtractorTest.GetMaxU64_unchecked (1279 of 2108)
PASS: lldb-unit :: Utility/./UtilityTests/StreamTest.PutMaxHex64ByteOrderBig (1280 of 2108)
PASS: lldb-api :: functionalities/data-formatter/data-formatter-python-synth/TestDataFormatterPythonSynth.py (1281 of 2108)
XFAIL: lldb-shell :: Register/x86-mm-xmm-write.test (1282 of 2108)
PASS: lldb-unit :: Host/./HostTests/ConnectionFileDescriptorTest.TCPGetURIv4 (1283 of 2108)
PASS: lldb-unit :: Utility/./UtilityTests/RangeDataVector.FindEntryIndexesThatContain (1284 of 2108)
PASS: lldb-unit :: Utility/./UtilityTests/StringListTest.AppendList (1285 of 2108)
PASS: lldb-shell :: Settings/TestStopCommandSourceOnError.test (1286 of 2108)
PASS: lldb-shell :: Reproducer/TestReuseDirectory.test (1287 of 2108)
PASS: lldb-api :: functionalities/thread/concurrent_events/TestConcurrentCrashWithWatchpointBreakpointSignal.py (1288 of 2108)
PASS: lldb-unit :: Utility/./UtilityTests/StringListTest.CopyListEmpty (1289 of 2108)
PASS: lldb-api :: commands/add-dsym/uuid/TestAddDsymCommand.py (1290 of 2108)
PASS: lldb-shell :: SymbolFile/DWARF/DW_AT_low_pc-addrx.s (1291 of 2108)
PASS: lldb-api :: tools/lldb-vscode/breakpoint-events/TestVSCode_breakpointEvents.py (1292 of 2108)
PASS: lldb-api :: commands/expression/call-throws/TestCallThatThrows.py (1293 of 2108)
PASS: lldb-api :: functionalities/data-formatter/boolreference/TestFormattersBoolRefPtr.py (1294 of 2108)
PASS: lldb-unit :: Utility/./UtilityTests/ScalarTest.SetValueFromData (1295 of 2108)
UNSUPPORTED: lldb-shell :: SymbolFile/PDB/ast-restore.test (1296 of 2108)
XFAIL: lldb-shell :: Register/x86-64-ymm-write.test (1297 of 2108)
PASS: lldb-unit :: Utility/./UtilityTests/StreamTest.PutHex32ByteOrderLittle (1298 of 2108)
PASS: lldb-unit :: UnwindAssembly/x86/./UnwindAssemblyx86Tests/Testx86AssemblyInspectionEngine.TestPushEDX (1299 of 2108)
PASS: lldb-shell :: SymbolFile/DWARF/DW_TAG_variable-invalid_location.s (1300 of 2108)
PASS: lldb-unit :: Utility/./UtilityTests/RecordReplayTest.InstrumentedBarPtr (1301 of 2108)
PASS: lldb-unit :: Utility/./UtilityTests/ReproducerTest.SetCapture (1302 of 2108)
PASS: lldb-unit :: Utility/./UtilityTests/UriParserTest.BadPort (1303 of 2108)
PASS: lldb-unit :: Utility/./UtilityTests/StringListTest.GetMaxStringLengthMixed (1304 of 2108)
PASS: lldb-api :: lang/objc/orderedset/TestOrderedSet.py (1305 of 2108)
PASS: lldb-api :: functionalities/thread/concurrent_events/TestConcurrentDelaySignalBreak.py (1306 of 2108)
PASS: lldb-unit :: Utility/./UtilityTests/RangeDataVector.FindEntryThatContains_Overlap (1307 of 2108)
PASS: lldb-unit :: Utility/./UtilityTests/StreamTeeTest.DefaultConstructor (1308 of 2108)
PASS: lldb-api :: functionalities/data-formatter/data-formatter-proper-plurals/TestFormattersOneIsSingular.py (1309 of 2108)
PASS: lldb-shell :: Breakpoint/split-dwarf-5-addrbase.test (1310 of 2108)
PASS: lldb-unit :: Utility/./UtilityTests/AnsiTerminal.Unknown (1311 of 2108)
PASS: lldb-unit :: Utility/./UtilityTests/ReproducerTest.SetReplay (1312 of 2108)
PASS: lldb-shell :: SymbolFile/DWARF/anon_class_w_and_wo_export_symbols.ll (1313 of 2108)
PASS: lldb-unit :: Utility/./UtilityTests/RangeTest.Union (1314 of 2108)
PASS: lldb-api :: lang/objc/objc-class-method/TestObjCClassMethod.py (1315 of 2108)
PASS: lldb-api :: commands/frame/diagnose/virtual-method-call/TestDiagnoseDereferenceVirtualMethodCall.py (1316 of 2108)
PASS: lldb-api :: functionalities/thread/concurrent_events/TestConcurrentDelaySignalWatch.py (1317 of 2108)
PASS: lldb-api :: functionalities/data-formatter/data-formatter-smart-array/TestDataFormatterSmartArray.py (1318 of 2108)
PASS: lldb-api :: lang/cpp/alignas_base_class/TestAlignAsBaseClass.py (1319 of 2108)
PASS: lldb-api :: terminal/TestSTTYBeforeAndAfter.py (1320 of 2108)
PASS: lldb-api :: functionalities/return-value/TestReturnValue.py (1321 of 2108)
PASS: lldb-unit :: ScriptInterpreter/Python/./ScriptInterpreterPythonTests/PythonDataObjectsTest.TestPythonDictionaryManipulation (1322 of 2108)
PASS: lldb-unit :: Utility/./UtilityTests/StringExtractorTest.DecodeHexU8_Exact (1323 of 2108)
PASS: lldb-unit :: Utility/./UtilityTests/SerializationRountripTest.SerializeDeserializePodPointers (1324 of 2108)
PASS: lldb-shell :: SymbolFile/Breakpad/line-table-edgecases.test (1325 of 2108)
PASS: lldb-api :: lang/c/const_variables/TestConstVariables.py (1326 of 2108)
PASS: lldb-shell :: ObjectFile/ELF/PT_LOAD-empty.yaml (1327 of 2108)
PASS: lldb-unit :: Expression/./ExpressionTests/CppModuleConfigurationTest.IgnoreLibStdCpp (1328 of 2108)
PASS: lldb-api :: lang/c/unions/TestUnionMembers.py (1329 of 2108)
PASS: lldb-unit :: Process/minidump/./LLDBMinidumpTests/MinidumpParserTest.GetThreadContext_x86_32 (1330 of 2108)
PASS: lldb-unit :: Utility/./UtilityTests/OptionsWithRawTest.EmptySuffixSingleWhitespace (1331 of 2108)
PASS: lldb-api :: functionalities/data-formatter/data-formatter-stl/libcxx/optional/TestDataFormatterLibcxxOptional.py (1332 of 2108)
PASS: lldb-unit :: Utility/./UtilityTests/ArgsTest.ReplaceArgumentAtIndexFarOutOfRange (1333 of 2108)
PASS: lldb-unit :: Utility/./UtilityTests/ArgsTest.StringListConstructor (1334 of 2108)
PASS: lldb-unit :: ScriptInterpreter/Python/./ScriptInterpreterPythonTests/PythonDataObjectsTest.TestPythonCallableInvoke (1335 of 2108)
PASS: lldb-shell :: Process/UnsupportedLanguage.test (1336 of 2108)
PASS: lldb-unit :: Target/./TargetTests/PathMappingListTest.AbsoluteTests (1337 of 2108)
PASS: lldb-unit :: Utility/./UtilityTests/DataExtractorTest.GetMaxS64 (1338 of 2108)
PASS: lldb-api :: python_api/exprpath_synthetic/TestExprPathSynthetic.py (1339 of 2108)
PASS: lldb-unit :: SymbolFile/DWARF/./SymbolFileDWARFTests/SymbolFileDWARFTests.TestAbilitiesForDWARF (1340 of 2108)
PASS: lldb-api :: commands/expression/namespace_local_var_same_name_obj_c/TestNamespaceLocalVarSameNameObjC.py (1341 of 2108)
PASS: lldb-unit :: SymbolFile/NativePDB/./SymbolFileNativePDBTests/PDBFPOProgramToDWARFExpressionTests.SingleAssignmentRegisterRef (1342 of 2108)
PASS: lldb-unit :: Host/./HostTests/HostInfoTest.GetAugmentedArchSpec (1343 of 2108)
UNSUPPORTED: lldb-api :: benchmarks/frame_variable/TestFrameVariableResponse.py (1344 of 2108)
PASS: lldb-api :: lang/c/complex/TestComplexC99.py (1345 of 2108)
PASS: lldb-unit :: Utility/./UtilityTests/FileSpecTest.OperatorBool (1346 of 2108)
PASS: lldb-api :: lang/objc/modules/TestObjCModules.py (1347 of 2108)
PASS: lldb-unit :: Utility/./UtilityTests/StringListTest.GetMaxStringLengthIncreasingSize (1348 of 2108)
PASS: lldb-api :: functionalities/data-formatter/data-formatter-stl/libcxx/queue/TestDataFormatterLibcxxQueue.py (1349 of 2108)
PASS: lldb-shell :: ObjectFile/Breakpad/discontiguous-sections.test (1350 of 2108)
UNSUPPORTED: lldb-shell :: SymbolFile/PDB/calling-conventions.test (1351 of 2108)
PASS: lldb-shell :: Expr/TestIRMemoryMap.test (1352 of 2108)
PASS: lldb-shell :: SymbolFile/DWARF/split-dwarf-inlining.cpp (1353 of 2108)
PASS: lldb-api :: macosx/safe-to-func-call/TestSafeFuncCalls.py (1354 of 2108)
PASS: lldb-shell :: SymbolFile/NativePDB/globals-bss.cpp (1355 of 2108)
PASS: lldb-unit :: Utility/./UtilityTests/PassiveReplayTest.InstrumentedFooInvalid (1356 of 2108)
PASS: lldb-unit :: Utility/./UtilityTests/VMRange.Reset (1357 of 2108)
PASS: lldb-unit :: UnwindAssembly/x86/./UnwindAssemblyx86Tests/Testx86AssemblyInspectionEngine.TestPopRBP (1358 of 2108)
UNSUPPORTED: lldb-api :: functionalities/darwin_log/filter/exact_match/subsystem/TestDarwinLogFilterMatchSubsystem.py (1359 of 2108)
PASS: lldb-api :: lang/objc/rdar-11355592/TestRdar11355592.py (1360 of 2108)
PASS: lldb-unit :: Utility/./UtilityTests/StringListTest.JoinSingle (1361 of 2108)
PASS: lldb-api :: functionalities/deleted-executable/TestDeletedExecutable.py (1362 of 2108)
PASS: lldb-api :: macosx/add-dsym/TestAddDsymMidExecutionCommand.py (1363 of 2108)
PASS: lldb-unit :: UnwindAssembly/x86/./UnwindAssemblyx86Tests/Testx86AssemblyInspectionEngine.Test64bitFramelessBigStackFrame (1364 of 2108)
PASS: lldb-api :: functionalities/set-data/TestSetData.py (1365 of 2108)
PASS: lldb-shell :: Register/x86-64-ymm-read.test (1366 of 2108)
PASS: lldb-api :: lang/c/vla/TestVLA.py (1367 of 2108)
PASS: lldb-shell :: SymbolFile/DWARF/find-qualified-variable.cpp (1368 of 2108)
PASS: lldb-api :: python_api/debugger/TestDebuggerAPI.py (1369 of 2108)
PASS: lldb-api :: functionalities/data-formatter/varscript_formatting/TestDataFormatterVarScriptFormatting.py (1370 of 2108)
PASS: lldb-unit :: Utility/./UtilityTests/UriParserTest.BracketedHostnamePort (1371 of 2108)
PASS: lldb-api :: functionalities/data-formatter/data-formatter-objc/cmtime/TestDataFormatterCMTime.py (1372 of 2108)
PASS: lldb-api :: lang/c/anonymous/TestAnonymous.py (1373 of 2108)
PASS: lldb-unit :: Language/Highlighting/./HighlighterTests/HighlighterTest.ClangCursorPosAfterOtherToken (1374 of 2108)
PASS: lldb-unit :: Expression/./ExpressionTests/CppModuleConfigurationTest.MissingUsrInclude (1375 of 2108)
PASS: lldb-api :: python_api/process/read-mem-cstring/TestReadMemCString.py (1376 of 2108)
PASS: lldb-api :: types/TestLongTypes.py (1377 of 2108)
PASS: lldb-unit :: Symbol/./SymbolTests/TestTypeSystemClang.TestRecordHasFields (1378 of 2108)
PASS: lldb-api :: commands/target/stop-hook/delete/TestTargetStopHookDelete.py (1379 of 2108)
PASS: lldb-unit :: Symbol/./SymbolTests/TestTypeSystemClang.TestConvertAccessTypeToAccessSpecifier (1380 of 2108)
PASS: lldb-unit :: Expression/./ExpressionTests/DiagnosticManagerTest.AppendMessageSubsequentDiags (1381 of 2108)
PASS: lldb-api :: functionalities/gdb_remote_client/TestRegDefinitionInParts.py (1382 of 2108)
PASS: lldb-api :: functionalities/thread/concurrent_events/TestConcurrentWatchpointDelayWatchpointOneBreakpoint.py (1383 of 2108)
PASS: lldb-api :: python_api/watchpoint/watchlocation/TestTargetWatchAddress.py (1384 of 2108)
PASS: lldb-unit :: Utility/./UtilityTests/StreamTeeTest.SetStreamAtIndexOutOfBounds (1385 of 2108)
UNSUPPORTED: lldb-shell :: ScriptInterpreter/Lua/persistent_state.test (1386 of 2108)
PASS: lldb-unit :: Utility/./UtilityTests/ScalarTest.Getters (1387 of 2108)
PASS: lldb-unit :: Utility/./UtilityTests/StreamTest.PutHex64ByteOrderLittle (1388 of 2108)
PASS: lldb-unit :: Interpreter/./InterpreterTests/OptionArgParserTest.toBoolean (1389 of 2108)
PASS: lldb-api :: python_api/sblaunchinfo/TestSBLaunchInfo.py (1390 of 2108)
PASS: lldb-unit :: Utility/./UtilityTests/StringListTest.InsertStringAtIndexOutOfBounds (1391 of 2108)
UNSUPPORTED: lldb-shell :: Register/x86-64-ymm16-read.test (1392 of 2108)
PASS: lldb-api :: types/TestDoubleTypes.py (1393 of 2108)
PASS: lldb-unit :: Symbol/./SymbolTests/TestClangASTImporter.CompleteFwdDeclWithOtherOrigin (1394 of 2108)
PASS: lldb-unit :: Utility/./UtilityTests/StreamTest.PutBytesAsRawHex8ToLittleEndian (1395 of 2108)
PASS: lldb-api :: commands/expression/namespace_local_var_same_name_cpp_and_c/TestNamespaceLocalVarSameNameCppAndC.py (1396 of 2108)
PASS: lldb-shell :: SymbolFile/DWARF/array-sizes.s (1397 of 2108)
PASS: lldb-unit :: debugserver/./debugserverTests/RNBSocket.AnyListen (1398 of 2108)
PASS: lldb-shell :: ObjectFile/MachO/lc_version_min.yaml (1399 of 2108)
PASS: lldb-unit :: ScriptInterpreter/Python/./ScriptInterpreterPythonTests/PythonDataObjectsTest.TestResetting (1400 of 2108)
PASS: lldb-api :: lang/objc/modules-app-update/TestClangModulesAppUpdate.py (1401 of 2108)
PASS: lldb-unit :: Host/./HostTests/FileSystemTest.MakeAbsolute (1402 of 2108)
PASS: lldb-unit :: Utility/./UtilityTests/CompletionRequest.TryCompleteCurrentArgBad (1403 of 2108)
PASS: lldb-api :: macosx/universal/TestUniversal.py (1404 of 2108)
PASS: lldb-api :: lang/cpp/char1632_t/TestChar1632T.py (1405 of 2108)
PASS: lldb-unit :: ObjectFile/Breakpad/./ObjectFileBreakpadTests/InfoRecord.parse (1406 of 2108)
PASS: lldb-unit :: Utility/./UtilityTests/EventTest.DumpEventDataBytes (1407 of 2108)
PASS: lldb-shell :: Settings/TestFrameFormatNoColor.test (1408 of 2108)
PASS: lldb-api :: functionalities/thread/concurrent_events/TestConcurrentManyBreakpoints.py (1409 of 2108)
UNSUPPORTED: lldb-api :: tools/lldb-server/libraries-svr4/TestGdbRemoteLibrariesSvr4Support.py (1410 of 2108)
PASS: lldb-unit :: Utility/./UtilityTests/StreamTeeTest.GetStreamAtIndexOutOfBounds (1411 of 2108)
PASS: lldb-api :: functionalities/breakpoint/breakpoint_locations/TestBreakpointLocations.py (1412 of 2108)
PASS: lldb-api :: functionalities/gdb_remote_client/TestProcessConnect.py (1413 of 2108)
PASS: lldb-api :: lang/objc/rdar-10967107/TestRdar10967107.py (1414 of 2108)
PASS: lldb-unit :: UnwindAssembly/x86/./UnwindAssemblyx86Tests/Testx86AssemblyInspectionEngine.TestStackRealign8BitDisp_i386 (1415 of 2108)
PASS: lldb-api :: tools/lldb-vscode/attach/TestVSCode_attach.py (1416 of 2108)
PASS: lldb-api :: commands/settings/TestSettings.py (1417 of 2108)
PASS: lldb-shell :: Minidump/disassemble-no-module.yaml (1418 of 2108)
PASS: lldb-unit :: Utility/./UtilityTests/PassiveReplayTest.InstrumentedFoo (1419 of 2108)
PASS: lldb-unit :: Utility/./UtilityTests/StringLexerTest.Next (1420 of 2108)
PASS: lldb-unit :: ScriptInterpreter/Python/./ScriptInterpreterPythonTests/PythonDataObjectsTest.TestExtractingUInt64ThroughStructuredData (1421 of 2108)
PASS: lldb-api :: functionalities/breakpoint/move_nearest/TestMoveNearest.py (1422 of 2108)
PASS: lldb-shell :: SymbolFile/DWARF/debug-names-compressed.cpp (1423 of 2108)
PASS: lldb-api :: tools/lldb-server/TestGdbRemoteProcessInfo.py (1424 of 2108)
PASS: lldb-shell :: Driver/TestHelp.test (1425 of 2108)
PASS: lldb-api :: lang/objc/objc-new-syntax/TestObjCNewSyntaxArray.py (1426 of 2108)
PASS: lldb-unit :: Utility/./UtilityTests/ArgsTest.DoubleQuotedItem (1427 of 2108)
PASS: lldb-unit :: Utility/./UtilityTests/RangeTest.ContainsEndInclusiveInvalid (1428 of 2108)
PASS: lldb-shell :: SymbolFile/Breakpad/unwind-via-raSearch.test (1429 of 2108)
PASS: lldb-shell :: BuildScript/modes.test (1430 of 2108)
PASS: lldb-unit :: Utility/./UtilityTests/RangeTest.Clear (1431 of 2108)
PASS: lldb-unit :: Utility/./UtilityTests/GeneratorTest.YamlMultiProvider (1432 of 2108)
PASS: lldb-unit :: Utility/./UtilityTests/ArgsTest.BareSingleQuote (1433 of 2108)
PASS: lldb-unit :: SymbolFile/DWARF/./SymbolFileDWARFTests/SymbolFileDWARFTests.TestAbbrevInvalidNULLTag (1434 of 2108)
PASS: lldb-api :: python_api/file_handle/TestFileHandle.py (1435 of 2108)
PASS: lldb-unit :: Utility/./UtilityTests/BinaryStreamTest.PutSLEB128TwoBytes (1436 of 2108)
PASS: lldb-api :: functionalities/thread/concurrent_events/TestConcurrentCrashWithBreak.py (1437 of 2108)
PASS: lldb-unit :: Expression/./ExpressionTests/DiagnosticManagerTest.GetStringSeverityLabels (1438 of 2108)
PASS: lldb-unit :: ScriptInterpreter/Python/./ScriptInterpreterPythonTests/PythonDataObjectsTest.TestPythonDictionaryToStructuredDictionary (1439 of 2108)
UNSUPPORTED: lldb-api :: lang/objc/rdar-12408181/TestRdar12408181.py (1440 of 2108)
PASS: lldb-unit :: Process/./ProcessEventDataTests/ProcessEventDataTest.DoOnRemoval (1441 of 2108)
PASS: lldb-unit :: Utility/./UtilityTests/OptionsWithRawTest.ArgsButNoDelimiter (1442 of 2108)
PASS: lldb-api :: functionalities/data-formatter/data-formatter-objc/TestDataFormatterObjCCF.py (1443 of 2108)
UNSUPPORTED: lldb-shell :: ScriptInterpreter/Lua/convenience_variables.test (1444 of 2108)
UNSUPPORTED: lldb-shell :: ObjectFile/ELF/minidebuginfo-no-lzma.yaml (1445 of 2108)
PASS: lldb-unit :: Expression/./ExpressionTests/CppModuleConfigurationTest.UnknownLibCppFile (1446 of 2108)
PASS: lldb-shell :: Settings/TestEchoCommands.test (1447 of 2108)
PASS: lldb-unit :: Utility/./UtilityTests/LogTest.LLDB_LOG_nullptr (1448 of 2108)
PASS: lldb-api :: commands/command/source/TestCommandSource.py (1449 of 2108)
PASS: lldb-unit :: Process/gdb-remote/./ProcessGdbRemoteTests/GDBRemoteClientBaseTest.SendContinueDelegateStructuredDataReceipt (1450 of 2108)
PASS: lldb-api :: functionalities/thread/state_after_expression/TestStateAfterExpression.py (1451 of 2108)
PASS: lldb-shell :: ObjectFile/ELF/section-overlap.yaml (1452 of 2108)
PASS: lldb-api :: commands/watchpoints/hello_watchpoint/TestMyFirstWatchpoint.py (1453 of 2108)
PASS: lldb-unit :: Utility/./UtilityTests/StringExtractorTest.DecodeHexU8_InvalidHex2 (1454 of 2108)
PASS: lldb-unit :: SymbolFile/NativePDB/./SymbolFileNativePDBTests/PDBFPOProgramToDWARFExpressionTests.InvalidOpUnary (1455 of 2108)
PASS: lldb-unit :: UnwindAssembly/x86/./UnwindAssemblyx86Tests/Testx86AssemblyInspectionEngine.TestPushRBPWithREX (1456 of 2108)
PASS: lldb-unit :: Utility/./UtilityTests/StringExtractorTest.GetHexBytes_OddPair (1457 of 2108)
PASS: lldb-api :: lang/cpp/global_variables/TestCPPGlobalVariables.py (1458 of 2108)
PASS: lldb-shell :: ObjectFile/PECOFF/symbol.yaml (1459 of 2108)
PASS: lldb-shell :: ObjectFile/ELF/aarch64-relocations.yaml (1460 of 2108)
PASS: lldb-shell :: Reproducer/TestDSYM.test (1461 of 2108)
UNSUPPORTED: lldb-api :: functionalities/thread/thread_specific_break_plus_condition/TestThreadSpecificBpPlusCondition.py (1462 of 2108)
PASS: lldb-shell :: SymbolFile/DWARF/clang-ast-from-dwarf-objc-property.m (1463 of 2108)
PASS: lldb-api :: macosx/queues/TestQueues.py (1464 of 2108)
PASS: lldb-shell :: ScriptInterpreter/None/import_module.test (1465 of 2108)
PASS: lldb-unit :: Utility/./UtilityTests/StringExtractorTest.GetHexBytes (1466 of 2108)
PASS: lldb-unit :: Expression/./ExpressionTests/DiagnosticManagerTest.FixedExpression (1467 of 2108)
PASS: lldb-shell :: ObjectFile/ELF/PT_LOAD-overlap-PT_TLS.yaml (1468 of 2108)
PASS: lldb-shell :: ObjectFile/ELF/minidebuginfo-find-symbols.yaml (1469 of 2108)
PASS: lldb-unit :: Language/Highlighting/./HighlighterTests/HighlighterTest.ClangCursorPos (1470 of 2108)
UNSUPPORTED: lldb-api :: functionalities/data-formatter/data-formatter-stl/libstdcpp/smart_ptr/TestDataFormatterStdSmartPtr.py (1471 of 2108)
PASS: lldb-unit :: UnwindAssembly/x86/./UnwindAssemblyx86Tests/Testx86AssemblyInspectionEngine.TestPushEAX (1472 of 2108)
PASS: lldb-shell :: SymbolFile/DWARF/limit-debug-info.s (1473 of 2108)
XFAIL: lldb-shell :: Register/x86-mm-xmm-read.test (1474 of 2108)
PASS: lldb-unit :: Utility/./UtilityTests/SerializationRountripTest.SerializeDeserializeCStringArray (1475 of 2108)
PASS: lldb-unit :: ScriptInterpreter/Python/./ScriptInterpreterPythonTests/PythonDataObjectsTest.TestPythonBytes (1476 of 2108)
UNSUPPORTED: lldb-api :: python_api/disassemble-raw-data/TestDisassemble_VST1_64.py (1477 of 2108)
PASS: lldb-unit :: Process/minidump/./LLDBMinidumpTests/MinidumpParserTest.GetMemoryRegionInfoLinuxMaps (1478 of 2108)
PASS: lldb-unit :: Utility/./UtilityTests/StreamTeeTest.AppendStream (1479 of 2108)
PASS: lldb-api :: commands/frame/diagnose/array/TestArray.py (1480 of 2108)
PASS: lldb-api :: commands/expression/deleting-implicit-copy-constructor/TestDeletingImplicitCopyConstructor.py (1481 of 2108)
PASS: lldb-unit :: Utility/./UtilityTests/TimeoutTest.Format (1482 of 2108)
PASS: lldb-unit :: Utility/./UtilityTests/StreamTest.AddressRangeSize (1483 of 2108)
PASS: lldb-api :: commands/expression/argument_passing_restrictions/TestArgumentPassingRestrictions.py (1484 of 2108)
PASS: lldb-shell :: Commands/command-breakpoint-col.test (1485 of 2108)
PASS: lldb-unit :: Symbol/./SymbolTests/TestClangASTImporter.DeportDeclTagDecl (1486 of 2108)
PASS: lldb-unit :: UnwindAssembly/x86/./UnwindAssemblyx86Tests/Testx86AssemblyInspectionEngine.TestMovRSPtoRBP (1487 of 2108)
PASS: lldb-unit :: Symbol/./SymbolTests/TestTypeSystemClang.TestGetTypeClassTypeOf (1488 of 2108)
PASS: lldb-shell :: SymbolFile/DWARF/compilercontext.ll (1489 of 2108)
PASS: lldb-api :: functionalities/memory/find/TestMemoryFind.py (1490 of 2108)
FAIL: lldb-api :: macosx/simulator/TestSimulatorPlatform.py (1491 of 2108)
******************** TEST 'lldb-api :: macosx/simulator/TestSimulatorPlatform.py' FAILED ********************
Script:
--
/Users/buildslave/jenkins/workspace/lldb-cmake-sanitized/lldb-build/lldb-test-build.noindex/copied-python /Users/buildslave/jenkins/workspace/lldb-cmake-sanitized/llvm-project/lldb/test/API/dotest.py --arch x86_64 -s /Users/buildslave/jenkins/workspace/lldb-cmake-sanitized/lldb-build/lldb-test-traces -S nm -u CXXFLAGS -u CFLAGS --codesign-identity lldb_codesign --server /Users/buildslave/jenkins/workspace/lldb-cmake-sanitized/lldb-build/./bin/debugserver --arch x86_64 --build-dir /Users/buildslave/jenkins/workspace/lldb-cmake-sanitized/lldb-build/lldb-test-build.noindex -s=/Users/buildslave/jenkins/workspace/lldb-cmake-sanitized/test/logs -t --env TERM=vt100 --env LLVM_LIBS_DIR=/Users/buildslave/jenkins/workspace/lldb-cmake-sanitized/lldb-build/./lib --inferior-env ASAN_OPTIONS=detect_stack_use_after_return=1 --inferior-env DYLD_INSERT_LIBRARIES=/Users/buildslave/jenkins/workspace/lldb-cmake-sanitized/host-compiler/lib/clang/12.0.0/lib/darwin/libclang_rt.asan_osx_dynamic.dylib --build-dir /Users/buildslave/jenkins/workspace/lldb-cmake-sanitized/lldb-build/lldb-test-build.noindex --lldb-module-cache-dir /Users/buildslave/jenkins/workspace/lldb-cmake-sanitized/lldb-build/lldb-test-build.noindex/module-cache-lldb/lldb-api --clang-module-cache-dir /Users/buildslave/jenkins/workspace/lldb-cmake-sanitized/lldb-build/lldb-test-build.noindex/module-cache-clang/lldb-api --executable /Users/buildslave/jenkins/workspace/lldb-cmake-sanitized/lldb-build/./bin/lldb --compiler /Users/buildslave/jenkins/workspace/lldb-cmake-sanitized/lldb-build/./bin/clang --dsymutil /Users/buildslave/jenkins/workspace/lldb-cmake-sanitized/lldb-build/./bin/dsymutil --filecheck /Users/buildslave/jenkins/workspace/lldb-cmake-sanitized/lldb-build/./bin/FileCheck --yaml2obj /Users/buildslave/jenkins/workspace/lldb-cmake-sanitized/lldb-build/./bin/yaml2obj --lldb-libs-dir /Users/buildslave/jenkins/workspace/lldb-cmake-sanitized/lldb-build/./lib /Users/buildslave/jenkins/workspace/lldb-cmake-sanitized/llvm-project/lldb/test/API/macosx/simulator -p TestSimulatorPlatform.py
--
Exit Code: 1

Hide Details

Command Output (stdout): -- lldb version 12.0.99 clang revision 38537307e502c1ac9a09e6f75f9208db1327a0bf llvm revision 38537307e502c1ac9a09e6f75f9208db1327a0bf LLDB library dir: /Users/buildslave/jenkins/workspace/lldb-cmake-sanitized/lldb-build/bin LLDB import library dir: /Users/buildslave/jenkins/workspace/lldb-cmake-sanitized/lldb-build/./lib libstdcxx tests will not be run because: Don't know how to build with libstdcxx on macosx Skipping following debug info categories: ['dwo']

Hide Details

-- Command Output (stderr): --

Hide Details

Session logs for test failures/errors/unexpected successes will go into directory '/Users/buildslave/jenkins/workspace/lldb-cmake-sanitized/test/logs' Change dir to: /Users/buildslave/jenkins/workspace/lldb-cmake-sanitized/llvm-project/lldb/test/API/macosx/simulator runCmd: settings clear -all output:

Hide Details

runCmd: settings set symbols.enable-external-lookup false output:

Hide Details

runCmd: settings set target.inherit-tcc true output:

Hide Details

runCmd: settings set target.auto-apply-fixits false output:

Hide Details

runCmd: settings set plugin.process.gdb-remote.packet-timeout 60 output:

Hide Details

runCmd: settings set symbols.clang-modules-cache-path "/Users/buildslave/jenkins/workspace/lldb-cmake-sanitized/lldb-build/lldb-test-build.noindex/module-cache-lldb/lldb-api" output:

Hide Details

runCmd: settings set use-color false output:

Hide Details

runCmd: setting set target.prefer-dynamic-value no-dynamic-values output:

Hide Details

runCmd: settings set target.env-vars ASAN_OPTIONS=detect_stack_use_after_return=1 DYLD_INSERT_LIBRARIES=/Users/buildslave/jenkins/workspace/lldb-cmake-sanitized/host-compiler/lib/clang/12.0.0/lib/darwin/libclang_rt.asan_osx_dynamic.dylib output:

Hide Details

runCmd: log enable gdb-remote packets -f /Users/buildslave/jenkins/workspace/lldb-cmake-sanitized/lldb-build/lldb-test-build.noindex/macosx/simulator/TestSimulatorPlatform.test_ios/packets.log output:

Hide Details

runCmd: settings set target.env-vars ASAN_OPTIONS=detect_stack_use_after_return=1 DYLD_INSERT_LIBRARIES=/Users/buildslave/jenkins/workspace/lldb-cmake-sanitized/host-compiler/lib/clang/12.0.0/lib/darwin/libclang_rt.asan_osx_dynamic.dylib output:

Hide Details

FAIL: LLDB (/Users/buildslave/jenkins/workspace/lldb-cmake-sanitized/lldb-build/bin/clang-x86_64) :: test_ios (TestSimulatorPlatform.TestSimulatorPlatformLaunching) <bound method SBProcess.Kill of <lldb.SBProcess; proxy of <Swig Object of type 'lldb::SBProcess *' at 0x12060b690> >>: success

Hide Details

runCmd: settings clear -all output:

Hide Details

runCmd: settings set symbols.enable-external-lookup false output:

Hide Details

runCmd: settings set target.inherit-tcc true output:

Hide Details

runCmd: settings set target.auto-apply-fixits false output:

Hide Details

runCmd: settings set plugin.process.gdb-remote.packet-timeout 60 output:

Hide Details

runCmd: settings set symbols.clang-modules-cache-path "/Users/buildslave/jenkins/workspace/lldb-cmake-sanitized/lldb-build/lldb-test-build.noindex/module-cache-lldb/lldb-api" output:

Hide Details

runCmd: settings set use-color false output:

Hide Details

runCmd: setting set target.prefer-dynamic-value no-dynamic-values output:

Hide Details

runCmd: settings set target.env-vars ASAN_OPTIONS=detect_stack_use_after_return=1 DYLD_INSERT_LIBRARIES=/Users/buildslave/jenkins/workspace/lldb-cmake-sanitized/host-compiler/lib/clang/12.0.0/lib/darwin/libclang_rt.asan_osx_dynamic.dylib output:

Hide Details

UNSUPPORTED: LLDB (/Users/buildslave/jenkins/workspace/lldb-cmake-sanitized/lldb-build/bin/clang-x86_64) :: test_ios_backdeploy_apple_silicon (TestSimulatorPlatform.TestSimulatorPlatformLaunching) (skipping due to the following parameter(s): architecture) runCmd: settings clear -all output:

Hide Details

runCmd: settings set symbols.enable-external-lookup false output:

Hide Details

runCmd: settings set target.inherit-tcc true output:

Hide Details

runCmd: settings set target.auto-apply-fixits false output:

Hide Details

runCmd: settings set plugin.process.gdb-remote.packet-timeout 60 output:

Hide Details

runCmd: settings set symbols.clang-modules-cache-path "/Users/buildslave/jenkins/workspace/lldb-cmake-sanitized/lldb-build/lldb-test-build.noindex/module-cache-lldb/lldb-api" output:

Hide Details

runCmd: settings set use-color false output:

Hide Details

runCmd: setting set target.prefer-dynamic-value no-dynamic-values output:

Hide Details

runCmd: settings set target.env-vars ASAN_OPTIONS=detect_stack_use_after_return=1 DYLD_INSERT_LIBRARIES=/Users/buildslave/jenkins/workspace/lldb-cmake-sanitized/host-compiler/lib/clang/12.0.0/lib/darwin/libclang_rt.asan_osx_dynamic.dylib output:

Hide Details

runCmd: log enable gdb-remote packets -f /Users/buildslave/jenkins/workspace/lldb-cmake-sanitized/lldb-build/lldb-test-build.noindex/macosx/simulator/TestSimulatorPlatform.test_ios_backdeploy_x86/packets.log output:

Hide Details

runCmd: settings set target.env-vars ASAN_OPTIONS=detect_stack_use_after_return=1 DYLD_INSERT_LIBRARIES=/Users/buildslave/jenkins/workspace/lldb-cmake-sanitized/host-compiler/lib/clang/12.0.0/lib/darwin/libclang_rt.asan_osx_dynamic.dylib output:

Hide Details

FAIL: LLDB (/Users/buildslave/jenkins/workspace/lldb-cmake-sanitized/lldb-build/bin/clang-x86_64) :: test_ios_backdeploy_x86 (TestSimulatorPlatform.TestSimulatorPlatformLaunching) <bound method SBProcess.Kill of <lldb.SBProcess; proxy of <Swig Object of type 'lldb::SBProcess *' at 0x11d8e4420> >>: success

Hide Details

runCmd: settings clear -all output:

Hide Details

runCmd: settings set symbols.enable-external-lookup false output:

Hide Details

runCmd: settings set target.inherit-tcc true output:

Hide Details

runCmd: settings set target.auto-apply-fixits false output:

Hide Details

runCmd: settings set plugin.process.gdb-remote.packet-timeout 60 output:

Hide Details

runCmd: settings set symbols.clang-modules-cache-path "/Users/buildslave/jenkins/workspace/lldb-cmake-sanitized/lldb-build/lldb-test-build.noindex/module-cache-lldb/lldb-api" output:

Hide Details

runCmd: settings set use-color false output:

Hide Details

runCmd: setting set target.prefer-dynamic-value no-dynamic-values output:

Hide Details

runCmd: settings set target.env-vars ASAN_OPTIONS=detect_stack_use_after_return=1 DYLD_INSERT_LIBRARIES=/Users/buildslave/jenkins/workspace/lldb-cmake-sanitized/host-compiler/lib/clang/12.0.0/lib/darwin/libclang_rt.asan_osx_dynamic.dylib output:

Hide Details

runCmd: log enable gdb-remote packets -f /Users/buildslave/jenkins/workspace/lldb-cmake-sanitized/lldb-build/lldb-test-build.noindex/macosx/simulator/TestSimulatorPlatform.test_lc_version_min_iphoneos/packets.log output:

Hide Details

runCmd: settings set target.env-vars ASAN_OPTIONS=detect_stack_use_after_return=1 DYLD_INSERT_LIBRARIES=/Users/buildslave/jenkins/workspace/lldb-cmake-sanitized/host-compiler/lib/clang/12.0.0/lib/darwin/libclang_rt.asan_osx_dynamic.dylib output:

Hide Details

FAIL: LLDB (/Users/buildslave/jenkins/workspace/lldb-cmake-sanitized/lldb-build/bin/clang-x86_64) :: test_lc_version_min_iphoneos (TestSimulatorPlatform.TestSimulatorPlatformLaunching) <bound method SBProcess.Kill of <lldb.SBProcess; proxy of <Swig Object of type 'lldb::SBProcess *' at 0x1077183f0> >>: success

Hide Details

runCmd: settings clear -all output:

Hide Details

runCmd: settings set symbols.enable-external-lookup false output:

Hide Details

runCmd: settings set target.inherit-tcc true output:

Hide Details

runCmd: settings set target.auto-apply-fixits false output:

Hide Details

runCmd: settings set plugin.process.gdb-remote.packet-timeout 60 output:

Hide Details

runCmd: settings set symbols.clang-modules-cache-path "/Users/buildslave/jenkins/workspace/lldb-cmake-sanitized/lldb-build/lldb-test-build.noindex/module-cache-lldb/lldb-api" output:

Hide Details

runCmd: settings set use-color false output:

Hide Details

runCmd: setting set target.prefer-dynamic-value no-dynamic-values output:

Hide Details

runCmd: settings set target.env-vars ASAN_OPTIONS=detect_stack_use_after_return=1 DYLD_INSERT_LIBRARIES=/Users/buildslave/jenkins/workspace/lldb-cmake-sanitized/host-compiler/lib/clang/12.0.0/lib/darwin/libclang_rt.asan_osx_dynamic.dylib output:

Hide Details

runCmd: log enable gdb-remote packets -f /Users/buildslave/jenkins/workspace/lldb-cmake-sanitized/lldb-build/lldb-test-build.noindex/macosx/simulator/TestSimulatorPlatform.test_lc_version_min_macosx/packets.log output:

Hide Details

runCmd: settings set target.env-vars ASAN_OPTIONS=detect_stack_use_after_return=1 DYLD_INSERT_LIBRARIES=/Users/buildslave/jenkins/workspace/lldb-cmake-sanitized/host-compiler/lib/clang/12.0.0/lib/darwin/libclang_rt.asan_osx_dynamic.dylib output:

Hide Details

runCmd: image list -b -t output: [ 0] a.out x86_64-apple-macosx10.9.0 [ 1] dyld x86_64-apple-macosx10.15.0 [ 2] libc++.1.dylib x86_64-apple-macosx10.15.0 [ 3] libSystem.B.dylib x86_64-apple-macosx10.15.0 [ 4] libc++abi.dylib x86_64-apple-macosx10.15.0 [ 5] libcache.dylib x86_64-apple-macosx10.15.0 [ 6] libcommonCrypto.dylib x86_64-apple-macosx10.15.0 [ 7] libcompiler_rt.dylib x86_64-apple-macosx10.15.0 [ 8] libcopyfile.dylib x86_64-apple-macosx10.15.0 [ 9] libcorecrypto.dylib x86_64-apple-macosx10.15.0 [ 10] libdispatch.dylib x86_64-apple-macosx10.15.0 [ 11] libdyld.dylib x86_64-apple-macosx10.15.0 [ 12] libkeymgr.dylib x86_64-apple-macosx10.15.0 [ 13] liblaunch.dylib x86_64-apple-macosx10.15.0 [ 14] libmacho.dylib x86_64-apple-macosx10.15.0 [ 15] libquarantine.dylib x86_64-apple-macosx10.15.0 [ 16] libremovefile.dylib x86_64-apple-macosx10.15.0 [ 17] libsystem_asl.dylib x86_64-apple-macosx10.15.0 [ 18] libsystem_blocks.dylib x86_64-apple-macosx10.15.0 [ 19] libsystem_c.dylib x86_64-apple-macosx10.15.0 [ 20] libsystem_configuration.dylib x86_64-apple-macosx10.15.0 [ 21] libsystem_coreservices.dylib x86_64-apple-macosx10.15.0 [ 22] libsystem_darwin.dylib x86_64-apple-macosx10.15.0 [ 23] libsystem_dnssd.dylib x86_64-apple-macosx10.15.0 [ 24] libsystem_featureflags.dylib x86_64-apple-macosx10.15.0 [ 25] libsystem_info.dylib x86_64-apple-macosx10.15.0 [ 26] libsystem_m.dylib x86_64-apple-macosx10.15.0 [ 27] libsystem_malloc.dylib x86_64-apple-macosx10.15.0 [ 28] libsystem_networkextension.dylib x86_64-apple-macosx10.15.0 [ 29] libsystem_notify.dylib x86_64-apple-macosx10.15.0 [ 30] libsystem_sandbox.dylib x86_64-apple-macosx10.15.0 [ 31] libsystem_secinit.dylib x86_64-apple-macosx10.15.0 [ 32] libsystem_kernel.dylib x86_64-apple-macosx10.15.0 [ 33] libsystem_platform.dylib x86_64-apple-macosx10.15.0 [ 34] libsystem_pthread.dylib x86_64-apple-macosx10.15.0 [ 35] libsystem_symptoms.dylib x86_64-apple-macosx10.15.0 [ 36] libsystem_trace.dylib x86_64-apple-macosx10.15.0 [ 37] libunwind.dylib x86_64-apple-macosx10.15.0 [ 38] libxpc.dylib x86_64-apple-macosx10.15.0 [ 39] libobjc.A.dylib x86_64-apple-macosx10.15.0 [ 40] libclang_rt.asan_osx_dynamic.dylib x86_64-apple-macosx10.9.0

Hide Details

Hide Details

Expecting pattern: a\.out x86_64-apple-macosx10.9.* Matched

Hide Details

FAIL: LLDB (/Users/buildslave/jenkins/workspace/lldb-cmake-sanitized/lldb-build/bin/clang-x86_64) :: test_lc_version_min_macosx (TestSimulatorPlatform.TestSimulatorPlatformLaunching) <bound method SBProcess.Kill of <lldb.SBProcess; proxy of <Swig Object of type 'lldb::SBProcess *' at 0x11d8e4660> >>: success

Hide Details

runCmd: settings clear -all output:

Hide Details

runCmd: settings set symbols.enable-external-lookup false output:

Hide Details

runCmd: settings set target.inherit-tcc true output:

Hide Details

runCmd: settings set target.auto-apply-fixits false output:

Hide Details

runCmd: settings set plugin.process.gdb-remote.packet-timeout 60 output:

Hide Details

runCmd: settings set symbols.clang-modules-cache-path "/Users/buildslave/jenkins/workspace/lldb-cmake-sanitized/lldb-build/lldb-test-build.noindex/module-cache-lldb/lldb-api" output:

Hide Details

runCmd: settings set use-color false output:

Hide Details

runCmd: setting set target.prefer-dynamic-value no-dynamic-values output:

Hide Details

runCmd: settings set target.env-vars ASAN_OPTIONS=detect_stack_use_after_return=1 DYLD_INSERT_LIBRARIES=/Users/buildslave/jenkins/workspace/lldb-cmake-sanitized/host-compiler/lib/clang/12.0.0/lib/darwin/libclang_rt.asan_osx_dynamic.dylib output:

Hide Details

runCmd: log enable gdb-remote packets -f /Users/buildslave/jenkins/workspace/lldb-cmake-sanitized/lldb-build/lldb-test-build.noindex/macosx/simulator/TestSimulatorPlatform.test_lc_version_min_tvos/packets.log output:

Hide Details

runCmd: settings set target.env-vars ASAN_OPTIONS=detect_stack_use_after_return=1 DYLD_INSERT_LIBRARIES=/Users/buildslave/jenkins/workspace/lldb-cmake-sanitized/host-compiler/lib/clang/12.0.0/lib/darwin/libclang_rt.asan_osx_dynamic.dylib output:

Hide Details

FAIL: LLDB (/Users/buildslave/jenkins/workspace/lldb-cmake-sanitized/lldb-build/bin/clang-x86_64) :: test_lc_version_min_tvos (TestSimulatorPlatform.TestSimulatorPlatformLaunching) <bound method SBProcess.Kill of <lldb.SBProcess; proxy of <Swig Object of type 'lldb::SBProcess *' at 0x1077188d0> >>: success

Hide Details

UNSUPPORTED: LLDB (/Users/buildslave/jenkins/workspace/lldb-cmake-sanitized/lldb-build/bin/clang-x86_64) :: test_lc_version_min_watchos (TestSimulatorPlatform.TestSimulatorPlatformLaunching) (skip on macosx, darwin, ios, tvos, watchos, bridgeos) runCmd: settings clear -all output:

Hide Details

runCmd: settings set symbols.enable-external-lookup false output:

Hide Details

runCmd: settings set target.inherit-tcc true output:

Hide Details

runCmd: settings set target.auto-apply-fixits false output:

Hide Details

runCmd: settings set plugin.process.gdb-remote.packet-timeout 60 output:

Hide Details

runCmd: settings set symbols.clang-modules-cache-path "/Users/buildslave/jenkins/workspace/lldb-cmake-sanitized/lldb-build/lldb-test-build.noindex/module-cache-lldb/lldb-api" output:

Hide Details

runCmd: settings set use-color false output:

Hide Details

runCmd: setting set target.prefer-dynamic-value no-dynamic-values output:

Hide Details

runCmd: settings set target.env-vars ASAN_OPTIONS=detect_stack_use_after_return=1 DYLD_INSERT_LIBRARIES=/Users/buildslave/jenkins/workspace/lldb-cmake-sanitized/host-compiler/lib/clang/12.0.0/lib/darwin/libclang_rt.asan_osx_dynamic.dylib output:

Hide Details

runCmd: log enable gdb-remote packets -f /Users/buildslave/jenkins/workspace/lldb-cmake-sanitized/lldb-build/lldb-test-build.noindex/macosx/simulator/TestSimulatorPlatform.test_tvos/packets.log output:

Hide Details

runCmd: settings set target.env-vars ASAN_OPTIONS=detect_stack_use_after_return=1 DYLD_INSERT_LIBRARIES=/Users/buildslave/jenkins/workspace/lldb-cmake-sanitized/host-compiler/lib/clang/12.0.0/lib/darwin/libclang_rt.asan_osx_dynamic.dylib output:

Hide Details

FAIL: LLDB (/Users/buildslave/jenkins/workspace/lldb-cmake-sanitized/lldb-build/bin/clang-x86_64) :: test_tvos (TestSimulatorPlatform.TestSimulatorPlatformLaunching) <bound method SBProcess.Kill of <lldb.SBProcess; proxy of <Swig Object of type 'lldb::SBProcess *' at 0x11d8e4420> >>: success

Hide Details

runCmd: settings clear -all output:

Hide Details

runCmd: settings set symbols.enable-external-lookup false output:

Hide Details

runCmd: settings set target.inherit-tcc true output:

Hide Details

runCmd: settings set target.auto-apply-fixits false output:

Hide Details

runCmd: settings set plugin.process.gdb-remote.packet-timeout 60 output:

Hide Details

runCmd: settings set symbols.clang-modules-cache-path "/Users/buildslave/jenkins/workspace/lldb-cmake-sanitized/lldb-build/lldb-test-build.noindex/module-cache-lldb/lldb-api" output:

Hide Details

runCmd: settings set use-color false output:

Hide Details

runCmd: setting set target.prefer-dynamic-value no-dynamic-values output:

Hide Details

runCmd: settings set target.env-vars ASAN_OPTIONS=detect_stack_use_after_return=1 DYLD_INSERT_LIBRARIES=/Users/buildslave/jenkins/workspace/lldb-cmake-sanitized/host-compiler/lib/clang/12.0.0/lib/darwin/libclang_rt.asan_osx_dynamic.dylib output:

Hide Details

UNSUPPORTED: LLDB (/Users/buildslave/jenkins/workspace/lldb-cmake-sanitized/lldb-build/bin/clang-x86_64) :: test_tvos_backdeploy_apple_silicon (TestSimulatorPlatform.TestSimulatorPlatformLaunching) (skipping due to the following parameter(s): architecture) UNSUPPORTED: LLDB (/Users/buildslave/jenkins/workspace/lldb-cmake-sanitized/lldb-build/bin/clang-x86_64) :: test_watchos_armv7k (TestSimulatorPlatform.TestSimulatorPlatformLaunching) (skip on macosx, darwin, ios, tvos, watchos, bridgeos) UNSUPPORTED: LLDB (/Users/buildslave/jenkins/workspace/lldb-cmake-sanitized/lldb-build/bin/clang-x86_64) :: test_watchos_backdeploy_apple_silicon (TestSimulatorPlatform.TestSimulatorPlatformLaunching) (skip on macosx, darwin, ios, tvos, watchos, bridgeos) UNSUPPORTED: LLDB (/Users/buildslave/jenkins/workspace/lldb-cmake-sanitized/lldb-build/bin/clang-x86_64) :: test_watchos_i386 (TestSimulatorPlatform.TestSimulatorPlatformLaunching) (skip on macosx, darwin, ios, tvos, watchos, bridgeos) Restore dir to: /Users/buildslave/jenkins/workspace/lldb-cmake-sanitized/lldb-build/tools/lldb/test ====================================================================== FAIL: test_ios (TestSimulatorPlatform.TestSimulatorPlatformLaunching) Test running an iOS simulator binary ---------------------------------------------------------------------- Traceback (most recent call last): File "/Users/buildslave/jenkins/workspace/lldb-cmake-sanitized/llvm-project/lldb/packages/Python/lldbsuite/test/decorators.py", line 135, in wrapper return func(*args, **kwargs) File "/Users/buildslave/jenkins/workspace/lldb-cmake-sanitized/llvm-project/lldb/test/API/macosx/simulator/TestSimulatorPlatform.py", line 62, in test_ios expected_load_command='LC_BUILD_VERSION') File "/Users/buildslave/jenkins/workspace/lldb-cmake-sanitized/llvm-project/lldb/test/API/macosx/simulator/TestSimulatorPlatform.py", line 50, in run_with lldb.SBFileSpec("hello.c")) File "/Users/buildslave/jenkins/workspace/lldb-cmake-sanitized/llvm-project/lldb/packages/Python/lldbsuite/test/lldbutil.py", line 919, in run_to_source_breakpoint only_one_thread, extra_images) File "/Users/buildslave/jenkins/workspace/lldb-cmake-sanitized/llvm-project/lldb/packages/Python/lldbsuite/test/lldbutil.py", line 848, in run_to_breakpoint_do_run test.assertEqual(num_threads, 1, "Expected 1 thread to stop at breakpoint, %d did."%(num_threads)) AssertionError: 0 != 1 : Expected 1 thread to stop at breakpoint, 0 did. Config=x86_64-/Users/buildslave/jenkins/workspace/lldb-cmake-sanitized/lldb-build/bin/clang ====================================================================== FAIL: test_ios_backdeploy_x86 (TestSimulatorPlatform.TestSimulatorPlatformLaunching) Test running a back-deploying iOS simulator binary ---------------------------------------------------------------------- Traceback (most recent call last): File "/Users/buildslave/jenkins/workspace/lldb-cmake-sanitized/llvm-project/lldb/packages/Python/lldbsuite/test/decorators.py", line 135, in wrapper return func(*args, **kwargs) File "/Users/buildslave/jenkins/workspace/lldb-cmake-sanitized/llvm-project/lldb/packages/Python/lldbsuite/test/decorators.py", line 135, in wrapper return func(*args, **kwargs) File "/Users/buildslave/jenkins/workspace/lldb-cmake-sanitized/llvm-project/lldb/test/API/macosx/simulator/TestSimulatorPlatform.py", line 132, in test_ios_backdeploy_x86 expected_load_command='LC_BUILD_VERSION') File "/Users/buildslave/jenkins/workspace/lldb-cmake-sanitized/llvm-project/lldb/test/API/macosx/simulator/TestSimulatorPlatform.py", line 50, in run_with lldb.SBFileSpec("hello.c")) File "/Users/buildslave/jenkins/workspace/lldb-cmake-sanitized/llvm-project/lldb/packages/Python/lldbsuite/test/lldbutil.py", line 919, in run_to_source_breakpoint only_one_thread, extra_images) File "/Users/buildslave/jenkins/workspace/lldb-cmake-sanitized/llvm-project/lldb/packages/Python/lldbsuite/test/lldbutil.py", line 848, in run_to_breakpoint_do_run test.assertEqual(num_threads, 1, "Expected 1 thread to stop at breakpoint, %d did."%(num_threads)) AssertionError: 0 != 1 : Expected 1 thread to stop at breakpoint, 0 did. Config=x86_64-/Users/buildslave/jenkins/workspace/lldb-cmake-sanitized/lldb-build/bin/clang ====================================================================== FAIL: test_lc_version_min_iphoneos (TestSimulatorPlatform.TestSimulatorPlatformLaunching) Test running a back-deploying iOS simulator binary ---------------------------------------------------------------------- Traceback (most recent call last): File "/Users/buildslave/jenkins/workspace/lldb-cmake-sanitized/llvm-project/lldb/packages/Python/lldbsuite/test/decorators.py", line 135, in wrapper return func(*args, **kwargs) File "/Users/buildslave/jenkins/workspace/lldb-cmake-sanitized/llvm-project/lldb/packages/Python/lldbsuite/test/decorators.py", line 135, in wrapper return func(*args, **kwargs) File "/Users/buildslave/jenkins/workspace/lldb-cmake-sanitized/llvm-project/lldb/test/API/macosx/simulator/TestSimulatorPlatform.py", line 121, in test_lc_version_min_iphoneos expected_load_command='LC_VERSION_MIN_IPHONEOS') File "/Users/buildslave/jenkins/workspace/lldb-cmake-sanitized/llvm-project/lldb/test/API/macosx/simulator/TestSimulatorPlatform.py", line 50, in run_with lldb.SBFileSpec("hello.c")) File "/Users/buildslave/jenkins/workspace/lldb-cmake-sanitized/llvm-project/lldb/packages/Python/lldbsuite/test/lldbutil.py", line 919, in run_to_source_breakpoint only_one_thread, extra_images) File "/Users/buildslave/jenkins/workspace/lldb-cmake-sanitized/llvm-project/lldb/packages/Python/lldbsuite/test/lldbutil.py", line 848, in run_to_breakpoint_do_run test.assertEqual(num_threads, 1, "Expected 1 thread to stop at breakpoint, %d did."%(num_threads)) AssertionError: 0 != 1 : Expected 1 thread to stop at breakpoint, 0 did. Config=x86_64-/Users/buildslave/jenkins/workspace/lldb-cmake-sanitized/lldb-build/bin/clang ====================================================================== FAIL: test_lc_version_min_macosx (TestSimulatorPlatform.TestSimulatorPlatformLaunching) Test running a back-deploying non-simulator MacOS X binary ---------------------------------------------------------------------- Traceback (most recent call last): File "/Users/buildslave/jenkins/workspace/lldb-cmake-sanitized/llvm-project/lldb/test/API/macosx/simulator/TestSimulatorPlatform.py", line 111, in test_lc_version_min_macosx expected_load_command='LC_VERSION_MIN_MACOSX') File "/Users/buildslave/jenkins/workspace/lldb-cmake-sanitized/llvm-project/lldb/test/API/macosx/simulator/TestSimulatorPlatform.py", line 53, in run_with self.check_debugserver(log, os+env, vers) File "/Users/buildslave/jenkins/workspace/lldb-cmake-sanitized/llvm-project/lldb/test/API/macosx/simulator/TestSimulatorPlatform.py", line 36, in check_debugserver self.assertTrue(aout_info) AssertionError: None is not True Config=x86_64-/Users/buildslave/jenkins/workspace/lldb-cmake-sanitized/lldb-build/bin/clang ====================================================================== FAIL: test_lc_version_min_tvos (TestSimulatorPlatform.TestSimulatorPlatformLaunching) Test running a back-deploying tvOS simulator binary ---------------------------------------------------------------------- Traceback (most recent call last): File "/Users/buildslave/jenkins/workspace/lldb-cmake-sanitized/llvm-project/lldb/packages/Python/lldbsuite/test/decorators.py", line 135, in wrapper return func(*args, **kwargs) File "/Users/buildslave/jenkins/workspace/lldb-cmake-sanitized/llvm-project/lldb/packages/Python/lldbsuite/test/decorators.py", line 135, in wrapper return func(*args, **kwargs) File "/Users/buildslave/jenkins/workspace/lldb-cmake-sanitized/llvm-project/lldb/test/API/macosx/simulator/TestSimulatorPlatform.py", line 153, in test_lc_version_min_tvos expected_load_command='LC_VERSION_MIN_TVOS') File "/Users/buildslave/jenkins/workspace/lldb-cmake-sanitized/llvm-project/lldb/test/API/macosx/simulator/TestSimulatorPlatform.py", line 50, in run_with lldb.SBFileSpec("hello.c")) File "/Users/buildslave/jenkins/workspace/lldb-cmake-sanitized/llvm-project/lldb/packages/Python/lldbsuite/test/lldbutil.py", line 919, in run_to_source_breakpoint only_one_thread, extra_images) File "/Users/buildslave/jenkins/workspace/lldb-cmake-sanitized/llvm-project/lldb/packages/Python/lldbsuite/test/lldbutil.py", line 848, in run_to_breakpoint_do_run test.assertEqual(num_threads, 1, "Expected 1 thread to stop at breakpoint, %d did."%(num_threads)) AssertionError: 0 != 1 : Expected 1 thread to stop at breakpoint, 0 did. Config=x86_64-/Users/buildslave/jenkins/workspace/lldb-cmake-sanitized/lldb-build/bin/clang ====================================================================== FAIL: test_tvos (TestSimulatorPlatform.TestSimulatorPlatformLaunching) Test running an tvOS simulator binary ---------------------------------------------------------------------- Traceback (most recent call last): File "/Users/buildslave/jenkins/workspace/lldb-cmake-sanitized/llvm-project/lldb/packages/Python/lldbsuite/test/decorators.py", line 135, in wrapper return func(*args, **kwargs) File "/Users/buildslave/jenkins/workspace/lldb-cmake-sanitized/llvm-project/lldb/test/API/macosx/simulator/TestSimulatorPlatform.py", line 71, in test_tvos expected_load_command='LC_BUILD_VERSION') File "/Users/buildslave/jenkins/workspace/lldb-cmake-sanitized/llvm-project/lldb/test/API/macosx/simulator/TestSimulatorPlatform.py", line 50, in run_with lldb.SBFileSpec("hello.c")) File "/Users/buildslave/jenkins/workspace/lldb-cmake-sanitized/llvm-project/lldb/packages/Python/lldbsuite/test/lldbutil.py", line 919, in run_to_source_breakpoint only_one_thread, extra_images) File "/Users/buildslave/jenkins/workspace/lldb-cmake-sanitized/llvm-project/lldb/packages/Python/lldbsuite/test/lldbutil.py", line 848, in run_to_breakpoint_do_run test.assertEqual(num_threads, 1, "Expected 1 thread to stop at breakpoint, %d did."%(num_threads)) AssertionError: 0 != 1 : Expected 1 thread to stop at breakpoint, 0 did. Config=x86_64-/Users/buildslave/jenkins/workspace/lldb-cmake-sanitized/lldb-build/bin/clang ---------------------------------------------------------------------- Ran 12 tests in 48.335s

Hide Details

RESULT: FAILED (0 passes, 6 failures, 0 errors, 6 skipped, 0 expected failures, 0 unexpected successes)

Hide Details

--

Hide Details

******************** PASS: lldb-unit :: Symbol/./SymbolTests/TestClangASTImporter.CopyTypeTagDecl (1492 of 2108) UNSUPPORTED: lldb-api :: commands/expression/macros/TestMacros.py (1493 of 2108) PASS: lldb-unit :: Utility/./UtilityTests/StreamTest.ShiftOperatorStrings (1494 of 2108) PASS: lldb-api :: functionalities/show_location/TestShowLocationDwarf5.py (1495 of 2108) PASS: lldb-unit :: Utility/./UtilityTests/StreamTeeTest.Flush (1496 of 2108) UNSUPPORTED: lldb-shell :: SymbolFile/NativePDB/typedefs.cpp (1497 of 2108) PASS: lldb-api :: commands/command/script/import/TestImport.py (1498 of 2108) PASS: lldb-unit :: UnwindAssembly/x86/./UnwindAssemblyx86Tests/Testx86AssemblyInspectionEngine.TestPushImm (1499 of 2108) PASS: lldb-api :: types/TestIntegerType.py (1500 of 2108) PASS: lldb-api :: commands/command/script_alias/TestCommandScriptAlias.py (1501 of 2108) PASS: lldb-api :: lang/c/local_types/TestUseClosestType.py (1502 of 2108) PASS: lldb-unit :: UnwindAssembly/x86/./UnwindAssemblyx86Tests/Testx86AssemblyInspectionEngine.TestPopR12 (1503 of 2108) UNSUPPORTED: lldb-api :: commands/gui/breakpoints/TestGuiBreakpoints.py (1504 of 2108) PASS: lldb-api :: python_api/frame/inlines/TestInlinedFrame.py (1505 of 2108) PASS: lldb-unit :: Utility/./UtilityTests/RangeTest.NotEqualInvalid (1506 of 2108) PASS: lldb-unit :: Core/./LLDBCoreTests/RichManglingContextTest.IPDRealloc (1507 of 2108) PASS: lldb-unit :: Utility/./UtilityTests/StreamTest.PutULEB128 (1508 of 2108) PASS: lldb-unit :: Target/./TargetTests/RemoteAwarePlatformTest.TestResolveExecutabelOnClientByPlatform (1509 of 2108) PASS: lldb-api :: python_api/function_symbol/TestDisasmAPI.py (1510 of 2108) PASS: lldb-unit :: Process/gdb-remote/./ProcessGdbRemoteTests/GDBRemoteCommunicationClientTest.WriteRegister (1511 of 2108) PASS: lldb-unit :: Utility/./UtilityTests/DataExtractorTest.GetSLEB128_bit63 (1512 of 2108) PASS: lldb-unit :: UnwindAssembly/x86/./UnwindAssemblyx86Tests/Testx86AssemblyInspectionEngine.TestPopR13 (1513 of 2108) PASS: lldb-api :: functionalities/plugins/python_os_plugin/TestPythonOSPlugin.py (1514 of 2108) PASS: lldb-api :: commands/command/invalid-args/TestInvalidArgsCommand.py (1515 of 2108) PASS: lldb-api :: lang/cpp/function_refs/TestFunctionRefs.py (1516 of 2108) UNSUPPORTED: lldb-api :: iohandler/resize/TestIOHandlerResize.py (1517 of 2108) PASS: lldb-unit :: Process/gdb-remote/./ProcessGdbRemoteTests/GDBRemoteCommunicationClientTest.WriteRegisterNoSuffix (1518 of 2108) PASS: lldb-api :: commands/expression/completion-crash-incomplete-record/TestCompletionCrashIncompleteRecord.py (1519 of 2108) PASS: lldb-shell :: Driver/LocalLLDBInit.test (1520 of 2108) PASS: lldb-shell :: Expr/TestMultilineExpr.test (1521 of 2108) PASS: lldb-unit :: Platform/./LLDBPlatformTests/PlatformAppleSimulatorTest.TestHostPlatformToSim (1522 of 2108) PASS: lldb-unit :: ScriptInterpreter/Python/./ScriptInterpreterPythonTests/PythonDataObjectsTest.TestPythonTupleValues (1523 of 2108) PASS: lldb-shell :: SymbolFile/DWARF/dwarf5_locations.s (1524 of 2108) PASS: lldb-api :: functionalities/data-formatter/ostypeformatting/TestFormattersOsType.py (1525 of 2108) PASS: lldb-unit :: ScriptInterpreter/Python/./ScriptInterpreterPythonTests/PythonDataObjectsTest.TestPythonTupleSize (1526 of 2108) PASS: lldb-unit :: Utility/./UtilityTests/StringListTest.AppendStringStdString (1527 of 2108) PASS: lldb-unit :: Utility/./UtilityTests/StringExtractorTest.GetHexU8_Exact (1528 of 2108) PASS: lldb-unit :: Utility/./UtilityTests/StringLexerTest.HasAtLeast (1529 of 2108) PASS: lldb-api :: functionalities/var_path/TestVarPath.py (1530 of 2108) PASS: lldb-unit :: Utility/./UtilityTests/RangeTest.SetRangeBase (1531 of 2108) PASS: lldb-api :: commands/watchpoints/watchpoint_size/TestWatchpointSizes.py (1532 of 2108) PASS: lldb-unit :: Utility/./UtilityTests/ScalarTest.Scalar_512 (1533 of 2108) PASS: lldb-shell :: SymbolFile/NativePDB/source-list.cpp (1534 of 2108) PASS: lldb-shell :: Driver/TestPositionalArgs.test (1535 of 2108) PASS: lldb-unit :: Utility/./UtilityTests/StringListTest.CopyList (1536 of 2108) PASS: lldb-unit :: Utility/./UtilityTests/FileSpecTest.Equal (1537 of 2108) PASS: lldb-unit :: Symbol/./SymbolTests/TestClangASTImporter.ImportInvalidType (1538 of 2108) PASS: lldb-unit :: Utility/./UtilityTests/StreamTest.ShiftOperatorPtr (1539 of 2108) PASS: lldb-unit :: Utility/./UtilityTests/BinaryStreamTest.PutULEB128EightBytes (1540 of 2108) PASS: lldb-unit :: Utility/./UtilityTests/StreamTeeTest.Constructor2Streams (1541 of 2108) PASS: lldb-shell :: ObjectFile/ELF/many-sections.s (1542 of 2108) PASS: lldb-api :: functionalities/process_crash_info/TestProcessCrashInfo.py (1543 of 2108) PASS: lldb-shell :: SymbolFile/DWARF/DW_AT_declaration-with-children.s (1544 of 2108) PASS: lldb-api :: functionalities/data-formatter/data-formatter-categories/TestDataFormatterCategories.py (1545 of 2108) PASS: lldb-unit :: Utility/./UtilityTests/ArchSpecTest.YAML (1546 of 2108) UNSUPPORTED: lldb-shell :: Register/x86-zmm-write.test (1547 of 2108) PASS: lldb-shell :: Minidump/breakpad-symbols.test (1548 of 2108) PASS: lldb-api :: commands/watchpoints/watchpoint_commands/command/TestWatchpointCommandPython.py (1549 of 2108) PASS: lldb-api :: types/TestIntegerTypeExpr.py (1550 of 2108) PASS: lldb-api :: functionalities/tail_call_frames/inlining_and_tail_calls/TestInliningAndTailCalls.py (1551 of 2108) PASS: lldb-api :: python_api/objc_type/TestObjCType.py (1552 of 2108) UNSUPPORTED: lldb-shell :: Minidump/Windows/arm-fp-unwind.test (1553 of 2108) PASS: lldb-shell :: Driver/TestTarget.test (1554 of 2108) PASS: lldb-unit :: UnwindAssembly/x86/./UnwindAssemblyx86Tests/Testx86AssemblyInspectionEngine.TestPopR14 (1555 of 2108) PASS: lldb-api :: commands/watchpoints/watchpoint_commands/condition/TestWatchpointConditionCmd.py (1556 of 2108) PASS: lldb-api :: commands/expression/call-function/TestCallStdStringFunction.py (1557 of 2108) PASS: lldb-unit :: Utility/./UtilityTests/BinaryStreamTest.PutSLEB128SixBytes (1558 of 2108) UNSUPPORTED: lldb-api :: linux/add-symbols/TestTargetSymbolsAddCommand.py (1559 of 2108) PASS: lldb-unit :: Utility/./UtilityTests/Flags.IsClear (1560 of 2108) PASS: lldb-unit :: Host/./HostTests/MainLoopTest.UnmonitoredSignal (1561 of 2108) PASS: lldb-api :: macosx/duplicate-archive-members/TestDuplicateMembers.py (1562 of 2108) PASS: lldb-api :: functionalities/tail_call_frames/cross_dso/TestCrossDSOTailCalls.py (1563 of 2108) UNSUPPORTED: lldb-shell :: ScriptInterpreter/Lua/lua.test (1564 of 2108) PASS: lldb-api :: lang/objcxx/objcxx-ivar-vector/TestIvarVector.py (1565 of 2108) PASS: lldb-unit :: Utility/./UtilityTests/PassiveReplayTest.InstrumentedBar (1566 of 2108) PASS: lldb-api :: functionalities/load_using_paths/TestLoadUsingPaths.py (1567 of 2108) PASS: lldb-shell :: SymbolFile/NativePDB/function-types-builtins.cpp (1568 of 2108) PASS: lldb-api :: lang/cpp/chained-calls/TestCppChainedCalls.py (1569 of 2108) PASS: lldb-shell :: ExecControl/StopHook/stop-hook.test (1570 of 2108) PASS: lldb-api :: functionalities/breakpoint/address_breakpoints/TestBadAddressBreakpoints.py (1571 of 2108) PASS: lldb-api :: commands/frame/diagnose/dereference-function-return/TestDiagnoseDereferenceFunctionReturn.py (1572 of 2108) PASS: lldb-api :: lang/cpp/gmodules-templates/TestGModules.py (1573 of 2108) PASS: lldb-api :: commands/expression/import-std-module/shared_ptr/TestSharedPtrFromStdModule.py (1574 of 2108) PASS: lldb-api :: lang/cpp/limit-debug-info/TestWithLimitDebugInfo.py (1575 of 2108) PASS: lldb-unit :: Host/./HostTests/NativeProcessProtocolTest.SetBreakpointFailWrite (1576 of 2108) PASS: lldb-unit :: Utility/./UtilityTests/ArgsTest.GetArgumentArrayRef (1577 of 2108) PASS: lldb-unit :: Utility/./UtilityTests/BinaryStreamTest.PutULEB128TwoBytes (1578 of 2108) PASS: lldb-unit :: Language/Highlighting/./HighlighterTests/HighlighterTest.ClangComments (1579 of 2108) PASS: lldb-unit :: Utility/./UtilityTests/VMRange.CollectionContains (1580 of 2108) PASS: lldb-api :: functionalities/object-file/TestImageListMultiArchitecture.py (1581 of 2108) PASS: lldb-unit :: Utility/./UtilityTests/RegisterValueTest.GetSet8 (1582 of 2108) PASS: lldb-api :: commands/quit/TestQuit.py (1583 of 2108) PASS: lldb-api :: functionalities/thread/thread_exit/TestThreadExit.py (1584 of 2108) PASS: lldb-unit :: ObjectFile/ELF/./ObjectFileELFTests/ObjectFileELFTest.GetSymtab_NoSymEntryPointArmAddressClass (1585 of 2108) UNSUPPORTED: lldb-api :: functionalities/tty/TestTerminal.py (1586 of 2108) PASS: lldb-unit :: UnwindAssembly/x86/./UnwindAssemblyx86Tests/Testx86AssemblyInspectionEngine.TestPushR15 (1587 of 2108) PASS: lldb-unit :: Utility/./UtilityTests/LogChannelEnabledTest.LogGetLogThread (1588 of 2108) PASS: lldb-api :: functionalities/unwind/noreturn/TestNoreturnUnwind.py (1589 of 2108) PASS: lldb-api :: functionalities/breakpoint/scripted_bkpt/TestScriptedResolver.py (1590 of 2108) PASS: lldb-unit :: Utility/./UtilityTests/StreamTest.PutHex16ByteOrderBig (1591 of 2108) PASS: lldb-api :: commands/expression/import-std-module/queue/TestQueueFromStdModule.py (1592 of 2108) PASS: lldb-unit :: Utility/./UtilityTests/StringListTest.LongestCommonPrefix (1593 of 2108) PASS: lldb-shell :: SymbolFile/DWARF/find-variable-dwo.cpp (1594 of 2108) PASS: lldb-unit :: Utility/./UtilityTests/StringExtractorTest.GetU64LittleEndian (1595 of 2108) PASS: lldb-api :: functionalities/non-overlapping-index-variable-i/TestIndexVariable.py (1596 of 2108) PASS: lldb-api :: commands/thread/select/TestThreadSelect.py (1597 of 2108) PASS: lldb-unit :: Symbol/./SymbolTests/TestTypeSystemClang.TestDeletingImplicitCopyCstrDueToMoveCStr (1598 of 2108) PASS: lldb-unit :: Utility/./UtilityTests/CompletionRequest.TestCompletionOwnership (1599 of 2108) PASS: lldb-unit :: Utility/./UtilityTests/ArgsTest.GetQuotedCommandString (1600 of 2108) PASS: lldb-unit :: ObjectFile/ELF/./ObjectFileELFTests/ObjectFileELFTest.GetSymtab_NoSymEntryPointArmThumbAddressClass (1601 of 2108) PASS: lldb-api :: lang/cpp/lambdas/TestLambdas.py (1602 of 2108) PASS: lldb-unit :: Utility/./UtilityTests/OptionsWithRawTest.ArgsButNoLeadingDash (1603 of 2108) PASS: lldb-shell :: SymbolFile/NativePDB/ast-types.cpp (1604 of 2108) UNSUPPORTED: lldb-shell :: Register/aarch64-gp-read.test (1605 of 2108) PASS: lldb-api :: functionalities/postmortem/mach-core/TestMachCore.py (1606 of 2108) PASS: lldb-api :: commands/frame/diagnose/local-variable/TestLocalVariable.py (1607 of 2108) PASS: lldb-unit :: DataFormatter/./LLDBFormatterTests/StringPrinterTests.CxxUTF8 (1608 of 2108) PASS: lldb-unit :: Symbol/./SymbolTests/TestTypeSystemClang.TestGetTypeClassDeclType (1609 of 2108) PASS: lldb-unit :: Utility/./UtilityTests/OptionsWithRawTest.EmptyArgsOnlySuffix (1610 of 2108) PASS: lldb-api :: functionalities/thread/concurrent_events/TestConcurrentBreakpointsDelayedBreakpointOneWatchpoint.py (1611 of 2108) PASS: lldb-unit :: Utility/./UtilityTests/SerializationRountripTest.SerializeDeserializeCStringArrayNullptrElem (1612 of 2108) PASS: lldb-api :: functionalities/data-formatter/data-formatter-stl/libcxx/forward_list/TestDataFormatterLibcxxForwardList.py (1613 of 2108) PASS: lldb-unit :: Target/./TargetTests/MCBasedABI.MapRegisterName (1614 of 2108) PASS: lldb-api :: types/TestCharTypeExpr.py (1615 of 2108) PASS: lldb-api :: commands/platform/basic/TestPlatformCommand.py (1616 of 2108) PASS: lldb-unit :: Utility/./UtilityTests/DataExtractorTest.GetULEB128_bit63 (1617 of 2108) PASS: lldb-api :: functionalities/wrong_commands/TestWrongCommands.py (1618 of 2108) PASS: lldb-shell :: Reproducer/TestProcessList.test (1619 of 2108) PASS: lldb-shell :: SymbolFile/Breakpad/unwind-via-stack-win.test (1620 of 2108) PASS: lldb-api :: commands/expression/import-std-module/weak_ptr/TestWeakPtrFromStdModule.py (1621 of 2108) PASS: lldb-unit :: Utility/./UtilityTests/ScalarTest.GetBytes (1622 of 2108) PASS: lldb-api :: commands/expression/anonymous-struct/TestCallUserAnonTypedef.py (1623 of 2108) PASS: lldb-api :: commands/apropos/with-process/TestAproposWithProcess.py (1624 of 2108) PASS: lldb-api :: lang/c/conflicting-symbol/TestConflictingSymbol.py (1625 of 2108) PASS: lldb-unit :: Process/minidump/./LLDBMinidumpTests/MinidumpParserTest.GetThreadContext_x86_64 (1626 of 2108) PASS: lldb-api :: tools/lldb-server/TestGdbRemoteExitCode.py (1627 of 2108) PASS: lldb-unit :: Utility/./UtilityTests/SerializationRountripTest.SerializeDeserializePod (1628 of 2108) PASS: lldb-unit :: SymbolFile/NativePDB/./SymbolFileNativePDBTests/PDBFPOProgramToDWARFExpressionTests.UnknownOp (1629 of 2108) PASS: lldb-shell :: ObjectFile/PECOFF/sections-names.yaml (1630 of 2108) PASS: lldb-unit :: Language/Highlighting/./HighlighterTests/HighlighterTest.FallbackHighlighter (1631 of 2108) UNSUPPORTED: lldb-api :: functionalities/asan/TestMemoryHistory.py (1632 of 2108) PASS: lldb-unit :: Expression/./ExpressionTests/DiagnosticManagerTest.PutStringSeverities (1633 of 2108) PASS: lldb-api :: python_api/frame/get-variables/TestGetVariables.py (1634 of 2108) PASS: lldb-shell :: SymbolFile/DWARF/dwo-type-in-main-file.s (1635 of 2108) PASS: lldb-unit :: Utility/./UtilityTests/StreamTest.AddressRangeEmptyRange (1636 of 2108) PASS: lldb-unit :: UnwindAssembly/x86/./UnwindAssemblyx86Tests/Testx86AssemblyInspectionEngine.TestSimple64bitFrameFunction (1637 of 2108) PASS: lldb-unit :: Host/./HostTests/Host.GetEnvironment (1638 of 2108) UNSUPPORTED: lldb-shell :: SymbolFile/DWARF/debug-types-expressions.test (1639 of 2108) PASS: lldb-shell :: SymbolFile/DWARF/find-variable-file.cpp (1640 of 2108) PASS: lldb-unit :: Language/Highlighting/./HighlighterTests/HighlighterTest.ClangCursorPosBeforeOtherToken (1641 of 2108) PASS: lldb-unit :: Utility/./UtilityTests/StructuredDataTest.StringDump (1642 of 2108) PASS: lldb-shell :: BuildScript/script-args.test (1643 of 2108) PASS: lldb-unit :: Core/./LLDBCoreTests/ModuleSpecTest.InvalidInMemoryBuffer (1644 of 2108) PASS: lldb-api :: commands/expression/unwind_expression/TestUnwindExpression.py (1645 of 2108) PASS: lldb-unit :: Language/Highlighting/./HighlighterTests/HighlighterTest.ClangPreserveNewLine (1646 of 2108) PASS: lldb-shell :: SymbolFile/Breakpad/line-table-missing-file.test (1647 of 2108) PASS: lldb-unit :: Process/gdb-remote/./ProcessGdbRemoteTests/GDBRemoteCommunicationClientTest.SendSignalsToIgnore (1648 of 2108) PASS: lldb-api :: functionalities/breakpoint/comp_dir_symlink/TestCompDirSymLink.py (1649 of 2108) PASS: lldb-api :: functionalities/data-formatter/data-formatter-stl/libcxx/list/loop/TestDataFormatterLibcxxListLoop.py (1650 of 2108) PASS: lldb-api :: lang/cpp/function-qualifiers/TestCppFunctionQualifiers.py (1651 of 2108) PASS: lldb-shell :: Reproducer/TestPythonImport.test (1652 of 2108) UNSUPPORTED: lldb-api :: lang/objc/foundation/TestFoundationDisassembly.py (1653 of 2108) PASS: lldb-api :: lang/cpp/breakpoint_in_member_func_w_non_primitive_params/TestBreakpointInMemberFuncWNonPrimitiveParams.py (1654 of 2108) PASS: lldb-unit :: Utility/./UtilityTests/UUIDTest.StringConverion (1655 of 2108) PASS: lldb-unit :: Utility/./UtilityTests/Flags.Clear (1656 of 2108) PASS: lldb-unit :: Process/minidump/./LLDBMinidumpTests/MinidumpParserTest.FindMemoryRangeWithFullMemoryMinidump (1657 of 2108) PASS: lldb-unit :: Core/./LLDBCoreTests/RichManglingContextTest.SwitchProvider (1658 of 2108) PASS: lldb-unit :: Target/./TargetTests/ExecutionContextTest.GetByteOrderProcess (1659 of 2108) PASS: lldb-unit :: Utility/./UtilityTests/StringExtractorTest.GetHexBytes_FullString (1660 of 2108) PASS: lldb-unit :: Utility/./UtilityTests/StringListTest.AppendListCStringArray (1661 of 2108) PASS: lldb-unit :: Utility/./UtilityTests/ProcessInfoTest.Constructor (1662 of 2108) PASS: lldb-unit :: ScriptInterpreter/Python/./ScriptInterpreterPythonTests/PythonDataObjectsTest.TestModuleNameResolutionNoDot (1663 of 2108) PASS: lldb-unit :: SymbolFile/DWARF/./SymbolFileDWARFTests/SymbolFileDWARFTests.TestAbbrevOutOfOrder (1664 of 2108) PASS: lldb-shell :: SymbolFile/DWARF/find-function-regex.cpp (1665 of 2108) PASS: lldb-api :: functionalities/data-formatter/data-formatter-cpp/TestDataFormatterCpp.py (1666 of 2108) UNSUPPORTED: lldb-api :: functionalities/breakpoint/breakpoint_in_delayslot/TestAvoidBreakpointInDelaySlot.py (1667 of 2108) PASS: lldb-api :: functionalities/thread/concurrent_events/TestConcurrentDelayedCrashWithBreakpointSignal.py (1668 of 2108) PASS: lldb-api :: lang/cpp/virtual-functions/TestCppVirtualFunctions.py (1669 of 2108) PASS: lldb-api :: lang/cpp/overloaded-functions/TestOverloadedFunctions.py (1670 of 2108) PASS: lldb-api :: tools/lldb-vscode/launch/TestVSCode_launch.py (1671 of 2108) PASS: lldb-unit :: UnwindAssembly/x86/./UnwindAssemblyx86Tests/Testx86AssemblyInspectionEngine.TestPopEBX (1672 of 2108) PASS: lldb-shell :: Unwind/eh-frame-dwarf-unwind.test (1673 of 2108) PASS: lldb-api :: source-manager/TestSourceManager.py (1674 of 2108) PASS: lldb-api :: lang/cpp/enum_types/TestCPP11EnumTypes.py (1675 of 2108) PASS: lldb-unit :: Utility/./UtilityTests/UriParserTest.TypicalPortPathIPv6 (1676 of 2108) PASS: lldb-shell :: SymbolFile/NativePDB/ast-functions.cpp (1677 of 2108) PASS: lldb-api :: functionalities/mtc/simple/TestMTCSimple.py (1678 of 2108) PASS: lldb-unit :: Utility/./UtilityTests/StringExtractorTest.GetHexU8_Underflow (1679 of 2108) PASS: lldb-api :: python_api/symbol-context/TestSymbolContext.py (1680 of 2108) PASS: lldb-unit :: Utility/./UtilityTests/StreamTest.PutCString (1681 of 2108) PASS: lldb-unit :: Utility/./UtilityTests/StreamTest.AddressSuffix (1682 of 2108) PASS: lldb-unit :: Utility/./UtilityTests/ArgsTest.TestQuotedUnknownEscape (1683 of 2108) PASS: lldb-unit :: Language/Highlighting/./HighlighterTests/HighlighterTest.ClangTrailingBackslashBeforeNewline (1684 of 2108) PASS: lldb-unit :: Host/./HostTests/Host.WaitStatusFormat (1685 of 2108) PASS: lldb-shell :: SymbolFile/DWARF/dir-separator-posix.s (1686 of 2108) PASS: lldb-api :: commands/version/TestVersion.py (1687 of 2108) PASS: lldb-api :: macosx/save_crashlog/TestSaveCrashlog.py (1688 of 2108) PASS: lldb-unit :: Utility/./UtilityTests/StringExtractorTest.GetHexU8_Underflow2_NoEof (1689 of 2108) PASS: lldb-api :: commands/watchpoints/watchpoint_set_command/TestWatchLocationWithWatchSet.py (1690 of 2108) PASS: lldb-unit :: Utility/./UtilityTests/BinaryStreamTest.PutULEB128One (1691 of 2108) UNSUPPORTED: lldb-shell :: SymbolFile/PDB/expressions.test (1692 of 2108) PASS: lldb-unit :: Utility/./UtilityTests/ScalarTest.Equality (1693 of 2108) PASS: lldb-unit :: Process/gdb-remote/./ProcessGdbRemoteTests/GDBRemoteCommunicationServerTest.SendErrorResponse_UnimplementedError (1694 of 2108) PASS: lldb-shell :: SymbolFile/Breakpad/symtab-macho.test (1695 of 2108) PASS: lldb-api :: tools/lldb-server/inferior-crash/TestGdbRemoteAbort.py (1696 of 2108) PASS: lldb-unit :: Symbol/./SymbolTests/TestTypeSystemClang.TestGetBasicTypeFromEnum (1697 of 2108) PASS: lldb-api :: functionalities/data-formatter/data-formatter-stl/libcxx/map/TestDataFormatterLibccMap.py (1698 of 2108) PASS: lldb-api :: commands/watchpoints/watchpoint_disable/TestWatchpointDisable.py (1699 of 2108) PASS: lldb-api :: commands/frame/diagnose/dereference-argument/TestDiagnoseDereferenceArgument.py (1700 of 2108) PASS: lldb-unit :: Utility/./UtilityTests/Flags.Reset (1701 of 2108) PASS: lldb-api :: commands/expression/result_numbering/TestResultNumbering.py (1702 of 2108) PASS: lldb-unit :: Utility/./UtilityTests/XcodeSDKTest.FindXcodeContentsDirectoryInPath (1703 of 2108) PASS: lldb-unit :: Core/./LLDBCoreTests/UniqueCStringMap.NoDefaultConstructor (1704 of 2108) PASS: lldb-api :: functionalities/pre_run_dylibs/TestPreRunDylibs.py (1705 of 2108) PASS: lldb-unit :: Utility/./UtilityTests/VMRange.Ordering (1706 of 2108) PASS: lldb-shell :: Breakpoint/debug_rnglist_offset_pair.test (1707 of 2108) UNSUPPORTED: lldb-shell :: Register/x86-ymm-read.test (1708 of 2108) UNSUPPORTED: lldb-api :: benchmarks/stepping/TestSteppingSpeed.py (1709 of 2108) PASS: lldb-unit :: UnwindAssembly/x86/./UnwindAssemblyx86Tests/Testx86AssemblyInspectionEngine.TestReturnDetect (1710 of 2108) PASS: lldb-api :: lang/cpp/accelerator-table/TestCPPAccelerator.py (1711 of 2108) UNSUPPORTED: lldb-api :: functionalities/breakpoint/hardware_breakpoints/hardware_breakpoint_on_multiple_threads/TestHWBreakMultiThread.py (1712 of 2108) PASS: lldb-unit :: UnwindAssembly/x86/./UnwindAssemblyx86Tests/Testx86AssemblyInspectionEngine.TestPopRBPWithREX (1713 of 2108) PASS: lldb-unit :: Symbol/./SymbolTests/TestTypeSystemClang.TestGetEnumIntegerTypeUnexpectedType (1714 of 2108) PASS: lldb-unit :: Expression/./ExpressionTests/DiagnosticManagerTest.PutString (1715 of 2108) UNSUPPORTED: lldb-shell :: BuildScript/toolchain-msvc.test (1716 of 2108) PASS: lldb-unit :: Utility/./UtilityTests/IndexToObjectTest.ObjectForIndex (1717 of 2108) PASS: lldb-unit :: Expression/./ExpressionTests/ClangHostTest.MacOSX (1718 of 2108) UNSUPPORTED: lldb-api :: tools/lldb-server/signal-filtering/TestGdbRemote_QPassSignals.py (1719 of 2108) PASS: lldb-api :: functionalities/postmortem/minidump-new/TestMiniDumpNew.py (1720 of 2108) PASS: lldb-api :: commands/expression/import-std-module/deque-basic/TestDequeFromStdModule.py (1721 of 2108) PASS: lldb-api :: lang/objc/objc-checker/TestObjCCheckers.py (1722 of 2108) PASS: lldb-shell :: SymbolFile/NativePDB/globals-fundamental.cpp (1723 of 2108) PASS: lldb-api :: functionalities/breakpoint/breakpoint_conditions/TestBreakpointConditions.py (1724 of 2108) PASS: lldb-api :: functionalities/data-formatter/data-formatter-stl/libcxx/unordered/TestDataFormatterUnordered.py (1725 of 2108) PASS: lldb-unit :: Host/./HostTests/FileSystemTest.EmptyTest (1726 of 2108) PASS: lldb-api :: commands/expression/persist_objc_pointeetype/TestPersistObjCPointeeType.py (1727 of 2108) PASS: lldb-shell :: Minidump/Windows/broken-unwind.test (1728 of 2108) PASS: lldb-unit :: Expression/./ExpressionTests/DWARFExpression.DW_OP_convert (1729 of 2108) UNSUPPORTED: lldb-shell :: SymbolFile/PDB/function-level-linking.test (1730 of 2108) PASS: lldb-unit :: Expression/./ExpressionTests/ClangHostTest.ComputeClangResourceDirectory (1731 of 2108) PASS: lldb-api :: lang/objc/real-definition/TestRealDefinition.py (1732 of 2108) PASS: lldb-unit :: UnwindAssembly/x86/./UnwindAssemblyx86Tests/Testx86AssemblyInspectionEngine.TestSubRSP (1733 of 2108) PASS: lldb-shell :: Reproducer/TestFileRepro.test (1734 of 2108) PASS: lldb-api :: functionalities/limit-debug-info/TestLimitDebugInfo.py (1735 of 2108) PASS: lldb-api :: functionalities/tail_call_frames/thread_step_out_or_return/TestSteppingOutWithArtificialFrames.py (1736 of 2108) PASS: lldb-api :: functionalities/type_completion/TestTypeCompletion.py (1737 of 2108) PASS: lldb-unit :: Utility/./UtilityTests/DataExtractorTest.GetBitfield (1738 of 2108) PASS: lldb-unit :: Utility/./UtilityTests/ListenerTest.GetEventWait (1739 of 2108) PASS: lldb-unit :: Platform/./LLDBPlatformTests/PlatformAppleSimulatorTest.TestSimHasSimEnvionament (1740 of 2108) PASS: lldb-api :: commands/target/stop-hooks/TestStopHooks.py (1741 of 2108) PASS: lldb-unit :: Utility/./UtilityTests/SubsystemRAIITest.SubsystemWithErrorSuccess (1742 of 2108) PASS: lldb-unit :: Utility/./UtilityTests/StringListTest.SplitIntoLinesEmpty (1743 of 2108) PASS: lldb-unit :: Utility/./UtilityTests/XcodeSDKTest.SDKSupportsSwift (1744 of 2108) PASS: lldb-api :: functionalities/pointer_num_children/TestPointerNumChildren.py (1745 of 2108) PASS: lldb-shell :: SymbolFile/Breakpad/unwind-via-stack-win-no-memory-info.yaml (1746 of 2108) UNSUPPORTED: lldb-shell :: Register/x86-64-ymm16-write.test (1747 of 2108) PASS: lldb-unit :: Utility/./UtilityTests/BinaryStreamTest.PutULEB128FiveBytes (1748 of 2108) PASS: lldb-unit :: Host/./HostTests/ProcessLaunchInfoTest.Constructor (1749 of 2108) PASS: lldb-unit :: Utility/./UtilityTests/SubsystemRAIITest.SubsystemWithErrorFailure (1750 of 2108) PASS: lldb-api :: lang/objc/objc-new-syntax/TestObjCNewSyntaxLiteral.py (1751 of 2108) PASS: lldb-unit :: Host/./HostTests/FileSystemTest.Readable (1752 of 2108) PASS: lldb-api :: commands/expression/calculator_mode/TestCalculatorMode.py (1753 of 2108) PASS: lldb-unit :: Expression/./ExpressionTests/DWARFExpression.DW_OP_pick (1754 of 2108) PASS: lldb-unit :: Host/./HostTests/NativeProcessProtocolTest.ReadCStringFromMemory_CrossPageBoundary (1755 of 2108) PASS: lldb-api :: commands/expression/po_verbosity/TestPoVerbosity.py (1756 of 2108) PASS: lldb-unit :: Utility/./UtilityTests/ArgsTest.TestUnknownEscape (1757 of 2108) PASS: lldb-unit :: Core/./LLDBCoreTests/ModuleSpecTest.TestCOFFFile (1758 of 2108) UNSUPPORTED: lldb-api :: functionalities/darwin_log/basic/TestDarwinLogBasic.py (1759 of 2108) PASS: lldb-api :: lang/c/step-target/TestStepTarget.py (1760 of 2108) PASS: lldb-shell :: Reproducer/TestRelativePath.test (1761 of 2108) UNSUPPORTED: lldb-api :: benchmarks/expression/TestRepeatedExprs.py (1762 of 2108) PASS: lldb-api :: functionalities/abbreviation/TestCommonShortSpellings.py (1763 of 2108) PASS: lldb-unit :: Utility/./UtilityTests/ConstStringTest.format_provider (1764 of 2108) PASS: lldb-unit :: Core/./LLDBCoreTests/RichManglingContextTest.Basic (1765 of 2108) PASS: lldb-unit :: Expression/./ExpressionTests/DiagnosticManagerTest.AppendMessageAttachToLastDiag (1766 of 2108) PASS: lldb-api :: tools/lldb-server/TestGdbRemoteRegisterState.py (1767 of 2108) PASS: lldb-api :: functionalities/data-formatter/data-formatter-stl/libstdcpp/unique_ptr/invalid/TestDataFormatterInvalidStdUniquePtr.py (1768 of 2108) PASS: lldb-shell :: SymbolFile/DWARF/debug-types-basic.test (1769 of 2108) PASS: lldb-unit :: Process/gdb-remote/./ProcessGdbRemoteTests/GDBRemoteCommunicationClientTest.GetMemoryRegionInfoInvalidResponse (1770 of 2108) PASS: lldb-unit :: Utility/./UtilityTests/StatusTest.Formatv (1771 of 2108) PASS: lldb-unit :: SymbolFile/DWARF/./SymbolFileDWARFTests/SymbolFileDWARFTests.TestAbbrevMissingTerminator (1772 of 2108) PASS: lldb-unit :: Host/./HostTests/SocketTest.UDPConnect (1773 of 2108) PASS: lldb-unit :: UnwindAssembly/x86/./UnwindAssemblyx86Tests/Testx86AssemblyInspectionEngine.TestSpArithx86_64Augmented (1774 of 2108) PASS: lldb-api :: lang/cpp/const_this/TestConstThis.py (1775 of 2108) PASS: lldb-api :: lang/cpp/dynamic-value/TestDynamicValue.py (1776 of 2108) PASS: lldb-api :: commands/watchpoints/watchpoint_events/TestWatchpointEvents.py (1777 of 2108) PASS: lldb-unit :: Utility/./UtilityTests/StringListTest.GetMaxStringLengthEqualSize (1778 of 2108) PASS: lldb-shell :: Commands/command-disassemble-process.yaml (1779 of 2108) PASS: lldb-api :: functionalities/data-formatter/pyobjsynthprovider/TestPyObjSynthProvider.py (1780 of 2108) PASS: lldb-unit :: Expression/./ExpressionTests/DiagnosticManagerTest.HasFixits (1781 of 2108) PASS: lldb-api :: functionalities/gdb_remote_client/TestWriteMemory.py (1782 of 2108) PASS: lldb-unit :: Thread/./ThreadTests/ThreadTest.SetStopInfo (1783 of 2108) PASS: lldb-api :: lang/objc/objc-baseclass-sbtype/TestObjCBaseClassSBType.py (1784 of 2108) UNSUPPORTED: lldb-api :: api/multiple-debuggers/TestMultipleDebuggers.py (1785 of 2108) PASS: lldb-api :: commands/frame/recognizer/TestFrameRecognizer.py (1786 of 2108) PASS: lldb-unit :: Utility/./UtilityTests/SerializationRountripTest.SerializeDeserializeCStringNull (1787 of 2108) UNSUPPORTED: lldb-shell :: Register/aarch64-fp-read.test (1788 of 2108) PASS: lldb-unit :: Symbol/./SymbolTests/TestTypeSystemClang.TestGetEnumIntegerTypeBasicTypes (1789 of 2108) PASS: lldb-api :: commands/target/select/TestTargetSelect.py (1790 of 2108) PASS: lldb-unit :: Target/./TargetTests/StackFrameRecognizerTest.NullModuleRegex (1791 of 2108) PASS: lldb-unit :: Utility/./UtilityTests/StringListTest.JoinThree (1792 of 2108) PASS: lldb-unit :: Process/gdb-remote/./ProcessGdbRemoteTests/GDBRemoteCommunicationClientTest.GetModulesInfoInvalidResponse (1793 of 2108) PASS: lldb-shell :: ObjectFile/PECOFF/export-dllfunc.yaml (1794 of 2108) PASS: lldb-api :: lang/c/bitfields/TestBitfields.py (1795 of 2108) PASS: lldb-api :: lang/objc/modules-compile-error/TestModulesCompileError.py (1796 of 2108) PASS: lldb-api :: lang/cpp/llvm-style/TestLLVMStyle.py (1797 of 2108) PASS: lldb-unit :: Expression/./ExpressionTests/CppModuleConfigurationTest.LinuxLocalLibCpp (1798 of 2108) PASS: lldb-api :: commands/expression/dont_allow_jit/TestAllowJIT.py (1799 of 2108) UNSUPPORTED: lldb-shell :: SymbolFile/NativePDB/ast-functions-msvc.cpp (1800 of 2108) UNSUPPORTED: lldb-shell :: SymbolFile/PDB/variables.test (1801 of 2108) PASS: lldb-shell :: SymbolFile/DWARF/dwp.s (1802 of 2108) PASS: lldb-api :: functionalities/data-formatter/data-formatter-objc/TestDataFormatterObjCNSError.py (1803 of 2108) PASS: lldb-unit :: Process/minidump/./LLDBMinidumpTests/MinidumpParserTest.GetMiscInfo_no_stream (1804 of 2108) PASS: lldb-api :: macosx/function-starts/TestFunctionStarts.py (1805 of 2108) UNSUPPORTED: lldb-api :: commands/register/register/intel_xtended_registers/mpx_bound_violation/TestBoundViolation.py (1806 of 2108) UNSUPPORTED: lldb-api :: functionalities/darwin_log/filter/regex/message/TestDarwinLogFilterRegexMessage.py (1807 of 2108) PASS: lldb-unit :: Utility/./UtilityTests/StringExtractorTest.GetHexBytes_Underflow (1808 of 2108) PASS: lldb-api :: functionalities/tail_call_frames/sbapi_support/TestTailCallFrameSBAPI.py (1809 of 2108) PASS: lldb-unit :: Utility/./UtilityTests/TimerTest.CategoryTimes2 (1810 of 2108) PASS: lldb-api :: functionalities/thread/concurrent_events/TestConcurrentSignalBreak.py (1811 of 2108) UNSUPPORTED: lldb-shell :: ScriptInterpreter/Lua/watchpoint_callback.test (1812 of 2108) PASS: lldb-unit :: Symbol/./SymbolTests/TestClangASTImporter.MetadataPropagationAfterCopying (1813 of 2108) PASS: lldb-shell :: SymbolFile/DWARF/debug_line-relative_path.s (1814 of 2108) PASS: lldb-unit :: Utility/./UtilityTests/StringExtractorTest.GetU32LittleEndian (1815 of 2108) PASS: lldb-unit :: Utility/./UtilityTests/StreamTest.Indent (1816 of 2108) PASS: lldb-unit :: Utility/./UtilityTests/BinaryStreamTest.PutSLEB128MaxValue (1817 of 2108) PASS: lldb-unit :: tools/lldb-server/tests/./LLDBServerTests/StandardStartupTest.TestStopReplyContainsThreadPcs (1818 of 2108) PASS: lldb-api :: functionalities/data-formatter/compactvectors/TestCompactVectors.py (1819 of 2108) PASS: lldb-unit :: Utility/./UtilityTests/DataExtractorTest.GetFloatUnaligned (1820 of 2108) PASS: lldb-unit :: Host/./HostTests/ConnectionFileDescriptorTest.TCPGetURIv6 (1821 of 2108) PASS: lldb-api :: lang/cpp/dynamic-value-same-basename/TestDynamicValueSameBase.py (1822 of 2108) PASS: lldb-unit :: Expression/./ExpressionTests/DiagnosticManagerTest.GetStringNoDiags (1823 of 2108) PASS: lldb-api :: commands/expression/fixits/TestFixIts.py (1824 of 2108) PASS: lldb-api :: commands/command/nested_alias/TestNestedAlias.py (1825 of 2108) PASS: lldb-shell :: ScriptInterpreter/Python/scripted_breakpoint.test (1826 of 2108) PASS: lldb-unit :: Utility/./UtilityTests/ProcessInstanceInfo.DumpTable_invalidUID (1827 of 2108) PASS: lldb-unit :: Utility/./UtilityTests/UserIDResolver.GetUserName (1828 of 2108) PASS: lldb-unit :: Utility/./UtilityTests/OptionsWithRawTest.EmptyInput (1829 of 2108) PASS: lldb-unit :: SymbolFile/NativePDB/./SymbolFileNativePDBTests/PDBFPOProgramToDWARFExpressionTests.UnresolvedCyclicRegisterAssignmentReference (1830 of 2108) UNSUPPORTED: lldb-api :: commands/gui/basic/TestGuiBasic.py (1831 of 2108) PASS: lldb-shell :: ObjectFile/ELF/gnu-debuglink.yaml (1832 of 2108) PASS: lldb-api :: lang/cpp/std-function-step-into-callable/TestStdFunctionStepIntoCallable.py (1833 of 2108) PASS: lldb-unit :: DataFormatter/./LLDBFormatterTests/TypeMatcherTests.CreatedBySameMatchString (1834 of 2108) PASS: lldb-shell :: Minidump/Windows/find-module.test (1835 of 2108) PASS: lldb-shell :: Register/x86-64-gp-read.test (1836 of 2108) PASS: lldb-shell :: Reproducer/TestSynchronous.test (1837 of 2108) PASS: lldb-shell :: SymbolFile/DWARF/debug_loc_and_loclists.s (1838 of 2108) UNSUPPORTED: lldb-api :: lang/c/typedef/Testtypedef.py (1839 of 2108) PASS: lldb-shell :: Driver/TestRepl.test (1840 of 2108) PASS: lldb-unit :: Utility/./UtilityTests/UUIDTest.Validity (1841 of 2108) PASS: lldb-unit :: UnwindAssembly/x86/./UnwindAssemblyx86Tests/Testx86AssemblyInspectionEngine.Testi386IgnoredRegisters (1842 of 2108) PASS: lldb-unit :: UnwindAssembly/x86/./UnwindAssemblyx86Tests/Testx86AssemblyInspectionEngine.TestPushR14 (1843 of 2108) PASS: lldb-unit :: Symbol/./SymbolTests/TestTypeSystemClang.TestDisplayName (1844 of 2108) PASS: lldb-unit :: Host/./HostTests/SocketTest.DecodeHostAndPort (1845 of 2108) PASS: lldb-unit :: ScriptInterpreter/Python/./ScriptInterpreterPythonTests/PythonDataObjectsTest.TestPythonByteArray (1846 of 2108) PASS: lldb-api :: commands/gui/invalid-args/TestInvalidArgsGui.py (1847 of 2108) UNSUPPORTED: lldb-api :: functionalities/ptr_refs/TestPtrRefs.py (1848 of 2108) PASS: lldb-unit :: Utility/./UtilityTests/StatusTest.ErrorCodeConstructor (1849 of 2108) PASS: lldb-api :: commands/target/modules/search-paths/insert/TestTargetModulesSearchpathsInsert.py (1850 of 2108) PASS: lldb-unit :: Utility/./UtilityTests/StringExtractorTest.InitMisc (1851 of 2108) PASS: lldb-shell :: ObjectFile/ELF/section-addresses.yaml (1852 of 2108) PASS: lldb-unit :: Symbol/./SymbolTests/Type.GetTypeScopeAndBasename (1853 of 2108) PASS: lldb-shell :: ObjectFile/MachO/lc_build_version.yaml (1854 of 2108) PASS: lldb-unit :: Utility/./UtilityTests/ConstStringTest.CompareStringRef (1855 of 2108) PASS: lldb-unit :: Utility/./UtilityTests/StreamTest.AddressNoSuffix (1856 of 2108) PASS: lldb-unit :: Utility/./UtilityTests/VMRange.Clear (1857 of 2108) PASS: lldb-api :: tools/lldb-server/TestGdbRemote_qThreadStopInfo.py (1858 of 2108) PASS: lldb-unit :: Utility/./UtilityTests/RegularExpression.CopyAssignment (1859 of 2108) PASS: lldb-unit :: UnwindAssembly/x86/./UnwindAssemblyx86Tests/Testx86AssemblyInspectionEngine.TestSpillRegToStackViaMOVi386 (1860 of 2108) PASS: lldb-api :: functionalities/step-avoids-no-debug/TestStepNoDebug.py (1861 of 2108) PASS: lldb-shell :: ObjectFile/MachO/symtab.yaml (1862 of 2108) PASS: lldb-api :: functionalities/thread/exit_during_break/TestExitDuringBreak.py (1863 of 2108) UNSUPPORTED: lldb-api :: functionalities/thread/create_during_step/TestCreateDuringStep.py (1864 of 2108) PASS: lldb-unit :: Utility/./UtilityTests/RangeTest.LessThanInvalid (1865 of 2108) PASS: lldb-unit :: Utility/./UtilityTests/BroadcasterTest.EventTypeHasListeners (1866 of 2108) PASS: lldb-unit :: Core/./LLDBCoreTests/CommunicationTest.SynchronizeWhileClosing (1867 of 2108) PASS: lldb-api :: lang/cpp/bitfields/TestCppBitfields.py (1868 of 2108) PASS: lldb-unit :: Utility/./UtilityTests/ArgsTest.TestAppendArg (1869 of 2108) PASS: lldb-unit :: Utility/./UtilityTests/SerializationRountripTest.SerializeDeserializeObjectReference (1870 of 2108) PASS: lldb-api :: tools/lldb-server/inferior-crash/TestGdbRemoteSegFault.py (1871 of 2108) PASS: lldb-unit :: Process/minidump/./LLDBMinidumpTests/MinidumpParserTest.MinidumpDuplicateModuleMinAddress (1872 of 2108) PASS: lldb-api :: commands/expression/pr35310/TestExprsBug35310.py (1873 of 2108) FAIL: lldb-api :: macosx/macCatalyst/TestMacCatalyst.py (1874 of 2108) ******************** TEST 'lldb-api :: macosx/macCatalyst/TestMacCatalyst.py' FAILED ******************** Script: -- /Users/buildslave/jenkins/workspace/lldb-cmake-sanitized/lldb-build/lldb-test-build.noindex/copied-python /Users/buildslave/jenkins/workspace/lldb-cmake-sanitized/llvm-project/lldb/test/API/dotest.py --arch x86_64 -s /Users/buildslave/jenkins/workspace/lldb-cmake-sanitized/lldb-build/lldb-test-traces -S nm -u CXXFLAGS -u CFLAGS --codesign-identity lldb_codesign --server /Users/buildslave/jenkins/workspace/lldb-cmake-sanitized/lldb-build/./bin/debugserver --arch x86_64 --build-dir /Users/buildslave/jenkins/workspace/lldb-cmake-sanitized/lldb-build/lldb-test-build.noindex -s=/Users/buildslave/jenkins/workspace/lldb-cmake-sanitized/test/logs -t --env TERM=vt100 --env LLVM_LIBS_DIR=/Users/buildslave/jenkins/workspace/lldb-cmake-sanitized/lldb-build/./lib --inferior-env ASAN_OPTIONS=detect_stack_use_after_return=1 --inferior-env DYLD_INSERT_LIBRARIES=/Users/buildslave/jenkins/workspace/lldb-cmake-sanitized/host-compiler/lib/clang/12.0.0/lib/darwin/libclang_rt.asan_osx_dynamic.dylib --build-dir /Users/buildslave/jenkins/workspace/lldb-cmake-sanitized/lldb-build/lldb-test-build.noindex --lldb-module-cache-dir /Users/buildslave/jenkins/workspace/lldb-cmake-sanitized/lldb-build/lldb-test-build.noindex/module-cache-lldb/lldb-api --clang-module-cache-dir /Users/buildslave/jenkins/workspace/lldb-cmake-sanitized/lldb-build/lldb-test-build.noindex/module-cache-clang/lldb-api --executable /Users/buildslave/jenkins/workspace/lldb-cmake-sanitized/lldb-build/./bin/lldb --compiler /Users/buildslave/jenkins/workspace/lldb-cmake-sanitized/lldb-build/./bin/clang --dsymutil /Users/buildslave/jenkins/workspace/lldb-cmake-sanitized/lldb-build/./bin/dsymutil --filecheck /Users/buildslave/jenkins/workspace/lldb-cmake-sanitized/lldb-build/./bin/FileCheck --yaml2obj /Users/buildslave/jenkins/workspace/lldb-cmake-sanitized/lldb-build/./bin/yaml2obj --lldb-libs-dir /Users/buildslave/jenkins/workspace/lldb-cmake-sanitized/lldb-build/./lib /Users/buildslave/jenkins/workspace/lldb-cmake-sanitized/llvm-project/lldb/test/API/macosx/macCatalyst -p TestMacCatalyst.py -- Exit Code: 1

Hide Details

Command Output (stdout): -- lldb version 12.0.99 clang revision 38537307e502c1ac9a09e6f75f9208db1327a0bf llvm revision 38537307e502c1ac9a09e6f75f9208db1327a0bf LLDB library dir: /Users/buildslave/jenkins/workspace/lldb-cmake-sanitized/lldb-build/bin LLDB import library dir: /Users/buildslave/jenkins/workspace/lldb-cmake-sanitized/lldb-build/./lib libstdcxx tests will not be run because: Don't know how to build with libstdcxx on macosx Skipping following debug info categories: ['dwo']

Hide Details

-- Command Output (stderr): --

Hide Details

Session logs for test failures/errors/unexpected successes will go into directory '/Users/buildslave/jenkins/workspace/lldb-cmake-sanitized/test/logs' Change dir to: /Users/buildslave/jenkins/workspace/lldb-cmake-sanitized/llvm-project/lldb/test/API/macosx/macCatalyst runCmd: settings clear -all output:

Hide Details

runCmd: settings set symbols.enable-external-lookup false output:

Hide Details

runCmd: settings set target.inherit-tcc true output:

Hide Details

runCmd: settings set target.auto-apply-fixits false output:

Hide Details

runCmd: settings set plugin.process.gdb-remote.packet-timeout 60 output:

Hide Details

runCmd: settings set symbols.clang-modules-cache-path "/Users/buildslave/jenkins/workspace/lldb-cmake-sanitized/lldb-build/lldb-test-build.noindex/module-cache-lldb/lldb-api" output:

Hide Details

runCmd: settings set use-color false output:

Hide Details

runCmd: setting set target.prefer-dynamic-value no-dynamic-values output:

Hide Details

runCmd: settings set target.env-vars ASAN_OPTIONS=detect_stack_use_after_return=1 DYLD_INSERT_LIBRARIES=/Users/buildslave/jenkins/workspace/lldb-cmake-sanitized/host-compiler/lib/clang/12.0.0/lib/darwin/libclang_rt.asan_osx_dynamic.dylib output:

Hide Details

runCmd: log enable gdb-remote packets -f /Users/buildslave/jenkins/workspace/lldb-cmake-sanitized/lldb-build/lldb-test-build.noindex/macosx/macCatalyst/TestMacCatalyst.test_macabi_dsym/packets.log output:

Hide Details

runCmd: settings set target.env-vars ASAN_OPTIONS=detect_stack_use_after_return=1 DYLD_INSERT_LIBRARIES=/Users/buildslave/jenkins/workspace/lldb-cmake-sanitized/host-compiler/lib/clang/12.0.0/lib/darwin/libclang_rt.asan_osx_dynamic.dylib output:

Hide Details

runCmd: image list -t -b output: [ 0] x86_64-apple-ios13.0.0-macabi a.out [ 1] x86_64-apple-macosx10.15.0 dyld [ 2] x86_64-apple-ios13.0-macabi libc++.1.dylib [ 3] x86_64-apple-ios13.5-macabi libSystem.B.dylib [ 4] x86_64-apple-ios13.0-macabi libc++abi.dylib [ 5] x86_64-apple-ios13.4-macabi libcache.dylib [ 6] x86_64-apple-ios13.4-macabi libcommonCrypto.dylib [ 7] x86_64-apple-macosx10.15.0 libcompiler_rt.dylib [ 8] x86_64-apple-ios13.4-macabi libcopyfile.dylib [ 9] x86_64-apple-ios13.4-macabi libcorecrypto.dylib [ 10] x86_64-apple-ios13.4-macabi libdispatch.dylib [ 11] x86_64-apple-ios13.4-macabi libdyld.dylib [ 12] x86_64-apple-ios13.4-macabi libkeymgr.dylib [ 13] x86_64-apple-ios13.4-macabi liblaunch.dylib [ 14] x86_64-apple-ios13.0-macabi libmacho.dylib [ 15] x86_64-apple-ios13.4-macabi libquarantine.dylib [ 16] x86_64-apple-ios13.4-macabi libremovefile.dylib [ 17] x86_64-apple-ios13.4-macabi libsystem_asl.dylib [ 18] x86_64-apple-ios13.4-macabi libsystem_blocks.dylib [ 19] x86_64-apple-ios13.4-macabi libsystem_c.dylib [ 20] x86_64-apple-ios13.4-macabi libsystem_configuration.dylib [ 21] x86_64-apple-ios13.4-macabi libsystem_coreservices.dylib [ 22] x86_64-apple-ios13.4-macabi libsystem_darwin.dylib [ 23] x86_64-apple-ios13.4-macabi libsystem_dnssd.dylib [ 24] x86_64-apple-ios13.4-macabi libsystem_featureflags.dylib [ 25] x86_64-apple-ios13.4-macabi libsystem_info.dylib [ 26] x86_64-apple-ios13.4-macabi libsystem_m.dylib [ 27] x86_64-apple-ios13.4-macabi libsystem_malloc.dylib [ 28] x86_64-apple-ios13.4-macabi libsystem_networkextension.dylib [ 29] x86_64-apple-ios13.4-macabi libsystem_notify.dylib [ 30] x86_64-apple-ios13.4-macabi libsystem_sandbox.dylib [ 31] x86_64-apple-ios13.4-macabi libsystem_secinit.dylib [ 32] x86_64-apple-ios13.5-macabi libsystem_kernel.dylib [ 33] x86_64-apple-ios13.4-macabi libsystem_platform.dylib [ 34] x86_64-apple-ios13.4-macabi libsystem_pthread.dylib [ 35] x86_64-apple-ios13.4-macabi libsystem_symptoms.dylib [ 36] x86_64-apple-ios13.4-macabi libsystem_trace.dylib [ 37] x86_64-apple-ios13.4-macabi libunwind.dylib [ 38] x86_64-apple-ios13.4-macabi libxpc.dylib [ 39] x86_64-apple-ios13.4-macabi libobjc.A.dylib [ 40] x86_64-apple-macosx10.9.0 libclang_rt.asan_osx_dynamic.dylib

Hide Details

Hide Details

Expecting pattern: x86_64.*-apple-ios.*-macabi a\.out Matched

Hide Details

runCmd: fr v s output: (const char *) s = 0x0000000100000f9a "Hello macCatalyst!"

Hide Details

Hide Details

runCmd: p s output: (const char *) $0 = 0x0000000100000f9a "Hello macCatalyst!"

Hide Details

Hide Details

FAIL: LLDB (/Users/buildslave/jenkins/workspace/lldb-cmake-sanitized/lldb-build/bin/clang-x86_64) :: test_macabi_dsym (TestMacCatalyst.TestMacCatalyst) <bound method SBProcess.Kill of <lldb.SBProcess; proxy of <Swig Object of type 'lldb::SBProcess *' at 0x107245540> >>: success

Hide Details

runCmd: settings clear -all output:

Hide Details

runCmd: settings set symbols.enable-external-lookup false output:

Hide Details

runCmd: settings set target.inherit-tcc true output:

Hide Details

runCmd: settings set target.auto-apply-fixits false output:

Hide Details

runCmd: settings set plugin.process.gdb-remote.packet-timeout 60 output:

Hide Details

runCmd: settings set symbols.clang-modules-cache-path "/Users/buildslave/jenkins/workspace/lldb-cmake-sanitized/lldb-build/lldb-test-build.noindex/module-cache-lldb/lldb-api" output:

Hide Details

runCmd: settings set use-color false output:

Hide Details

runCmd: setting set target.prefer-dynamic-value no-dynamic-values output:

Hide Details

runCmd: settings set target.env-vars ASAN_OPTIONS=detect_stack_use_after_return=1 DYLD_INSERT_LIBRARIES=/Users/buildslave/jenkins/workspace/lldb-cmake-sanitized/host-compiler/lib/clang/12.0.0/lib/darwin/libclang_rt.asan_osx_dynamic.dylib output:

Hide Details

runCmd: log enable gdb-remote packets -f /Users/buildslave/jenkins/workspace/lldb-cmake-sanitized/lldb-build/lldb-test-build.noindex/macosx/macCatalyst/TestMacCatalyst.test_macabi_dwarf/packets.log output:

Hide Details

runCmd: settings set target.env-vars ASAN_OPTIONS=detect_stack_use_after_return=1 DYLD_INSERT_LIBRARIES=/Users/buildslave/jenkins/workspace/lldb-cmake-sanitized/host-compiler/lib/clang/12.0.0/lib/darwin/libclang_rt.asan_osx_dynamic.dylib output:

Hide Details

runCmd: image list -t -b output: [ 0] x86_64-apple-ios13.0.0-macabi a.out [ 1] x86_64-apple-macosx10.15.0 dyld [ 2] x86_64-apple-ios13.0-macabi libc++.1.dylib [ 3] x86_64-apple-ios13.5-macabi libSystem.B.dylib [ 4] x86_64-apple-ios13.0-macabi libc++abi.dylib [ 5] x86_64-apple-ios13.4-macabi libcache.dylib [ 6] x86_64-apple-ios13.4-macabi libcommonCrypto.dylib [ 7] x86_64-apple-macosx10.15.0 libcompiler_rt.dylib [ 8] x86_64-apple-ios13.4-macabi libcopyfile.dylib [ 9] x86_64-apple-ios13.4-macabi libcorecrypto.dylib [ 10] x86_64-apple-ios13.4-macabi libdispatch.dylib [ 11] x86_64-apple-ios13.4-macabi libdyld.dylib [ 12] x86_64-apple-ios13.4-macabi libkeymgr.dylib [ 13] x86_64-apple-ios13.4-macabi liblaunch.dylib [ 14] x86_64-apple-ios13.0-macabi libmacho.dylib [ 15] x86_64-apple-ios13.4-macabi libquarantine.dylib [ 16] x86_64-apple-ios13.4-macabi libremovefile.dylib [ 17] x86_64-apple-ios13.4-macabi libsystem_asl.dylib [ 18] x86_64-apple-ios13.4-macabi libsystem_blocks.dylib [ 19] x86_64-apple-ios13.4-macabi libsystem_c.dylib [ 20] x86_64-apple-ios13.4-macabi libsystem_configuration.dylib [ 21] x86_64-apple-ios13.4-macabi libsystem_coreservices.dylib [ 22] x86_64-apple-ios13.4-macabi libsystem_darwin.dylib [ 23] x86_64-apple-ios13.4-macabi libsystem_dnssd.dylib [ 24] x86_64-apple-ios13.4-macabi libsystem_featureflags.dylib [ 25] x86_64-apple-ios13.4-macabi libsystem_info.dylib [ 26] x86_64-apple-ios13.4-macabi libsystem_m.dylib [ 27] x86_64-apple-ios13.4-macabi libsystem_malloc.dylib [ 28] x86_64-apple-ios13.4-macabi libsystem_networkextension.dylib [ 29] x86_64-apple-ios13.4-macabi libsystem_notify.dylib [ 30] x86_64-apple-ios13.4-macabi libsystem_sandbox.dylib [ 31] x86_64-apple-ios13.4-macabi libsystem_secinit.dylib [ 32] x86_64-apple-ios13.5-macabi libsystem_kernel.dylib [ 33] x86_64-apple-ios13.4-macabi libsystem_platform.dylib [ 34] x86_64-apple-ios13.4-macabi libsystem_pthread.dylib [ 35] x86_64-apple-ios13.4-macabi libsystem_symptoms.dylib [ 36] x86_64-apple-ios13.4-macabi libsystem_trace.dylib [ 37] x86_64-apple-ios13.4-macabi libunwind.dylib [ 38] x86_64-apple-ios13.4-macabi libxpc.dylib [ 39] x86_64-apple-ios13.4-macabi libobjc.A.dylib [ 40] x86_64-apple-macosx10.9.0 libclang_rt.asan_osx_dynamic.dylib

Hide Details

Hide Details

Expecting pattern: x86_64.*-apple-ios.*-macabi a\.out Matched

Hide Details

runCmd: fr v s output: (const char *) s = 0x0000000100000f9a "Hello macCatalyst!"

Hide Details

Hide Details

runCmd: p s output: (const char *) $0 = 0x0000000100000f9a "Hello macCatalyst!"

Hide Details

Hide Details

FAIL: LLDB (/Users/buildslave/jenkins/workspace/lldb-cmake-sanitized/lldb-build/bin/clang-x86_64) :: test_macabi_dwarf (TestMacCatalyst.TestMacCatalyst) <bound method SBProcess.Kill of <lldb.SBProcess; proxy of <Swig Object of type 'lldb::SBProcess *' at 0x1065b48d0> >>: success

Hide Details

UNSUPPORTED: LLDB (/Users/buildslave/jenkins/workspace/lldb-cmake-sanitized/lldb-build/bin/clang-x86_64) :: test_macabi_dwo (TestMacCatalyst.TestMacCatalyst) (test case does not fall in any category of interest for this run) runCmd: settings clear -all output:

Hide Details

runCmd: settings set symbols.enable-external-lookup false output:

Hide Details

runCmd: settings set target.inherit-tcc true output:

Hide Details

runCmd: settings set target.auto-apply-fixits false output:

Hide Details

runCmd: settings set plugin.process.gdb-remote.packet-timeout 60 output:

Hide Details

runCmd: settings set symbols.clang-modules-cache-path "/Users/buildslave/jenkins/workspace/lldb-cmake-sanitized/lldb-build/lldb-test-build.noindex/module-cache-lldb/lldb-api" output:

Hide Details

runCmd: settings set use-color false output:

Hide Details

runCmd: setting set target.prefer-dynamic-value no-dynamic-values output:

Hide Details

runCmd: settings set target.env-vars ASAN_OPTIONS=detect_stack_use_after_return=1 DYLD_INSERT_LIBRARIES=/Users/buildslave/jenkins/workspace/lldb-cmake-sanitized/host-compiler/lib/clang/12.0.0/lib/darwin/libclang_rt.asan_osx_dynamic.dylib output:

Hide Details

runCmd: log enable gdb-remote packets -f /Users/buildslave/jenkins/workspace/lldb-cmake-sanitized/lldb-build/lldb-test-build.noindex/macosx/macCatalyst/TestMacCatalyst.test_macabi_gmodules/packets.log output:

Hide Details

runCmd: settings set target.env-vars ASAN_OPTIONS=detect_stack_use_after_return=1 DYLD_INSERT_LIBRARIES=/Users/buildslave/jenkins/workspace/lldb-cmake-sanitized/host-compiler/lib/clang/12.0.0/lib/darwin/libclang_rt.asan_osx_dynamic.dylib output:

Hide Details

runCmd: image list -t -b output: [ 0] x86_64-apple-ios13.0.0-macabi a.out [ 1] x86_64-apple-macosx10.15.0 dyld [ 2] x86_64-apple-ios13.0-macabi libc++.1.dylib [ 3] x86_64-apple-ios13.5-macabi libSystem.B.dylib [ 4] x86_64-apple-ios13.0-macabi libc++abi.dylib [ 5] x86_64-apple-ios13.4-macabi libcache.dylib [ 6] x86_64-apple-ios13.4-macabi libcommonCrypto.dylib [ 7] x86_64-apple-macosx10.15.0 libcompiler_rt.dylib [ 8] x86_64-apple-ios13.4-macabi libcopyfile.dylib [ 9] x86_64-apple-ios13.4-macabi libcorecrypto.dylib [ 10] x86_64-apple-ios13.4-macabi libdispatch.dylib [ 11] x86_64-apple-ios13.4-macabi libdyld.dylib [ 12] x86_64-apple-ios13.4-macabi libkeymgr.dylib [ 13] x86_64-apple-ios13.4-macabi liblaunch.dylib [ 14] x86_64-apple-ios13.0-macabi libmacho.dylib [ 15] x86_64-apple-ios13.4-macabi libquarantine.dylib [ 16] x86_64-apple-ios13.4-macabi libremovefile.dylib [ 17] x86_64-apple-ios13.4-macabi libsystem_asl.dylib [ 18] x86_64-apple-ios13.4-macabi libsystem_blocks.dylib [ 19] x86_64-apple-ios13.4-macabi libsystem_c.dylib [ 20] x86_64-apple-ios13.4-macabi libsystem_configuration.dylib [ 21] x86_64-apple-ios13.4-macabi libsystem_coreservices.dylib [ 22] x86_64-apple-ios13.4-macabi libsystem_darwin.dylib [ 23] x86_64-apple-ios13.4-macabi libsystem_dnssd.dylib [ 24] x86_64-apple-ios13.4-macabi libsystem_featureflags.dylib [ 25] x86_64-apple-ios13.4-macabi libsystem_info.dylib [ 26] x86_64-apple-ios13.4-macabi libsystem_m.dylib [ 27] x86_64-apple-ios13.4-macabi libsystem_malloc.dylib [ 28] x86_64-apple-ios13.4-macabi libsystem_networkextension.dylib [ 29] x86_64-apple-ios13.4-macabi libsystem_notify.dylib [ 30] x86_64-apple-ios13.4-macabi libsystem_sandbox.dylib [ 31] x86_64-apple-ios13.4-macabi libsystem_secinit.dylib [ 32] x86_64-apple-ios13.5-macabi libsystem_kernel.dylib [ 33] x86_64-apple-ios13.4-macabi libsystem_platform.dylib [ 34] x86_64-apple-ios13.4-macabi libsystem_pthread.dylib [ 35] x86_64-apple-ios13.4-macabi libsystem_symptoms.dylib [ 36] x86_64-apple-ios13.4-macabi libsystem_trace.dylib [ 37] x86_64-apple-ios13.4-macabi libunwind.dylib [ 38] x86_64-apple-ios13.4-macabi libxpc.dylib [ 39] x86_64-apple-ios13.4-macabi libobjc.A.dylib [ 40] x86_64-apple-macosx10.9.0 libclang_rt.asan_osx_dynamic.dylib

Hide Details

Hide Details

Expecting pattern: x86_64.*-apple-ios.*-macabi a\.out Matched

Hide Details

runCmd: fr v s output: (const char *) s = 0x0000000100000f9a "Hello macCatalyst!"

Hide Details

Hide Details

runCmd: p s output: (const char *) $0 = 0x0000000100000f9a "Hello macCatalyst!"

Hide Details

Hide Details

FAIL: LLDB (/Users/buildslave/jenkins/workspace/lldb-cmake-sanitized/lldb-build/bin/clang-x86_64) :: test_macabi_gmodules (TestMacCatalyst.TestMacCatalyst) <bound method SBProcess.Kill of <lldb.SBProcess; proxy of <Swig Object of type 'lldb::SBProcess *' at 0x107245ae0> >>: success

Hide Details

Restore dir to: /Users/buildslave/jenkins/workspace/lldb-cmake-sanitized/lldb-build/tools/lldb/test ====================================================================== FAIL: test_macabi_dsym (TestMacCatalyst.TestMacCatalyst) Test the x86_64-apple-ios-macabi target linked against a macos dylib ---------------------------------------------------------------------- Traceback (most recent call last): File "/Users/buildslave/jenkins/workspace/lldb-cmake-sanitized/llvm-project/lldb/packages/Python/lldbsuite/test/lldbtest.py", line 1741, in test_method return attrvalue(self) File "/Users/buildslave/jenkins/workspace/lldb-cmake-sanitized/llvm-project/lldb/packages/Python/lldbsuite/test/decorators.py", line 135, in wrapper return func(*args, **kwargs) File "/Users/buildslave/jenkins/workspace/lldb-cmake-sanitized/llvm-project/lldb/packages/Python/lldbsuite/test/decorators.py", line 135, in wrapper return func(*args, **kwargs) File "/Users/buildslave/jenkins/workspace/lldb-cmake-sanitized/llvm-project/lldb/test/API/macosx/macCatalyst/TestMacCatalyst.py", line 29, in test_macabi self.check_debugserver(log) File "/Users/buildslave/jenkins/workspace/lldb-cmake-sanitized/llvm-project/lldb/test/API/macosx/macCatalyst/TestMacCatalyst.py", line 42, in check_debugserver self.assertTrue(aout_info) AssertionError: None is not True Config=x86_64-/Users/buildslave/jenkins/workspace/lldb-cmake-sanitized/lldb-build/bin/clang ====================================================================== FAIL: test_macabi_dwarf (TestMacCatalyst.TestMacCatalyst) Test the x86_64-apple-ios-macabi target linked against a macos dylib ---------------------------------------------------------------------- Traceback (most recent call last): File "/Users/buildslave/jenkins/workspace/lldb-cmake-sanitized/llvm-project/lldb/packages/Python/lldbsuite/test/lldbtest.py", line 1741, in test_method return attrvalue(self) File "/Users/buildslave/jenkins/workspace/lldb-cmake-sanitized/llvm-project/lldb/packages/Python/lldbsuite/test/decorators.py", line 135, in wrapper return func(*args, **kwargs) File "/Users/buildslave/jenkins/workspace/lldb-cmake-sanitized/llvm-project/lldb/packages/Python/lldbsuite/test/decorators.py", line 135, in wrapper return func(*args, **kwargs) File "/Users/buildslave/jenkins/workspace/lldb-cmake-sanitized/llvm-project/lldb/test/API/macosx/macCatalyst/TestMacCatalyst.py", line 29, in test_macabi self.check_debugserver(log) File "/Users/buildslave/jenkins/workspace/lldb-cmake-sanitized/llvm-project/lldb/test/API/macosx/macCatalyst/TestMacCatalyst.py", line 42, in check_debugserver self.assertTrue(aout_info) AssertionError: None is not True Config=x86_64-/Users/buildslave/jenkins/workspace/lldb-cmake-sanitized/lldb-build/bin/clang ====================================================================== FAIL: test_macabi_gmodules (TestMacCatalyst.TestMacCatalyst) Test the x86_64-apple-ios-macabi target linked against a macos dylib ---------------------------------------------------------------------- Traceback (most recent call last): File "/Users/buildslave/jenkins/workspace/lldb-cmake-sanitized/llvm-project/lldb/packages/Python/lldbsuite/test/lldbtest.py", line 1741, in test_method return attrvalue(self) File "/Users/buildslave/jenkins/workspace/lldb-cmake-sanitized/llvm-project/lldb/packages/Python/lldbsuite/test/decorators.py", line 135, in wrapper return func(*args, **kwargs) File "/Users/buildslave/jenkins/workspace/lldb-cmake-sanitized/llvm-project/lldb/packages/Python/lldbsuite/test/decorators.py", line 135, in wrapper return func(*args, **kwargs) File "/Users/buildslave/jenkins/workspace/lldb-cmake-sanitized/llvm-project/lldb/test/API/macosx/macCatalyst/TestMacCatalyst.py", line 29, in test_macabi self.check_debugserver(log) File "/Users/buildslave/jenkins/workspace/lldb-cmake-sanitized/llvm-project/lldb/test/API/macosx/macCatalyst/TestMacCatalyst.py", line 42, in check_debugserver self.assertTrue(aout_info) AssertionError: None is not True Config=x86_64-/Users/buildslave/jenkins/workspace/lldb-cmake-sanitized/lldb-build/bin/clang ---------------------------------------------------------------------- Ran 4 tests in 12.017s

Hide Details

RESULT: FAILED (0 passes, 3 failures, 0 errors, 1 skipped, 0 expected failures, 0 unexpected successes)

Hide Details

--

Hide Details

******************** PASS: lldb-api :: functionalities/unwind/zeroth_frame/TestZerothFrame.py (1875 of 2108) PASS: lldb-shell :: SymbolFile/DWARF/debug_loc.s (1876 of 2108) PASS: lldb-shell :: Breakpoint/split-dwarf5-debug-stroffsets.test (1877 of 2108) PASS: lldb-unit :: Utility/./UtilityTests/UriParserTest.MinimalPortPath (1878 of 2108) PASS: lldb-api :: functionalities/thread/concurrent_events/TestConcurrentCrashWithWatchpoint.py (1879 of 2108) PASS: lldb-unit :: Symbol/./SymbolTests/TestTypeSystemClang.TestNotDeletingUserCopyCstrDueToMoveCStr (1880 of 2108) UNSUPPORTED: lldb-api :: arm/breakpoint-it/TestBreakpointIt.py (1881 of 2108) UNSUPPORTED: lldb-shell :: Breakpoint/case-insensitive.test (1882 of 2108) UNSUPPORTED: lldb-api :: functionalities/exec/TestExec.py (1883 of 2108) PASS: lldb-api :: python_api/sbvalue_const_addrof/TestSBValueConstAddrOf.py (1884 of 2108) PASS: lldb-api :: lang/objc/objc-optimized/TestObjcOptimized.py (1885 of 2108) PASS: lldb-unit :: Expression/./ExpressionTests/CppModuleConfigurationTest.Linux (1886 of 2108) PASS: lldb-unit :: Symbol/./SymbolTests/TestTypeSystemClang.TestBuiltinTypeForEncodingAndBitSize (1887 of 2108) PASS: lldb-api :: types/TestDoubleTypesExpr.py (1888 of 2108) PASS: lldb-shell :: Reproducer/Functionalities/TestExpressionEvaluation.test (1889 of 2108) PASS: lldb-api :: commands/process/attach/TestProcessAttach.py (1890 of 2108) PASS: lldb-unit :: Symbol/./SymbolTests/TestClangASTImporter.CanImportInvalidType (1891 of 2108) PASS: lldb-unit :: Utility/./UtilityTests/FileSpecTest.GuessPathStyle (1892 of 2108) UNSUPPORTED: lldb-shell :: Register/x86-gp-write.test (1893 of 2108) PASS: lldb-api :: commands/expression/import-std-module/unique_ptr/TestUniquePtrFromStdModule.py (1894 of 2108) PASS: lldb-unit :: Signals/./SignalsTests/UnixSignalsTest.Iteration (1895 of 2108) PASS: lldb-unit :: SymbolFile/NativePDB/./SymbolFileNativePDBTests/PDBFPOProgramToDWARFExpressionTests.MultipleDependentAssignments (1896 of 2108) PASS: lldb-api :: commands/expression/call-function/TestCallUserDefinedFunction.py (1897 of 2108) PASS: lldb-api :: lang/objc/hidden-ivars/TestHiddenIvars.py (1898 of 2108) UNSUPPORTED: lldb-api :: commands/gui/viewlarge/TestGuiViewLarge.py (1899 of 2108) PASS: lldb-api :: functionalities/data-formatter/data-formatter-stl/libcxx/initializerlist/TestInitializerList.py (1900 of 2108) PASS: lldb-api :: functionalities/breakpoint/cpp_exception/TestCPPExceptionBreakpoint.py (1901 of 2108) PASS: lldb-shell :: Breakpoint/implicit_const_form_support.test (1902 of 2108) PASS: lldb-shell :: Quit/TestQuitExitCodeHex0.test (1903 of 2108) PASS: lldb-api :: functionalities/data-formatter/data-formatter-stl/libcxx/variant/TestDataFormatterLibcxxVariant.py (1904 of 2108) PASS: lldb-api :: functionalities/dynamic_value_child_count/TestDynamicValueChildCount.py (1905 of 2108) PASS: lldb-unit :: Utility/./UtilityTests/ArgsTest.TestSingleArgWithQuotedSpace (1906 of 2108) PASS: lldb-unit :: tools/lldb-server/tests/./LLDBServerTests/TestBase.LaunchModePreservesEnvironment (1907 of 2108) PASS: lldb-unit :: UnwindAssembly/x86/./UnwindAssemblyx86Tests/Testx86AssemblyInspectionEngine.TestPushRBX (1908 of 2108) UNSUPPORTED: lldb-api :: commands/register/register/intel_xtended_registers/mpx_offset_intersection/TestMPXOffsetIntersection.py (1909 of 2108) PASS: lldb-unit :: Target/./TargetTests/ModuleCacheTest.GetAndPutUuidExists (1910 of 2108) PASS: lldb-api :: commands/expression/ignore-artificial-constructors/TestIgnoreArtificialConstructors.py (1911 of 2108) PASS: lldb-api :: python_api/get-value-32bit-int/TestGetValue32BitInt.py (1912 of 2108) PASS: lldb-api :: lang/objc/variadic_methods/TestVariadicMethods.py (1913 of 2108) PASS: lldb-unit :: Utility/./UtilityTests/StringListTest.CopyListSingle (1914 of 2108) PASS: lldb-unit :: UnwindAssembly/x86/./UnwindAssemblyx86Tests/Testx86AssemblyInspectionEngine.TestAddRSP (1915 of 2108) PASS: lldb-unit :: Utility/./UtilityTests/StringExtractorTest.GetNameColonValueNoColon (1916 of 2108) PASS: lldb-shell :: ObjectFile/PECOFF/sections.yaml (1917 of 2108) PASS: lldb-api :: python_api/type/TestTypeList.py (1918 of 2108) PASS: lldb-unit :: UnwindAssembly/x86/./UnwindAssemblyx86Tests/Testx86AssemblyInspectionEngine.TestLEAVE (1919 of 2108) PASS: lldb-unit :: Utility/./UtilityTests/ArchSpecTest.OperatorBool (1920 of 2108) PASS: lldb-api :: tools/lldb-server/TestGdbRemoteHostInfo.py (1921 of 2108) PASS: lldb-api :: functionalities/gdb_remote_client/TestNoWatchpointSupportInfo.py (1922 of 2108) PASS: lldb-unit :: Utility/./UtilityTests/BroadcasterTest.BroadcastEvent (1923 of 2108) PASS: lldb-unit :: Signals/./SignalsTests/UnixSignalsTest.GetFilteredSignals (1924 of 2108) PASS: lldb-shell :: SymbolFile/DWARF/find-method.cpp (1925 of 2108) PASS: lldb-unit :: Utility/./UtilityTests/RangeTest.ContainsRangeStartingFromZero (1926 of 2108) PASS: lldb-api :: tools/lldb-server/TestLldbGdbServer.py (1927 of 2108) PASS: lldb-api :: commands/frame/diagnose/inheritance/TestDiagnoseInheritance.py (1928 of 2108) PASS: lldb-unit :: Host/./HostTests/MainLoopTest.Signal (1929 of 2108) PASS: lldb-unit :: Utility/./UtilityTests/AnsiTerminal.KnownPrefix (1930 of 2108) PASS: lldb-unit :: Utility/./UtilityTests/ArgsTest.TestOverwriteArgs (1931 of 2108) PASS: lldb-unit :: Host/./HostTests/File.GetWaitableHandleFileno (1932 of 2108) PASS: lldb-unit :: Utility/./UtilityTests/RangeTest.DoesIntersect (1933 of 2108) UNSUPPORTED: lldb-shell :: Register/arm-fp-read.test (1934 of 2108) PASS: lldb-unit :: Utility/./UtilityTests/RangeTest.Slide (1935 of 2108) PASS: lldb-shell :: SymbolFile/Breakpad/line-table-mixed-path-styles.test (1936 of 2108) PASS: lldb-api :: functionalities/breakpoint/auto_continue/TestBreakpointAutoContinue.py (1937 of 2108) PASS: lldb-unit :: Host/./HostTests/File.GetStreamFromDescriptor (1938 of 2108) PASS: lldb-api :: lang/cpp/rvalue-references/TestRvalueReferences.py (1939 of 2108) PASS: lldb-unit :: ObjectFile/PECOFF/./ObjectFilePECOFFTests/PECallFrameInfoTest.Chained_eh (1940 of 2108) PASS: lldb-unit :: Utility/./UtilityTests/BinaryStreamTest.PutSLEB128OneByte (1941 of 2108) PASS: lldb-api :: python_api/lldbutil/iter/TestRegistersIterator.py (1942 of 2108) PASS: lldb-unit :: Utility/./UtilityTests/CompletionRequest.FakeLastArg (1943 of 2108) PASS: lldb-unit :: Utility/./UtilityTests/ArchSpecTest.TripleComponentsWereSpecified (1944 of 2108) PASS: lldb-unit :: Symbol/./SymbolTests/TestTypeSystemClang.TestUnifyAccessSpecifiers (1945 of 2108) PASS: lldb-shell :: Reproducer/TestWorkingDir.test (1946 of 2108) PASS: lldb-api :: functionalities/avoids-fd-leak/TestFdLeak.py (1947 of 2108) PASS: lldb-api :: functionalities/data-formatter/data-formatter-stl/libcxx/function/TestLibCxxFunction.py (1948 of 2108) PASS: lldb-api :: lang/c/stepping/TestThreadStepping.py (1949 of 2108) PASS: lldb-api :: functionalities/thread/concurrent_events/TestConcurrentSignalWatch.py (1950 of 2108) PASS: lldb-shell :: Commands/command-regex-unalias.test (1951 of 2108) PASS: lldb-unit :: Utility/./UtilityTests/RangeTest.ContainsAddrInvalid (1952 of 2108) PASS: lldb-unit :: ScriptInterpreter/Python/./ScriptInterpreterPythonTests/PythonDataObjectsTest.TestPythonCallableCheck (1953 of 2108) PASS: lldb-api :: lang/cpp/dynamic-value/TestCppValueCast.py (1954 of 2108) PASS: lldb-unit :: Process/./ProcessEventDataTests/ProcessEventDataTest.ShouldStop (1955 of 2108) PASS: lldb-shell :: SymbolFile/DWARF/inline-function-address.ll (1956 of 2108) PASS: lldb-api :: lang/cpp/diamond/TestDiamond.py (1957 of 2108) PASS: lldb-shell :: Driver/TestProcessAttach.test (1958 of 2108) PASS: lldb-api :: lang/objc/ivar-IMP/TestObjCiVarIMP.py (1959 of 2108) PASS: lldb-unit :: Utility/./UtilityTests/FileSpecTest.EqualDotsPosixRoot (1960 of 2108) PASS: lldb-unit :: Utility/./UtilityTests/TimeoutTest.Construction (1961 of 2108) PASS: lldb-api :: functionalities/unwind/sigtramp/TestSigtrampUnwind.py (1962 of 2108) PASS: lldb-api :: functionalities/gdb_remote_client/TestPlatformClient.py (1963 of 2108) PASS: lldb-unit :: Utility/./UtilityTests/ConstStringTest.UpdateMangledCounterpart (1964 of 2108) PASS: lldb-api :: commands/expression/context-object-objc/TestContextObjectObjc.py (1965 of 2108) PASS: lldb-api :: commands/expression/import-std-module/unique_ptr-dbg-info-content/TestUniquePtrDbgInfoContent.py (1966 of 2108) PASS: lldb-unit :: SymbolFile/NativePDB/./SymbolFileNativePDBTests/PDBFPOProgramToDWARFExpressionTests.UnsupportedRASearch (1967 of 2108) UNSUPPORTED: lldb-api :: functionalities/darwin_log/filter/exact_match/category/TestDarwinLogFilterMatchCategory.py (1968 of 2108) UNSUPPORTED: lldb-api :: commands/watchpoints/multi_watchpoint_slots/TestWatchpointMultipleSlots.py (1969 of 2108) PASS: lldb-api :: functionalities/data-formatter/data-formatter-stl/libcxx/atomic/TestLibCxxAtomic.py (1970 of 2108) PASS: lldb-unit :: ObjectFile/Breakpad/./ObjectFileBreakpadTests/PublicRecord.parse (1971 of 2108) PASS: lldb-api :: functionalities/data-formatter/refpointer-recursion/TestDataFormatterRefPtrRecursion.py (1972 of 2108) PASS: lldb-unit :: UnwindAssembly/x86/./UnwindAssemblyx86Tests/Testx86AssemblyInspectionEngine.TestPushR13 (1973 of 2108) PASS: lldb-unit :: Utility/./UtilityTests/StringExtractorTest.InitEmpty (1974 of 2108) PASS: lldb-unit :: Symbol/./SymbolTests/TestTypeSystemClang.TestFunctionTemplateConstruction (1975 of 2108) PASS: lldb-api :: commands/expression/import-std-module/empty-module/TestEmptyStdModule.py (1976 of 2108) PASS: lldb-api :: commands/expression/rdar44436068/Test128BitsInteger.py (1977 of 2108) PASS: lldb-unit :: Utility/./UtilityTests/ArgsTest.ReplaceArgumentAtIndexShort (1978 of 2108) PASS: lldb-api :: commands/expression/cast_int_to_anonymous_enum/TestCastIntToAnonymousEnum.py (1979 of 2108) PASS: lldb-unit :: Utility/./UtilityTests/StreamTest.PutHex64ByteOrderBig (1980 of 2108) PASS: lldb-api :: lang/cpp/typeof/TestTypeOfDeclTypeExpr.py (1981 of 2108) PASS: lldb-api :: functionalities/postmortem/elf-core/TestLinuxCore.py (1982 of 2108) PASS: lldb-api :: functionalities/thread/concurrent_events/TestConcurrentSignalDelayWatch.py (1983 of 2108) PASS: lldb-unit :: Utility/./UtilityTests/CompletionRequest.ShiftArguments (1984 of 2108) PASS: lldb-unit :: Process/gdb-remote/./ProcessGdbRemoteTests/GDBRemoteCommunicationClientTest.SendGetMetaDataPacket (1985 of 2108) PASS: lldb-unit :: Utility/./UtilityTests/FileSpecTest.CopyByAppendingPathComponent (1986 of 2108) UNSUPPORTED: lldb-api :: functionalities/thread/concurrent_events/TestConcurrentManySignals.py (1987 of 2108) PASS: lldb-shell :: SymbolFile/DWARF/dwarf5-debug_line.s (1988 of 2108) PASS: lldb-api :: functionalities/data-formatter/user-format-vs-summary/TestUserFormatVsSummary.py (1989 of 2108) PASS: lldb-shell :: ObjectFile/ELF/section-permissions.yaml (1990 of 2108) PASS: lldb-unit :: Symbol/./SymbolTests/PostfixExpression.ParseFPOProgram (1991 of 2108) PASS: lldb-unit :: ScriptInterpreter/Python/./ScriptInterpreterPythonTests/PythonDataObjectsTest.TestGlobalNameResolutionNoDot (1992 of 2108) PASS: lldb-shell :: ObjectFile/ELF/minidebuginfo-corrupt-xz.yaml (1993 of 2108) PASS: lldb-shell :: SymbolFile/DWARF/deterministic-build.cpp (1994 of 2108) PASS: lldb-unit :: Utility/./UtilityTests/DataExtractorTest.GetDoubleUnaligned (1995 of 2108) PASS: lldb-api :: functionalities/thread/concurrent_events/TestConcurrentTwoWatchpointsOneSignal.py (1996 of 2108) UNSUPPORTED: lldb-shell :: Register/x86-gp-read.test (1997 of 2108) PASS: lldb-unit :: Utility/./UtilityTests/NameMatchesTest.RegularExpression (1998 of 2108) PASS: lldb-unit :: Utility/./UtilityTests/VASprintfTest.NoBufferResize (1999 of 2108) PASS: lldb-unit :: Utility/./UtilityTests/StreamTest.AddressEmptyPrefix (2000 of 2108) PASS: lldb-unit :: Utility/./UtilityTests/StringListTest.Clear (2001 of 2108) PASS: lldb-api :: lang/objc/foundation/TestConstStrings.py (2002 of 2108) PASS: lldb-api :: lang/objc/exceptions/TestObjCExceptions.py (2003 of 2108) PASS: lldb-unit :: Utility/./UtilityTests/UUIDTest.SetFromStringRef (2004 of 2108) PASS: lldb-unit :: Host/./HostTests/FileActionTest.Open (2005 of 2108) PASS: lldb-unit :: Utility/./UtilityTests/StringLexerTest.GetUnlexed (2006 of 2108) PASS: lldb-api :: functionalities/breakpoint/breakpoint_by_line_and_column/TestBreakpointByLineAndColumn.py (2007 of 2108) PASS: lldb-unit :: Utility/./UtilityTests/ScalarTest.GetValue (2008 of 2108) UNSUPPORTED: lldb-shell :: SymbolFile/PDB/pointers.test (2009 of 2108) PASS: lldb-api :: lang/c/tls_globals/TestTlsGlobals.py (2010 of 2108) PASS: lldb-unit :: Utility/./UtilityTests/StringListTest.JoinEmpty (2011 of 2108) PASS: lldb-unit :: Utility/./UtilityTests/RangeTest.ContainsEndInclusive (2012 of 2108) PASS: lldb-shell :: Driver/TestConvenienceVariables.test (2013 of 2108) PASS: lldb-shell :: SymbolFile/DWARF/find-basic-variable.cpp (2014 of 2108) PASS: lldb-unit :: Utility/./UtilityTests/DeserializerTest.HasData (2015 of 2108) PASS: lldb-api :: functionalities/stats_api/TestStatisticsAPI.py (2016 of 2108) UNSUPPORTED: lldb-shell :: Register/x86-64-zmm-read.test (2017 of 2108) PASS: lldb-unit :: Utility/./UtilityTests/RangeTest.SizeTypes (2018 of 2108) PASS: lldb-api :: commands/expression/class_template_specialization_empty_pack/TestClassTemplateSpecializationParametersHandling.py (2019 of 2108) PASS: lldb-unit :: SymbolFile/DWARF/./SymbolFileDWARFTests/XcodeSDKModuleTests.TestModuleGetXcodeSDK (2020 of 2108) PASS: lldb-unit :: Expression/./ExpressionTests/DiagnosticManagerTest.GetStringMultipleDiags (2021 of 2108) PASS: lldb-api :: functionalities/signal/TestSendSignal.py (2022 of 2108) PASS: lldb-api :: functionalities/gdb_remote_client/TestqOffsets.py (2023 of 2108) PASS: lldb-unit :: Utility/./UtilityTests/StringExtractorTest.GetHexBytesAvail_OddPair2 (2024 of 2108) PASS: lldb-shell :: ObjectFile/PECOFF/basic-info.yaml (2025 of 2108) PASS: lldb-shell :: Minidump/fb-dump.test (2026 of 2108) PASS: lldb-api :: commands/process/attach/attach_denied/TestAttachDenied.py (2027 of 2108) PASS: lldb-unit :: Symbol/./SymbolTests/SymbolsTest.TerminateLocateExecutableSymbolFileForUnknownExecutableAndUnknownSymbolFile (2028 of 2108) PASS: lldb-shell :: Breakpoint/single-file-split-dwarf.test (2029 of 2108) PASS: lldb-api :: functionalities/tail_call_frames/ambiguous_tail_call_seq2/TestAmbiguousTailCallSeq2.py (2030 of 2108) PASS: lldb-api :: lang/objc/modules-inline-functions/TestModulesInlineFunctions.py (2031 of 2108) PASS: lldb-unit :: Utility/./UtilityTests/SerializationRountripTest.SerializeDeserializeCString (2032 of 2108) PASS: lldb-api :: commands/watchpoints/watchpoint_on_vectors/TestValueOfVectorVariable.py (2033 of 2108) PASS: lldb-api :: commands/expression/import-std-module/conflicts/TestStdModuleWithConflicts.py (2034 of 2108) PASS: lldb-unit :: Host/./HostTests/SocketAddressTest.GetAddressInfo (2035 of 2108) PASS: lldb-shell :: Reproducer/Functionalities/TestDataFormatter.test (2036 of 2108) PASS: lldb-unit :: Target/./TargetTests/ExecutionContextTest.GetByteOrder (2037 of 2108) PASS: lldb-unit :: Utility/./UtilityTests/FileSpecTest.EqualSeparator (2038 of 2108) PASS: lldb-shell :: Settings/TestDisableColor.test (2039 of 2108) PASS: lldb-unit :: UnwindAssembly/x86/./UnwindAssemblyx86Tests/Testx86AssemblyInspectionEngine.Test32bitFramelessBigStackFrame (2040 of 2108) PASS: lldb-unit :: Language/Highlighting/./HighlighterTests/HighlighterTest.ClangStringLiterals (2041 of 2108) PASS: lldb-unit :: Host/./HostTests/NativeProcessProtocolTest.SetBreakpoint (2042 of 2108) PASS: lldb-api :: python_api/default-constructor/TestDefaultConstructorForAPIObjects.py (2043 of 2108) UNSUPPORTED: lldb-api :: lang/objc/objc-dynamic-value/TestObjCDynamicValue.py (2044 of 2108) PASS: lldb-unit :: Language/CLanguages/./LanguageCLanguagesTests/CLanguages.LookupCLanguagesByLanguageType (2045 of 2108) PASS: lldb-api :: functionalities/breakpoint/inlined_breakpoints/TestInlinedBreakpoints.py (2046 of 2108) PASS: lldb-unit :: Utility/./UtilityTests/NameMatchesTest.EndsWith (2047 of 2108) PASS: lldb-shell :: SymbolFile/Breakpad/unwind-via-stack-cfi.test (2048 of 2108) PASS: lldb-shell :: SymbolFile/DWARF/debug_line-tombstone.s (2049 of 2108) PASS: lldb-api :: functionalities/postmortem/minidump-new/TestMiniDumpUUID.py (2050 of 2108) PASS: lldb-shell :: Reproducer/TestVersionCheck.test (2051 of 2108) PASS: lldb-api :: python_api/breakpoint/TestBreakpointAPI.py (2052 of 2108) PASS: lldb-api :: functionalities/target-new-solib-notifications/TestModuleLoadedNotifys.py (2053 of 2108) PASS: lldb-api :: functionalities/thread/concurrent_events/TestConcurrentTwoBreakpointsOneWatchpoint.py (2054 of 2108) PASS: lldb-api :: lang/c/stepping/TestStepAndBreakpoints.py (2055 of 2108) PASS: lldb-api :: functionalities/data-formatter/data-formatter-objc/nsstring/TestDataFormatterNSString.py (2056 of 2108) PASS: lldb-api :: functionalities/data-formatter/synthupdate/TestSyntheticFilterRecompute.py (2057 of 2108) PASS: lldb-unit :: Utility/./UtilityTests/StatusTest.ErrorConversion (2058 of 2108) PASS: lldb-api :: functionalities/data-formatter/dump_dynamic/TestDumpDynamic.py (2059 of 2108) UNSUPPORTED: lldb-api :: benchmarks/expression/TestExpressionCmd.py (2060 of 2108) PASS: lldb-api :: functionalities/data-formatter/typedef_array/TestTypedefArray.py (2061 of 2108) PASS: lldb-unit :: Utility/./UtilityTests/XcodeSDKTest.ParseTest (2062 of 2108) PASS: lldb-unit :: UnwindAssembly/x86/./UnwindAssemblyx86Tests/Testx86AssemblyInspectionEngine.TestSimple32bitFrameFunction (2063 of 2108) PASS: lldb-unit :: Interpreter/./InterpreterTests/CompletionTest.FileCompletionAbsolute (2064 of 2108) PASS: lldb-api :: functionalities/inferior-crashing/recursive-inferior/TestRecursiveInferior.py (2065 of 2108) UNSUPPORTED: lldb-api :: functionalities/darwin_log/filter/regex/category/TestDarwinLogFilterRegexCategory.py (2066 of 2108) PASS: lldb-unit :: Utility/./UtilityTests/FileSpecTest.FileAndDirectoryComponents (2067 of 2108) PASS: lldb-unit :: Language/Highlighting/./HighlighterTests/HighlighterTest.DefaultHighlighterWithCursorOutOfBounds (2068 of 2108) PASS: lldb-api :: functionalities/plugins/command_plugin/TestPluginCommands.py (2069 of 2108) PASS: lldb-api :: lang/c/enum_types/TestEnumTypes.py (2070 of 2108) PASS: lldb-shell :: Driver/TestNoUseColor.test (2071 of 2108) PASS: lldb-api :: lang/c/modules/TestCModules.py (2072 of 2108) PASS: lldb-api :: functionalities/data-formatter/data-formatter-globals/TestDataFormatterGlobals.py (2073 of 2108) PASS: lldb-api :: functionalities/breakpoint/hardware_breakpoints/require_hw_breakpoints/TestRequireHWBreakpoints.py (2074 of 2108) PASS: lldb-shell :: SymbolFile/DWARF/dir-separator-windows.s (2075 of 2108) PASS: lldb-unit :: Core/./LLDBCoreTests/MangledTest.ResultForBlockInvocation (2076 of 2108) PASS: lldb-unit :: Target/./TargetTests/PathMappingListTest.RemapRoot (2077 of 2108) PASS: lldb-api :: commands/expression/completion/TestExprCompletion.py (2078 of 2108) PASS: lldb-shell :: SymbolFile/DWARF/dwarf5-atomic.s (2079 of 2108) PASS: lldb-api :: python_api/watchpoint/condition/TestWatchpointConditionAPI.py (2080 of 2108) PASS: lldb-unit :: Utility/./UtilityTests/OptionsWithRawTest.SingleWhitespaceInput (2081 of 2108) PASS: lldb-unit :: Process/gdb-remote/./ProcessGdbRemoteTests/GDBRemoteClientBaseTest.SendContinueAndWait (2082 of 2108) UNSUPPORTED: lldb-api :: functionalities/breakpoint/hardware_breakpoints/write_memory_with_hw_breakpoint/TestWriteMemoryWithHWBreakpoint.py (2083 of 2108) PASS: lldb-api :: commands/watchpoints/watchpoint_count/TestWatchpointCount.py (2084 of 2108) PASS: lldb-unit :: Utility/./UtilityTests/ProcessInstanceInfoMatch.Name (2085 of 2108) PASS: lldb-api :: lang/objc/self/TestObjCSelf.py (2086 of 2108) PASS: lldb-unit :: Utility/./UtilityTests/StreamTest.PutPtr (2087 of 2108) PASS: lldb-api :: functionalities/data-formatter/data-formatter-stl/libcxx/unique_ptr/TestDataFormatterLibcxxUniquePtr.py (2088 of 2108) PASS: lldb-unit :: Utility/./UtilityTests/StreamTeeTest.GetStreamAtIndexOutOfBoundsEmpty (2089 of 2108) PASS: lldb-shell :: Recognizer/assert.test (2090 of 2108) PASS: lldb-shell :: Breakpoint/dummy-target.test (2091 of 2108) PASS: lldb-shell :: ObjectFile/ELF/avr-basic-info.yaml (2092 of 2108) UNSUPPORTED: lldb-shell :: SymbolFile/DWARF/split-dwarf-expression-eval-bug.cpp (2093 of 2108) PASS: lldb-unit :: Process/gdb-remote/./ProcessGdbRemoteTests/GDBRemoteCommunicationServerTest.SendErrorResponse_ErrorNumber (2094 of 2108) PASS: lldb-unit :: Process/minidump/./LLDBMinidumpTests/MinidumpParserTest.GetMemoryRegionInfo (2095 of 2108) PASS: lldb-unit :: Expression/./ExpressionTests/ClangExpressionDeclMapTest.TestPersistentDeclLookup (2096 of 2108) PASS: lldb-unit :: Process/gdb-remote/./ProcessGdbRemoteTests/GDBRemoteCommunicationClientTest.GetQOffsets (2097 of 2108) PASS: lldb-unit :: Target/./TargetTests/ModuleCacheTest.GetAndPutStrangeHostname (2098 of 2108) PASS: lldb-unit :: Utility/./UtilityTests/LogChannelTest.Enable (2099 of 2108) PASS: lldb-api :: lang/objc/radar-9691614/TestObjCMethodReturningBOOL.py (2100 of 2108) PASS: lldb-unit :: Utility/./UtilityTests/FileSpecTest.Yaml (2101 of 2108) PASS: lldb-unit :: Utility/./UtilityTests/DataExtractorTest.GetDouble (2102 of 2108) PASS: lldb-unit :: Utility/./UtilityTests/OptionsWithRawTest.SingleWordSuffix (2103 of 2108) PASS: lldb-unit :: Utility/./UtilityTests/XcodeSDKTest.GetSDKTypeForTriple (2104 of 2108) PASS: lldb-unit :: Utility/./UtilityTests/StreamTest.PutHex32ByteOrderBig (2105 of 2108) PASS: lldb-api :: functionalities/breakpoint/cpp/TestCPPBreakpointLocations.py (2106 of 2108) PASS: lldb-api :: functionalities/data-formatter/data-formatter-objc/TestDataFormatterObjCNSURL.py (2107 of 2108) PASS: lldb-api :: lang/objc/foundation/TestObjCMethodsString.py (2108 of 2108) Slowest Tests: -------------------------------------------------------------------------- 348.41s: lldb-api :: tools/lldb-server/TestLldbGdbServer.py 260.03s: lldb-api :: lang/cpp/enum_types/TestCPP11EnumTypes.py 241.46s: lldb-api :: api/multithreaded/TestMultithreaded.py 205.30s: lldb-api :: lang/objc/hidden-ivars/TestHiddenIvars.py 203.92s: lldb-api :: lang/objc/foundation/TestObjCMethods.py 144.14s: lldb-api :: lang/cpp/namespace/TestNamespaceLookup.py 143.31s: lldb-api :: lang/objc/exceptions/TestObjCExceptions.py 136.43s: lldb-api :: lang/objc/objc-new-syntax/TestObjCNewSyntaxLiteral.py 134.75s: lldb-api :: lang/objc/real-definition/TestRealDefinition.py 121.61s: lldb-api :: types/TestLongTypesExpr.py 120.02s: lldb-api :: lang/objc/forward-decl/TestForwardDecl.py 107.76s: lldb-api :: lang/objcxx/class-name-clash/TestNameClash.py 107.29s: lldb-api :: lang/objc/foundation/TestObjCMethodsNSError.py 104.56s: lldb-api :: lang/objc/objc-new-syntax/TestObjCNewSyntaxArray.py 104.42s: lldb-api :: lang/objc/objc-new-syntax/TestObjCNewSyntaxDictionary.py 100.83s: lldb-api :: lang/objc/foundation/TestObjCMethodsString.py 99.27s: lldb-api :: python_api/lldbutil/iter/TestLLDBIterator.py 96.98s: lldb-api :: commands/expression/import-std-module/basic/TestImportStdModule.py 91.59s: lldb-api :: functionalities/gdb_remote_client/TestWasm.py 88.73s: lldb-api :: commands/settings/TestSettings.py

Hide Details

Tests Times: -------------------------------------------------------------------------- [ Range ] :: [ Percentage ] :: [ Count ] -------------------------------------------------------------------------- [340s,360s) :: [ ] :: [ 1/2108] [320s,340s) :: [ ] :: [ 0/2108] [300s,320s) :: [ ] :: [ 0/2108] [280s,300s) :: [ ] :: [ 0/2108] [260s,280s) :: [ ] :: [ 1/2108] [240s,260s) :: [ ] :: [ 1/2108] [220s,240s) :: [ ] :: [ 0/2108] [200s,220s) :: [ ] :: [ 2/2108] [180s,200s) :: [ ] :: [ 0/2108] [160s,180s) :: [ ] :: [ 0/2108] [140s,160s) :: [ ] :: [ 3/2108] [120s,140s) :: [ ] :: [ 3/2108] [100s,120s) :: [ ] :: [ 7/2108] [ 80s,100s) :: [ ] :: [ 6/2108] [ 60s, 80s) :: [ ] :: [ 19/2108] [ 40s, 60s) :: [ ] :: [ 52/2108] [ 20s, 40s) :: [** ] :: [ 151/2108] [ 0s, 20s) :: [*********************************** ] :: [1862/2108] -------------------------------------------------------------------------- ******************** Failed Tests (3): lldb-api :: python_api/target/TestTargetAPI.py lldb-api :: macosx/simulator/TestSimulatorPlatform.py lldb-api :: macosx/macCatalyst/TestMacCatalyst.py

Hide Details

Hide Details

Testing Time: 4198.13s Unsupported : 182 Passed : 1917 Expectedly Failed: 6 Failed : 3 FAILED: tools/lldb/test/CMakeFiles/check-lldb-lit cd /Users/buildslave/jenkins/workspace/lldb-cmake-sanitized/lldb-build/tools/lldb/test && /usr/local/Frameworks/Python.framework/Versions/3.7/bin/python3.7 /Users/buildslave/jenkins/workspace/lldb-cmake-sanitized/lldb-build/./bin/llvm-lit -v --time-tests --shuffle --xunit-xml-output=/Users/buildslave/jenkins/workspace/lldb-cmake-sanitized/test/results.xml -v -j 4 --timeout 1200 /Users/buildslave/jenkins/workspace/lldb-cmake-sanitized/lldb-build/tools/lldb/test ninja: build stopped: subcommand failed. Command failed: Command '['/usr/bin/env', 'TERM=vt100', '/usr/local/bin/ninja', '-v', 'check-lldb']' returned non-zero exit status 1. Command: ['/usr/bin/env', 'TERM=vt100', '/usr/local/bin/ninja', '-v', 'check-lldb'] [Pipeline] } [Pipeline] // timeout [Pipeline] } [Pipeline] // stage [Pipeline] stage [Pipeline] { (Declarative: Post Actions) [Pipeline] scanForIssues [Clang (LLVM based)] Sleeping for 5 seconds due to JENKINS-32191... [Clang (LLVM based)] Parsing console log (workspace: '/Users/buildslave/jenkins/workspace/lldb-cmake-sanitized') [Clang (LLVM based)] Successfully parsed console log [Clang (LLVM based)] -> found 4 issues (skipped 5 duplicates) [Clang (LLVM based)] Post processing issues on 'green-dragon-23' with source code encoding 'UTF-8' [Clang (LLVM based)] Creating SCM blamer to obtain author and commit information for affected files [Clang (LLVM based)] Creating SCM miner to obtain statistics for affected repository files [Clang (LLVM based)] Resolving file names for all issues in source directory '/Users/buildslave/jenkins/workspace/lldb-cmake-sanitized' [Clang (LLVM based)] -> resolved paths in source directory (3 found, 0 not found) [Clang (LLVM based)] Resolving module names from module definitions (build.xml, pom.xml, or Manifest.mf files) [Clang (LLVM based)] -> resolved module names for 4 issues [Clang (LLVM based)] Resolving package names (or namespaces) by parsing the affected files [Clang (LLVM based)] -> resolved package names of 3 affected files [Clang (LLVM based)] No filter has been set, publishing all 4 issues [Clang (LLVM based)] Creating fingerprints for all affected code blocks to track issues over different builds [Clang (LLVM based)] -> created fingerprints for 4 issues (skipped 0 issues) [Clang (LLVM based)] Copying affected files to Jenkins' build folder '/Users/Shared/Jenkins/Home/jobs/lldb-cmake-sanitized/builds/1692/files-with-issues' [Clang (LLVM based)] -> 3 copied, 0 not in workspace, 0 not-found, 0 with I/O error [Pipeline] junit Recording test results [Pipeline] } [Pipeline] // stage [Pipeline] } [Pipeline] // withEnv [Pipeline] } [Pipeline] // node [Pipeline] End of Pipeline ERROR: script returned exit code 1 Finished: FAILURE