FailedConsole Output

Skipping 34,415 KB.. Full Log
 (TestTargetAPI.TargetAPITestCase) (test case does not fall in any category of interest for this run) 
runCmd: settings clear -all
output: 

Hide Details

runCmd: settings set symbols.enable-external-lookup false output:

Hide Details

runCmd: settings set target.inherit-tcc true output:

Hide Details

runCmd: settings set target.auto-apply-fixits false output:

Hide Details

runCmd: settings set plugin.process.gdb-remote.packet-timeout 60 output:

Hide Details

runCmd: settings set symbols.clang-modules-cache-path "/Users/buildslave/jenkins/workspace/lldb-cmake-sanitized/lldb-build/lldb-test-build.noindex/module-cache-lldb/lldb-api" output:

Hide Details

runCmd: settings set use-color false output:

Hide Details

runCmd: setting set target.prefer-dynamic-value no-dynamic-values output:

Hide Details

runCmd: settings set target.env-vars ASAN_OPTIONS=detect_stack_use_after_return=1 DYLD_INSERT_LIBRARIES=/Users/buildslave/jenkins/workspace/lldb-cmake-sanitized/host-compiler/lib/clang/12.0.0/lib/darwin/libclang_rt.asan_osx_dynamic.dylib output:

Hide Details

PASS: LLDB (/Users/buildslave/jenkins/workspace/lldb-cmake-sanitized/lldb-build/bin/clang-x86_64) :: test_resolve_file_address_gmodules (TestTargetAPI.TargetAPITestCase) runCmd: settings clear -all output:

Hide Details

runCmd: settings set symbols.enable-external-lookup false output:

Hide Details

runCmd: settings set target.inherit-tcc true output:

Hide Details

runCmd: settings set target.auto-apply-fixits false output:

Hide Details

runCmd: settings set plugin.process.gdb-remote.packet-timeout 60 output:

Hide Details

runCmd: settings set symbols.clang-modules-cache-path "/Users/buildslave/jenkins/workspace/lldb-cmake-sanitized/lldb-build/lldb-test-build.noindex/module-cache-lldb/lldb-api" output:

Hide Details

runCmd: settings set use-color false output:

Hide Details

runCmd: setting set target.prefer-dynamic-value no-dynamic-values output:

Hide Details

runCmd: settings set target.env-vars ASAN_OPTIONS=detect_stack_use_after_return=1 DYLD_INSERT_LIBRARIES=/Users/buildslave/jenkins/workspace/lldb-cmake-sanitized/host-compiler/lib/clang/12.0.0/lib/darwin/libclang_rt.asan_osx_dynamic.dylib output:

Hide Details

breakpoint1: SBBreakpoint: id = 1, file = 'main.c', line = 21, exact_match = 0, locations = 1

Hide Details

breakpoint2: SBBreakpoint: id = 2, file = 'main.c', line = 26, exact_match = 0, locations = 1

Hide Details

address1: a.out`a + 11 at main.c:21:13

Hide Details

address2: a.out`a + 63 at main.c:26:12

Hide Details

context1: Module: file = "/Users/buildslave/jenkins/workspace/lldb-cmake-sanitized/lldb-build/lldb-test-build.noindex/python_api/target/TestTargetAPI.test_resolve_symbol_context_with_address_dsym/a.out", arch = "x86_64" CompileUnit: id = {0x00000000}, file = "/Users/buildslave/jenkins/workspace/lldb-cmake-sanitized/llvm-project/lldb/test/API/python_api/target/main.c", language = "c99" Function: id = {0x7fffffff0000004e}, name = "a", range = [0x0000000100000dd0-0x0000000100000e18) FuncType: id = {0x7fffffff0000004e}, byte-size = 0, decl = main.c:19, compiler_type = "int (int)" Blocks: id = {0x7fffffff0000004e}, range = [0x100000dd0-0x100000e18) LineEntry: [0x0000000100000ddb-0x0000000100000ddf): /Users/buildslave/jenkins/workspace/lldb-cmake-sanitized/llvm-project/lldb/test/API/python_api/target/main.c:21:13, is_start_of_statement = TRUE, is_prologue_end = TRUE Symbol: id = {0x00000005}, range = [0x0000000100000dd0-0x0000000100000e20), name="a"

Hide Details

context2: Module: file = "/Users/buildslave/jenkins/workspace/lldb-cmake-sanitized/lldb-build/lldb-test-build.noindex/python_api/target/TestTargetAPI.test_resolve_symbol_context_with_address_dsym/a.out", arch = "x86_64" CompileUnit: id = {0x00000000}, file = "/Users/buildslave/jenkins/workspace/lldb-cmake-sanitized/llvm-project/lldb/test/API/python_api/target/main.c", language = "c99" Function: id = {0x7fffffff0000004e}, name = "a", range = [0x0000000100000dd0-0x0000000100000e18) FuncType: id = {0x7fffffff0000004e}, byte-size = 0, decl = main.c:19, compiler_type = "int (int)" Blocks: id = {0x7fffffff0000004e}, range = [0x100000dd0-0x100000e18) LineEntry: [0x0000000100000e0f-0x0000000100000e12): /Users/buildslave/jenkins/workspace/lldb-cmake-sanitized/llvm-project/lldb/test/API/python_api/target/main.c:26:12, is_start_of_statement = TRUE Symbol: id = {0x00000005}, range = [0x0000000100000dd0-0x0000000100000e20), name="a"

Hide Details

symbol1: id = {0x00000005}, range = [0x0000000100000dd0-0x0000000100000e20), name="a"

Hide Details

symbol2: id = {0x00000005}, range = [0x0000000100000dd0-0x0000000100000e20), name="a"

Hide Details

<bound method SBProcess.Kill of <lldb.SBProcess; proxy of <Swig Object of type 'lldb::SBProcess *' at 0x10e72b3f0> >>: success

Hide Details

PASS: LLDB (/Users/buildslave/jenkins/workspace/lldb-cmake-sanitized/lldb-build/bin/clang-x86_64) :: test_resolve_symbol_context_with_address_dsym (TestTargetAPI.TargetAPITestCase) runCmd: settings clear -all output:

Hide Details

runCmd: settings set symbols.enable-external-lookup false output:

Hide Details

runCmd: settings set target.inherit-tcc true output:

Hide Details

runCmd: settings set target.auto-apply-fixits false output:

Hide Details

runCmd: settings set plugin.process.gdb-remote.packet-timeout 60 output:

Hide Details

runCmd: settings set symbols.clang-modules-cache-path "/Users/buildslave/jenkins/workspace/lldb-cmake-sanitized/lldb-build/lldb-test-build.noindex/module-cache-lldb/lldb-api" output:

Hide Details

runCmd: settings set use-color false output:

Hide Details

runCmd: setting set target.prefer-dynamic-value no-dynamic-values output:

Hide Details

runCmd: settings set target.env-vars ASAN_OPTIONS=detect_stack_use_after_return=1 DYLD_INSERT_LIBRARIES=/Users/buildslave/jenkins/workspace/lldb-cmake-sanitized/host-compiler/lib/clang/12.0.0/lib/darwin/libclang_rt.asan_osx_dynamic.dylib output:

Hide Details

breakpoint1: SBBreakpoint: id = 1, file = 'main.c', line = 21, exact_match = 0, locations = 1

Hide Details

breakpoint2: SBBreakpoint: id = 2, file = 'main.c', line = 26, exact_match = 0, locations = 1

Hide Details

address1: a.out`a + 11 at main.c:21:13

Hide Details

address2: a.out`a + 63 at main.c:26:12

Hide Details

context1: Module: file = "/Users/buildslave/jenkins/workspace/lldb-cmake-sanitized/lldb-build/lldb-test-build.noindex/python_api/target/TestTargetAPI.test_resolve_symbol_context_with_address_dwarf/a.out", arch = "x86_64" CompileUnit: id = {0x00000000}, file = "/Users/buildslave/jenkins/workspace/lldb-cmake-sanitized/llvm-project/lldb/test/API/python_api/target/main.c", language = "unknown" Function: id = {0x10000004e}, name = "a", range = [0x0000000100000dd0-0x0000000100000e18) FuncType: id = {0x10000004e}, byte-size = 0, decl = main.c:19, compiler_type = "int (int)" Blocks: id = {0x10000004e}, range = [0x100000dd0-0x100000e18) LineEntry: [0x0000000100000ddb-0x0000000100000ddf): /Users/buildslave/jenkins/workspace/lldb-cmake-sanitized/llvm-project/lldb/test/API/python_api/target/main.c:21:13, is_start_of_statement = TRUE, is_prologue_end = TRUE Symbol: id = {0x00000005}, range = [0x0000000100000dd0-0x0000000100000e20), name="a"

Hide Details

context2: Module: file = "/Users/buildslave/jenkins/workspace/lldb-cmake-sanitized/lldb-build/lldb-test-build.noindex/python_api/target/TestTargetAPI.test_resolve_symbol_context_with_address_dwarf/a.out", arch = "x86_64" CompileUnit: id = {0x00000000}, file = "/Users/buildslave/jenkins/workspace/lldb-cmake-sanitized/llvm-project/lldb/test/API/python_api/target/main.c", language = "unknown" Function: id = {0x10000004e}, name = "a", range = [0x0000000100000dd0-0x0000000100000e18) FuncType: id = {0x10000004e}, byte-size = 0, decl = main.c:19, compiler_type = "int (int)" Blocks: id = {0x10000004e}, range = [0x100000dd0-0x100000e18) LineEntry: [0x0000000100000e0f-0x0000000100000e12): /Users/buildslave/jenkins/workspace/lldb-cmake-sanitized/llvm-project/lldb/test/API/python_api/target/main.c:26:12, is_start_of_statement = TRUE Symbol: id = {0x00000005}, range = [0x0000000100000dd0-0x0000000100000e20), name="a"

Hide Details

symbol1: id = {0x00000005}, range = [0x0000000100000dd0-0x0000000100000e20), name="a"

Hide Details

symbol2: id = {0x00000005}, range = [0x0000000100000dd0-0x0000000100000e20), name="a"

Hide Details

<bound method SBProcess.Kill of <lldb.SBProcess; proxy of <Swig Object of type 'lldb::SBProcess *' at 0x127133810> >>: success

Hide Details

PASS: LLDB (/Users/buildslave/jenkins/workspace/lldb-cmake-sanitized/lldb-build/bin/clang-x86_64) :: test_resolve_symbol_context_with_address_dwarf (TestTargetAPI.TargetAPITestCase) UNSUPPORTED: LLDB (/Users/buildslave/jenkins/workspace/lldb-cmake-sanitized/lldb-build/bin/clang-x86_64) :: test_resolve_symbol_context_with_address_dwo (TestTargetAPI.TargetAPITestCase) (test case does not fall in any category of interest for this run) runCmd: settings clear -all output:

Hide Details

runCmd: settings set symbols.enable-external-lookup false output:

Hide Details

runCmd: settings set target.inherit-tcc true output:

Hide Details

runCmd: settings set target.auto-apply-fixits false output:

Hide Details

runCmd: settings set plugin.process.gdb-remote.packet-timeout 60 output:

Hide Details

runCmd: settings set symbols.clang-modules-cache-path "/Users/buildslave/jenkins/workspace/lldb-cmake-sanitized/lldb-build/lldb-test-build.noindex/module-cache-lldb/lldb-api" output:

Hide Details

runCmd: settings set use-color false output:

Hide Details

runCmd: setting set target.prefer-dynamic-value no-dynamic-values output:

Hide Details

runCmd: settings set target.env-vars ASAN_OPTIONS=detect_stack_use_after_return=1 DYLD_INSERT_LIBRARIES=/Users/buildslave/jenkins/workspace/lldb-cmake-sanitized/host-compiler/lib/clang/12.0.0/lib/darwin/libclang_rt.asan_osx_dynamic.dylib output:

Hide Details

breakpoint1: SBBreakpoint: id = 1, file = 'main.c', line = 21, exact_match = 0, locations = 1

Hide Details

breakpoint2: SBBreakpoint: id = 2, file = 'main.c', line = 26, exact_match = 0, locations = 1

Hide Details

address1: a.out`a + 11 at main.c:21:13

Hide Details

address2: a.out`a + 63 at main.c:26:12

Hide Details

context1: Module: file = "/Users/buildslave/jenkins/workspace/lldb-cmake-sanitized/lldb-build/lldb-test-build.noindex/python_api/target/TestTargetAPI.test_resolve_symbol_context_with_address_gmodules/a.out", arch = "x86_64" CompileUnit: id = {0x00000000}, file = "/Users/buildslave/jenkins/workspace/lldb-cmake-sanitized/llvm-project/lldb/test/API/python_api/target/main.c", language = "unknown" Function: id = {0x100000072}, name = "a", range = [0x0000000100000dd0-0x0000000100000e18) FuncType: id = {0x100000072}, byte-size = 0, decl = main.c:19, compiler_type = "int (int)" Blocks: id = {0x100000072}, range = [0x100000dd0-0x100000e18) LineEntry: [0x0000000100000ddb-0x0000000100000ddf): /Users/buildslave/jenkins/workspace/lldb-cmake-sanitized/llvm-project/lldb/test/API/python_api/target/main.c:21:13, is_start_of_statement = TRUE, is_prologue_end = TRUE Symbol: id = {0x00000005}, range = [0x0000000100000dd0-0x0000000100000e20), name="a"

Hide Details

context2: Module: file = "/Users/buildslave/jenkins/workspace/lldb-cmake-sanitized/lldb-build/lldb-test-build.noindex/python_api/target/TestTargetAPI.test_resolve_symbol_context_with_address_gmodules/a.out", arch = "x86_64" CompileUnit: id = {0x00000000}, file = "/Users/buildslave/jenkins/workspace/lldb-cmake-sanitized/llvm-project/lldb/test/API/python_api/target/main.c", language = "unknown" Function: id = {0x100000072}, name = "a", range = [0x0000000100000dd0-0x0000000100000e18) FuncType: id = {0x100000072}, byte-size = 0, decl = main.c:19, compiler_type = "int (int)" Blocks: id = {0x100000072}, range = [0x100000dd0-0x100000e18) LineEntry: [0x0000000100000e0f-0x0000000100000e12): /Users/buildslave/jenkins/workspace/lldb-cmake-sanitized/llvm-project/lldb/test/API/python_api/target/main.c:26:12, is_start_of_statement = TRUE Symbol: id = {0x00000005}, range = [0x0000000100000dd0-0x0000000100000e20), name="a"

Hide Details

symbol1: id = {0x00000005}, range = [0x0000000100000dd0-0x0000000100000e20), name="a"

Hide Details

symbol2: id = {0x00000005}, range = [0x0000000100000dd0-0x0000000100000e20), name="a"

Hide Details

<bound method SBProcess.Kill of <lldb.SBProcess; proxy of <Swig Object of type 'lldb::SBProcess *' at 0x10e72b3f0> >>: success

Hide Details

PASS: LLDB (/Users/buildslave/jenkins/workspace/lldb-cmake-sanitized/lldb-build/bin/clang-x86_64) :: test_resolve_symbol_context_with_address_gmodules (TestTargetAPI.TargetAPITestCase) Restore dir to: /Users/buildslave/jenkins/workspace/lldb-cmake-sanitized/lldb-build/tools/lldb/test ====================================================================== FAIL: test_launch_simple (TestTargetAPI.TargetAPITestCase) ---------------------------------------------------------------------- Traceback (most recent call last): File "/Users/buildslave/jenkins/workspace/lldb-cmake-sanitized/llvm-project/lldb/packages/Python/lldbsuite/test/decorators.py", line 135, in wrapper return func(*args, **kwargs) File "/Users/buildslave/jenkins/workspace/lldb-cmake-sanitized/llvm-project/lldb/packages/Python/lldbsuite/test/decorators.py", line 345, in wrapper return func(self, *args, **kwargs) File "/Users/buildslave/jenkins/workspace/lldb-cmake-sanitized/llvm-project/lldb/test/API/python_api/target/TestTargetAPI.py", line 172, in test_launch_simple self.assertEqual(process.GetState(), lldb.eStateExited) AssertionError: 0 != 10 Config=x86_64-/Users/buildslave/jenkins/workspace/lldb-cmake-sanitized/lldb-build/bin/clang ---------------------------------------------------------------------- Ran 42 tests in 55.948s

Hide Details

RESULT: FAILED (31 passes, 1 failures, 0 errors, 10 skipped, 0 expected failures, 0 unexpected successes)

Hide Details

--

Hide Details

******************** PASS: lldb-unit :: Core/./LLDBCoreTests/RichManglingContextTest.IPDRealloc (704 of 2108) PASS: lldb-shell :: Heap/heap-cstr.test (705 of 2108) PASS: lldb-api :: functionalities/gdb_remote_client/TestGDBRemoteLoad.py (706 of 2108) PASS: lldb-unit :: Utility/./UtilityTests/XcodeSDKTest.GetCanonicalNameAndConstruct (707 of 2108) PASS: lldb-api :: lang/objc/modules-cache/TestClangModulesCache.py (708 of 2108) PASS: lldb-api :: functionalities/thread/concurrent_events/TestConcurrentCrashWithSignal.py (709 of 2108) PASS: lldb-unit :: Utility/./UtilityTests/ArgsTest.ReplaceArgumentAtIndexOutOfRange (710 of 2108) UNSUPPORTED: lldb-api :: functionalities/tsan/cpp_global_location/TestTsanCPPGlobalLocation.py (711 of 2108) PASS: lldb-api :: tools/lldb-server/TestAppleSimulatorOSType.py (712 of 2108) UNSUPPORTED: lldb-shell :: ScriptInterpreter/Lua/io.test (713 of 2108) PASS: lldb-unit :: Utility/./UtilityTests/AnsiTerminal.Unknown (714 of 2108) PASS: lldb-shell :: SymbolFile/NativePDB/source-list.cpp (715 of 2108) PASS: lldb-unit :: Process/gdb-remote/./ProcessGdbRemoteTests/GDBRemoteCommunicationClientTest.ReadRegister (716 of 2108) PASS: lldb-api :: functionalities/limit-debug-info/TestLimitDebugInfo.py (717 of 2108) PASS: lldb-unit :: Utility/./UtilityTests/OptionsWithRawTest.LeadingSpaceArgs (718 of 2108) PASS: lldb-shell :: Driver/TestSingleQuote.test (719 of 2108) PASS: lldb-shell :: Commands/CommandScriptImmediateOutput/CommandScriptImmediateOutputFile.test (720 of 2108) PASS: lldb-unit :: Utility/./UtilityTests/StringListTest.JoinThree (721 of 2108) PASS: lldb-shell :: SymbolFile/DWARF/dwo-type-in-main-file.s (722 of 2108) PASS: lldb-api :: lang/cpp/offsetof/TestOffsetofCpp.py (723 of 2108) PASS: lldb-unit :: Symbol/./SymbolTests/PostfixExpression.ParseOneExpression (724 of 2108) UNSUPPORTED: lldb-api :: functionalities/exec/TestExec.py (725 of 2108) PASS: lldb-unit :: Utility/./UtilityTests/RangeTest.LessThan (726 of 2108) PASS: lldb-unit :: ScriptInterpreter/Python/./ScriptInterpreterPythonTests/PythonDataObjectsTest.TestTypeNameResolutionNoDot (727 of 2108) PASS: lldb-unit :: Core/./LLDBCoreTests/MangledTest.EmptyForInvalidName (728 of 2108) PASS: lldb-unit :: Process/minidump/./LLDBMinidumpTests/MinidumpParserTest.GetArchitectureWindows (729 of 2108) PASS: lldb-api :: functionalities/thread/concurrent_events/TestConcurrentTwoWatchpointsOneSignal.py (730 of 2108) PASS: lldb-api :: lang/cpp/limit-debug-info/TestWithLimitDebugInfo.py (731 of 2108) PASS: lldb-unit :: Utility/./UtilityTests/TimerTest.CategoryTimes (732 of 2108) PASS: lldb-api :: lang/cpp/member-and-local-vars-with-same-name/TestMembersAndLocalsWithSameName.py (733 of 2108) PASS: lldb-api :: functionalities/data-formatter/data-formatter-stl/libcxx/queue/TestDataFormatterLibcxxQueue.py (734 of 2108) PASS: lldb-api :: functionalities/tail_call_frames/ambiguous_tail_call_seq2/TestAmbiguousTailCallSeq2.py (735 of 2108) PASS: lldb-shell :: SymbolFile/DWARF/gnu-style-compression.cpp (736 of 2108) PASS: lldb-unit :: Language/CPlusPlus/./LanguageCPlusPlusTests/CPlusPlusLanguage.FindAlternateFunctionManglings (737 of 2108) PASS: lldb-unit :: ScriptInterpreter/Python/./ScriptInterpreterPythonTests/PythonDataObjectsTest.TestPythonInteger (738 of 2108) PASS: lldb-unit :: Process/gdb-remote/./ProcessGdbRemoteTests/GDBRemoteClientBaseTest.SendContinueDelegateStructuredDataReceipt (739 of 2108) PASS: lldb-shell :: ObjectFile/wasm/unified-debug-sections.yaml (740 of 2108) PASS: lldb-unit :: ScriptInterpreter/Python/./ScriptInterpreterPythonTests/PythonDataObjectsTest.TestObjectAttributes (741 of 2108) PASS: lldb-unit :: Host/./HostTests/SocketTest.TCPListen0GetPort (742 of 2108) PASS: lldb-api :: functionalities/thread/step_until/TestStepUntil.py (743 of 2108) PASS: lldb-unit :: Utility/./UtilityTests/UriParserTest.BadPort (744 of 2108) PASS: lldb-unit :: Signals/./SignalsTests/UnixSignalsTest.Iteration (745 of 2108) PASS: lldb-api :: lang/objc/foundation/TestObjCMethods.py (746 of 2108) PASS: lldb-api :: functionalities/inferior-crashing/TestInferiorCrashingStep.py (747 of 2108) PASS: lldb-shell :: ObjectFile/PECOFF/basic-info-arm64.yaml (748 of 2108) UNSUPPORTED: lldb-shell :: Breakpoint/ppc64-localentry.test (749 of 2108) PASS: lldb-unit :: Utility/./UtilityTests/UriParserTest.MinimalPort (750 of 2108) PASS: lldb-unit :: Utility/./UtilityTests/StringListTest.GetMaxStringLengthMixed (751 of 2108) PASS: lldb-api :: lang/cpp/virtual-functions/TestCppVirtualFunctions.py (752 of 2108) UNSUPPORTED: lldb-api :: lang/objc/rdar-12408181/TestRdar12408181.py (753 of 2108) XFAIL: lldb-shell :: SymbolFile/DWARF/find-type-in-function.cpp (754 of 2108) PASS: lldb-shell :: Settings/TestFrameFormatColor.test (755 of 2108) PASS: lldb-api :: functionalities/postmortem/minidump/TestMiniDump.py (756 of 2108) PASS: lldb-unit :: Utility/./UtilityTests/RangeTest.NotEqualInvalid (757 of 2108) PASS: lldb-shell :: ObjectFile/ELF/PT_LOAD-overlap-section.yaml (758 of 2108) PASS: lldb-unit :: API/./APITests/SBCommandInterpreterTest.MultiWordCommand (759 of 2108) PASS: lldb-api :: functionalities/data-formatter/boolreference/TestFormattersBoolRefPtr.py (760 of 2108) PASS: lldb-api :: lang/cpp/class_types/TestClassTypesDisassembly.py (761 of 2108) PASS: lldb-unit :: ScriptInterpreter/Python/./ScriptInterpreterPythonTests/PythonDataObjectsTest.TestPythonDictionaryValueEquality (762 of 2108) PASS: lldb-api :: functionalities/data-formatter/data-formatter-synthval/TestDataFormatterSynthVal.py (763 of 2108) PASS: lldb-unit :: Utility/./UtilityTests/StringLexerTest.AdvanceIf (764 of 2108) UNSUPPORTED: lldb-api :: lang/objc/foundation/TestFoundationDisassembly.py (765 of 2108) PASS: lldb-shell :: SymbolFile/DWARF/find-variable-file.cpp (766 of 2108) PASS: lldb-shell :: ObjectFile/ELF/PT_LOAD.yaml (767 of 2108) PASS: lldb-shell :: Commands/command-thread-select.test (768 of 2108) PASS: lldb-api :: functionalities/thread/concurrent_events/TestConcurrentBreakpointsDelayedBreakpointOneWatchpoint.py (769 of 2108) PASS: lldb-unit :: Utility/./UtilityTests/EnvironmentTest.EnvpConstruction (770 of 2108) PASS: lldb-shell :: Quit/TestQuitExitCodeImplicit0.test (771 of 2108) PASS: lldb-unit :: ObjectFile/Breakpad/./ObjectFileBreakpadTests/StackCFIRecord.parse (772 of 2108) PASS: lldb-unit :: Utility/./UtilityTests/XcodeSDKTest.SDKSupportsModules (773 of 2108) PASS: lldb-api :: functionalities/data-formatter/compactvectors/TestCompactVectors.py (774 of 2108) PASS: lldb-unit :: Utility/./UtilityTests/RangeTest.Copy (775 of 2108) PASS: lldb-api :: sanity/TestModuleCacheSanity.py (776 of 2108) PASS: lldb-unit :: Utility/./UtilityTests/StringExtractorTest.GetHexBytesAvail_OddPair (777 of 2108) PASS: lldb-unit :: Utility/./UtilityTests/StreamTest.PutULEB128 (778 of 2108) PASS: lldb-api :: python_api/signals/TestSignalsAPI.py (779 of 2108) PASS: lldb-api :: commands/frame/diagnose/complicated-expression/TestComplicatedExpression.py (780 of 2108) PASS: lldb-unit :: UnwindAssembly/x86/./UnwindAssemblyx86Tests/Testx86AssemblyInspectionEngine.TestSubRSP (781 of 2108) PASS: lldb-api :: functionalities/jitloader_gdb/TestJITLoaderGDB.py (782 of 2108) UNSUPPORTED: lldb-api :: functionalities/asan/TestReportData.py (783 of 2108) PASS: lldb-unit :: Utility/./UtilityTests/BinaryStreamTest.PutSLEB128NineBytes (784 of 2108) PASS: lldb-unit :: DataFormatter/./LLDBFormatterTests/TypeMatcherTests.GetMatchStringRegex (785 of 2108) UNSUPPORTED: lldb-api :: commands/register/register/intel_xtended_registers/mpx_offset_intersection/TestMPXOffsetIntersection.py (786 of 2108) PASS: lldb-shell :: SymbolFile/DWARF/find-inline-method.s (787 of 2108) PASS: lldb-unit :: UnwindAssembly/x86/./UnwindAssemblyx86Tests/Testx86AssemblyInspectionEngine.TestSimplei386ugmented (788 of 2108) UNSUPPORTED: lldb-api :: benchmarks/expression/TestRepeatedExprs.py (789 of 2108) PASS: lldb-unit :: Host/./HostTests/ConnectionFileDescriptorTest.TCPGetURIv4 (790 of 2108) PASS: lldb-unit :: Utility/./UtilityTests/ProcessInstanceInfo.Dump (791 of 2108) PASS: lldb-unit :: Process/minidump/./LLDBMinidumpTests/RegisterContextMinidump.ConvertMinidumpContext_x86_32 (792 of 2108) PASS: lldb-unit :: Utility/./UtilityTests/ArchSpecTest.TripleComponentsWereSpecified (793 of 2108) PASS: lldb-shell :: SymbolFile/DWARF/compilercontext.ll (794 of 2108) PASS: lldb-api :: functionalities/breakpoint/address_breakpoints/TestBadAddressBreakpoints.py (795 of 2108) PASS: lldb-unit :: Utility/./UtilityTests/UriParserTest.MinimalPortPath (796 of 2108) PASS: lldb-unit :: Expression/./ExpressionTests/DWARFExpression.DW_OP_piece (797 of 2108) PASS: lldb-unit :: SymbolFile/NativePDB/./SymbolFileNativePDBTests/PDBFPOProgramToDWARFExpressionTests.InvalidOpBinary (798 of 2108) PASS: lldb-api :: functionalities/tail_call_frames/disambiguate_tail_call_seq/TestDisambiguateTailCallSeq.py (799 of 2108) PASS: lldb-api :: macosx/order/TestOrderFile.py (800 of 2108) PASS: lldb-unit :: Process/minidump/./LLDBMinidumpTests/MinidumpParserTest.GetPidWindows (801 of 2108) PASS: lldb-shell :: ObjectFile/ELF/netbsd-exec-8.99.30-amd64.yaml (802 of 2108) PASS: lldb-unit :: UnwindAssembly/x86/./UnwindAssemblyx86Tests/Testx86AssemblyInspectionEngine.TestPushR14 (803 of 2108) PASS: lldb-unit :: Language/Highlighting/./HighlighterTests/HighlighterTest.ClangBraces (804 of 2108) UNSUPPORTED: lldb-api :: iohandler/resize/TestIOHandlerResize.py (805 of 2108) UNSUPPORTED: lldb-shell :: SymbolFile/PDB/function-level-linking.test (806 of 2108) UNSUPPORTED: lldb-api :: iohandler/completion/TestIOHandlerCompletion.py (807 of 2108) PASS: lldb-api :: commands/expression/static-initializers/TestStaticInitializers.py (808 of 2108) PASS: lldb-api :: lang/cpp/covariant-return-types/TestCovariantReturnTypes.py (809 of 2108) PASS: lldb-api :: functionalities/pre_run_dylibs/TestPreRunDylibs.py (810 of 2108) PASS: lldb-unit :: debugserver/./debugserverTests/RNBSocket.LoopBackListenIPv6 (811 of 2108) PASS: lldb-unit :: Expression/./ExpressionTests/CppModuleConfigurationTest.LinuxLocalLibCpp (812 of 2108) UNSUPPORTED: lldb-shell :: Breakpoint/case-insensitive.test (813 of 2108) PASS: lldb-unit :: Utility/./UtilityTests/UriParserTest.BracketedHostnameWithPortIPv6 (814 of 2108) PASS: lldb-shell :: SymbolFile/DWARF/find-basic-function.cpp (815 of 2108) PASS: lldb-api :: lang/cpp/accelerator-table/TestCPPAccelerator.py (816 of 2108) PASS: lldb-api :: commands/expression/import-std-module/forward_list-dbg-info-content/TestDbgInfoContentForwardListFromStdModule.py (817 of 2108) PASS: lldb-unit :: Symbol/./SymbolTests/TestTypeSystemClang.TestGetTypeClassDeclType (818 of 2108) PASS: lldb-shell :: Expr/TestMultilineExpr.test (819 of 2108) PASS: lldb-unit :: Utility/./UtilityTests/ConstStringTest.YAML (820 of 2108) PASS: lldb-unit :: Utility/./UtilityTests/RangeTest.Clear (821 of 2108) PASS: lldb-api :: lang/cpp/typedef/TestCppTypedef.py (822 of 2108) PASS: lldb-api :: lang/c/bitfields/TestBitfields.py (823 of 2108) UNSUPPORTED: lldb-api :: functionalities/darwin_log/source/debug/TestDarwinLogSourceDebug.py (824 of 2108) PASS: lldb-unit :: Process/gdb-remote/./ProcessGdbRemoteTests/GDBRemoteCommunicationServerTest.SendErrorResponse_StringError (825 of 2108) UNSUPPORTED: lldb-api :: functionalities/darwin_log/filter/exact_match/activity-chain/TestDarwinLogFilterMatchActivityChain.py (826 of 2108) PASS: lldb-api :: tools/lldb-server/TestGdbRemote_vCont.py (827 of 2108) PASS: lldb-unit :: Signals/./SignalsTests/UnixSignalsTest.GetFilteredSignals (828 of 2108) PASS: lldb-api :: functionalities/data-formatter/nsarraysynth/TestNSArraySynthetic.py (829 of 2108) PASS: lldb-api :: functionalities/data-formatter/data-formatter-objc/TestDataFormatterObjCCF.py (830 of 2108) PASS: lldb-api :: python_api/watchpoint/TestWatchpointIgnoreCount.py (831 of 2108) PASS: lldb-unit :: Utility/./UtilityTests/RangeTest.ContainsRangeStartingFromZero (832 of 2108) PASS: lldb-api :: commands/expression/completion-in-lambda-and-unnamed-class/TestCompletionInLambdaAndUnnamedClass.py (833 of 2108) PASS: lldb-unit :: Utility/./UtilityTests/RegularExpression.CopyAssignment (834 of 2108) PASS: lldb-api :: functionalities/non-overlapping-index-variable-i/TestIndexVariable.py (835 of 2108) PASS: lldb-api :: python_api/type/TestTypeList.py (836 of 2108) PASS: lldb-unit :: Utility/./UtilityTests/StringListTest.RemoveBlankLines (837 of 2108) PASS: lldb-api :: commands/expression/import-std-module/deque-dbg-info-content/TestDbgInfoContentDequeFromStdModule.py (838 of 2108) PASS: lldb-shell :: SymbolFile/DWARF/static_scope.s (839 of 2108) PASS: lldb-api :: functionalities/breakpoint/breakpoint_hit_count/TestBreakpointHitCount.py (840 of 2108) PASS: lldb-unit :: Utility/./UtilityTests/FileSpecTest.FormatFileSpec (841 of 2108) PASS: lldb-api :: functionalities/tail_call_frames/sbapi_support/TestTailCallFrameSBAPI.py (842 of 2108) PASS: lldb-api :: types/TestLongTypes.py (843 of 2108) PASS: lldb-api :: commands/expression/ignore-artificial-constructors/TestIgnoreArtificialConstructors.py (844 of 2108) PASS: lldb-shell :: SymbolFile/DWARF/find-basic-variable.cpp (845 of 2108) PASS: lldb-unit :: Utility/./UtilityTests/StreamTeeTest.SetStreamAtIndexOutOfBounds (846 of 2108) PASS: lldb-api :: functionalities/thread/concurrent_events/TestConcurrentCrashWithBreak.py (847 of 2108) PASS: lldb-api :: functionalities/target-new-solib-notifications/TestModuleLoadedNotifys.py (848 of 2108) PASS: lldb-unit :: Utility/./UtilityTests/StreamTeeTest.Flush (849 of 2108) PASS: lldb-api :: functionalities/postmortem/minidump-new/TestMiniDumpNew.py (850 of 2108) PASS: lldb-api :: functionalities/thread/concurrent_events/TestConcurrentTwoBreakpointsOneSignal.py (851 of 2108) PASS: lldb-unit :: Utility/./UtilityTests/ArchSpecTest.TestSetTriple (852 of 2108) PASS: lldb-api :: lang/cpp/template-function/TestTemplateFunctions.py (853 of 2108) PASS: lldb-unit :: Utility/./UtilityTests/UriParserTest.BracketedHostnameWithPortIPv4 (854 of 2108) PASS: lldb-unit :: Utility/./UtilityTests/StringListTest.JoinSingle (855 of 2108) PASS: lldb-unit :: Utility/./UtilityTests/StringListTest.JoinMultiCharSeparator (856 of 2108) PASS: lldb-api :: python_api/module_section/TestModuleAndSection.py (857 of 2108) PASS: lldb-unit :: Utility/./UtilityTests/RangeTest.EqualInvalid (858 of 2108) PASS: lldb-api :: python_api/disassemble-raw-data/TestDisassembleRawData.py (859 of 2108) PASS: lldb-api :: commands/expression/pr35310/TestExprsBug35310.py (860 of 2108) PASS: lldb-unit :: SymbolFile/DWARF/./SymbolFileDWARFTests/SymbolFileDWARFTests.TestAbbrevNullAttrValidForm (861 of 2108) PASS: lldb-unit :: Utility/./UtilityTests/StringExtractorTest.DecodeHexU8_Underflow2 (862 of 2108) PASS: lldb-unit :: Utility/./UtilityTests/ConstStringTest.UpdateMangledCounterpart (863 of 2108) UNSUPPORTED: lldb-shell :: ScriptInterpreter/Lua/watchpoint_callback.test (864 of 2108) UNSUPPORTED: lldb-shell :: BuildScript/toolchain-clang-cl.test (865 of 2108) PASS: lldb-api :: functionalities/data-formatter/setvaluefromcstring/TestSetValueFromCString.py (866 of 2108) UNSUPPORTED: lldb-api :: functionalities/data-formatter/data-formatter-stl/libstdcpp/list/TestDataFormatterStdList.py (867 of 2108) PASS: lldb-unit :: Editline/./EditlineTests/EditlineTestFixture.EditlineReceivesMultiLineText (868 of 2108) PASS: lldb-shell :: SymbolFile/Breakpad/line-table-discontinuous-file-ids.test (869 of 2108) PASS: lldb-api :: functionalities/data-formatter/data-formatter-cpp/TestDataFormatterCpp.py (870 of 2108) PASS: lldb-unit :: Utility/./UtilityTests/ProcessInstanceInfo.DumpTable (871 of 2108) PASS: lldb-unit :: Utility/./UtilityTests/StreamTest.AddressSize (872 of 2108) PASS: lldb-api :: functionalities/data-formatter/data-formatter-objc/TestDataFormatterObjCNSContainer.py (873 of 2108) PASS: lldb-api :: functionalities/testid/TestTestId.py (874 of 2108) PASS: lldb-api :: functionalities/thread/concurrent_events/TestConcurrentWatchpointDelayWatchpointOneBreakpoint.py (875 of 2108) PASS: lldb-unit :: Utility/./UtilityTests/StreamTest.PutCString (876 of 2108) PASS: lldb-unit :: Utility/./UtilityTests/StreamTeeTest.CopyConstructor (877 of 2108) PASS: lldb-api :: lang/cpp/namespace/TestNamespaceLookup.py (878 of 2108) PASS: lldb-shell :: Breakpoint/single-file-split-dwarf.test (879 of 2108) PASS: lldb-unit :: Utility/./UtilityTests/ScalarTest.ExtractBitfield (880 of 2108) PASS: lldb-api :: sample_test/TestSampleInlineTest.py (881 of 2108) PASS: lldb-unit :: Utility/./UtilityTests/FileSpecTest.FileAndDirectoryComponents (882 of 2108) PASS: lldb-shell :: SymbolFile/DWARF/DW_OP_piece-struct.s (883 of 2108) UNSUPPORTED: lldb-api :: functionalities/data-formatter/data-formatter-stl/libstdcpp/string/TestDataFormatterStdString.py (884 of 2108) PASS: lldb-unit :: Utility/./UtilityTests/StreamTeeTest.GetStreamAtIndexOutOfBoundsEmpty (885 of 2108) PASS: lldb-unit :: Host/./HostTests/Host.GetEnvironment (886 of 2108) PASS: lldb-unit :: Utility/./UtilityTests/ArgsTest.TestUnknownEscape (887 of 2108) PASS: lldb-api :: lang/c/blocks/TestBlocks.py (888 of 2108) PASS: lldb-api :: python_api/value/change_values/TestChangeValueAPI.py (889 of 2108) PASS: lldb-api :: lang/cpp/extern_c/TestExternCSymbols.py (890 of 2108) PASS: lldb-api :: tools/lldb-server/TestLldbGdbServer.py (891 of 2108) PASS: lldb-unit :: UnwindAssembly/x86/./UnwindAssemblyx86Tests/Testx86AssemblyInspectionEngine.TestPopRBPWithREX (892 of 2108) PASS: lldb-unit :: Process/minidump/./LLDBMinidumpTests/MinidumpParserTest.GetPidWow64 (893 of 2108) PASS: lldb-unit :: Expression/./ExpressionTests/DiagnosticManagerTest.PutString (894 of 2108) PASS: lldb-api :: functionalities/data-formatter/data-formatter-objc/TestDataFormatterObjCNSData.py (895 of 2108) PASS: lldb-unit :: Host/./HostTests/File.GetStreamFromDescriptor (896 of 2108) PASS: lldb-shell :: SymbolFile/DWARF/find-basic-namespace.cpp (897 of 2108) PASS: lldb-unit :: Utility/./UtilityTests/FileSpecTest.OperatorBool (898 of 2108) PASS: lldb-api :: lang/cpp/gmodules/TestWithModuleDebugging.py (899 of 2108) PASS: lldb-unit :: Utility/./UtilityTests/DataExtractorTest.GetSLEB128_bit63 (900 of 2108) PASS: lldb-unit :: Utility/./UtilityTests/ArchSpecTest.TestParseMachCPUDashSubtypeTripleSimple (901 of 2108) PASS: lldb-unit :: debugserver/./debugserverTests/RNBSocket.LoopBackConnectIPv4 (902 of 2108) PASS: lldb-api :: functionalities/data-formatter/data-formatter-stl/libcxx/list/loop/TestDataFormatterLibcxxListLoop.py (903 of 2108) PASS: lldb-api :: functionalities/data-formatter/type_summary_list_script/TestTypeSummaryListScript.py (904 of 2108) PASS: lldb-unit :: Host/./HostTests/File.GetWaitableHandleFileno (905 of 2108) PASS: lldb-api :: lang/cpp/this_class_type_mixing/TestThisClassTypeMixing.py (906 of 2108) PASS: lldb-unit :: Utility/./UtilityTests/RecordReplayTest.InstrumentedBarPtr (907 of 2108) PASS: lldb-unit :: Utility/./UtilityTests/AnsiTerminal.Incomplete (908 of 2108) PASS: lldb-unit :: Utility/./UtilityTests/ArgsTest.StringListConstructor (909 of 2108) PASS: lldb-unit :: Utility/./UtilityTests/Flags.Reset (910 of 2108) PASS: lldb-api :: functionalities/breakpoint/consecutive_breakpoints/TestConsecutiveBreakpoints.py (911 of 2108) PASS: lldb-api :: lang/cpp/frame-var-anon-unions/TestFrameVariableAnonymousUnions.py (912 of 2108) PASS: lldb-unit :: Utility/./UtilityTests/RangeDataVector.FindEntryIndexesThatContain_Overlap (913 of 2108) PASS: lldb-api :: python_api/process/TestProcessAPI.py (914 of 2108) PASS: lldb-unit :: Utility/./UtilityTests/StringListTest.ShiftCString (915 of 2108) PASS: lldb-api :: functionalities/plugins/command_plugin/TestPluginCommands.py (916 of 2108) PASS: lldb-api :: functionalities/data-formatter/data-formatter-enum-format/TestDataFormatterEnumFormat.py (917 of 2108) PASS: lldb-unit :: Utility/./UtilityTests/StreamTest.AddressPrefix (918 of 2108) PASS: lldb-api :: commands/expression/calculator_mode/TestCalculatorMode.py (919 of 2108) PASS: lldb-api :: functionalities/thread/concurrent_events/TestConcurrentTwoBreakpointsOneWatchpoint.py (920 of 2108) PASS: lldb-unit :: Expression/./ExpressionTests/DWARFExpression.DW_OP_stack_value (921 of 2108) PASS: lldb-shell :: ScriptInterpreter/None/import_module.test (922 of 2108) PASS: lldb-unit :: Utility/./UtilityTests/StringLexerTest.Peek (923 of 2108) PASS: lldb-api :: tools/lldb-vscode/breakpoint/TestVSCode_setExceptionBreakpoints.py (924 of 2108) PASS: lldb-unit :: Utility/./UtilityTests/DataExtractorTest.GetCStrUnterminated (925 of 2108) PASS: lldb-unit :: Utility/./UtilityTests/FileSpecTest.Yaml (926 of 2108) PASS: lldb-unit :: Signals/./SignalsTests/UnixSignalsTest.GetInfo (927 of 2108) XFAIL: lldb-shell :: Register/x86-mm-xmm-read.test (928 of 2108) UNSUPPORTED: lldb-api :: tools/lldb-vscode/completions/TestVSCode_completions.py (929 of 2108) PASS: lldb-api :: commands/expression/import-std-module/conflicts/TestStdModuleWithConflicts.py (930 of 2108) PASS: lldb-shell :: Minidump/no-process-id.yaml (931 of 2108) PASS: lldb-api :: lang/objc/objc-new-syntax/TestObjCNewSyntaxDictionary.py (932 of 2108) UNSUPPORTED: lldb-shell :: SymbolFile/PDB/class-layout.test (933 of 2108) PASS: lldb-api :: types/TestIntegerTypeExpr.py (934 of 2108) PASS: lldb-unit :: Utility/./UtilityTests/StreamTest.PutNHex8 (935 of 2108) PASS: lldb-api :: functionalities/data-formatter/data-formatter-caching/TestDataFormatterCaching.py (936 of 2108) PASS: lldb-api :: functionalities/data-formatter/data-formatter-stl/libcxx/tuple/TestDataFormatterLibcxxTuple.py (937 of 2108) PASS: lldb-unit :: Process/gdb-remote/./ProcessGdbRemoteTests/GDBRemoteCommunicationClientTest.TestPacketSpeedJSON (938 of 2108) PASS: lldb-api :: functionalities/gdb_remote_client/TestqOffsets.py (939 of 2108) PASS: lldb-shell :: ScriptInterpreter/None/none.test (940 of 2108) PASS: lldb-unit :: Host/./HostTests/SocketAddressTest.Set (941 of 2108) PASS: lldb-unit :: Host/./HostTests/NativeProcessProtocolTest.ReadCStringFromMemory_CrossPageBoundary (942 of 2108) PASS: lldb-shell :: Settings/TestStopCommandSourceOnError.test (943 of 2108) PASS: lldb-api :: lang/cpp/char1632_t/TestChar1632T.py (944 of 2108) PASS: lldb-unit :: Utility/./UtilityTests/ArgsTest.ReplaceArgumentAtIndexFarOutOfRange (945 of 2108) PASS: lldb-unit :: Host/./HostTests/FileSystemTest.OpenErrno (946 of 2108) PASS: lldb-api :: functionalities/data-formatter/synthcapping/TestSyntheticCapping.py (947 of 2108) PASS: lldb-shell :: SymbolFile/DWARF/DW_OP_piece-smaller-than-struct.s (948 of 2108) PASS: lldb-api :: functionalities/thread/concurrent_events/TestConcurrentWatchBreak.py (949 of 2108) PASS: lldb-unit :: Utility/./UtilityTests/LogChannelTest.Enable (950 of 2108) PASS: lldb-unit :: Utility/./UtilityTests/ScalarTest.Equality (951 of 2108) PASS: lldb-api :: lang/objc/modules/TestObjCModules.py (952 of 2108) PASS: lldb-shell :: ObjectFile/ELF/compressed-sections.yaml (953 of 2108) PASS: lldb-unit :: debugserver/./debugserverTests/RNBSocket.LoopBackListenIPv4 (954 of 2108) PASS: lldb-unit :: Utility/./UtilityTests/RangeTest.Slide (955 of 2108) PASS: lldb-unit :: Utility/./UtilityTests/DataExtractorTest.GetMaxU64_unchecked (956 of 2108) PASS: lldb-unit :: Utility/./UtilityTests/VMRange.SetEndAddress (957 of 2108) PASS: lldb-unit :: Language/Highlighting/./HighlighterTests/HighlighterTest.ClangComments (958 of 2108) PASS: lldb-unit :: Utility/./UtilityTests/StringListTest.GetMaxStringLengthDecreasingSize (959 of 2108) PASS: lldb-unit :: Utility/./UtilityTests/ScalarTest.CastOperations (960 of 2108) PASS: lldb-unit :: Utility/./UtilityTests/UriParserTest.LongPath (961 of 2108) PASS: lldb-api :: macosx/lc-note/kern-ver-str/TestKernVerStrLCNOTE.py (962 of 2108) PASS: lldb-unit :: Utility/./UtilityTests/ArgsTest.ReplaceArgumentAtIndexShort (963 of 2108) PASS: lldb-api :: lang/cpp/template-specialization-type/TestTemplateSpecializationType.py (964 of 2108) PASS: lldb-unit :: ScriptInterpreter/Python/./ScriptInterpreterPythonTests/PythonDataObjectsTest.TestDictionaryResolutionWithDot (965 of 2108) PASS: lldb-shell :: Reproducer/TestReuseDirectory.test (966 of 2108) PASS: lldb-unit :: Host/./HostTests/ConnectionFileDescriptorTest.TCPGetURIv6 (967 of 2108) PASS: lldb-unit :: Utility/./UtilityTests/RangeTest.DefaultConstructor (968 of 2108) PASS: lldb-shell :: Driver/TestUseColor.test (969 of 2108) PASS: lldb-unit :: Utility/./UtilityTests/StringListTest.PopBack (970 of 2108) PASS: lldb-unit :: Expression/./ExpressionTests/ClangHostTest.ComputeClangResourceDirectory (971 of 2108) PASS: lldb-api :: commands/platform/basic/TestPlatformPython.py (972 of 2108) UNSUPPORTED: lldb-shell :: Register/x86-64-zmm-read.test (973 of 2108) PASS: lldb-unit :: Utility/./UtilityTests/StreamTest.ShiftOperatorStrings (974 of 2108) PASS: lldb-shell :: ScriptInterpreter/Python/crashlog.test (975 of 2108) PASS: lldb-unit :: Process/gdb-remote/./ProcessGdbRemoteTests/GDBRemoteCommunicationClientTest.GetMemoryRegionInfoInvalidResponse (976 of 2108) PASS: lldb-unit :: Utility/./UtilityTests/BinaryStreamTest.PutSLEB128MaxValue (977 of 2108) PASS: lldb-api :: commands/command/script/TestCommandScript.py (978 of 2108) PASS: lldb-unit :: Utility/./UtilityTests/RangeTest.ContainsEndInclusive (979 of 2108) PASS: lldb-unit :: Process/gdb-remote/./ProcessGdbRemoteTests/GDBRemoteCommunicationServerTest.SendErrorResponse_UnimplementedError (980 of 2108) PASS: lldb-unit :: ObjectFile/Breakpad/./ObjectFileBreakpadTests/FileRecord.parse (981 of 2108) PASS: lldb-api :: python_api/function_symbol/TestSymbolAPI.py (982 of 2108) PASS: lldb-api :: functionalities/data-formatter/vector-types/TestVectorTypesFormatting.py (983 of 2108) PASS: lldb-api :: functionalities/gdb_remote_client/TestWriteMemory.py (984 of 2108) PASS: lldb-shell :: SymbolFile/DWARF/find-basic-type.cpp (985 of 2108) PASS: lldb-shell :: SymbolFile/DWARF/dwp-debug-types.s (986 of 2108) PASS: lldb-unit :: Utility/./UtilityTests/StreamTest.PutMaxHex64ByteOrderBig (987 of 2108) PASS: lldb-api :: macosx/find-dsym/bundle-with-dot-in-filename/TestBundleWithDotInFilename.py (988 of 2108) PASS: lldb-api :: lang/cpp/virtual-overload/TestVirtualOverload.py (989 of 2108) PASS: lldb-unit :: Process/gdb-remote/./ProcessGdbRemoteTests/GDBRemoteClientBaseTest.InterruptNoResponse (990 of 2108) PASS: lldb-api :: functionalities/recursion/TestValueObjectRecursion.py (991 of 2108) PASS: lldb-api :: commands/settings/use_source_cache/TestUseSourceCache.py (992 of 2108) PASS: lldb-api :: commands/process/signal/TestProcessSignal.py (993 of 2108) PASS: lldb-api :: commands/expression/import-std-module/vector-bool/TestVectorBoolFromStdModule.py (994 of 2108) PASS: lldb-shell :: SymbolFile/NativePDB/ast-functions.cpp (995 of 2108) PASS: lldb-api :: functionalities/source-map/TestTargetSourceMap.py (996 of 2108) UNSUPPORTED: lldb-shell :: ScriptInterpreter/Lua/independent_state.test (997 of 2108) PASS: lldb-shell :: SymbolFile/Breakpad/unwind-via-stack-win-no-memory-info.yaml (998 of 2108) PASS: lldb-unit :: Utility/./UtilityTests/SubsystemRAIITest.SubsystemWithErrorFailure (999 of 2108) PASS: lldb-api :: python_api/lldbutil/iter/TestLLDBIterator.py (1000 of 2108) PASS: lldb-shell :: ObjectFile/ELF/minidebuginfo-corrupt-xz.yaml (1001 of 2108) PASS: lldb-unit :: UnwindAssembly/x86/./UnwindAssemblyx86Tests/Testx86AssemblyInspectionEngine.TestDisassemblyJunkBytes (1002 of 2108) PASS: lldb-api :: functionalities/postmortem/wow64_minidump/TestWow64MiniDump.py (1003 of 2108) PASS: lldb-unit :: Utility/./UtilityTests/BinaryStreamTest.PutSLEB128FiveBytes (1004 of 2108) PASS: lldb-shell :: Reproducer/TestDiscard.test (1005 of 2108) UNSUPPORTED: lldb-api :: macosx/macCatalystAppMacOSFramework/TestMacCatalystAppWithMacOSFramework.py (1006 of 2108) PASS: lldb-unit :: Target/./TargetTests/ExecutionContextTest.GetByteOrderProcess (1007 of 2108) PASS: lldb-unit :: Utility/./UtilityTests/ScalarTest.ComparisonFloat (1008 of 2108) PASS: lldb-unit :: UnwindAssembly/x86/./UnwindAssemblyx86Tests/Testx86AssemblyInspectionEngine.TestCALLNextInsn (1009 of 2108) PASS: lldb-shell :: ObjectFile/ELF/minidebuginfo-find-symbols.yaml (1010 of 2108) PASS: lldb-unit :: Expression/./ExpressionTests/DiagnosticManagerTest.AppendMessageAttachToLastDiag (1011 of 2108) PASS: lldb-unit :: Utility/./UtilityTests/StringExtractorTest.GetU64LittleEndian (1012 of 2108) PASS: lldb-unit :: Utility/./UtilityTests/DataExtractorTest.GetULEB128_bit63 (1013 of 2108) PASS: lldb-shell :: SymbolFile/Breakpad/line-table-mixed-path-styles.test (1014 of 2108) PASS: lldb-unit :: Process/minidump/./LLDBMinidumpTests/MinidumpParserTest.FindMemoryRange (1015 of 2108) PASS: lldb-api :: python_api/class_members/TestSBTypeClassMembers.py (1016 of 2108) PASS: lldb-api :: lang/cpp/incomplete-types/TestCppIncompleteTypes.py (1017 of 2108) UNSUPPORTED: lldb-shell :: SymbolFile/NativePDB/typedefs.cpp (1018 of 2108) PASS: lldb-api :: commands/expression/call-function/TestCallStopAndContinue.py (1019 of 2108) PASS: lldb-api :: functionalities/inline-stepping/TestInlineStepping.py (1020 of 2108) PASS: lldb-shell :: Breakpoint/debug_rnglistx_rlex.test (1021 of 2108) PASS: lldb-unit :: Utility/./UtilityTests/StringExtractorTest.GetHexU8_Underflow (1022 of 2108) XFAIL: lldb-shell :: Register/x86-64-ymm-write.test (1023 of 2108) UNSUPPORTED: lldb-shell :: SymbolFile/DWARF/debug-types-expressions.test (1024 of 2108) PASS: lldb-api :: functionalities/thread/concurrent_events/TestConcurrentDelayWatchBreak.py (1025 of 2108) PASS: lldb-shell :: Minidump/memory-region.yaml (1026 of 2108) PASS: lldb-api :: commands/process/attach-resume/TestAttachResume.py (1027 of 2108) PASS: lldb-unit :: Language/Highlighting/./HighlighterTests/HighlighterTest.ClangCursorPos (1028 of 2108) PASS: lldb-api :: types/TestDoubleTypes.py (1029 of 2108) PASS: lldb-unit :: Utility/./UtilityTests/AnsiTerminal.AtStart (1030 of 2108) PASS: lldb-unit :: Utility/./UtilityTests/StreamTest.Indent (1031 of 2108) PASS: lldb-unit :: Language/Highlighting/./HighlighterTests/HighlighterTest.ClangIdentifiers (1032 of 2108) PASS: lldb-api :: commands/target/dump-symtab-demangle/TestDumpSymtabDemangle.py (1033 of 2108) PASS: lldb-shell :: SymbolFile/DWARF/find-variable-dwo.cpp (1034 of 2108) PASS: lldb-api :: functionalities/process_group/TestChangeProcessGroup.py (1035 of 2108) PASS: lldb-unit :: Utility/./UtilityTests/StringListTest.AppendListCStringArrayEmpty (1036 of 2108) UNSUPPORTED: lldb-shell :: Register/aarch64-gp-read.test (1037 of 2108) PASS: lldb-api :: functionalities/mtc/simple/TestMTCSimple.py (1038 of 2108) PASS: lldb-unit :: Utility/./UtilityTests/OptionsWithRawTest.EmptySuffix (1039 of 2108) PASS: lldb-unit :: Utility/./UtilityTests/SerializationRountripTest.SerializeDeserializePod (1040 of 2108) PASS: lldb-shell :: SymbolFile/DWARF/debug_aranges-empty-section.s (1041 of 2108) PASS: lldb-shell :: SymbolFile/DWARF/debug_loclists-dwo.s (1042 of 2108) PASS: lldb-api :: commands/expression/inline-namespace/TestInlineNamespace.py (1043 of 2108) PASS: lldb-api :: commands/expression/namespace_local_var_same_name_obj_c/TestNamespaceLocalVarSameNameObjC.py (1044 of 2108) PASS: lldb-api :: commands/command/script_alias/TestCommandScriptAlias.py (1045 of 2108) PASS: lldb-api :: lang/objc/objc-class-method/TestObjCClassMethod.py (1046 of 2108) PASS: lldb-unit :: Utility/./UtilityTests/CompletionRequest.FakeLastArg (1047 of 2108) PASS: lldb-shell :: Unwind/trap_frame_sym_ctx.test (1048 of 2108) PASS: lldb-api :: python_api/frame/get-variables/TestGetVariables.py (1049 of 2108) PASS: lldb-api :: functionalities/breakpoint/breakpoint_command/TestRegexpBreakCommand.py (1050 of 2108) PASS: lldb-unit :: Target/./TargetTests/PathMappingListTest.RemapRoot (1051 of 2108) PASS: lldb-api :: lang/objc/modules-compile-error/TestModulesCompileError.py (1052 of 2108) PASS: lldb-unit :: Utility/./UtilityTests/Flags.AnyClear (1053 of 2108) PASS: lldb-api :: commands/apropos/with-process/TestAproposWithProcess.py (1054 of 2108) PASS: lldb-unit :: Symbol/./SymbolTests/TestTypeSystemClang.TestGetEnumIntegerTypeBasicTypes (1055 of 2108) PASS: lldb-api :: lang/objc/objc-builtin-types/TestObjCBuiltinTypes.py (1056 of 2108) PASS: lldb-unit :: Utility/./UtilityTests/StringExtractorTest.GetU64BigEndian (1057 of 2108) PASS: lldb-unit :: Process/minidump/./LLDBMinidumpTests/MinidumpParserTest.MinidumpDuplicateModuleMinAddress (1058 of 2108) PASS: lldb-unit :: Utility/./UtilityTests/StreamTest.ShiftOperatorChars (1059 of 2108) PASS: lldb-unit :: Utility/./UtilityTests/StreamTest.PutCharNull (1060 of 2108) PASS: lldb-shell :: SymbolFile/DWARF/debug-line-basic.s (1061 of 2108) PASS: lldb-unit :: Symbol/./SymbolTests/TestTypeSystemClang.TestGetTypeClassNested (1062 of 2108) PASS: lldb-unit :: Utility/./UtilityTests/StreamTest.PutHex8 (1063 of 2108) PASS: lldb-unit :: Utility/./UtilityTests/ConstStringTest.NullAndEmptyStates (1064 of 2108) PASS: lldb-api :: commands/expression/result_numbering/TestResultNumbering.py (1065 of 2108) PASS: lldb-api :: functionalities/wrong_commands/TestWrongCommands.py (1066 of 2108) PASS: lldb-unit :: Utility/./UtilityTests/ArgsTest.ReplaceArgumentAtIndexLonger (1067 of 2108) PASS: lldb-api :: functionalities/thread/thread_specific_break/TestThreadSpecificBreakpoint.py (1068 of 2108) PASS: lldb-api :: commands/process/launch-with-shellexpand/TestLaunchWithShellExpand.py (1069 of 2108) PASS: lldb-api :: functionalities/data-formatter/data-formatter-stl/libcxx/function/TestLibCxxFunction.py (1070 of 2108) PASS: lldb-shell :: SymbolFile/DWARF/win-i386-line-table.s (1071 of 2108) PASS: lldb-api :: functionalities/unwind/noreturn/TestNoreturnUnwind.py (1072 of 2108) PASS: lldb-unit :: Utility/./UtilityTests/StructuredDataTest.ParseJSONFromFile (1073 of 2108) PASS: lldb-unit :: Utility/./UtilityTests/PassiveReplayTest.InstrumentedFoo (1074 of 2108) PASS: lldb-shell :: ObjectFile/ELF/basic-info.yaml (1075 of 2108) PASS: lldb-unit :: Utility/./UtilityTests/AnsiTerminal.WhiteSpace (1076 of 2108) PASS: lldb-unit :: UnwindAssembly/x86/./UnwindAssemblyx86Tests/Testx86AssemblyInspectionEngine.TestSimple64bitFrameFunction (1077 of 2108) PASS: lldb-unit :: Process/minidump/./LLDBMinidumpTests/MinidumpParserTest.GetMemory (1078 of 2108) PASS: lldb-api :: functionalities/gdb_remote_client/TestTargetXMLArch.py (1079 of 2108) PASS: lldb-api :: lang/c/step-target/TestStepTarget.py (1080 of 2108) PASS: lldb-api :: commands/expression/persistent_ptr_update/TestPersistentPtrUpdate.py (1081 of 2108) PASS: lldb-unit :: Utility/./UtilityTests/StreamTest.PutHex32ByteOrderBig (1082 of 2108) PASS: lldb-api :: commands/expression/entry-bp/TestExprEntryBP.py (1083 of 2108) PASS: lldb-unit :: Utility/./UtilityTests/FileSpecTest.EqualSeparator (1084 of 2108) PASS: lldb-shell :: SymbolFile/DWARF/debug-types-missing-signature.test (1085 of 2108) PASS: lldb-shell :: SymbolFile/DWARF/module-ownership.mm (1086 of 2108) PASS: lldb-unit :: Host/./HostTests/FileSystemTest.Exists (1087 of 2108) PASS: lldb-unit :: Target/./TargetTests/ModuleCacheTest.GetAndPutStrangeHostname (1088 of 2108) PASS: lldb-unit :: ObjectFile/Breakpad/./ObjectFileBreakpadTests/FuncRecord.parse (1089 of 2108) PASS: lldb-shell :: Quit/TestQuitExitCode-30.test (1090 of 2108) PASS: lldb-api :: functionalities/step-avoids-no-debug/TestStepNoDebug.py (1091 of 2108) PASS: lldb-unit :: Interpreter/./InterpreterTests/OptionValueFileColonLine.setFromString (1092 of 2108) PASS: lldb-api :: commands/expression/import-std-module/sysroot/TestStdModuleSysroot.py (1093 of 2108) PASS: lldb-api :: commands/expression/ir-interpreter-phi-nodes/TestIRInterpreterPHINodes.py (1094 of 2108) PASS: lldb-api :: functionalities/postmortem/elf-core/TestLinuxCore.py (1095 of 2108) PASS: lldb-api :: lang/cpp/bitfields/TestCppBitfields.py (1096 of 2108) PASS: lldb-shell :: ObjectFile/PECOFF/symbol.yaml (1097 of 2108) UNSUPPORTED: lldb-shell :: BuildScript/toolchain-msvc.test (1098 of 2108) PASS: lldb-unit :: Platform/./LLDBPlatformTests/PlatformDarwinTest.TestParseVersionBuildDir (1099 of 2108) PASS: lldb-unit :: DataFormatter/./LLDBFormatterTests/StringPrinterTests.CxxASCII (1100 of 2108) PASS: lldb-api :: functionalities/breakpoint/comp_dir_symlink/TestCompDirSymLink.py (1101 of 2108) UNSUPPORTED: lldb-api :: arm/breakpoint-thumb-codesection/TestBreakpointThumbCodesection.py (1102 of 2108) PASS: lldb-shell :: Quit/TestQuitExitCodeHexA.test (1103 of 2108) UNSUPPORTED: lldb-api :: tools/intel-features/intel-pt/test/TestIntelPTSimpleBinary.py (1104 of 2108) PASS: lldb-api :: api/listeners/TestListener.py (1105 of 2108) UNSUPPORTED: lldb-api :: functionalities/darwin_log/filter/regex/subsystem/TestDarwinLogFilterRegexSubsystem.py (1106 of 2108) PASS: lldb-api :: lang/cpp/namespace_conflicts/TestNamespaceConflicts.py (1107 of 2108) PASS: lldb-unit :: Utility/./UtilityTests/NameMatchesTest.Equals (1108 of 2108) PASS: lldb-api :: lang/cpp/stl/TestSTL.py (1109 of 2108) PASS: lldb-unit :: Utility/./UtilityTests/OptionsWithRawTest.SingleWhitespaceInput (1110 of 2108) PASS: lldb-unit :: Utility/./UtilityTests/TimerTest.CategoryTimesStats (1111 of 2108) PASS: lldb-api :: functionalities/data-formatter/data-formatter-objc/cmtime/TestDataFormatterCMTime.py (1112 of 2108) PASS: lldb-api :: commands/frame/var-scope/TestFrameVariableScope.py (1113 of 2108) PASS: lldb-api :: functionalities/gdb_remote_client/TestArmRegisterDefinition.py (1114 of 2108) PASS: lldb-unit :: Host/./HostTests/FileSystemTest.GetByteSize (1115 of 2108) PASS: lldb-shell :: Commands/command-target-modules-dump-sections.yaml (1116 of 2108) PASS: lldb-unit :: tools/lldb-server/tests/./LLDBServerTests/TestBase.LaunchModePreservesEnvironment (1117 of 2108) PASS: lldb-api :: lang/objc/foundation/TestObjCMethods2.py (1118 of 2108) PASS: lldb-unit :: Expression/./ExpressionTests/CppModuleConfigurationTest.Linux (1119 of 2108) UNSUPPORTED: lldb-api :: functionalities/process_save_core/TestProcessSaveCore.py (1120 of 2108) PASS: lldb-unit :: Interpreter/./InterpreterTests/CompletionTest.DirCompletionAbsolute (1121 of 2108) PASS: lldb-unit :: Utility/./UtilityTests/BinaryStreamTest.PutULEB128EightBytes (1122 of 2108) PASS: lldb-api :: python_api/frame/TestFrames.py (1123 of 2108) PASS: lldb-shell :: Commands/command-disassemble-process.yaml (1124 of 2108) UNSUPPORTED: lldb-shell :: SymbolFile/PDB/enums-layout.test (1125 of 2108) PASS: lldb-unit :: Utility/./UtilityTests/Flags.Clear (1126 of 2108) PASS: lldb-api :: functionalities/breakpoint/inlined_breakpoints/TestInlinedBreakpoints.py (1127 of 2108) PASS: lldb-api :: lang/cpp/type_lookup/TestCppTypeLookup.py (1128 of 2108) PASS: lldb-api :: lang/cpp/operator-overload/TestOperatorOverload.py (1129 of 2108) PASS: lldb-api :: commands/target/stop-hooks/TestStopHooks.py (1130 of 2108) PASS: lldb-unit :: Utility/./UtilityTests/ArgsTest.TestOverwriteArgs (1131 of 2108) PASS: lldb-unit :: Utility/./UtilityTests/StatusTest.ErrorConversion (1132 of 2108) PASS: lldb-api :: commands/expression/dollar-in-variable/TestDollarInVariable.py (1133 of 2108) PASS: lldb-unit :: Utility/./UtilityTests/OptionsWithRawTest.WhitespaceSuffix (1134 of 2108) PASS: lldb-unit :: Utility/./UtilityTests/AnsiTerminal.Basic (1135 of 2108) UNSUPPORTED: lldb-shell :: SymbolFile/PDB/type-quals.test (1136 of 2108) PASS: lldb-unit :: Host/./HostTests/FileSystemTest.MakeAbsolute (1137 of 2108) PASS: lldb-unit :: Utility/./UtilityTests/RangeTest.ClearWithStarAddress (1138 of 2108) PASS: lldb-unit :: SymbolFile/NativePDB/./SymbolFileNativePDBTests/PDBFPOProgramToDWARFExpressionTests.InvalidAssignmentSingle (1139 of 2108) PASS: lldb-unit :: UnwindAssembly/x86/./UnwindAssemblyx86Tests/Testx86AssemblyInspectionEngine.Testi386IgnoredRegisters (1140 of 2108) PASS: lldb-api :: functionalities/breakpoint/breakpoint_command/TestBreakpointCommand.py (1141 of 2108) PASS: lldb-api :: commands/expression/completion-crash-incomplete-record/TestCompletionCrashIncompleteRecord.py (1142 of 2108) UNSUPPORTED: lldb-shell :: Register/x86-gp-read.test (1143 of 2108) PASS: lldb-api :: functionalities/data-formatter/data-formatter-script/TestDataFormatterScript.py (1144 of 2108) PASS: lldb-api :: commands/command/nested_alias/TestNestedAlias.py (1145 of 2108) PASS: lldb-api :: functionalities/thread/concurrent_events/TestConcurrentSignalBreak.py (1146 of 2108) PASS: lldb-api :: python_api/value/empty_class/TestValueAPIEmptyClass.py (1147 of 2108) PASS: lldb-shell :: ObjectFile/PECOFF/invalid-export-table.yaml (1148 of 2108) PASS: lldb-api :: macosx/thread-names/TestInterruptThreadNames.py (1149 of 2108) PASS: lldb-unit :: Utility/./UtilityTests/OptionsWithRawTest.EmptySuffixSingleWhitespace (1150 of 2108) PASS: lldb-unit :: Utility/./UtilityTests/StreamTest.AddressSuffix (1151 of 2108) PASS: lldb-api :: commands/watchpoints/watchpoint_on_vectors/TestValueOfVectorVariable.py (1152 of 2108) PASS: lldb-unit :: Expression/./ExpressionTests/DWARFExpression.DW_OP_pick (1153 of 2108) PASS: lldb-unit :: Utility/./UtilityTests/ReproducerTest.SetReplay (1154 of 2108) PASS: lldb-shell :: SymbolFile/DWARF/childless-compile-unit.s (1155 of 2108) PASS: lldb-api :: functionalities/gdb_remote_client/TestIOSSimulator.py (1156 of 2108) PASS: lldb-api :: functionalities/data-formatter/parray/TestPrintArray.py (1157 of 2108) PASS: lldb-unit :: Process/minidump/./LLDBMinidumpTests/MinidumpParserTest.GetArchitecture (1158 of 2108) PASS: lldb-api :: lang/cpp/unicode-literals/TestUnicodeLiterals.py (1159 of 2108) PASS: lldb-api :: commands/expression/import-std-module/weak_ptr-dbg-info-content/TestDbgInfoContentWeakPtrFromStdModule.py (1160 of 2108) PASS: lldb-api :: lang/cpp/operators/TestCppOperators.py (1161 of 2108) PASS: lldb-unit :: Process/minidump/./LLDBMinidumpTests/MinidumpParserTest.GetMemoryRegionInfoFromMemory64List (1162 of 2108) PASS: lldb-unit :: Symbol/./SymbolTests/TestTypeSystemClang.TestIsClangType (1163 of 2108) PASS: lldb-api :: tools/lldb-server/commandline/TestStubSetSID.py (1164 of 2108) PASS: lldb-api :: functionalities/breakpoint/breakpoint_set_restart/TestBreakpointSetRestart.py (1165 of 2108) PASS: lldb-api :: commands/command/script/import/rdar-12586188/TestRdar12586188.py (1166 of 2108) PASS: lldb-api :: python_api/get-value-32bit-int/TestGetValue32BitInt.py (1167 of 2108) PASS: lldb-shell :: Settings/TestModuleCacheSanity.test (1168 of 2108) UNSUPPORTED: lldb-api :: lang/cpp/static_members/TestCPPStaticMembers.py (1169 of 2108) PASS: lldb-unit :: Symbol/./SymbolTests/TestTypeSystemClang.TestGetEnumIntegerTypeUnexpectedType (1170 of 2108) PASS: lldb-unit :: ScriptInterpreter/Python/./ScriptInterpreterPythonTests/PythonDataObjectsTest.TestPythonTupleValues (1171 of 2108) PASS: lldb-api :: lang/cpp/inlines/TestInlines.py (1172 of 2108) UNSUPPORTED: lldb-api :: benchmarks/continue/TestBenchmarkContinue.py (1173 of 2108) PASS: lldb-unit :: Utility/./UtilityTests/StringListTest.SplitIntoLinesSingleTrailingCR (1174 of 2108) PASS: lldb-unit :: UnwindAssembly/x86/./UnwindAssemblyx86Tests/Testx86AssemblyInspectionEngine.TestStackRealign8BitDisp_i386 (1175 of 2108) PASS: lldb-unit :: Expression/./ExpressionTests/CppModuleConfigurationTest.AmbiguousCLib (1176 of 2108) PASS: lldb-unit :: DataFormatter/./LLDBFormatterTests/TypeMatcherTests.RegexMatchPart (1177 of 2108) PASS: lldb-unit :: Host/./HostTests/FileSystemTest.GetPermissions (1178 of 2108) PASS: lldb-api :: commands/expression/radar_9673664/TestExprHelpExamples.py (1179 of 2108) PASS: lldb-unit :: Core/./LLDBCoreTests/StreamCallbackTest.Callback (1180 of 2108) PASS: lldb-api :: commands/expression/weak_symbols/TestWeakSymbols.py (1181 of 2108) PASS: lldb-unit :: Process/gdb-remote/./ProcessGdbRemoteTests/GDBRemoteCommunicationServerTest.SendErrorResponse_ErrorNumber (1182 of 2108) PASS: lldb-unit :: Utility/./UtilityTests/FileSpecTest.EqualDotsWindows (1183 of 2108) PASS: lldb-shell :: Minidump/Windows/broken-unwind.test (1184 of 2108) PASS: lldb-shell :: SymbolFile/Breakpad/line-table.test (1185 of 2108) PASS: lldb-unit :: ObjectFile/MachO/./ObjectFileMachOTests/ObjectFileMachOTest.ModuleFromSharedCacheInfo (1186 of 2108) PASS: lldb-unit :: Language/Highlighting/./HighlighterTests/HighlighterTest.ClangCursorOutOfBounds (1187 of 2108) PASS: lldb-api :: functionalities/step_scripted/TestStepScripted.py (1188 of 2108) PASS: lldb-unit :: Process/minidump/./LLDBMinidumpTests/MinidumpParserTest.GetFilteredModuleList (1189 of 2108) PASS: lldb-shell :: ObjectFile/ELF/PT_LOAD-overlap-PT_INTERP.yaml (1190 of 2108) PASS: lldb-api :: commands/expression/deleting-implicit-copy-constructor/TestDeletingImplicitCopyConstructor.py (1191 of 2108) PASS: lldb-unit :: Utility/./UtilityTests/VMRange.IsValid (1192 of 2108) PASS: lldb-unit :: Utility/./UtilityTests/VMRange.Comparison (1193 of 2108) PASS: lldb-shell :: Reproducer/TestSynchronous.test (1194 of 2108) PASS: lldb-api :: functionalities/data-formatter/data-formatter-stl/libcxx/optional/TestDataFormatterLibcxxOptional.py (1195 of 2108) PASS: lldb-api :: functionalities/process_crash_info/TestProcessCrashInfo.py (1196 of 2108) PASS: lldb-api :: functionalities/memory/read/TestMemoryRead.py (1197 of 2108) PASS: lldb-api :: functionalities/param_entry_vals/basic_entry_values/TestBasicEntryValues.py (1198 of 2108) PASS: lldb-unit :: Utility/./UtilityTests/LogTest.LLDB_LOG_nullptr (1199 of 2108) PASS: lldb-api :: commands/expression/function_template_specialization_temp_args/TestFunctionTemplateSpecializationTempArgs.py (1200 of 2108) PASS: lldb-unit :: ObjectFile/ELF/./ObjectFileELFTests/ObjectFileELFTest.SectionsResolveConsistently (1201 of 2108) PASS: lldb-unit :: ScriptInterpreter/Python/./ScriptInterpreterPythonTests/PythonDataObjectsTest.TestPythonByteArray (1202 of 2108) PASS: lldb-api :: functionalities/breakpoint/breakpoint_by_file_colon_line/TestBreakpointByFileColonLine.py (1203 of 2108) PASS: lldb-api :: lang/objc/modules-update/TestClangModulesUpdate.py (1204 of 2108) UNSUPPORTED: lldb-api :: tools/lldb-server/signal-filtering/TestGdbRemote_QPassSignals.py (1205 of 2108) PASS: lldb-api :: functionalities/data-formatter/typedef_array/TestTypedefArray.py (1206 of 2108) UNSUPPORTED: lldb-shell :: Watchpoint/netbsd-nouserdbregs.test (1207 of 2108) PASS: lldb-unit :: Utility/./UtilityTests/DataExtractorTest.GetMaxU64 (1208 of 2108) PASS: lldb-shell :: Breakpoint/jitbp_elf.test (1209 of 2108) PASS: lldb-unit :: Process/minidump/./LLDBMinidumpTests/MinidumpParserTest.GetThreadsAndGetThreadContext (1210 of 2108) PASS: lldb-api :: functionalities/thread/ignore_suspended/TestIgnoreSuspendedThread.py (1211 of 2108) UNSUPPORTED: lldb-shell :: SymbolFile/NativePDB/ast-functions-msvc.cpp (1212 of 2108) PASS: lldb-unit :: SymbolFile/DWARF/./SymbolFileDWARFTests/SymbolFileDWARFTests.TestAbbrevValidAttrNullForm (1213 of 2108) PASS: lldb-shell :: SymbolFile/DWARF/dwp.s (1214 of 2108) PASS: lldb-shell :: Reproducer/TestVersionCheck.test (1215 of 2108) PASS: lldb-api :: tools/lldb-server/TestGdbRemoteKill.py (1216 of 2108) PASS: lldb-api :: python_api/sbplatform/TestSBPlatform.py (1217 of 2108) PASS: lldb-unit :: Utility/./UtilityTests/ScalarTest.Promotion (1218 of 2108) PASS: lldb-shell :: ObjectFile/wasm/embedded-debug-sections.yaml (1219 of 2108) PASS: lldb-unit :: DataFormatter/./LLDBFormatterTests/TypeMatcherTests.GetMatchStringExactName (1220 of 2108) PASS: lldb-api :: commands/session/history/TestSessionHistory.py (1221 of 2108) PASS: lldb-unit :: Core/./LLDBCoreTests/MangledTest.ResultForBlockInvocation (1222 of 2108) UNSUPPORTED: lldb-api :: functionalities/darwin_log/format/TestDarwinLogMessageFormat.py (1223 of 2108) UNSUPPORTED: lldb-api :: tools/lldb-vscode/disconnect/TestVSCode_disconnect.py (1224 of 2108) PASS: lldb-api :: functionalities/breakpoint/source_regexp/TestSourceRegexBreakpoints.py (1225 of 2108) UNSUPPORTED: lldb-api :: commands/expression/call-restarts/TestCallThatRestarts.py (1226 of 2108) PASS: lldb-unit :: UnwindAssembly/x86/./UnwindAssemblyx86Tests/Testx86AssemblyInspectionEngine.TestPushESI (1227 of 2108) PASS: lldb-unit :: UnwindAssembly/x86/./UnwindAssemblyx86Tests/Testx86AssemblyInspectionEngine.TestPushR15 (1228 of 2108) PASS: lldb-api :: lang/objc/foundation/TestObjCMethodsNSArray.py (1229 of 2108) PASS: lldb-shell :: Settings/TestSettingsWrite.test (1230 of 2108) PASS: lldb-unit :: Utility/./UtilityTests/LogTest.Register (1231 of 2108) PASS: lldb-unit :: SymbolFile/DWARF/./SymbolFileDWARFTests/XcodeSDKModuleTests.TestModuleGetXcodeSDK (1232 of 2108) PASS: lldb-unit :: Utility/./UtilityTests/StringExtractorTest.GetHexU8_Extra_NoEof (1233 of 2108) PASS: lldb-api :: functionalities/thread/concurrent_events/TestConcurrentManyBreakpoints.py (1234 of 2108) PASS: lldb-unit :: Host/./HostTests/HostInfoTest.GetXcodeSDK (1235 of 2108) PASS: lldb-unit :: Symbol/./SymbolTests/Type.CompilerContextPattern (1236 of 2108) PASS: lldb-shell :: Breakpoint/debug_rnglist_rlestartend.test (1237 of 2108) PASS: lldb-api :: python_api/symbol-context/two-files/TestSymbolContextTwoFiles.py (1238 of 2108) PASS: lldb-unit :: Symbol/./SymbolTests/PostfixExpression.ToDWARF (1239 of 2108) PASS: lldb-api :: commands/expression/vector_of_enums/TestVectorOfEnums.py (1240 of 2108) PASS: lldb-unit :: Symbol/./SymbolTests/Type.GetTypeScopeAndBasename (1241 of 2108) PASS: lldb-api :: functionalities/thread/thread_exit/TestThreadExit.py (1242 of 2108) PASS: lldb-api :: lang/c/vla/TestVLA.py (1243 of 2108) PASS: lldb-unit :: SymbolFile/NativePDB/./SymbolFileNativePDBTests/PDBFPOProgramToDWARFExpressionTests.MissingTargetRegister (1244 of 2108) PASS: lldb-unit :: Utility/./UtilityTests/StringListTest.AppendStringCString (1245 of 2108) PASS: lldb-unit :: Utility/./UtilityTests/StreamTest.PutSLEB128 (1246 of 2108) PASS: lldb-api :: commands/expression/import-std-module/queue/TestQueueFromStdModule.py (1247 of 2108) PASS: lldb-unit :: Utility/./UtilityTests/Flags.AnySet (1248 of 2108) PASS: lldb-api :: lang/objc/objc-optimized/TestObjcOptimized.py (1249 of 2108) PASS: lldb-unit :: Utility/./UtilityTests/StringExtractorTest.GetNameColonValueNoColon (1250 of 2108) PASS: lldb-shell :: ObjectFile/PECOFF/export-dllfunc.yaml (1251 of 2108) PASS: lldb-api :: lang/objcxx/hide-runtime-values/TestObjCXXHideRuntimeValues.py (1252 of 2108) UNSUPPORTED: lldb-shell :: Register/x86-64-zmm-write.test (1253 of 2108) PASS: lldb-unit :: Utility/./UtilityTests/RangeDataVector.CustomSort (1254 of 2108) PASS: lldb-api :: lang/objcxx/cxx-bridged-po/TestObjCXXBridgedPO.py (1255 of 2108) PASS: lldb-unit :: Process/gdb-remote/./ProcessGdbRemoteTests/GDBRemoteClientBaseTest.SendPacketAndReceiveResponseWithOutputSupport (1256 of 2108) PASS: lldb-api :: lang/cpp/typeof/TestTypeOfDeclTypeExpr.py (1257 of 2108) PASS: lldb-unit :: Process/gdb-remote/./ProcessGdbRemoteTests/GDBRemoteCommunicationClientTest.GetModulesInfo_UUID20 (1258 of 2108) PASS: lldb-api :: commands/expression/test/TestExprs2.py (1259 of 2108) PASS: lldb-unit :: Symbol/./SymbolTests/TestClangASTImporter.MetadataPropagationAfterCopying (1260 of 2108) PASS: lldb-shell :: SymbolFile/DWARF/dwp-separate-debug-file.cpp (1261 of 2108) PASS: lldb-shell :: ObjectFile/ELF/section-permissions.yaml (1262 of 2108) PASS: lldb-api :: functionalities/rerun/TestRerun.py (1263 of 2108) UNSUPPORTED: lldb-shell :: Register/x86-zmm-read.test (1264 of 2108) PASS: lldb-api :: types/TestLongTypesExpr.py (1265 of 2108) PASS: lldb-api :: functionalities/data-formatter/array_typedef/TestArrayTypedef.py (1266 of 2108) PASS: lldb-api :: commands/frame/diagnose/dereference-argument/TestDiagnoseDereferenceArgument.py (1267 of 2108) UNSUPPORTED: lldb-shell :: SymbolFile/dissassemble-entry-point.s (1268 of 2108) PASS: lldb-api :: tools/lldb-server/inferior-crash/TestGdbRemoteAbort.py (1269 of 2108) PASS: lldb-api :: functionalities/data-formatter/type_summary_list_arg/TestTypeSummaryListArg.py (1270 of 2108) PASS: lldb-shell :: SymbolFile/DWARF/debug_ranges.s (1271 of 2108) PASS: lldb-shell :: BuildScript/compiler-full-path.test (1272 of 2108) PASS: lldb-api :: lang/objcxx/class-name-clash/TestNameClash.py (1273 of 2108) PASS: lldb-shell :: ObjectFile/PECOFF/section-types.yaml (1274 of 2108) PASS: lldb-api :: commands/frame/var/TestFrameVar.py (1275 of 2108) PASS: lldb-api :: functionalities/breakpoint/breakpoint_conditions/TestBreakpointConditions.py (1276 of 2108) PASS: lldb-unit :: ObjectFile/Breakpad/./ObjectFileBreakpadTests/Record.classify (1277 of 2108) PASS: lldb-shell :: Register/x86-64-read.test (1278 of 2108) PASS: lldb-unit :: Expression/./ExpressionTests/DiagnosticManagerTest.FixedExpression (1279 of 2108) UNSUPPORTED: lldb-api :: commands/gui/breakpoints/TestGuiBreakpoints.py (1280 of 2108) PASS: lldb-api :: commands/expression/no-deadlock/TestExprDoesntBlock.py (1281 of 2108) PASS: lldb-api :: commands/expression/expr-in-syscall/TestExpressionInSyscall.py (1282 of 2108) PASS: lldb-unit :: Utility/./UtilityTests/StringExtractorTest.GetU32LittleEndian (1283 of 2108) PASS: lldb-unit :: Utility/./UtilityTests/StringListTest.LongestCommonPrefixSingleElement (1284 of 2108) PASS: lldb-unit :: Symbol/./SymbolTests/TestTypeSystemClang.TestNotDeletingUserCopyCstrDueToMoveCStr (1285 of 2108) PASS: lldb-unit :: Utility/./UtilityTests/OptionsWithRawTest.QuotedSuffix (1286 of 2108) PASS: lldb-shell :: Reproducer/TestCrash.test (1287 of 2108) PASS: lldb-shell :: ObjectFile/MachO/symtab.yaml (1288 of 2108) PASS: lldb-api :: commands/expression/import-std-module/vector/TestVectorFromStdModule.py (1289 of 2108) PASS: lldb-api :: python_api/sbvalue_persist/TestSBValuePersist.py (1290 of 2108) UNSUPPORTED: lldb-api :: tools/lldb-server/libraries-svr4/TestGdbRemoteLibrariesSvr4Support.py (1291 of 2108) PASS: lldb-unit :: Symbol/./SymbolTests/TestClangASTImporter.MetadataPropagationIndirectImport (1292 of 2108) UNSUPPORTED: lldb-shell :: Unwind/eh-frame-small-fde.test (1293 of 2108) PASS: lldb-shell :: Breakpoint/split-dwarf5-debug-stroffsets.test (1294 of 2108) PASS: lldb-unit :: Core/./LLDBCoreTests/ModuleSpecTest.TestMachOFile (1295 of 2108) PASS: lldb-api :: functionalities/data-formatter/data-formatter-objc/nsindexpath/TestDataFormatterNSIndexPath.py (1296 of 2108) PASS: lldb-unit :: Utility/./UtilityTests/ConstStringTest.CompareConstString (1297 of 2108) PASS: lldb-api :: lang/objc/exceptions/TestObjCExceptions.py (1298 of 2108) PASS: lldb-api :: functionalities/data-formatter/ostypeformatting/TestFormattersOsType.py (1299 of 2108) PASS: lldb-api :: tools/lldb-vscode/stackTrace/TestVSCode_stackTrace.py (1300 of 2108) PASS: lldb-shell :: ObjectFile/PECOFF/dep-modules.yaml (1301 of 2108) UNSUPPORTED: lldb-shell :: ScriptInterpreter/Lua/quit.test (1302 of 2108) UNSUPPORTED: lldb-api :: functionalities/tsan/thread_numbers/TestTsanThreadNumbers.py (1303 of 2108) PASS: lldb-unit :: ScriptInterpreter/Python/./ScriptInterpreterPythonTests/PythonDataObjectsTest.TestGlobalNameResolutionNoDot (1304 of 2108) PASS: lldb-api :: lang/objc/foundation/TestConstStrings.py (1305 of 2108) PASS: lldb-api :: functionalities/gdb_remote_client/TestNoGPacketSupported.py (1306 of 2108) PASS: lldb-api :: commands/expression/persist_objc_pointeetype/TestPersistObjCPointeeType.py (1307 of 2108) PASS: lldb-unit :: Utility/./UtilityTests/FileSpecTest.IsRelative (1308 of 2108) PASS: lldb-unit :: Process/minidump/./LLDBMinidumpTests/MinidumpParserTest.GetThreadContext_x86_32 (1309 of 2108) PASS: lldb-unit :: Expression/./ExpressionTests/DiagnosticManagerTest.PutStringMultiple (1310 of 2108) PASS: lldb-api :: functionalities/data-formatter/dump_dynamic/TestDumpDynamic.py (1311 of 2108) PASS: lldb-unit :: Target/./TargetTests/ExecutionContextTest.GetByteOrder (1312 of 2108) PASS: lldb-unit :: Symbol/./SymbolTests/TestTypeSystemClang.TestDisplayNameEmpty (1313 of 2108) PASS: lldb-api :: lang/cpp/modules-import/TestCXXModulesImport.py (1314 of 2108) PASS: lldb-unit :: Utility/./UtilityTests/StreamTest.AddressEmptyPrefix (1315 of 2108) PASS: lldb-unit :: Language/Highlighting/./HighlighterTests/HighlighterTest.ClangCursorPosAfterOtherToken (1316 of 2108) PASS: lldb-unit :: ScriptInterpreter/Python/./ScriptInterpreterPythonTests/PythonDataObjectsTest.TestPythonString (1317 of 2108) PASS: lldb-shell :: Minidump/Windows/Sigsegv/sigsegv.test (1318 of 2108) PASS: lldb-api :: lang/c/conflicting-symbol/TestConflictingSymbol.py (1319 of 2108) PASS: lldb-api :: lang/objc/objc-dyn-sbtype/TestObjCDynamicSBType.py (1320 of 2108) PASS: lldb-unit :: Utility/./UtilityTests/StringExtractorTest.DecodeHexU8_Extra (1321 of 2108) UNSUPPORTED: lldb-api :: functionalities/breakpoint/breakpoint_in_delayslot/TestAvoidBreakpointInDelaySlot.py (1322 of 2108) PASS: lldb-api :: commands/expression/test/TestExprs.py (1323 of 2108) PASS: lldb-api :: commands/watchpoints/watchpoint_commands/command/TestWatchpointCommandPython.py (1324 of 2108) PASS: lldb-shell :: Commands/command-script-import.test (1325 of 2108) PASS: lldb-api :: functionalities/unwind/sigtramp/TestSigtrampUnwind.py (1326 of 2108) PASS: lldb-api :: functionalities/tail_call_frames/unambiguous_sequence/TestUnambiguousTailCalls.py (1327 of 2108) PASS: lldb-unit :: Utility/./UtilityTests/ArgsTest.TestTrailingBackslash (1328 of 2108) PASS: lldb-shell :: BuildScript/toolchain-clang.test (1329 of 2108) PASS: lldb-unit :: Utility/./UtilityTests/BinaryStreamTest.PutULEB128TwoBytes (1330 of 2108) UNSUPPORTED: lldb-shell :: Register/x86-zmm-write.test (1331 of 2108) PASS: lldb-unit :: UnwindAssembly/x86/./UnwindAssemblyx86Tests/Testx86AssemblyInspectionEngine.Test32bitFramelessBigStackFrame (1332 of 2108) PASS: lldb-unit :: UnwindAssembly/x86/./UnwindAssemblyx86Tests/Testx86AssemblyInspectionEngine.TestPopEDI (1333 of 2108) PASS: lldb-unit :: Utility/./UtilityTests/ConstStringTest.FromMidOfBufferStringRef (1334 of 2108) UNSUPPORTED: lldb-api :: commands/expression/macros/TestMacros.py (1335 of 2108) PASS: lldb-unit :: Utility/./UtilityTests/ArgsTest.TestSingleArg (1336 of 2108) PASS: lldb-api :: commands/disassemble/basic/TestDisassembleBreakpoint.py (1337 of 2108) PASS: lldb-api :: functionalities/abbreviation/TestAbbreviations.py (1338 of 2108) PASS: lldb-unit :: Target/./TargetTests/StackFrameRecognizerTest.NullModuleRegex (1339 of 2108) PASS: lldb-api :: python_api/function_symbol/TestDisasmAPI.py (1340 of 2108) PASS: lldb-unit :: Utility/./UtilityTests/SerializationRountripTest.SerializeDeserializeCString (1341 of 2108) PASS: lldb-unit :: DataFormatter/./LLDBFormatterTests/TypeMatcherTests.RegexName (1342 of 2108) PASS: lldb-unit :: Utility/./UtilityTests/UriParserTest.TypicalPortPathIPv4 (1343 of 2108) PASS: lldb-api :: functionalities/thread/concurrent_events/TestConcurrentSignalWatch.py (1344 of 2108) UNSUPPORTED: lldb-api :: functionalities/longjmp/TestLongjmp.py (1345 of 2108) PASS: lldb-unit :: Process/gdb-remote/./ProcessGdbRemoteTests/GDBRemoteClientBaseTest.SendContinueAndInterrupt (1346 of 2108) PASS: lldb-shell :: BuildScript/modes.test (1347 of 2108) PASS: lldb-api :: functionalities/tail_call_frames/cross_dso/TestCrossDSOTailCalls.py (1348 of 2108) UNSUPPORTED: lldb-shell :: Unwind/unwind-plan-dwarf-dump.test (1349 of 2108) PASS: lldb-unit :: Host/./HostTests/SocketTest.TCPGetConnectURI (1350 of 2108) PASS: lldb-shell :: SymbolFile/Breakpad/unwind-via-stack-cfi.test (1351 of 2108) PASS: lldb-api :: functionalities/type_completion/TestTypeCompletion.py (1352 of 2108) PASS: lldb-api :: commands/expression/import-std-module/list/TestListFromStdModule.py (1353 of 2108) PASS: lldb-api :: tools/lldb-vscode/coreFile/TestVSCode_coreFile.py (1354 of 2108) PASS: lldb-api :: functionalities/thread/concurrent_events/TestConcurrentNWatchNBreak.py (1355 of 2108) PASS: lldb-unit :: Utility/./UtilityTests/NameMatchesTest.EndsWith (1356 of 2108) PASS: lldb-unit :: Utility/./UtilityTests/AnsiTerminal.AtEnd (1357 of 2108) PASS: lldb-unit :: Process/gdb-remote/./ProcessGdbRemoteTests/GDBRemoteClientBaseTest.SendContinueAndAsyncPacket (1358 of 2108) PASS: lldb-unit :: SymbolFile/DWARF/./SymbolFileDWARFTests/SymbolFileDWARFTests.TestAbbrevOutOfOrder (1359 of 2108) PASS: lldb-api :: functionalities/tail_call_frames/thread_step_out_or_return/TestSteppingOutWithArtificialFrames.py (1360 of 2108) PASS: lldb-unit :: Utility/./UtilityTests/DataExtractorTest.GetCStrEmpty (1361 of 2108) PASS: lldb-unit :: ScriptInterpreter/Python/./ScriptInterpreterPythonTests/PythonDataObjectsTest.TestInstanceNameResolutionNoDot (1362 of 2108) PASS: lldb-api :: python_api/frame/inlines/TestInlinedFrame.py (1363 of 2108) PASS: lldb-unit :: Host/./HostTests/MainLoopTest.DetectsEOF (1364 of 2108) PASS: lldb-unit :: ScriptInterpreter/Python/./ScriptInterpreterPythonTests/PythonDataObjectsTest.TestPythonTupleInitializerList2 (1365 of 2108) PASS: lldb-unit :: Utility/./UtilityTests/StringExtractorTest.InitEmpty (1366 of 2108) PASS: lldb-unit :: Utility/./UtilityTests/StringLexerTest.GetUnlexed (1367 of 2108) PASS: lldb-unit :: Utility/./UtilityTests/ArgsTest.TestQuotedTrailingBackslash (1368 of 2108) PASS: lldb-unit :: Utility/./UtilityTests/RegularExpression.Match (1369 of 2108) PASS: lldb-api :: tools/lldb-server/TestGdbRemoteProcessInfo.py (1370 of 2108) PASS: lldb-unit :: ScriptInterpreter/Python/./ScriptInterpreterPythonTests/PythonDataObjectsTest.TestPythonBytes (1371 of 2108) PASS: lldb-unit :: ScriptInterpreter/Python/./ScriptInterpreterPythonTests/PythonDataObjectsTest.TestPythonCallableCheck (1372 of 2108) PASS: lldb-unit :: Utility/./UtilityTests/TimeoutTest.Format (1373 of 2108) PASS: lldb-unit :: Utility/./UtilityTests/StreamTeeTest.AppendStream (1374 of 2108) PASS: lldb-api :: tools/lldb-vscode/variables/TestVSCode_variables.py (1375 of 2108) PASS: lldb-unit :: SymbolFile/DWARF/./SymbolFileDWARFTests/SymbolFileDWARFTests.TestAbbrevOrder1Start1 (1376 of 2108) PASS: lldb-unit :: Utility/./UtilityTests/UriParserTest.Empty (1377 of 2108) PASS: lldb-api :: functionalities/data-formatter/data-formatter-skip-summary/TestDataFormatterSkipSummary.py (1378 of 2108) PASS: lldb-shell :: SymbolFile/DWARF/DW_TAG_basic_type_DW_ATE_UTF_nonC.ll (1379 of 2108) PASS: lldb-shell :: Commands/command-disassemble.s (1380 of 2108) PASS: lldb-api :: lang/objc/modules-incomplete/TestIncompleteModules.py (1381 of 2108) PASS: lldb-unit :: Process/gdb-remote/./ProcessGdbRemoteTests/GDBRemoteCommunicationClientTest.WriteRegister (1382 of 2108) PASS: lldb-unit :: Utility/./UtilityTests/StreamTest.ShiftOperatorPtr (1383 of 2108) PASS: lldb-unit :: SymbolFile/NativePDB/./SymbolFileNativePDBTests/PDBFPOProgramToDWARFExpressionTests.UnsupportedRASearch (1384 of 2108) PASS: lldb-unit :: Utility/./UtilityTests/UriParserTest.BracketedHostnamePort (1385 of 2108) XFAIL: lldb-shell :: Register/x86-mm-xmm-write.test (1386 of 2108) PASS: lldb-shell :: SymbolFile/DWARF/dir-separator-no-comp-dir-relative-name.s (1387 of 2108) PASS: lldb-api :: commands/expression/import-std-module/shared_ptr-dbg-info-content/TestSharedPtrDbgInfoContentFromStdModule.py (1388 of 2108) PASS: lldb-unit :: Utility/./UtilityTests/PassiveReplayTest.InstrumentedBar (1389 of 2108) PASS: lldb-unit :: ScriptInterpreter/Python/./ScriptInterpreterPythonTests/PythonDataObjectsTest.TestPythonListManipulation (1390 of 2108) PASS: lldb-unit :: Utility/./UtilityTests/XcodeSDKTest.SDKSupportsSwift (1391 of 2108) PASS: lldb-api :: functionalities/inferior-crashing/recursive-inferior/TestRecursiveInferiorStep.py (1392 of 2108) PASS: lldb-unit :: Host/./HostTests/NativeProcessProtocolTest.SetBreakpointFailRead (1393 of 2108) PASS: lldb-shell :: SymbolFile/Breakpad/line-table-edgecases.test (1394 of 2108) PASS: lldb-unit :: Utility/./UtilityTests/StringListTest.AppendStringStdString (1395 of 2108) PASS: lldb-shell :: SymbolFile/NativePDB/globals-bss.cpp (1396 of 2108) PASS: lldb-api :: commands/frame/diagnose/local-variable/TestLocalVariable.py (1397 of 2108) PASS: lldb-unit :: Utility/./UtilityTests/StringExtractorTest.GetNameColonValueSuccess (1398 of 2108) PASS: lldb-unit :: Utility/./UtilityTests/UUIDTest.RelationalOperators (1399 of 2108) PASS: lldb-shell :: Reproducer/TestProcessList.test (1400 of 2108) PASS: lldb-unit :: Utility/./UtilityTests/DataExtractorTest.GetFloatUnaligned (1401 of 2108) PASS: lldb-api :: macosx/nslog/TestDarwinNSLogOutput.py (1402 of 2108) PASS: lldb-shell :: Quit/TestQuitExitCodeNonInt.test (1403 of 2108) PASS: lldb-api :: lang/cpp/class_static/TestStaticVariables.py (1404 of 2108) PASS: lldb-unit :: Utility/./UtilityTests/ArgsTest.TestMultipleArgs (1405 of 2108) UNSUPPORTED: lldb-api :: commands/watchpoints/variable_out_of_scope/TestWatchedVarHitWhenInScope.py (1406 of 2108) PASS: lldb-unit :: Utility/./UtilityTests/ReproducerTest.SetCapture (1407 of 2108) PASS: lldb-api :: functionalities/data-formatter/data-formatter-objc/TestDataFormatterObjCPlain.py (1408 of 2108) PASS: lldb-api :: lang/objc/print-obj/TestPrintObj.py (1409 of 2108) PASS: lldb-api :: commands/expression/import_base_class_when_class_has_derived_member/TestImportBaseClassWhenClassHasDerivedMember.py (1410 of 2108) PASS: lldb-api :: python_api/file_handle/TestFileHandle.py (1411 of 2108) PASS: lldb-api :: commands/expression/import_builtin_fileid/TestImportBuiltinFileID.py (1412 of 2108) PASS: lldb-api :: functionalities/stats_api/TestStatisticsAPI.py (1413 of 2108) PASS: lldb-unit :: UnwindAssembly/x86/./UnwindAssemblyx86Tests/Testx86AssemblyInspectionEngine.TestPush0 (1414 of 2108) PASS: lldb-shell :: ObjectFile/MachO/lc_version_min.yaml (1415 of 2108) PASS: lldb-api :: functionalities/data-formatter/data-formatter-ptr-to-array/TestPtrToArrayFormatting.py (1416 of 2108) PASS: lldb-shell :: Reproducer/Functionalities/TestExpressionEvaluation.test (1417 of 2108) PASS: lldb-api :: functionalities/data-formatter/varscript_formatting/TestDataFormatterVarScriptFormatting.py (1418 of 2108) UNSUPPORTED: lldb-shell :: ScriptInterpreter/Lua/persistent_state.test (1419 of 2108) PASS: lldb-shell :: Minidump/memory-region-from-module.yaml (1420 of 2108) PASS: lldb-api :: functionalities/tail_call_frames/disambiguate_paths_to_common_sink/TestDisambiguatePathsToCommonSink.py (1421 of 2108) PASS: lldb-unit :: Language/Highlighting/./HighlighterTests/HighlighterTest.ClangTrailingBackslashWithWhitespace (1422 of 2108) PASS: lldb-unit :: Utility/./UtilityTests/StreamTeeTest.GetStreamAtIndexOutOfBounds (1423 of 2108) PASS: lldb-unit :: Utility/./UtilityTests/OptionsWithRawTest.WhitespaceInput (1424 of 2108) PASS: lldb-api :: commands/expression/import-std-module/unique_ptr/TestUniquePtrFromStdModule.py (1425 of 2108) PASS: lldb-unit :: Utility/./UtilityTests/DataExtractorTest.GetFloat (1426 of 2108) PASS: lldb-unit :: Utility/./UtilityTests/GeneratorTest.Get (1427 of 2108) PASS: lldb-unit :: Utility/./UtilityTests/PassiveReplayTest.InstrumentedBarRef (1428 of 2108) PASS: lldb-api :: lang/objc/objc-struct-return/TestObjCStructReturn.py (1429 of 2108) PASS: lldb-unit :: Breakpoint/./LLDBBreakpointTests/BreakpointIDTest.StringIsBreakpointName (1430 of 2108) PASS: lldb-unit :: Host/./HostTests/MainLoopTest.ReadObject (1431 of 2108) PASS: lldb-shell :: Minidump/disassemble-no-module.yaml (1432 of 2108) UNSUPPORTED: lldb-api :: tools/lldb-server/TestGdbRemoteModuleInfo.py (1433 of 2108) PASS: lldb-api :: functionalities/breakpoint/cpp_exception/TestCPPExceptionBreakpoint.py (1434 of 2108) PASS: lldb-api :: commands/expression/timeout/TestCallWithTimeout.py (1435 of 2108) PASS: lldb-unit :: Symbol/./SymbolTests/SymbolsTest.LocateExecutableSymbolFileForUnknownExecutableAndMissingSymbolFile (1436 of 2108) UNSUPPORTED: lldb-shell :: ScriptInterpreter/Lua/nested_sessions.test (1437 of 2108) PASS: lldb-api :: api/command-return-object/TestSBCommandReturnObject.py (1438 of 2108) PASS: lldb-unit :: Utility/./UtilityTests/ArgsTest.TestAppendArg (1439 of 2108) PASS: lldb-unit :: UnwindAssembly/x86/./UnwindAssemblyx86Tests/Testx86AssemblyInspectionEngine.TestPopR12 (1440 of 2108) PASS: lldb-api :: commands/watchpoints/multiple_threads/TestWatchpointMultipleThreads.py (1441 of 2108) PASS: lldb-unit :: Utility/./UtilityTests/EnvironmentTest.EnvpConversion (1442 of 2108) PASS: lldb-api :: commands/version/TestVersion.py (1443 of 2108) UNSUPPORTED: lldb-shell :: ExecControl/StopHook/stop-hook-threads.test (1444 of 2108) PASS: lldb-unit :: Language/Highlighting/./HighlighterTests/HighlighterTest.ClangTrailingBackslashMissingNewLine (1445 of 2108) PASS: lldb-unit :: Expression/./ExpressionTests/DiagnosticManagerTest.AppendMessageNoDiag (1446 of 2108) PASS: lldb-api :: macosx/save_crashlog/TestSaveCrashlog.py (1447 of 2108) PASS: lldb-unit :: Symbol/./SymbolTests/SymbolsTest.TerminateLocateExecutableSymbolFileForUnknownExecutableAndUnknownSymbolFile (1448 of 2108) PASS: lldb-unit :: Symbol/./SymbolTests/TestTypeSystemClang.TestGetTypeClassTypeOf (1449 of 2108) PASS: lldb-unit :: Utility/./UtilityTests/StringListTest.ShiftMove (1450 of 2108) PASS: lldb-api :: commands/breakpoint/set/func-regex/TestBreakpointRegexError.py (1451 of 2108) UNSUPPORTED: lldb-api :: commands/target/auto-install-main-executable/TestAutoInstallMainExecutable.py (1452 of 2108) PASS: lldb-unit :: Process/minidump/./LLDBMinidumpTests/MinidumpParserTest.MinidumpModuleOrder (1453 of 2108) PASS: lldb-unit :: Process/gdb-remote/./ProcessGdbRemoteTests/GDBRemoteCommunicationClientTest.GetQOffsets (1454 of 2108) PASS: lldb-api :: functionalities/data-formatter/poarray/TestPrintObjectArray.py (1455 of 2108) PASS: lldb-unit :: Symbol/./SymbolTests/TestClangASTImporter.RecordLayout (1456 of 2108) UNSUPPORTED: lldb-api :: api/multiple-debuggers/TestMultipleDebuggers.py (1457 of 2108) PASS: lldb-unit :: Symbol/./SymbolTests/TestTypeSystemClang.TestConvertAccessTypeToAccessSpecifier (1458 of 2108) PASS: lldb-api :: functionalities/thread/jump/TestThreadJump.py (1459 of 2108) PASS: lldb-api :: api/multiple-targets/TestMultipleTargets.py (1460 of 2108) PASS: lldb-shell :: SymbolFile/DWARF/debug_rnglists-dwo.s (1461 of 2108) PASS: lldb-unit :: Expression/./ExpressionTests/DiagnosticManagerTest.GetStringSeverityLabels (1462 of 2108) PASS: lldb-api :: functionalities/thread/backtrace_limit/TestBacktraceLimit.py (1463 of 2108) PASS: lldb-api :: macosx/version_zero/TestGetVersionZeroVersion.py (1464 of 2108) PASS: lldb-unit :: Utility/./UtilityTests/RangeVector.CombineConsecutiveRanges (1465 of 2108) PASS: lldb-shell :: SymbolFile/DWARF/apple-index-is-used.cpp (1466 of 2108) PASS: lldb-unit :: Host/./HostTests/FileSystemTest.EmptyTest (1467 of 2108) PASS: lldb-unit :: Utility/./UtilityTests/OptionsWithRawTest.SingleWordSuffix (1468 of 2108) PASS: lldb-api :: functionalities/data-formatter/data-formatter-globals/TestDataFormatterGlobals.py (1469 of 2108) PASS: lldb-api :: functionalities/thread/concurrent_events/TestConcurrentSignalNWatchNBreak.py (1470 of 2108) PASS: lldb-shell :: ObjectFile/PECOFF/sections.yaml (1471 of 2108) PASS: lldb-unit :: Utility/./UtilityTests/ScalarTest.GetValue (1472 of 2108) PASS: lldb-api :: functionalities/breakpoint/auto_continue/TestBreakpointAutoContinue.py (1473 of 2108) PASS: lldb-api :: python_api/process/read-mem-cstring/TestReadMemCString.py (1474 of 2108) PASS: lldb-unit :: DataFormatter/./LLDBFormatterTests/StringPrinterTests.SwiftUTF8 (1475 of 2108) PASS: lldb-unit :: Utility/./UtilityTests/ProcessInstanceInfo.Yaml (1476 of 2108) PASS: lldb-api :: functionalities/thread/concurrent_events/TestConcurrentDelayedCrashWithBreakpointWatchpoint.py (1477 of 2108) PASS: lldb-shell :: SymbolFile/DWARF/debug-types-dwo-cross-reference.cpp (1478 of 2108) PASS: lldb-api :: python_api/process/io/TestProcessIO.py (1479 of 2108) PASS: lldb-unit :: Utility/./UtilityTests/ScalarTest.TruncOrExtendTo (1480 of 2108) PASS: lldb-api :: functionalities/data-formatter/data-formatter-proper-plurals/TestFormattersOneIsSingular.py (1481 of 2108) PASS: lldb-api :: functionalities/dead-strip/TestDeadStrip.py (1482 of 2108) PASS: lldb-shell :: SymbolFile/DWARF/DW_TAG_variable-DW_AT_const_value.s (1483 of 2108) PASS: lldb-api :: functionalities/breakpoint/breakpoint_options/TestBreakpointOptions.py (1484 of 2108) PASS: lldb-api :: macosx/add-dsym/TestAddDsymMidExecutionCommand.py (1485 of 2108) PASS: lldb-unit :: UnwindAssembly/x86/./UnwindAssemblyx86Tests/Testx86AssemblyInspectionEngine.TestPushEBX (1486 of 2108) PASS: lldb-unit :: Utility/./UtilityTests/FileSpecTest.PrependPathComponent (1487 of 2108) UNSUPPORTED: lldb-shell :: ObjectFile/ELF/minidebuginfo-set-and-hit-breakpoint.test (1488 of 2108) PASS: lldb-unit :: Utility/./UtilityTests/StringExtractorTest.GetHexU8_Extra (1489 of 2108) PASS: lldb-unit :: Host/./HostTests/NativeProcessProtocolTest.SetBreakpointFailWrite (1490 of 2108) PASS: lldb-api :: functionalities/breakpoint/address_breakpoints/TestAddressBreakpoints.py (1491 of 2108) PASS: lldb-unit :: Symbol/./SymbolTests/TestClangASTImporter.CopyTypeTagDecl (1492 of 2108) PASS: lldb-api :: lang/objc/objc-static-method/TestObjCStaticMethod.py (1493 of 2108) PASS: lldb-unit :: Host/./HostTests/NativeProcessProtocolTest.ReadCStringFromMemory (1494 of 2108) PASS: lldb-shell :: ObjectFile/MachO/lc_build_version_notools.yaml (1495 of 2108) PASS: lldb-api :: commands/expression/options/TestExprOptions.py (1496 of 2108) PASS: lldb-unit :: Expression/./ExpressionTests/DiagnosticManagerTest.GetStringMultipleDiags (1497 of 2108) PASS: lldb-api :: python_api/default-constructor/TestDefaultConstructorForAPIObjects.py (1498 of 2108) PASS: lldb-unit :: SymbolFile/NativePDB/./SymbolFileNativePDBTests/PDBFPOProgramToDWARFExpressionTests.UnresolvedDependentCyclicRegisterAssignmentReference (1499 of 2108) PASS: lldb-unit :: SymbolFile/NativePDB/./SymbolFileNativePDBTests/PDBFPOProgramToDWARFExpressionTests.MultipleIndependentAssignments (1500 of 2108) PASS: lldb-shell :: SymbolFile/Breakpad/unwind-via-stack-win.test (1501 of 2108) PASS: lldb-api :: lang/c/strings/TestCStrings.py (1502 of 2108) PASS: lldb-unit :: Language/Highlighting/./HighlighterTests/HighlighterTest.ClangPPDirectives (1503 of 2108) PASS: lldb-unit :: UnwindAssembly/x86/./UnwindAssemblyx86Tests/Testx86AssemblyInspectionEngine.TestPushRBX (1504 of 2108) PASS: lldb-api :: functionalities/thread/concurrent_events/TestConcurrentTwoWatchpointsOneBreakpoint.py (1505 of 2108) PASS: lldb-api :: functionalities/data-formatter/data-formatter-objc/TestDataFormatterObjCKVO.py (1506 of 2108) PASS: lldb-api :: functionalities/signal/raise/TestRaise.py (1507 of 2108) PASS: lldb-unit :: Utility/./UtilityTests/GeneratorTest.GetOrCreate (1508 of 2108) PASS: lldb-unit :: Process/minidump/./LLDBMinidumpTests/MinidumpParserTest.GetMiscInfoWindows (1509 of 2108) PASS: lldb-api :: functionalities/load_using_paths/TestLoadUsingPaths.py (1510 of 2108) PASS: lldb-api :: lang/cpp/dynamic-value/TestCppValueCast.py (1511 of 2108) PASS: lldb-shell :: SymbolFile/DWARF/dir-separator-posix.s (1512 of 2108) PASS: lldb-api :: commands/frame/diagnose/virtual-method-call/TestDiagnoseDereferenceVirtualMethodCall.py (1513 of 2108) PASS: lldb-api :: commands/target/stop-hook/enable/TestTargetStopHookEnable.py (1514 of 2108) PASS: lldb-unit :: Utility/./UtilityTests/VMRange.ContainsRange (1515 of 2108) PASS: lldb-api :: commands/reproducer/invalid-args/TestInvalidArgsReproducer.py (1516 of 2108) PASS: lldb-api :: python_api/breakpoint/TestBreakpointAPI.py (1517 of 2108) UNSUPPORTED: lldb-api :: functionalities/darwin_log/filter/exact_match/category/TestDarwinLogFilterMatchCategory.py (1518 of 2108) PASS: lldb-unit :: Utility/./UtilityTests/FileSpecTest.EqualDotsPosix (1519 of 2108) PASS: lldb-api :: lang/c/local_variables/TestLocalVariables.py (1520 of 2108) PASS: lldb-unit :: Utility/./UtilityTests/RangeTest.SetRangeBase (1521 of 2108) PASS: lldb-unit :: Language/Highlighting/./HighlighterTests/HighlighterTest.ClangCursorPosBeforeOtherToken (1522 of 2108) PASS: lldb-api :: functionalities/data-formatter/data-formatter-python-synth/TestDataFormatterPythonSynth.py (1523 of 2108) PASS: lldb-unit :: Utility/./UtilityTests/StreamTest.PutStringAsRawHex8 (1524 of 2108) PASS: lldb-shell :: SymbolFile/Breakpad/stack-cfi-parsing.test (1525 of 2108) PASS: lldb-shell :: ObjectFile/Breakpad/sections.test (1526 of 2108) PASS: lldb-api :: functionalities/fat_archives/TestFatArchives.py (1527 of 2108) PASS: lldb-unit :: Utility/./UtilityTests/DataExtractorTest.GetMaxS64 (1528 of 2108) PASS: lldb-shell :: Quit/TestQuitExitCode0.test (1529 of 2108) PASS: lldb-api :: types/TestShortType.py (1530 of 2108) PASS: lldb-api :: python_api/value/TestValueAPI.py (1531 of 2108) PASS: lldb-unit :: Process/gdb-remote/./ProcessGdbRemoteTests/GDBRemoteClientBaseTest.SendContinueAndLateInterrupt (1532 of 2108) PASS: lldb-unit :: SymbolFile/NativePDB/./SymbolFileNativePDBTests/PDBFPOProgramToDWARFExpressionTests.MultipleDependentAssignments (1533 of 2108) PASS: lldb-shell :: Register/x86-64-gp-read.test (1534 of 2108) PASS: lldb-api :: commands/expression/call-function/TestCallUserDefinedFunction.py (1535 of 2108) PASS: lldb-unit :: Symbol/./SymbolTests/PostfixExpression.ParseFPOProgram (1536 of 2108) PASS: lldb-unit :: Utility/./UtilityTests/RangeDataVector.FindEntryThatContains (1537 of 2108) PASS: lldb-api :: lang/cpp/gmodules-templates/TestGModules.py (1538 of 2108) PASS: lldb-unit :: Utility/./UtilityTests/StringExtractorTest.GetNameColonValueContainsColon (1539 of 2108) PASS: lldb-unit :: Language/Highlighting/./HighlighterTests/HighlighterTest.ClangScalarLiterals (1540 of 2108) PASS: lldb-shell :: SymbolFile/NativePDB/nested-types.cpp (1541 of 2108) PASS: lldb-unit :: Symbol/./SymbolTests/TestTypeSystemClang.TemplateArguments (1542 of 2108) PASS: lldb-api :: commands/expression/persistent_types/TestNestedPersistentTypes.py (1543 of 2108) PASS: lldb-shell :: ObjectFile/Breakpad/breakpad-identification.test (1544 of 2108) PASS: lldb-unit :: DataFormatter/./LLDBFormatterTests/FormatManagerTests.CompatibleLangs (1545 of 2108) UNSUPPORTED: lldb-api :: commands/expression/multiline-completion/TestMultilineCompletion.py (1546 of 2108) PASS: lldb-api :: commands/disassemble/basic/TestFrameDisassemble.py (1547 of 2108) PASS: lldb-api :: functionalities/breakpoint/objc/TestObjCBreakpoints.py (1548 of 2108) PASS: lldb-unit :: Utility/./UtilityTests/ArgsTest.TestArgv (1549 of 2108) PASS: lldb-api :: commands/statistics/basic/TestStats.py (1550 of 2108) PASS: lldb-unit :: Language/Highlighting/./HighlighterTests/HighlighterTest.ClangTrailingBackslashBeforeNewline (1551 of 2108) PASS: lldb-unit :: Utility/./UtilityTests/LogChannelTest.List (1552 of 2108) PASS: lldb-shell :: SymbolFile/DWARF/find-method.cpp (1553 of 2108) UNSUPPORTED: lldb-api :: functionalities/data-formatter/data-formatter-stl/libstdcpp/iterator/TestDataFormatterStdIterator.py (1554 of 2108) PASS: lldb-api :: python_api/exprpath_synthetic/TestExprPathSynthetic.py (1555 of 2108) PASS: lldb-shell :: Minidump/Windows/find-module.test (1556 of 2108) PASS: lldb-api :: commands/expression/fixits/TestFixIts.py (1557 of 2108) PASS: lldb-unit :: debugserver/./debugserverTests/RNBSocket.AnyListen (1558 of 2108) PASS: lldb-unit :: Utility/./UtilityTests/Flags.Test (1559 of 2108) PASS: lldb-unit :: Utility/./UtilityTests/BinaryStreamTest.PutSLEB128OneByte (1560 of 2108) PASS: lldb-api :: lang/cpp/bool/TestCPPBool.py (1561 of 2108) PASS: lldb-api :: lang/cpp/llvm-style/TestLLVMStyle.py (1562 of 2108) PASS: lldb-unit :: Process/minidump/./LLDBMinidumpTests/MinidumpParserTest.GetThreadContext_x86_32_wow64 (1563 of 2108) PASS: lldb-unit :: Process/gdb-remote/./ProcessGdbRemoteTests/GDBRemoteCommunicationClientTest.SyncThreadState (1564 of 2108) PASS: lldb-api :: lang/cpp/rvalue-references/TestRvalueReferences.py (1565 of 2108) PASS: lldb-shell :: Settings/TestSettingsSet.test (1566 of 2108) PASS: lldb-api :: lang/cpp/constructors/TestCppConstructors.py (1567 of 2108) PASS: lldb-api :: python_api/interpreter/TestCommandInterpreterAPI.py (1568 of 2108) PASS: lldb-unit :: Process/minidump/./LLDBMinidumpTests/MinidumpParserTest.FindMemoryRangeWithFullMemoryMinidump (1569 of 2108) PASS: lldb-unit :: Utility/./UtilityTests/StringListTest.InsertStringAtIndexEnd (1570 of 2108) PASS: lldb-api :: macosx/load-kext/TestLoadKext.py (1571 of 2108) PASS: lldb-api :: functionalities/tail_call_frames/cross_object/TestCrossObjectTailCalls.py (1572 of 2108) PASS: lldb-shell :: SymbolFile/DWARF/dir-separator-no-comp-dir.s (1573 of 2108) PASS: lldb-unit :: Utility/./UtilityTests/OptionsWithRawTest.ArgsButNoDelimiter (1574 of 2108) PASS: lldb-api :: commands/gui/invalid-args/TestInvalidArgsGui.py (1575 of 2108) PASS: lldb-unit :: Utility/./UtilityTests/StreamTest.AddressPrefixAndSuffix (1576 of 2108) PASS: lldb-unit :: Utility/./UtilityTests/StringListTest.JoinNonSpace (1577 of 2108) PASS: lldb-unit :: Utility/./UtilityTests/DataExtractorTest.GetBitfield (1578 of 2108) PASS: lldb-unit :: Utility/./UtilityTests/DataExtractorTest.GetCStrAtNullOffset (1579 of 2108) PASS: lldb-api :: commands/expression/save_jit_objects/TestSaveJITObjects.py (1580 of 2108) PASS: lldb-api :: commands/expression/call-function/TestCallBuiltinFunction.py (1581 of 2108) PASS: lldb-unit :: Utility/./UtilityTests/RecordReplayTest.InstrumentedFooSameThis (1582 of 2108) PASS: lldb-unit :: Utility/./UtilityTests/ProcessInstanceInfoList.Yaml (1583 of 2108) PASS: lldb-api :: macosx/queues/TestQueues.py (1584 of 2108) PASS: lldb-api :: commands/expression/anonymous-struct/TestCallUserAnonTypedef.py (1585 of 2108) PASS: lldb-api :: tools/lldb-server/register-reading/TestGdbRemoteGPacket.py (1586 of 2108) PASS: lldb-api :: python_api/lldbutil/process/TestPrintStackTraces.py (1587 of 2108) PASS: lldb-shell :: SymbolFile/NativePDB/tag-types.cpp (1588 of 2108) PASS: lldb-shell :: Reproducer/TestFileRepro.test (1589 of 2108) UNSUPPORTED: lldb-api :: benchmarks/startup/TestStartupDelays.py (1590 of 2108) PASS: lldb-shell :: Breakpoint/dummy-target.test (1591 of 2108) PASS: lldb-unit :: Target/./TargetTests/PathMappingListTest.RelativeTests (1592 of 2108) PASS: lldb-api :: lang/c/complex_int/TestComplexInt.py (1593 of 2108) PASS: lldb-api :: commands/frame/diagnose/inheritance/TestDiagnoseInheritance.py (1594 of 2108) PASS: lldb-api :: functionalities/data-formatter/data-formatter-synth/TestDataFormatterSynth.py (1595 of 2108) PASS: lldb-unit :: Utility/./UtilityTests/CompletionRequest.TryCompleteCurrentArgMode (1596 of 2108) PASS: lldb-api :: functionalities/thread/step_out/TestThreadStepOut.py (1597 of 2108) PASS: lldb-unit :: Utility/./UtilityTests/BinaryStreamTest.PutSLEB128SixBytes (1598 of 2108) PASS: lldb-shell :: Settings/TestDisassemblyFormat.test (1599 of 2108) PASS: lldb-api :: commands/breakpoint/command/list/TestBreakpointCommandList.py (1600 of 2108) PASS: lldb-shell :: Watchpoint/SetErrorCases.test (1601 of 2108) PASS: lldb-api :: lang/cpp/lambdas/TestLambdas.py (1602 of 2108) PASS: lldb-api :: api/check_public_api_headers/TestPublicAPIHeaders.py (1603 of 2108) PASS: lldb-api :: lang/objc/forward-decl/TestForwardDecl.py (1604 of 2108) PASS: lldb-unit :: Utility/./UtilityTests/RangeTest.Union (1605 of 2108) PASS: lldb-api :: python_api/name_lookup/TestNameLookup.py (1606 of 2108) PASS: lldb-api :: sample_test/TestSampleTest.py (1607 of 2108) PASS: lldb-unit :: Utility/./UtilityTests/SerializationRountripTest.SerializeDeserializeCStringArray (1608 of 2108) PASS: lldb-shell :: Unwind/eh-frame-dwarf-unwind.test (1609 of 2108) PASS: lldb-api :: functionalities/thread/exit_during_break/TestExitDuringBreak.py (1610 of 2108) PASS: lldb-unit :: Process/gdb-remote/./ProcessGdbRemoteTests/GDBRemoteCommunicationClientTest.SendSignalsToIgnore (1611 of 2108) PASS: lldb-unit :: Utility/./UtilityTests/StreamTest.PutHex64ByteOrderLittle (1612 of 2108) PASS: lldb-unit :: UnwindAssembly/x86/./UnwindAssemblyx86Tests/Testx86AssemblyInspectionEngine.TestReturnDetect (1613 of 2108) PASS: lldb-api :: tools/lldb-server/TestGdbRemote_qThreadStopInfo.py (1614 of 2108) PASS: lldb-api :: lang/objc/objc-struct-argument/TestObjCStructArgument.py (1615 of 2108) PASS: lldb-api :: functionalities/target_var/TestTargetVar.py (1616 of 2108) PASS: lldb-api :: lang/objc/foundation/TestSymbolTable.py (1617 of 2108) PASS: lldb-unit :: Utility/./UtilityTests/StringExtractorTest.GetNameColonValueNoSemicolon (1618 of 2108) PASS: lldb-unit :: API/./APITests/SBCommandInterpreterTest.SingleWordCommand (1619 of 2108) PASS: lldb-unit :: Utility/./UtilityTests/TimeoutTest.Construction (1620 of 2108) PASS: lldb-unit :: Utility/./UtilityTests/RegularExpression.Valid (1621 of 2108) PASS: lldb-unit :: Utility/./UtilityTests/ScalarTest.SetValueFromCString (1622 of 2108) PASS: lldb-unit :: UnwindAssembly/x86/./UnwindAssemblyx86Tests/Testx86AssemblyInspectionEngine.Test32bitFramelessSmallStackFrame (1623 of 2108) UNSUPPORTED: lldb-api :: tools/lldb-server/TestGdbRemoteAuxvSupport.py (1624 of 2108) PASS: lldb-api :: types/TestFloatTypes.py (1625 of 2108) PASS: lldb-unit :: Utility/./UtilityTests/LogChannelTest.Disable (1626 of 2108) PASS: lldb-shell :: SymbolFile/NativePDB/bitfields.cpp (1627 of 2108) PASS: lldb-unit :: ObjectFile/Breakpad/./ObjectFileBreakpadTests/InfoRecord.parse (1628 of 2108) PASS: lldb-unit :: Utility/./UtilityTests/StringExtractorTest.GetHexBytesAvail_FullString (1629 of 2108) PASS: lldb-unit :: Utility/./UtilityTests/UriParserTest.Minimal (1630 of 2108) PASS: lldb-api :: commands/expression/import-std-module/vector-of-vectors/TestVectorOfVectorsFromStdModule.py (1631 of 2108) PASS: lldb-unit :: UnwindAssembly/x86/./UnwindAssemblyx86Tests/Testx86AssemblyInspectionEngine.TestPushECX (1632 of 2108) PASS: lldb-unit :: Utility/./UtilityTests/AnsiTerminal.Empty (1633 of 2108) UNSUPPORTED: lldb-shell :: SymbolFile/PDB/ast-restore.test (1634 of 2108) PASS: lldb-api :: commands/target/create-deps/TestTargetCreateDeps.py (1635 of 2108) PASS: lldb-api :: macosx/dyld-trie-symbols/TestDyldTrieSymbols.py (1636 of 2108) UNSUPPORTED: lldb-api :: lang/c/unicode/TestUnicodeSymbols.py (1637 of 2108) PASS: lldb-unit :: Utility/./UtilityTests/OptionsWithRawTest.EmptyInput (1638 of 2108) PASS: lldb-unit :: Expression/./ExpressionTests/DiagnosticManagerTest.GetStringNoDiags (1639 of 2108) PASS: lldb-unit :: Utility/./UtilityTests/VASprintfTest.EncodingError (1640 of 2108) PASS: lldb-api :: tools/lldb-vscode/breakpoint/TestVSCode_setBreakpoints.py (1641 of 2108) UNSUPPORTED: lldb-shell :: SymbolFile/DWARF/split-dwarf-expression-eval-bug.cpp (1642 of 2108) PASS: lldb-unit :: Utility/./UtilityTests/ArgsTest.DoubleQuotedItem (1643 of 2108) PASS: lldb-shell :: Process/UnsupportedLanguage.test (1644 of 2108) UNSUPPORTED: lldb-api :: functionalities/ptr_refs/TestPtrRefs.py (1645 of 2108) PASS: lldb-api :: commands/process/attach/attach_denied/TestAttachDenied.py (1646 of 2108) PASS: lldb-unit :: Utility/./UtilityTests/PassiveReplayTest.InstrumentedBarPtr (1647 of 2108) PASS: lldb-api :: commands/expression/completion/TestExprCompletion.py (1648 of 2108) PASS: lldb-shell :: Commands/command-regex-unalias.test (1649 of 2108) PASS: lldb-unit :: Utility/./UtilityTests/StreamTeeTest.Constructor2Streams (1650 of 2108) PASS: lldb-api :: functionalities/data-formatter/data-formatter-smart-array/TestDataFormatterSmartArray.py (1651 of 2108) PASS: lldb-unit :: ObjectFile/Breakpad/./ObjectFileBreakpadTests/LineRecord.parse (1652 of 2108) PASS: lldb-unit :: Utility/./UtilityTests/OptionsWithRawTest.ArgsButNoLeadingDash (1653 of 2108) PASS: lldb-unit :: Utility/./UtilityTests/StringLexerTest.NextIfList (1654 of 2108) PASS: lldb-api :: commands/expression/invalid-args/TestInvalidArgsExpression.py (1655 of 2108) PASS: lldb-api :: functionalities/thread/concurrent_events/TestConcurrentTwoBreakpointThreads.py (1656 of 2108) PASS: lldb-shell :: Breakpoint/debug_rnglist_basic.test (1657 of 2108) PASS: lldb-api :: functionalities/thread/concurrent_events/TestConcurrentBreakpointOneDelayBreakpointThreads.py (1658 of 2108) PASS: lldb-api :: functionalities/data-formatter/data-formatter-stl/libcxx/string/TestDataFormatterLibcxxString.py (1659 of 2108) PASS: lldb-unit :: UnwindAssembly/x86/./UnwindAssemblyx86Tests/Testx86AssemblyInspectionEngine.Test64bitFramelessSmallStackFrame (1660 of 2108) PASS: lldb-unit :: Utility/./UtilityTests/SerializationRountripTest.SerializeDeserializeObjectPointer (1661 of 2108) PASS: lldb-unit :: Utility/./UtilityTests/FileSpecTest.GetPath (1662 of 2108) PASS: lldb-unit :: Utility/./UtilityTests/UriParserTest.SchemeHostSeparator3 (1663 of 2108) PASS: lldb-api :: functionalities/breakpoint/move_nearest/TestMoveNearest.py (1664 of 2108) PASS: lldb-unit :: Utility/./UtilityTests/NameMatchesTest.RegularExpression (1665 of 2108) PASS: lldb-unit :: Interpreter/./InterpreterTests/OptionArgParserTest.toBoolean (1666 of 2108) PASS: lldb-unit :: Utility/./UtilityTests/StringListTest.InsertStringAtIndexStdString (1667 of 2108) PASS: lldb-unit :: Utility/./UtilityTests/FileSpecTest.GuessPathStyle (1668 of 2108) PASS: lldb-unit :: Utility/./UtilityTests/BinaryStreamTest.PutSLEB128Zero (1669 of 2108) PASS: lldb-api :: commands/watchpoints/watchpoint_size/TestWatchpointSizes.py (1670 of 2108) PASS: lldb-shell :: Commands/CommandScriptImmediateOutput/CommandScriptImmediateOutputConsole.test (1671 of 2108) PASS: lldb-api :: commands/expression/codegen-crash-typedefdecl-not-in_declcontext/TestCodegenCrashTypedefDeclNotInDeclContext.py (1672 of 2108) PASS: lldb-shell :: ObjectFile/Breakpad/uuid-matching-mac.test (1673 of 2108) PASS: lldb-unit :: Target/./TargetTests/RemoteAwarePlatformTest.TestResolveExecutabelOnClientByPlatform (1674 of 2108) PASS: lldb-api :: commands/expression/argument_passing_restrictions/TestArgumentPassingRestrictions.py (1675 of 2108) PASS: lldb-shell :: SymbolFile/DWARF/clang-ast-from-dwarf-unamed-and-anon-structs.cpp (1676 of 2108) PASS: lldb-unit :: Utility/./UtilityTests/StringExtractorTest.GetHexU8_Underflow2_NoEof (1677 of 2108) PASS: lldb-unit :: Host/./HostTests/FileSystemTest.FileAndDirectoryComponents (1678 of 2108) PASS: lldb-unit :: Core/./LLDBCoreTests/ModuleSpecTest.InvalidInMemoryBufferValidFile (1679 of 2108) PASS: lldb-api :: macosx/indirect_symbol/TestIndirectSymbols.py (1680 of 2108) PASS: lldb-api :: commands/watchpoints/hello_watchpoint/TestMyFirstWatchpoint.py (1681 of 2108) PASS: lldb-unit :: Platform/Android/./AdbClientTests/AdbClientTest.CreateByDeviceId (1682 of 2108) PASS: lldb-unit :: Utility/./UtilityTests/UriParserTest.SchemeHostSeparator4 (1683 of 2108) PASS: lldb-unit :: Utility/./UtilityTests/ArgsTest.TestInsertArg (1684 of 2108) PASS: lldb-unit :: UnwindAssembly/x86/./UnwindAssemblyx86Tests/Testx86AssemblyInspectionEngine.TestSimplex86_64Augmented (1685 of 2108) PASS: lldb-api :: lang/c/tls_globals/TestTlsGlobals.py (1686 of 2108) PASS: lldb-unit :: Symbol/./SymbolTests/TestTypeSystemClang.TestRecordHasFields (1687 of 2108) PASS: lldb-api :: commands/watchpoints/multiple_hits/TestMultipleHits.py (1688 of 2108) PASS: lldb-shell :: Driver/TestFile.test (1689 of 2108) PASS: lldb-shell :: Commands/command-breakpoint-col.test (1690 of 2108) PASS: lldb-shell :: SymbolFile/DWARF/array-sizes.s (1691 of 2108) PASS: lldb-shell :: SymbolFile/NativePDB/break-by-line.cpp (1692 of 2108) PASS: lldb-api :: lang/objc/rdar-10967107/TestRdar10967107.py (1693 of 2108) PASS: lldb-unit :: UnwindAssembly/x86/./UnwindAssemblyx86Tests/Testx86AssemblyInspectionEngine.TestPopR15 (1694 of 2108) PASS: lldb-unit :: Process/minidump/./LLDBMinidumpTests/RegisterContextMinidump.CheckRegisterContextMinidump_ARM (1695 of 2108) PASS: lldb-api :: lang/objc/objc++/TestObjCXX.py (1696 of 2108) PASS: lldb-api :: macosx/DBGSourcePathRemapping/TestDSYMSourcePathRemapping.py (1697 of 2108) PASS: lldb-shell :: Reproducer/Functionalities/TestStepping.test (1698 of 2108) PASS: lldb-unit :: UnwindAssembly/x86/./UnwindAssemblyx86Tests/Testx86AssemblyInspectionEngine.TestSpillRegToStackViaMOVx86_64 (1699 of 2108) PASS: lldb-unit :: Expression/./ExpressionTests/CppModuleConfigurationTest.LibCppV2 (1700 of 2108) PASS: lldb-api :: python_api/objc_type/TestObjCType.py (1701 of 2108) UNSUPPORTED: lldb-shell :: SymbolFile/PDB/pointers.test (1702 of 2108) PASS: lldb-api :: commands/apropos/basic/TestApropos.py (1703 of 2108) PASS: lldb-shell :: SymbolFile/DWARF/debug-types-signature-loop.s (1704 of 2108) PASS: lldb-api :: commands/expression/dont_allow_jit/TestAllowJIT.py (1705 of 2108) PASS: lldb-unit :: UnwindAssembly/x86/./UnwindAssemblyx86Tests/Testx86AssemblyInspectionEngine.Test64bitFramelessBigStackFrame (1706 of 2108) PASS: lldb-api :: lang/objc/rdar-11355592/TestRdar11355592.py (1707 of 2108) PASS: lldb-unit :: Expression/./ExpressionTests/DWARFExpression.DW_OP_convert (1708 of 2108) PASS: lldb-unit :: Symbol/./SymbolTests/TestTypeSystemClang.TestDisplayName (1709 of 2108) PASS: lldb-unit :: Process/minidump/./LLDBMinidumpTests/MinidumpParserTest.InvalidMinidump (1710 of 2108) PASS: lldb-api :: macosx/duplicate-archive-members/TestDuplicateMembers.py (1711 of 2108) PASS: lldb-unit :: Utility/./UtilityTests/UUIDTest.StringConverion (1712 of 2108) PASS: lldb-api :: functionalities/gdb_remote_client/TestStopPCs.py (1713 of 2108) UNSUPPORTED: lldb-api :: android/platform/TestDefaultCacheLineSize.py (1714 of 2108) PASS: lldb-api :: commands/expression/unicode-in-variable/TestUnicodeInVariable.py (1715 of 2108) PASS: lldb-shell :: Process/Optimization.test (1716 of 2108) PASS: lldb-api :: commands/expression/top-level/TestTopLevelExprs.py (1717 of 2108) PASS: lldb-shell :: SymbolFile/DWARF/inline-function-address-shared.test (1718 of 2108) PASS: lldb-shell :: SymbolFile/DWARF/dwarf5-debug_line.s (1719 of 2108) PASS: lldb-api :: functionalities/postmortem/elf-core/thread_crash/TestLinuxCoreThreads.py (1720 of 2108) UNSUPPORTED: lldb-api :: functionalities/tty/TestTerminal.py (1721 of 2108) UNSUPPORTED: lldb-api :: linux/sepdebugsymlink/TestTargetSymbolsSepDebugSymlink.py (1722 of 2108) PASS: lldb-shell :: ObjectFile/Breakpad/discontiguous-sections.test (1723 of 2108) PASS: lldb-api :: tools/lldb-vscode/launch/TestVSCode_launch.py (1724 of 2108) PASS: lldb-shell :: Reproducer/TestRelativePath.test (1725 of 2108) PASS: lldb-api :: functionalities/data-formatter/data-formatter-stl/libcxx/unique_ptr/TestDataFormatterLibcxxUniquePtr.py (1726 of 2108) PASS: lldb-api :: linux/builtin_trap/TestBuiltinTrap.py (1727 of 2108) PASS: lldb-unit :: Host/./HostTests/NativeProcessProtocolTest.ReadMemoryWithoutTrap (1728 of 2108) PASS: lldb-api :: functionalities/postmortem/elf-core/gcore/TestGCore.py (1729 of 2108) PASS: lldb-api :: functionalities/backticks/TestBackticksWithoutATarget.py (1730 of 2108) PASS: lldb-unit :: Utility/./UtilityTests/StringExtractorTest.GetHexBytes_OddPair2 (1731 of 2108) PASS: lldb-api :: tools/lldb-vscode/console/TestVSCode_console.py (1732 of 2108) PASS: lldb-api :: lang/objc/single-entry-dictionary/TestObjCSingleEntryDictionary.py (1733 of 2108) PASS: lldb-unit :: Utility/./UtilityTests/ScalarTest.APIntConstructor (1734 of 2108) PASS: lldb-api :: python_api/debugger/TestDebuggerAPI.py (1735 of 2108) UNSUPPORTED: lldb-api :: benchmarks/turnaround/TestCompileRunToBreakpointTurnaround.py (1736 of 2108) PASS: lldb-unit :: Utility/./UtilityTests/StringExtractorTest.GetHexBytesAvail_Underflow (1737 of 2108) PASS: lldb-unit :: Utility/./UtilityTests/CompletionRequest.DuplicateFiltering (1738 of 2108) PASS: lldb-api :: functionalities/breakpoint/global_constructor/TestBreakpointInGlobalConstructor.py (1739 of 2108) PASS: lldb-unit :: Utility/./UtilityTests/SubsystemRAIITest.SubsystemWithErrorSuccess (1740 of 2108) PASS: lldb-shell :: Commands/command-source.test (1741 of 2108) PASS: lldb-api :: commands/expression/issue_11588/Test11588.py (1742 of 2108) PASS: lldb-unit :: DataFormatter/./LLDBFormatterTests/TypeMatcherTests.CreatedBySameMatchStringExactNamePrefixes (1743 of 2108) PASS: lldb-api :: functionalities/thread/concurrent_events/TestConcurrentTwoWatchpointsOneDelayBreakpoint.py (1744 of 2108) PASS: lldb-unit :: Utility/./UtilityTests/VASprintfTest.BufferResize (1745 of 2108) PASS: lldb-api :: functionalities/data-formatter/data-formatter-objc/TestDataFormatterObjCExpr.py (1746 of 2108) PASS: lldb-api :: commands/session/save/TestSessionSave.py (1747 of 2108) PASS: lldb-api :: commands/expression/persistent_types/TestPersistentTypes.py (1748 of 2108) UNSUPPORTED: lldb-api :: functionalities/data-formatter/data-formatter-stl/libstdcpp/map/TestDataFormatterStdMap.py (1749 of 2108) PASS: lldb-api :: commands/expression/scoped_enums/TestScopedEnumType.py (1750 of 2108) UNSUPPORTED: lldb-shell :: Register/x86-ymm-read.test (1751 of 2108) PASS: lldb-api :: functionalities/data-formatter/data-formatter-categories/TestDataFormatterCategories.py (1752 of 2108) PASS: lldb-unit :: Utility/./UtilityTests/StreamTest.AddressRange (1753 of 2108) PASS: lldb-shell :: ScriptInterpreter/Python/sb_address_exception.test (1754 of 2108) PASS: lldb-unit :: Utility/./UtilityTests/LogChannelEnabledTest.LogThread (1755 of 2108) PASS: lldb-unit :: Interpreter/./InterpreterTests/OptionArgParserTest.toScriptLanguage (1756 of 2108) PASS: lldb-api :: commands/expression/import-std-module/vector-dbg-info-content/TestDbgInfoContentVectorFromStdModule.py (1757 of 2108) PASS: lldb-shell :: ObjectFile/ELF/netbsd-core-amd64.test (1758 of 2108) PASS: lldb-api :: commands/expression/persistent_variables/TestPersistentVariables.py (1759 of 2108) PASS: lldb-api :: lang/objc/objc-checker/TestObjCCheckers.py (1760 of 2108) PASS: lldb-unit :: Utility/./UtilityTests/VMRange.Reset (1761 of 2108) PASS: lldb-shell :: SymbolFile/DWARF/parallel-indexing-stress.s (1762 of 2108) UNSUPPORTED: lldb-api :: benchmarks/libcxxlist/TestBenchmarkLibcxxList.py (1763 of 2108) UNSUPPORTED: lldb-shell :: SymbolFile/PDB/variables-locations.test (1764 of 2108) PASS: lldb-unit :: Utility/./UtilityTests/VMRange.CollectionContains (1765 of 2108) PASS: lldb-api :: functionalities/data-formatter/data-formatter-objc/TestDataFormatterObjCNSDate.py (1766 of 2108) PASS: lldb-api :: functionalities/data-formatter/cstring-utf8-summary/TestCstringUnicode.py (1767 of 2108) PASS: lldb-api :: python_api/lldbutil/TestSwigVersion.py (1768 of 2108) PASS: lldb-api :: lang/cpp/multiple-inheritance/TestCppMultipleInheritance.py (1769 of 2108) PASS: lldb-api :: lang/c/set_values/TestSetValues.py (1770 of 2108) PASS: lldb-unit :: Utility/./UtilityTests/StreamTest.AddressRangeEmptyRange (1771 of 2108) UNSUPPORTED: lldb-api :: functionalities/darwin_log/filter/regex/activity/TestDarwinLogFilterRegexActivity.py (1772 of 2108) UNSUPPORTED: lldb-api :: commands/register/register/intel_xtended_registers/TestMPXRegisters.py (1773 of 2108) PASS: lldb-unit :: Language/Highlighting/./HighlighterTests/HighlighterTest.DefaultHighlighter (1774 of 2108) PASS: lldb-unit :: Utility/./UtilityTests/ConstStringTest.format_provider (1775 of 2108) PASS: lldb-unit :: Utility/./UtilityTests/StringExtractorTest.GetHexBytesAvail (1776 of 2108) PASS: lldb-unit :: Core/./LLDBCoreTests/SourceFileCache.FindSourceFileFound (1777 of 2108) PASS: lldb-unit :: ObjectFile/ELF/./ObjectFileELFTests/ObjectFileELFTest.GetSymtab_NoSymEntryPointArmAddressClass (1778 of 2108) PASS: lldb-shell :: ObjectFile/PECOFF/basic-info.yaml (1779 of 2108) PASS: lldb-unit :: Utility/./UtilityTests/ScalarTest.SetValueFromData (1780 of 2108) PASS: lldb-api :: functionalities/data-formatter/builtin-formats/TestBuiltinFormats.py (1781 of 2108) UNSUPPORTED: lldb-shell :: SymbolFile/PDB/vbases.test (1782 of 2108) PASS: lldb-api :: tools/lldb-server/TestGdbRemoteThreadsInStopReply.py (1783 of 2108) PASS: lldb-unit :: ScriptInterpreter/Python/./ScriptInterpreterPythonTests/PythonDataObjectsTest.TestPythonStringToStr (1784 of 2108) PASS: lldb-api :: lang/objc/modules-hash-mismatch/TestClangModulesHashMismatch.py (1785 of 2108) PASS: lldb-unit :: Utility/./UtilityTests/ScalarTest.Division (1786 of 2108) PASS: lldb-unit :: UnwindAssembly/x86/./UnwindAssemblyx86Tests/Testx86AssemblyInspectionEngine.TestSpArithx86_64Augmented (1787 of 2108) PASS: lldb-api :: commands/expression/import-std-module/stack/TestStackFromStdModule.py (1788 of 2108) PASS: lldb-api :: lang/cpp/namespace_definitions/TestNamespaceDefinitions.py (1789 of 2108) PASS: lldb-api :: python_api/hello_world/TestHelloWorld.py (1790 of 2108) PASS: lldb-unit :: Utility/./UtilityTests/LogChannelEnabledTest.LLDB_LOG_ERROR (1791 of 2108) UNSUPPORTED: lldb-api :: functionalities/thread/break_after_join/TestBreakAfterJoin.py (1792 of 2108) PASS: lldb-unit :: Utility/./UtilityTests/UserIDResolver.GetGroupName (1793 of 2108) PASS: lldb-api :: commands/watchpoints/watchpoint_events/TestWatchpointEvents.py (1794 of 2108) PASS: lldb-unit :: Utility/./UtilityTests/RecordReplayTest.InstrumentedBarRef (1795 of 2108) PASS: lldb-api :: lang/cpp/function-qualifiers/TestCppFunctionQualifiers.py (1796 of 2108) PASS: lldb-api :: lang/objc/objc-ivar-offsets/TestObjCIvarOffsets.py (1797 of 2108) PASS: lldb-api :: macosx/find-app-in-bundle/TestFindAppInBundle.py (1798 of 2108) PASS: lldb-api :: python_api/formatters/TestFormattersSBAPI.py (1799 of 2108) PASS: lldb-api :: lang/c/inlines/TestRedefinitionsInInlines.py (1800 of 2108) PASS: lldb-unit :: SymbolFile/DWARF/./SymbolFileDWARFTests/DWARFASTParserClangTests.EnsureAllDIEsInDeclContextHaveBeenParsedParsesOnlyMatchingEntries (1801 of 2108) PASS: lldb-shell :: Register/x86-64-ymm-read.test (1802 of 2108) PASS: lldb-unit :: Utility/./UtilityTests/DataExtractorTest.PeekData (1803 of 2108) PASS: lldb-unit :: Symbol/./SymbolTests/TestClangASTImporter.ImportInvalidType (1804 of 2108) PASS: lldb-api :: commands/expression/import-std-module/deque-basic/TestDequeFromStdModule.py (1805 of 2108) PASS: lldb-unit :: ScriptInterpreter/Python/./ScriptInterpreterPythonTests/PythonDataObjectsTest.TestPythonIntegerToStructuredInteger (1806 of 2108) PASS: lldb-unit :: Symbol/./SymbolTests/TestTypeSystemClang.TestGetBasicTypeFromEnum (1807 of 2108) PASS: lldb-shell :: Breakpoint/split-dwarf-5-addrbase.test (1808 of 2108) PASS: lldb-unit :: Utility/./UtilityTests/UriParserTest.BracketedHostnameWithColon (1809 of 2108) PASS: lldb-api :: iohandler/resize/TestIOHandlerResizeNoEditline.py (1810 of 2108) PASS: lldb-api :: functionalities/data-formatter/data-formatter-stl/libcxx/iterator/TestDataFormatterLibccIterator.py (1811 of 2108) PASS: lldb-unit :: Utility/./UtilityTests/BinaryStreamTest.PutSLEB128ThreeBytes (1812 of 2108) UNSUPPORTED: lldb-shell :: SymbolFile/PDB/compilands.test (1813 of 2108) PASS: lldb-unit :: Process/gdb-remote/./ProcessGdbRemoteTests/GDBRemoteCommunicationClientTest.SendGetTraceConfigPacket (1814 of 2108) PASS: lldb-api :: tools/lldb-vscode/step/TestVSCode_step.py (1815 of 2108) PASS: lldb-shell :: SymbolFile/NativePDB/function-types-calling-conv.cpp (1816 of 2108) PASS: lldb-api :: functionalities/thread/crash_during_step/TestCrashDuringStep.py (1817 of 2108) PASS: lldb-unit :: Utility/./UtilityTests/IndexToObjectTest.ObjectForIndex (1818 of 2108) PASS: lldb-shell :: ObjectFile/PECOFF/sections-names.yaml (1819 of 2108) PASS: lldb-api :: commands/expression/rdar42038760/TestScalarURem.py (1820 of 2108) PASS: lldb-shell :: ObjectFile/wasm/basic.yaml (1821 of 2108) PASS: lldb-shell :: Settings/TestLineMarkerColor.test (1822 of 2108) PASS: lldb-api :: lang/objc/direct-dispatch-step/TestObjCDirectDispatchStepping.py (1823 of 2108) PASS: lldb-unit :: Symbol/./SymbolTests/TestTypeSystemClang.TestOwningModule (1824 of 2108) UNSUPPORTED: lldb-shell :: Register/x86-64-ymm16-write.test (1825 of 2108) PASS: lldb-unit :: Utility/./UtilityTests/StringListTest.GetMaxStringLengthEqualSize (1826 of 2108) PASS: lldb-unit :: Utility/./UtilityTests/RangeTest.DoesIntersect (1827 of 2108) PASS: lldb-unit :: Utility/./UtilityTests/LogChannelEnabledTest.LogVerboseThread (1828 of 2108) PASS: lldb-unit :: Platform/Android/./AdbClientTests/AdbClientTest.CreateByDeviceId_ByEnvVar (1829 of 2108) PASS: lldb-shell :: ObjectFile/ELF/aarch64-relocations.yaml (1830 of 2108) PASS: lldb-unit :: UnwindAssembly/x86/./UnwindAssemblyx86Tests/Testx86AssemblyInspectionEngine.TestAddRSP (1831 of 2108) PASS: lldb-api :: commands/expression/import-std-module/forward_list/TestForwardListFromStdModule.py (1832 of 2108) PASS: lldb-api :: commands/help/TestHelp.py (1833 of 2108) PASS: lldb-unit :: DataFormatter/./LLDBFormatterTests/TypeMatcherTests.CreatedBySameMatchString (1834 of 2108) PASS: lldb-api :: commands/expression/formatters/TestFormatters.py (1835 of 2108) PASS: lldb-unit :: Utility/./UtilityTests/BinaryStreamTest.PutSLEB128FourBytes (1836 of 2108) PASS: lldb-api :: python_api/lldbutil/iter/TestRegistersIterator.py (1837 of 2108) PASS: lldb-shell :: Driver/TestCore.test (1838 of 2108) PASS: lldb-unit :: Process/minidump/./LLDBMinidumpTests/MinidumpParserTest.GetLinuxProcStatus (1839 of 2108) PASS: lldb-api :: commands/expression/radar_9531204/TestPrintfAfterUp.py (1840 of 2108) PASS: lldb-unit :: Utility/./UtilityTests/GeneratorTest.Create (1841 of 2108) PASS: lldb-api :: functionalities/optimized_code/TestNoASanExceptionAfterEvalOP_piece.py (1842 of 2108) UNSUPPORTED: lldb-api :: functionalities/ubsan/basic/TestUbsanBasic.py (1843 of 2108) PASS: lldb-unit :: Utility/./UtilityTests/ArgsTest.GetArgumentArrayRef (1844 of 2108) PASS: lldb-unit :: Utility/./UtilityTests/Predicate.WaitForValueNotEqualTo (1845 of 2108) PASS: lldb-api :: functionalities/postmortem/minidump-new/TestMiniDumpUUID.py (1846 of 2108) PASS: lldb-api :: functionalities/memory-region/TestMemoryRegion.py (1847 of 2108) PASS: lldb-shell :: Settings/TestEchoCommands.test (1848 of 2108) PASS: lldb-unit :: Symbol/./SymbolTests/TestClangASTImporter.MetadataPropagation (1849 of 2108) PASS: lldb-shell :: SymbolFile/DWARF/DW_TAG_variable-invalid_location.s (1850 of 2108) UNSUPPORTED: lldb-api :: lang/objc/objc-dynamic-value/TestObjCDynamicValue.py (1851 of 2108) PASS: lldb-unit :: Expression/./ExpressionTests/DiagnosticManagerTest.AddDiagnostic (1852 of 2108) PASS: lldb-api :: lang/cpp/alignas_base_class/TestAlignAsBaseClass.py (1853 of 2108) PASS: lldb-unit :: Process/minidump/./LLDBMinidumpTests/MinidumpParserTest.GetThreadContext_x86_64 (1854 of 2108) UNSUPPORTED: lldb-api :: iohandler/unicode/TestUnicode.py (1855 of 2108) PASS: lldb-shell :: SymbolFile/DWARF/anon_class_w_and_wo_export_symbols.ll (1856 of 2108) PASS: lldb-api :: functionalities/thread/concurrent_events/TestConcurrentBreakpointDelayBreakpointOneSignal.py (1857 of 2108) PASS: lldb-api :: lang/c/enum_types/TestEnumTypes.py (1858 of 2108) PASS: lldb-unit :: Process/gdb-remote/./ProcessGdbRemoteTests/GDBRemoteCommunicationClientTest.GetModulesInfo (1859 of 2108) PASS: lldb-api :: functionalities/dynamic_value_child_count/TestDynamicValueChildCount.py (1860 of 2108) PASS: lldb-shell :: Driver/TestPositionalArgs.test (1861 of 2108) PASS: lldb-api :: functionalities/abbreviation/TestCommonShortSpellings.py (1862 of 2108) PASS: lldb-shell :: ObjectFile/ELF/avr-basic-info.yaml (1863 of 2108) PASS: lldb-api :: lang/objc/variadic_methods/TestVariadicMethods.py (1864 of 2108) PASS: lldb-unit :: UnwindAssembly/x86/./UnwindAssemblyx86Tests/Testx86AssemblyInspectionEngine.TestSimple32bitFrameFunction (1865 of 2108) PASS: lldb-unit :: SymbolFile/NativePDB/./SymbolFileNativePDBTests/PDBFPOProgramToDWARFExpressionTests.UnresolvedRegisterReference (1866 of 2108) UNSUPPORTED: lldb-api :: lang/cpp/printf/TestPrintf.py (1867 of 2108) PASS: lldb-unit :: Utility/./UtilityTests/ScalarTest.GetBytes (1868 of 2108) PASS: lldb-api :: functionalities/postmortem/mach-core/TestMachCore.py (1869 of 2108) PASS: lldb-api :: functionalities/unwind/zeroth_frame/TestZerothFrame.py (1870 of 2108) PASS: lldb-unit :: Utility/./UtilityTests/DeserializerTest.HasData (1871 of 2108) PASS: lldb-unit :: Utility/./UtilityTests/ArchSpecTest.Compatibility (1872 of 2108) PASS: lldb-unit :: Process/minidump/./LLDBMinidumpTests/MinidumpParserTest.GetExceptionStream (1873 of 2108) PASS: lldb-unit :: Utility/./UtilityTests/StreamTest.PutRawBytesToMixedEndian (1874 of 2108) PASS: lldb-api :: functionalities/multiword-commands/TestMultiWordCommands.py (1875 of 2108) PASS: lldb-api :: types/TestRecursiveTypes.py (1876 of 2108) PASS: lldb-api :: commands/frame/select/TestFrameSelect.py (1877 of 2108) PASS: lldb-unit :: Utility/./UtilityTests/ArchSpecTest.OperatorBool (1878 of 2108) PASS: lldb-unit :: Utility/./UtilityTests/XcodeSDKTest.GetSDKTypeForTriple (1879 of 2108) PASS: lldb-shell :: Unwind/thread-step-out-ret-addr-check.test (1880 of 2108) PASS: lldb-unit :: Utility/./UtilityTests/BinaryStreamTest.PutULEB128Zero (1881 of 2108) PASS: lldb-unit :: Utility/./UtilityTests/StringExtractorTest.InitMisc (1882 of 2108) UNSUPPORTED: lldb-shell :: SymbolFile/target-symbols-add-unwind.test (1883 of 2108) PASS: lldb-api :: functionalities/data-formatter/data-formatter-stl/libcxx/forward_list/TestDataFormatterLibcxxForwardList.py (1884 of 2108) PASS: lldb-api :: macosx/universal/TestUniversal.py (1885 of 2108) PASS: lldb-unit :: Utility/./UtilityTests/XcodeSDKTest.FindXcodeContentsDirectoryInPath (1886 of 2108) PASS: lldb-shell :: ObjectFile/ELF/section-types.yaml (1887 of 2108) PASS: lldb-api :: tools/lldb-server/TestGdbRemoteAttach.py (1888 of 2108) PASS: lldb-api :: python_api/lldbutil/frame/TestFrameUtils.py (1889 of 2108) PASS: lldb-unit :: Utility/./UtilityTests/StringExtractorTest.GetHexU8_Exact (1890 of 2108) UNSUPPORTED: lldb-api :: functionalities/tsan/multiple/TestTsanMultiple.py (1891 of 2108) PASS: lldb-unit :: Symbol/./SymbolTests/TestClangASTImporter.CopyDeclTagDecl (1892 of 2108) PASS: lldb-api :: lang/objc/objc-super/TestObjCSuper.py (1893 of 2108) PASS: lldb-unit :: Utility/./UtilityTests/ScalarTest.RightShiftOperator (1894 of 2108) PASS: lldb-api :: commands/frame/language/TestGuessLanguage.py (1895 of 2108) PASS: lldb-unit :: ScriptInterpreter/Python/./ScriptInterpreterPythonTests/PythonDataObjectsTest.TestPythonTupleToStructuredList (1896 of 2108) PASS: lldb-api :: lang/objc/orderedset/TestOrderedSet.py (1897 of 2108) PASS: lldb-unit :: Expression/./ExpressionTests/ClangExpressionDeclMapTest.TestPersistentDeclLookup (1898 of 2108) PASS: lldb-unit :: Utility/./UtilityTests/ArgsTest.BareSingleQuote (1899 of 2108) PASS: lldb-api :: functionalities/var_path/TestVarPath.py (1900 of 2108) PASS: lldb-api :: python_api/symbol-context/TestSymbolContext.py (1901 of 2108) PASS: lldb-api :: functionalities/data-formatter/language_category_updates/TestDataFormatterLanguageCategoryUpdates.py (1902 of 2108) PASS: lldb-unit :: ScriptInterpreter/Python/./ScriptInterpreterPythonTests/PythonDataObjectsTest.TestPythonListToStructuredList (1903 of 2108) PASS: lldb-api :: commands/register/register/register_command/TestRegisters.py (1904 of 2108) PASS: lldb-unit :: Utility/./UtilityTests/StreamTest.PutRawBytesToBigEndian (1905 of 2108) PASS: lldb-api :: functionalities/lazy-loading/TestLazyLoading.py (1906 of 2108) PASS: lldb-unit :: UnwindAssembly/x86/./UnwindAssemblyx86Tests/Testx86AssemblyInspectionEngine.Test32BitOnlyInstruction (1907 of 2108) PASS: lldb-unit :: Host/./HostTests/MainLoopTest.TerminatesImmediately (1908 of 2108) PASS: lldb-shell :: SymbolFile/DWARF/DW_AT_low_pc-addrx.s (1909 of 2108) PASS: lldb-unit :: Utility/./UtilityTests/TimerTest.CategoryTimesNested (1910 of 2108) PASS: lldb-api :: python_api/sbvalue_const_addrof/TestSBValueConstAddrOf.py (1911 of 2108) PASS: lldb-api :: functionalities/thread/concurrent_events/TestConcurrentDelaySignalBreak.py (1912 of 2108) PASS: lldb-unit :: Language/Highlighting/./HighlighterTests/HighlighterTest.ClangSquareBrackets (1913 of 2108) UNSUPPORTED: lldb-api :: arm/breakpoint-it/TestBreakpointIt.py (1914 of 2108) PASS: lldb-unit :: Utility/./UtilityTests/StringListTest.Join (1915 of 2108) UNSUPPORTED: lldb-api :: commands/gui/basicdebug/TestGuiBasicDebug.py (1916 of 2108) PASS: lldb-unit :: Utility/./UtilityTests/StringListTest.CopyListEmpty (1917 of 2108) PASS: lldb-api :: commands/watchpoints/watchpoint_commands/command/TestWatchpointCommandLLDB.py (1918 of 2108) UNSUPPORTED: lldb-api :: commands/gui/viewlarge/TestGuiViewLarge.py (1919 of 2108) PASS: lldb-unit :: Utility/./UtilityTests/SerializationRountripTest.SerializeDeserializeCStringArrayNullptrElem (1920 of 2108) UNSUPPORTED: lldb-api :: functionalities/thread/state/TestThreadStates.py (1921 of 2108) PASS: lldb-api :: commands/platform/file/close/TestPlatformFileClose.py (1922 of 2108) PASS: lldb-unit :: Utility/./UtilityTests/UriParserTest.PortOverflow (1923 of 2108) PASS: lldb-shell :: BuildScript/script-args.test (1924 of 2108) PASS: lldb-unit :: Host/./HostTests/SocketAddressTest.GetAddressInfo (1925 of 2108) PASS: lldb-unit :: Utility/./UtilityTests/ArgsTest.TestSingleArgWithQuotedSpace (1926 of 2108) UNSUPPORTED: lldb-api :: linux/thread/create_during_instruction_step/TestCreateDuringInstructionStep.py (1927 of 2108) PASS: lldb-unit :: ScriptInterpreter/Python/./ScriptInterpreterPythonTests/PythonDataObjectsTest.TestRun (1928 of 2108) PASS: lldb-api :: commands/process/attach/TestProcessAttach.py (1929 of 2108) PASS: lldb-unit :: Language/Highlighting/./HighlighterTests/HighlighterTest.ClangPreserveNewLine (1930 of 2108) PASS: lldb-unit :: Utility/./UtilityTests/StreamTest.SetIndentLevel (1931 of 2108) PASS: lldb-unit :: Expression/./ExpressionTests/CppModuleConfigurationTest.MissingLibCpp (1932 of 2108) PASS: lldb-unit :: Utility/./UtilityTests/RangeTest.Equal (1933 of 2108) PASS: lldb-api :: python_api/sbstructureddata/TestStructuredDataAPI.py (1934 of 2108) PASS: lldb-unit :: Utility/./UtilityTests/ArgsTest.TestSingleQuotedArgWithSpace (1935 of 2108) PASS: lldb-unit :: Utility/./UtilityTests/AnsiTerminal.KnownPrefix (1936 of 2108) PASS: lldb-api :: python_api/watchpoint/condition/TestWatchpointConditionAPI.py (1937 of 2108) PASS: lldb-unit :: Host/./HostTests/NativeProcessProtocolTest.SetBreakpoint (1938 of 2108) PASS: lldb-unit :: Utility/./UtilityTests/Flags.IsClear (1939 of 2108) PASS: lldb-unit :: Utility/./UtilityTests/StreamTest.PutChar (1940 of 2108) UNSUPPORTED: lldb-api :: functionalities/tsan/basic/TestTsanBasic.py (1941 of 2108) PASS: lldb-unit :: UnwindAssembly/x86/./UnwindAssemblyx86Tests/Testx86AssemblyInspectionEngine.TestPushEDI (1942 of 2108) PASS: lldb-unit :: Utility/./UtilityTests/BinaryStreamTest.PutULEB128SixBytes (1943 of 2108) PASS: lldb-unit :: Core/./LLDBCoreTests/CommunicationTest.SynchronizeWhileClosing (1944 of 2108) PASS: lldb-unit :: Utility/./UtilityTests/StreamTest.PutHex16ByteOrderLittle (1945 of 2108) PASS: lldb-unit :: Utility/./UtilityTests/StreamTest.PutRawBytesToLittleEndian (1946 of 2108) PASS: lldb-unit :: Symbol/./SymbolTests/TestTypeSystemClang.TestGetEnumIntegerTypeInvalid (1947 of 2108) PASS: lldb-unit :: SymbolFile/NativePDB/./SymbolFileNativePDBTests/PDBFPOProgramToDWARFExpressionTests.UnresolvedCyclicRegisterAssignmentReference (1948 of 2108) PASS: lldb-unit :: Utility/./UtilityTests/StringListTest.LongestCommonPrefixDuplicateElement (1949 of 2108) PASS: lldb-unit :: Utility/./UtilityTests/CompletionRequest.TryCompleteCurrentArgBad (1950 of 2108) PASS: lldb-shell :: Settings/TestDisableColor.test (1951 of 2108) PASS: lldb-unit :: Utility/./UtilityTests/StringExtractorTest.GetHexU8_InvalidHex_NoEof (1952 of 2108) PASS: lldb-unit :: UnwindAssembly/x86/./UnwindAssemblyx86Tests/Testx86AssemblyInspectionEngine.TestMovRSPtoRBP (1953 of 2108) UNSUPPORTED: lldb-api :: functionalities/breakpoint/breakpoint_callback_command_source/TestBreakpointCallbackCommandSource.py (1954 of 2108) PASS: lldb-unit :: Utility/./UtilityTests/ArgsTest.AppendArguments (1955 of 2108) UNSUPPORTED: lldb-api :: functionalities/darwin_log/basic/TestDarwinLogBasic.py (1956 of 2108) PASS: lldb-unit :: Symbol/./SymbolTests/TestTypeSystemClang.TestGetTypeClassTypeOfExpr (1957 of 2108) PASS: lldb-unit :: Expression/./ExpressionTests/CppModuleConfigurationTest.Sysroot (1958 of 2108) PASS: lldb-shell :: ObjectFile/MachO/subsections.yaml (1959 of 2108) PASS: lldb-unit :: Language/Highlighting/./HighlighterTests/HighlighterTest.HighlighterSelectionType (1960 of 2108) PASS: lldb-api :: lang/objc/self/TestObjCSelf.py (1961 of 2108) PASS: lldb-unit :: Utility/./UtilityTests/Predicate.WaitForValueEqualTo (1962 of 2108) UNSUPPORTED: lldb-api :: benchmarks/expression/TestExpressionCmd.py (1963 of 2108) UNSUPPORTED: lldb-api :: functionalities/data-formatter/data-formatter-stl/libstdcpp/vbool/TestDataFormatterStdVBool.py (1964 of 2108) PASS: lldb-api :: functionalities/data-formatter/data-formatter-advanced/TestDataFormatterAdv.py (1965 of 2108) PASS: lldb-api :: python_api/sbdata/TestSBData.py (1966 of 2108) PASS: lldb-api :: functionalities/inferior-crashing/recursive-inferior/TestRecursiveInferior.py (1967 of 2108) PASS: lldb-api :: lang/objc/objc-static-method-stripped/TestObjCStaticMethodStripped.py (1968 of 2108) PASS: lldb-api :: macosx/function-starts/TestFunctionStarts.py (1969 of 2108) PASS: lldb-api :: functionalities/thread/backtrace_all/TestBacktraceAll.py (1970 of 2108) PASS: lldb-unit :: Utility/./UtilityTests/StringExtractorTest.GetHexU8_Underflow2 (1971 of 2108) PASS: lldb-api :: commands/expression/call-function/TestCallStdStringFunction.py (1972 of 2108) PASS: lldb-shell :: SymbolFile/DWARF/find-method-local-struct.cpp (1973 of 2108) PASS: lldb-unit :: Language/Highlighting/./HighlighterTests/HighlighterTest.ClangStringLiterals (1974 of 2108) PASS: lldb-unit :: Target/./TargetTests/MemoryRegionInfoTest.Formatv (1975 of 2108) PASS: lldb-api :: commands/expression/cast_int_to_anonymous_enum/TestCastIntToAnonymousEnum.py (1976 of 2108) PASS: lldb-unit :: Utility/./UtilityTests/RangeTest.SlideZero (1977 of 2108) PASS: lldb-unit :: Utility/./UtilityTests/LogChannelEnabledTest.log_options (1978 of 2108) PASS: lldb-unit :: Language/Highlighting/./HighlighterTests/HighlighterTest.Keywords (1979 of 2108) PASS: lldb-api :: functionalities/breakpoint/scripted_bkpt/TestScriptedResolver.py (1980 of 2108) PASS: lldb-api :: functionalities/data-formatter/frameformat_smallstruct/TestFrameFormatSmallStruct.py (1981 of 2108) PASS: lldb-unit :: Utility/./UtilityTests/StringListTest.GetMaxStringLengthEmpty (1982 of 2108) PASS: lldb-unit :: Utility/./UtilityTests/FileSpecTest.CopyByAppendingPathComponent (1983 of 2108) PASS: lldb-unit :: Target/./TargetTests/MCBasedABI.MapRegisterName (1984 of 2108) PASS: lldb-api :: commands/settings/quoting/TestQuoting.py (1985 of 2108) UNSUPPORTED: lldb-api :: benchmarks/stepping/TestSteppingSpeed.py (1986 of 2108) PASS: lldb-api :: commands/frame/diagnose/array/TestArray.py (1987 of 2108) PASS: lldb-unit :: Utility/./UtilityTests/BroadcasterTest.EventTypeHasListeners (1988 of 2108) PASS: lldb-api :: functionalities/reproducers/attach/TestReproducerAttach.py (1989 of 2108) UNSUPPORTED: lldb-api :: commands/expression/multiline-navigation/TestMultilineNavigation.py (1990 of 2108) PASS: lldb-shell :: SymbolFile/DWARF/debug_ranges-missing-section.s (1991 of 2108) PASS: lldb-api :: commands/command/source/TestCommandSource.py (1992 of 2108) PASS: lldb-unit :: Core/./LLDBCoreTests/ModuleSpecTest.TestCOFFFile (1993 of 2108) PASS: lldb-shell :: SymbolFile/Breakpad/line-table-missing-file.test (1994 of 2108) PASS: lldb-api :: functionalities/show_location/TestShowLocationDwarf5.py (1995 of 2108) PASS: lldb-unit :: Utility/./UtilityTests/Flags.GetBitSize (1996 of 2108) PASS: lldb-api :: functionalities/data-formatter/refpointer-recursion/TestDataFormatterRefPtrRecursion.py (1997 of 2108) PASS: lldb-unit :: Utility/./UtilityTests/UriParserTest.TypicalPortPathIPv6 (1998 of 2108) PASS: lldb-unit :: Process/minidump/./LLDBMinidumpTests/MinidumpParserTest.GetMemoryRegionInfoFromMemoryList (1999 of 2108) UNSUPPORTED: lldb-api :: functionalities/tsan/global_location/TestTsanGlobalLocation.py (2000 of 2108) PASS: lldb-unit :: Host/./HostTests/NativeProcessProtocolTest.SetBreakpointFailVerify (2001 of 2108) PASS: lldb-unit :: Utility/./UtilityTests/StringExtractorTest.GetHexU8_InvalidHex (2002 of 2108) UNSUPPORTED: lldb-api :: python_api/disassemble-raw-data/TestDisassemble_VST1_64.py (2003 of 2108) PASS: lldb-shell :: ExecControl/StopHook/stop-hook.test (2004 of 2108) PASS: lldb-shell :: Reproducer/TestGDBRemoteRepro.test (2005 of 2108) PASS: lldb-unit :: ScriptInterpreter/Python/./ScriptInterpreterPythonTests/PythonDataObjectsTest.TestPythonFile (2006 of 2108) PASS: lldb-api :: lang/objc/unicode-string/TestUnicodeString.py (2007 of 2108) UNSUPPORTED: lldb-api :: functionalities/darwin_log/filter/regex/activity-chain/TestDarwinLogFilterRegexActivityChain.py (2008 of 2108) PASS: lldb-unit :: Utility/./UtilityTests/ProcessInstanceInfoMatch.Name (2009 of 2108) PASS: lldb-unit :: Utility/./UtilityTests/StringListTest.SetSize (2010 of 2108) PASS: lldb-shell :: SymbolFile/DWARF/debug_loc-aslr.s (2011 of 2108) PASS: lldb-shell :: ObjectFile/ELF/PT_TLS-overlap-PT_LOAD.yaml (2012 of 2108) PASS: lldb-api :: functionalities/data-formatter/data-formatter-stl/libcxx/multiset/TestDataFormatterLibcxxMultiSet.py (2013 of 2108) PASS: lldb-api :: functionalities/thread/concurrent_events/TestConcurrentCrashWithWatchpoint.py (2014 of 2108) PASS: lldb-api :: functionalities/thread/concurrent_events/TestConcurrentSignalDelayBreak.py (2015 of 2108) UNSUPPORTED: lldb-api :: functionalities/signal/handle-segv/TestHandleSegv.py (2016 of 2108) PASS: lldb-api :: functionalities/data-formatter/synthupdate/TestSyntheticFilterRecompute.py (2017 of 2108) PASS: lldb-api :: commands/watchpoints/step_over_watchpoint/TestStepOverWatchpoint.py (2018 of 2108) PASS: lldb-api :: functionalities/load_unload/TestLoadUnload.py (2019 of 2108) PASS: lldb-api :: commands/watchpoints/watchpoint_commands/TestWatchpointCommands.py (2020 of 2108) PASS: lldb-unit :: Process/gdb-remote/./ProcessGdbRemoteTests/GDBRemoteCommunicationClientTest.SendStopTracePacket (2021 of 2108) PASS: lldb-api :: functionalities/data-formatter/data-formatter-stl/libcxx/map/TestDataFormatterLibccMap.py (2022 of 2108) PASS: lldb-unit :: Utility/./UtilityTests/UriParserTest.BracketedHostname (2023 of 2108) PASS: lldb-unit :: SymbolFile/DWARF/./SymbolFileDWARFTests/SymbolFileDWARFTests.TestAbbrevOrder1Start5 (2024 of 2108) PASS: lldb-unit :: Symbol/./SymbolTests/TestTypeSystemClang.TestFunctionTemplateConstruction (2025 of 2108) PASS: lldb-unit :: Utility/./UtilityTests/StreamTest.PutHex64ByteOrderBig (2026 of 2108) PASS: lldb-api :: functionalities/gdb_remote_client/TestRestartBug.py (2027 of 2108) PASS: lldb-unit :: Utility/./UtilityTests/ListenerTest.GetEventImmediate (2028 of 2108) PASS: lldb-api :: lang/objc/objc-ivar-stripped/TestObjCIvarStripped.py (2029 of 2108) PASS: lldb-unit :: Process/minidump/./LLDBMinidumpTests/RegisterContextMinidump.ConvertMinidumpContext_x86_64 (2030 of 2108) PASS: lldb-unit :: UnwindAssembly/x86/./UnwindAssemblyx86Tests/Testx86AssemblyInspectionEngine.TestPopRBX (2031 of 2108) UNSUPPORTED: lldb-shell :: ScriptInterpreter/Lua/convenience_variables.test (2032 of 2108) PASS: lldb-api :: functionalities/breakpoint/breakpoint_command/TestBreakpointCommandsFromPython.py (2033 of 2108) PASS: lldb-api :: commands/frame/diagnose/dereference-function-return/TestDiagnoseDereferenceFunctionReturn.py (2034 of 2108) PASS: lldb-unit :: Core/./LLDBCoreTests/RichManglingContextTest.Basic (2035 of 2108) PASS: lldb-unit :: Utility/./UtilityTests/RecordReplayTest.InstrumentedFoo (2036 of 2108) PASS: lldb-unit :: Language/Highlighting/./HighlighterTests/HighlighterTest.ClangOperators (2037 of 2108) PASS: lldb-shell :: Reproducer/Functionalities/TestDataFormatter.test (2038 of 2108) PASS: lldb-api :: functionalities/gdb_remote_client/TestRegDefinitionInParts.py (2039 of 2108) PASS: lldb-unit :: Utility/./UtilityTests/StreamTest.AddressRangeInvalidRange (2040 of 2108) PASS: lldb-unit :: Utility/./UtilityTests/SerializationRountripTest.SerializeDeserializeCStringNull (2041 of 2108) PASS: lldb-unit :: ObjectFile/Breakpad/./ObjectFileBreakpadTests/PublicRecord.parse (2042 of 2108) PASS: lldb-api :: lang/objc/modules-non-objc-target/TestObjCModulesNonObjCTarget.py (2043 of 2108) PASS: lldb-api :: types/TestCharTypeExpr.py (2044 of 2108) UNSUPPORTED: lldb-api :: functionalities/breakpoint/hardware_breakpoints/hardware_breakpoint_on_multiple_threads/TestHWBreakMultiThread.py (2045 of 2108) PASS: lldb-unit :: Utility/./UtilityTests/StringExtractorTest.GetHexU8_Underflow_NoEof (2046 of 2108) PASS: lldb-unit :: tools/lldb-server/tests/./LLDBServerTests/TestBase.DebugserverEnv (2047 of 2108) PASS: lldb-unit :: ObjectFile/PECOFF/./ObjectFilePECOFFTests/PECallFrameInfoTest.Basic_eh (2048 of 2108) PASS: lldb-shell :: SymbolFile/DWARF/debug-types-dwarf5.s (2049 of 2108) PASS: lldb-unit :: Utility/./UtilityTests/UserIDResolver.GetUserName (2050 of 2108) PASS: lldb-unit :: Utility/./UtilityTests/StreamTest.PutPtr (2051 of 2108) PASS: lldb-unit :: Host/./HostTests/SocketTest.UDPGetConnectURI (2052 of 2108) UNSUPPORTED: lldb-api :: linux/mix-dwo-and-regular-objects/TestMixedDwarfBinary.py (2053 of 2108) PASS: lldb-unit :: Utility/./UtilityTests/FileSpecTest.EqualDotsPosixRoot (2054 of 2108) PASS: lldb-unit :: ScriptInterpreter/Python/./ScriptInterpreterPythonTests/PythonDataObjectsTest.TestPythonStringToStructuredString (2055 of 2108) PASS: lldb-unit :: UnwindAssembly/x86/./UnwindAssemblyx86Tests/Testx86AssemblyInspectionEngine.TestPushRBP (2056 of 2108) PASS: lldb-unit :: Utility/./UtilityTests/RegularExpression.Empty (2057 of 2108) PASS: lldb-api :: commands/expression/radar_8638051/Test8638051.py (2058 of 2108) PASS: lldb-unit :: ObjectFile/Breakpad/./ObjectFileBreakpadTests/ModuleRecord.parse (2059 of 2108) PASS: lldb-api :: lang/c/forward/TestForwardDeclaration.py (2060 of 2108) PASS: lldb-unit :: Host/./HostTests/SocketTest.TCPGetAddress (2061 of 2108) UNSUPPORTED: lldb-shell :: ObjectFile/PECOFF/disassemble-thumb.yaml (2062 of 2108) PASS: lldb-api :: functionalities/data-formatter/summary-string-onfail/Test-rdar-9974002.py (2063 of 2108) PASS: lldb-api :: lang/cpp/trivial_abi/TestTrivialABI.py (2064 of 2108) PASS: lldb-unit :: ScriptInterpreter/Python/./ScriptInterpreterPythonTests/PythonDataObjectsTest.TestScript (2065 of 2108) PASS: lldb-unit :: Utility/./UtilityTests/StringLexerTest.Next (2066 of 2108) PASS: lldb-unit :: UnwindAssembly/x86/./UnwindAssemblyx86Tests/Testx86AssemblyInspectionEngine.TestSpillRegToStackViaMOVi386 (2067 of 2108) PASS: lldb-unit :: Utility/./UtilityTests/DataExtractorTest.GetCStr (2068 of 2108) PASS: lldb-api :: python_api/thread/TestThreadAPI.py (2069 of 2108) PASS: lldb-api :: lang/c/anonymous/TestAnonymous.py (2070 of 2108) UNSUPPORTED: lldb-api :: functionalities/darwin_log/filter/regex/category/TestDarwinLogFilterRegexCategory.py (2071 of 2108) PASS: lldb-unit :: Host/./HostTests/FileSystemTest.EnumerateDirectory (2072 of 2108) PASS: lldb-unit :: SymbolFile/DWARF/./SymbolFileDWARFTests/SymbolFileDWARFTests.ParseArangesNonzeroSegmentSize (2073 of 2108) PASS: lldb-api :: lang/c/stepping/TestStepAndBreakpoints.py (2074 of 2108) PASS: lldb-unit :: Utility/./UtilityTests/BinaryStreamTest.PutSLEB128SevenBytes (2075 of 2108) PASS: lldb-unit :: Interpreter/./InterpreterTests/CompletionTest.DirCompletionUsername (2076 of 2108) PASS: lldb-unit :: Utility/./UtilityTests/UriParserTest.SchemeHostSeparator2 (2077 of 2108) PASS: lldb-api :: tools/lldb-server/commandline/TestStubReverseConnect.py (2078 of 2108) PASS: lldb-unit :: Utility/./UtilityTests/StatusTest.ErrorConstructor (2079 of 2108) PASS: lldb-unit :: Symbol/./SymbolTests/TestTypeSystemClang.TestRemoveFastQualifiers (2080 of 2108) PASS: lldb-shell :: Settings/TestFrameFormatMangling.test (2081 of 2108) PASS: lldb-api :: types/TestFloatTypesExpr.py (2082 of 2108) PASS: lldb-api :: functionalities/data-formatter/data-formatter-stl/libcxx/initializerlist/TestInitializerList.py (2083 of 2108) UNSUPPORTED: lldb-shell :: SymbolFile/DWARF/DW_TAG_GNU_call_site-DW_AT_low_pc.s (2084 of 2108) PASS: lldb-api :: lang/objc/modules-auto-import/TestModulesAutoImport.py (2085 of 2108) PASS: lldb-unit :: Utility/./UtilityTests/StringListTest.JoinEmpty (2086 of 2108) PASS: lldb-api :: python_api/watchpoint/watchlocation/TestTargetWatchAddress.py (2087 of 2108) PASS: lldb-api :: commands/source/info/TestSourceInfo.py (2088 of 2108) PASS: lldb-unit :: Utility/./UtilityTests/BinaryStreamTest.PutULEB128NineBytes (2089 of 2108) PASS: lldb-unit :: Utility/./UtilityTests/RangeTest.NotEqual (2090 of 2108) PASS: lldb-unit :: Utility/./UtilityTests/ArchSpecTest.YAML (2091 of 2108) PASS: lldb-unit :: ScriptInterpreter/Python/./ScriptInterpreterPythonTests/PythonDataObjectsTest.TestExtractingUInt64ThroughStructuredData (2092 of 2108) PASS: lldb-unit :: Host/./HostTests/SocketTest.DomainListenConnectAccept (2093 of 2108) PASS: lldb-unit :: Platform/./LLDBPlatformTests/PlatformAppleSimulatorTest.TestHostPlatformToSim (2094 of 2108) PASS: lldb-api :: lang/cpp/call-function/TestCallCPPFunction.py (2095 of 2108) PASS: lldb-unit :: Language/Highlighting/./HighlighterTests/HighlighterTest.ClangCursorPosInOtherToken (2096 of 2108) PASS: lldb-unit :: Utility/./UtilityTests/StringLexerTest.HasAtLeast (2097 of 2108) PASS: lldb-api :: lang/objc/ivar-IMP/TestObjCiVarIMP.py (2098 of 2108) PASS: lldb-unit :: Utility/./UtilityTests/AnsiTerminal.Twice (2099 of 2108) PASS: lldb-unit :: Host/./HostTests/MainLoopTest.UnmonitoredSignal (2100 of 2108) PASS: lldb-api :: functionalities/breakpoint/serialize/TestBreakpointSerialization.py (2101 of 2108) PASS: lldb-api :: lang/cpp/thread_local/TestThreadLocal.py (2102 of 2108) PASS: lldb-unit :: Utility/./UtilityTests/StreamTest.PutHex32ByteOrderLittle (2103 of 2108) PASS: lldb-shell :: Host/TestCustomShell.test (2104 of 2108) PASS: lldb-api :: commands/expression/import-std-module/list-dbg-info-content/TestDbgInfoContentListFromStdModule.py (2105 of 2108) PASS: lldb-api :: lang/objc/real-definition/TestRealDefinition.py (2106 of 2108) PASS: lldb-api :: functionalities/inferior-assert/TestInferiorAssert.py (2107 of 2108) PASS: lldb-api :: functionalities/data-formatter/data-formatter-objc/nsstring/TestDataFormatterNSString.py (2108 of 2108) Slowest Tests: -------------------------------------------------------------------------- 650.77s: lldb-api :: tools/lldb-server/TestLldbGdbServer.py 264.18s: lldb-api :: lang/cpp/enum_types/TestCPP11EnumTypes.py 241.70s: lldb-api :: api/multithreaded/TestMultithreaded.py 207.63s: lldb-api :: lang/objc/hidden-ivars/TestHiddenIvars.py 198.72s: lldb-api :: lang/objc/foundation/TestObjCMethods.py 143.36s: lldb-api :: lang/cpp/namespace/TestNamespaceLookup.py 142.63s: lldb-api :: lang/objc/exceptions/TestObjCExceptions.py 138.40s: lldb-api :: lang/objc/objc-new-syntax/TestObjCNewSyntaxLiteral.py 133.91s: lldb-api :: lang/objc/real-definition/TestRealDefinition.py 120.65s: lldb-api :: types/TestLongTypesExpr.py 114.04s: lldb-api :: lang/objc/foundation/TestObjCMethodsString.py 105.37s: lldb-api :: lang/objc/foundation/TestObjCMethodsNSError.py 105.16s: lldb-api :: lang/objc/objc-new-syntax/TestObjCNewSyntaxDictionary.py 103.99s: lldb-api :: lang/objc/objc-new-syntax/TestObjCNewSyntaxArray.py 98.77s: lldb-api :: lang/objc/blocks/TestObjCIvarsInBlocks.py 97.56s: lldb-api :: python_api/lldbutil/iter/TestLLDBIterator.py 93.67s: lldb-api :: commands/settings/TestSettings.py 91.61s: lldb-api :: functionalities/gdb_remote_client/TestWasm.py 87.15s: lldb-api :: functionalities/type_lookup/TestTypeLookup.py 85.63s: lldb-api :: tools/lldb-server/TestGdbRemoteThreadsInStopReply.py

Hide Details

Tests Times: -------------------------------------------------------------------------- [ Range ] :: [ Percentage ] :: [ Count ] -------------------------------------------------------------------------- [650s,700s) :: [ ] :: [ 1/2108] [600s,650s) :: [ ] :: [ 0/2108] [550s,600s) :: [ ] :: [ 0/2108] [500s,550s) :: [ ] :: [ 0/2108] [450s,500s) :: [ ] :: [ 0/2108] [400s,450s) :: [ ] :: [ 0/2108] [350s,400s) :: [ ] :: [ 0/2108] [300s,350s) :: [ ] :: [ 0/2108] [250s,300s) :: [ ] :: [ 2/2108] [200s,250s) :: [ ] :: [ 2/2108] [150s,200s) :: [ ] :: [ 2/2108] [100s,150s) :: [ ] :: [ 10/2108] [ 50s,100s) :: [* ] :: [ 55/2108] [ 0s, 50s) :: [************************************** ] :: [2036/2108] -------------------------------------------------------------------------- ******************** Failed Tests (3): lldb-api :: macosx/simulator/TestSimulatorPlatform.py lldb-api :: macosx/macCatalyst/TestMacCatalyst.py lldb-api :: python_api/target/TestTargetAPI.py

Hide Details

Hide Details

Testing Time: 4269.42s Unsupported : 182 Passed : 1917 Expectedly Failed: 6 Failed : 3 FAILED: tools/lldb/test/CMakeFiles/check-lldb-lit cd /Users/buildslave/jenkins/workspace/lldb-cmake-sanitized/lldb-build/tools/lldb/test && /usr/local/Frameworks/Python.framework/Versions/3.7/bin/python3.7 /Users/buildslave/jenkins/workspace/lldb-cmake-sanitized/lldb-build/./bin/llvm-lit -v --time-tests --shuffle --xunit-xml-output=/Users/buildslave/jenkins/workspace/lldb-cmake-sanitized/test/results.xml -v -j 4 --timeout 1200 /Users/buildslave/jenkins/workspace/lldb-cmake-sanitized/lldb-build/tools/lldb/test ninja: build stopped: subcommand failed. Command failed: Command '['/usr/bin/env', 'TERM=vt100', '/usr/local/bin/ninja', '-v', 'check-lldb']' returned non-zero exit status 1. Command: ['/usr/bin/env', 'TERM=vt100', '/usr/local/bin/ninja', '-v', 'check-lldb'] [Pipeline] } [Pipeline] // timeout [Pipeline] } [Pipeline] // stage [Pipeline] stage [Pipeline] { (Declarative: Post Actions) [Pipeline] scanForIssues [Clang (LLVM based)] Sleeping for 5 seconds due to JENKINS-32191... [Clang (LLVM based)] Parsing console log (workspace: '/Users/buildslave/jenkins/workspace/lldb-cmake-sanitized') [Clang (LLVM based)] Successfully parsed console log [Clang (LLVM based)] -> found 14 issues (skipped 5 duplicates) [Clang (LLVM based)] Post processing issues on 'green-dragon-23' with source code encoding 'UTF-8' [Clang (LLVM based)] Creating SCM blamer to obtain author and commit information for affected files [Clang (LLVM based)] Creating SCM miner to obtain statistics for affected repository files [Clang (LLVM based)] Resolving file names for all issues in source directory '/Users/buildslave/jenkins/workspace/lldb-cmake-sanitized' [Clang (LLVM based)] -> resolved paths in source directory (6 found, 0 not found) [Clang (LLVM based)] Resolving module names from module definitions (build.xml, pom.xml, or Manifest.mf files) [Clang (LLVM based)] -> resolved module names for 14 issues [Clang (LLVM based)] Resolving package names (or namespaces) by parsing the affected files [Clang (LLVM based)] -> resolved package names of 6 affected files [Clang (LLVM based)] No filter has been set, publishing all 14 issues [Clang (LLVM based)] Creating fingerprints for all affected code blocks to track issues over different builds [Clang (LLVM based)] -> created fingerprints for 14 issues (skipped 0 issues) [Clang (LLVM based)] Copying affected files to Jenkins' build folder '/Users/Shared/Jenkins/Home/jobs/lldb-cmake-sanitized/builds/1695/files-with-issues' [Clang (LLVM based)] -> 6 copied, 0 not in workspace, 0 not-found, 0 with I/O error [Pipeline] junit Recording test results [Pipeline] } [Pipeline] // stage [Pipeline] } [Pipeline] // withEnv [Pipeline] } [Pipeline] // node [Pipeline] End of Pipeline ERROR: script returned exit code 1 Finished: FAILURE