FailedConsole Output

Skipping 34,366 KB.. Full Log
port-dllfunc.yaml (1089 of 2110)
PASS: lldb-api :: commands/expression/context-object-objc/TestContextObjectObjc.py (1090 of 2110)
PASS: lldb-api :: functionalities/breakpoint/move_nearest/TestMoveNearest.py (1091 of 2110)
PASS: lldb-unit :: Utility/./UtilityTests/StringListTest.LongestCommonPrefixNoPrefix (1092 of 2110)
PASS: lldb-api :: python_api/type/TestTypeList.py (1093 of 2110)
PASS: lldb-api :: lang/c/global_variables/TestGlobalVariables.py (1094 of 2110)
PASS: lldb-unit :: Process/minidump/./LLDBMinidumpTests/MinidumpParserTest.GetThreadContext_x86_32 (1095 of 2110)
PASS: lldb-shell :: Breakpoint/split-dwarf5-debug-stroffsets.test (1096 of 2110)
PASS: lldb-shell :: ScriptInterpreter/None/none.test (1097 of 2110)
PASS: lldb-api :: commands/expression/completion/TestExprCompletion.py (1098 of 2110)
PASS: lldb-unit :: Utility/./UtilityTests/StringExtractorTest.GetHexU8_Underflow2_NoEof (1099 of 2110)
PASS: lldb-unit :: Process/gdb-remote/./ProcessGdbRemoteTests/GDBRemoteCommunicationClientTest.SendStartTracePacket (1100 of 2110)
PASS: lldb-unit :: Language/Highlighting/./HighlighterTests/HighlighterTest.ClangTrailingBackslashBeforeNewline (1101 of 2110)
PASS: lldb-api :: lang/cpp/overloaded-functions/TestOverloadedFunctions.py (1102 of 2110)
PASS: lldb-unit :: Utility/./UtilityTests/StreamTeeTest.Assignment (1103 of 2110)
PASS: lldb-api :: functionalities/data-formatter/data-formatter-stl/libcxx/iterator/TestDataFormatterLibccIterator.py (1104 of 2110)
PASS: lldb-api :: functionalities/postmortem/mach-core/TestMachCore.py (1105 of 2110)
PASS: lldb-api :: functionalities/thread/backtrace_all/TestBacktraceAll.py (1106 of 2110)
PASS: lldb-unit :: Language/Highlighting/./HighlighterTests/HighlighterTest.Keywords (1107 of 2110)
PASS: lldb-shell :: ScriptInterpreter/None/import_module.test (1108 of 2110)
PASS: lldb-unit :: Utility/./UtilityTests/PassiveReplayTest.InstrumentedBar (1109 of 2110)
PASS: lldb-unit :: Expression/./ExpressionTests/DiagnosticManagerTest.AppendMessageAttachToLastDiag (1110 of 2110)
PASS: lldb-api :: macosx/nslog/TestDarwinNSLogOutput.py (1111 of 2110)
PASS: lldb-unit :: Host/./HostTests/ConnectionFileDescriptorTest.TCPGetURIv6 (1112 of 2110)
PASS: lldb-unit :: Target/./TargetTests/PathMappingListTest.RemapRoot (1113 of 2110)
PASS: lldb-shell :: Quit/TestQuitExitCodeImplicit0.test (1114 of 2110)
PASS: lldb-unit :: Utility/./UtilityTests/RangeTest.ContainsEndInclusiveInvalid (1115 of 2110)
PASS: lldb-api :: functionalities/dead-strip/TestDeadStrip.py (1116 of 2110)
PASS: lldb-api :: tools/lldb-server/TestGdbRemoteHostInfo.py (1117 of 2110)
PASS: lldb-shell :: ObjectFile/ELF/compressed-sections.yaml (1118 of 2110)
PASS: lldb-unit :: Utility/./UtilityTests/UriParserTest.SchemeHostSeparator4 (1119 of 2110)
PASS: lldb-api :: functionalities/postmortem/elf-core/TestLinuxCore.py (1120 of 2110)
PASS: lldb-api :: tools/lldb-server/inferior-crash/TestGdbRemoteSegFault.py (1121 of 2110)
UNSUPPORTED: lldb-api :: lang/c/typedef/Testtypedef.py (1122 of 2110)
PASS: lldb-unit :: Host/./HostTests/FileSystemTest.FileAndDirectoryComponents (1123 of 2110)
PASS: lldb-api :: functionalities/data-formatter/data-formatter-stl/libcxx/vector/TestDataFormatterLibcxxVector.py (1124 of 2110)
PASS: lldb-api :: lang/objc/single-entry-dictionary/TestObjCSingleEntryDictionary.py (1125 of 2110)
PASS: lldb-unit :: Utility/./UtilityTests/OptionsWithRawTest.UnterminatedQuote (1126 of 2110)
PASS: lldb-api :: lang/cpp/function_refs/TestFunctionRefs.py (1127 of 2110)
PASS: lldb-shell :: Driver/TestRepl.test (1128 of 2110)
PASS: lldb-unit :: Utility/./UtilityTests/XcodeSDKTest.GetSDKTypeForTriple (1129 of 2110)
PASS: lldb-unit :: Utility/./UtilityTests/StringListTest.GetSize (1130 of 2110)
PASS: lldb-api :: functionalities/data-formatter/format-propagation/TestFormatPropagation.py (1131 of 2110)
PASS: lldb-unit :: SymbolFile/DWARF/./SymbolFileDWARFTests/SymbolFileDWARFTests.TestAbbrevOrder1Start5 (1132 of 2110)
PASS: lldb-shell :: ObjectFile/ELF/base-address.yaml (1133 of 2110)
PASS: lldb-unit :: Core/./LLDBCoreTests/ModuleSpecTest.TestELFFile (1134 of 2110)
PASS: lldb-api :: lang/cpp/virtual-functions/TestCppVirtualFunctions.py (1135 of 2110)
PASS: lldb-unit :: Utility/./UtilityTests/RangeDataVector.FindEntryIndexesThatContain (1136 of 2110)
PASS: lldb-unit :: Host/./HostTests/SocketTest.TCPGetAddress (1137 of 2110)
PASS: lldb-unit :: Symbol/./SymbolTests/TestTypeSystemClang.TestGetEnumIntegerTypeUnexpectedType (1138 of 2110)
PASS: lldb-unit :: Utility/./UtilityTests/StreamTest.AddressPrefixAndSuffix (1139 of 2110)
PASS: lldb-api :: python_api/sbplatform/TestSBPlatform.py (1140 of 2110)
PASS: lldb-unit :: Process/gdb-remote/./ProcessGdbRemoteTests/GDBRemoteCommunicationClientTest.ReadRegister (1141 of 2110)
PASS: lldb-api :: functionalities/unwind/noreturn/TestNoreturnUnwind.py (1142 of 2110)
PASS: lldb-unit :: Utility/./UtilityTests/StructuredDataTest.StringDump (1143 of 2110)
PASS: lldb-api :: python_api/sbdata/TestSBData.py (1144 of 2110)
PASS: lldb-unit :: Utility/./UtilityTests/ScalarTest.GetBytes (1145 of 2110)
PASS: lldb-unit :: Utility/./UtilityTests/StringExtractorTest.GetHexBytesAvail_FullString (1146 of 2110)
PASS: lldb-api :: functionalities/thread/concurrent_events/TestConcurrentTwoBreakpointsOneDelaySignal.py (1147 of 2110)
PASS: lldb-api :: commands/expression/import-std-module/stack/TestStackFromStdModule.py (1148 of 2110)
PASS: lldb-api :: commands/expression/scoped_enums/TestScopedEnumType.py (1149 of 2110)
PASS: lldb-unit :: Utility/./UtilityTests/DataExtractorTest.UncommonAddressSize (1150 of 2110)
PASS: lldb-unit :: API/./APITests/SBCommandInterpreterTest.MultiWordCommand (1151 of 2110)
PASS: lldb-api :: lang/cpp/llvm-style/TestLLVMStyle.py (1152 of 2110)
PASS: lldb-unit :: SymbolFile/DWARF/./SymbolFileDWARFTests/SymbolFileDWARFTests.TestAbilitiesForDWARF (1153 of 2110)
PASS: lldb-shell :: SymbolFile/NativePDB/globals-bss.cpp (1154 of 2110)
PASS: lldb-unit :: Language/CPlusPlus/./LanguageCPlusPlusTests/CPlusPlusLanguage.ExtractContextAndIdentifier (1155 of 2110)
PASS: lldb-api :: commands/target/modules/search-paths/insert/TestTargetModulesSearchpathsInsert.py (1156 of 2110)
PASS: lldb-unit :: ScriptInterpreter/Python/./ScriptInterpreterPythonTests/PythonDataObjectsTest.TestPythonString (1157 of 2110)
PASS: lldb-api :: commands/expression/radar_9531204/TestPrintfAfterUp.py (1158 of 2110)
PASS: lldb-api :: commands/target/stop-hooks/TestStopHooks.py (1159 of 2110)
PASS: lldb-api :: functionalities/thread/ignore_suspended/TestIgnoreSuspendedThread.py (1160 of 2110)
PASS: lldb-api :: functionalities/data-formatter/user-format-vs-summary/TestUserFormatVsSummary.py (1161 of 2110)
PASS: lldb-unit :: Process/minidump/./LLDBMinidumpTests/RegisterContextMinidump.ConvertMinidumpContext_x86_64 (1162 of 2110)
PASS: lldb-unit :: Utility/./UtilityTests/RegularExpression.Valid (1163 of 2110)
PASS: lldb-api :: functionalities/gdb_remote_client/TestPlatformClient.py (1164 of 2110)
PASS: lldb-api :: python_api/function_symbol/TestSymbolAPI.py (1165 of 2110)
PASS: lldb-unit :: debugserver/./debugserverTests/RNBSocket.LoopBackConnectIPv6 (1166 of 2110)
PASS: lldb-shell :: Driver/LocalLLDBInit.test (1167 of 2110)
PASS: lldb-api :: lang/objc/ivar-IMP/TestObjCiVarIMP.py (1168 of 2110)
UNSUPPORTED: lldb-api :: commands/watchpoints/hello_watchlocation/TestWatchLocation.py (1169 of 2110)
PASS: lldb-api :: commands/frame/diagnose/array/TestArray.py (1170 of 2110)
UNSUPPORTED: lldb-shell :: Register/arm-fp-read.test (1171 of 2110)
PASS: lldb-unit :: Utility/./UtilityTests/ArgsTest.TestSingleArgWithQuotedSpace (1172 of 2110)
PASS: lldb-shell :: SymbolFile/DWARF/DW_OP_piece-smaller-than-struct.s (1173 of 2110)
PASS: lldb-unit :: Utility/./UtilityTests/SerializationRountripTest.SerializeDeserializePod (1174 of 2110)
PASS: lldb-unit :: Utility/./UtilityTests/StreamTeeTest.Flush (1175 of 2110)
UNSUPPORTED: lldb-api :: tools/intel-features/intel-pt/test/TestIntelPTSimpleBinary.py (1176 of 2110)
PASS: lldb-shell :: SymbolFile/DWARF/dir-separator-posix.s (1177 of 2110)
PASS: lldb-api :: macosx/lc-note/kern-ver-str/TestKernVerStrLCNOTE.py (1178 of 2110)
PASS: lldb-shell :: SymbolFile/DWARF/anon_class_w_and_wo_export_symbols.ll (1179 of 2110)
PASS: lldb-shell :: ObjectFile/wasm/unified-debug-sections.yaml (1180 of 2110)
PASS: lldb-api :: functionalities/non-overlapping-index-variable-i/TestIndexVariable.py (1181 of 2110)
PASS: lldb-unit :: Host/./HostTests/SocketTest.DomainGetConnectURI (1182 of 2110)
PASS: lldb-unit :: Utility/./UtilityTests/VMRange.Comparison (1183 of 2110)
PASS: lldb-shell :: Reproducer/TestDriverOptions.test (1184 of 2110)
PASS: lldb-api :: macosx/thread-names/TestInterruptThreadNames.py (1185 of 2110)
PASS: lldb-api :: lang/cpp/alignas_base_class/TestAlignAsBaseClass.py (1186 of 2110)
PASS: lldb-unit :: Expression/./ExpressionTests/CppModuleConfigurationTest.Linux (1187 of 2110)
PASS: lldb-unit :: Expression/./ExpressionTests/DWARFExpression.DW_OP_piece (1188 of 2110)
PASS: lldb-unit :: Interpreter/./InterpreterTests/OptionArgParserTest.toChar (1189 of 2110)
PASS: lldb-shell :: SymbolFile/NativePDB/break-by-line.cpp (1190 of 2110)
PASS: lldb-shell :: SymbolFile/NativePDB/s_constant.cpp (1191 of 2110)
PASS: lldb-api :: functionalities/breakpoint/breakpoint_set_restart/TestBreakpointSetRestart.py (1192 of 2110)
PASS: lldb-unit :: Expression/./ExpressionTests/DiagnosticManagerTest.FixedExpression (1193 of 2110)
PASS: lldb-api :: api/multithreaded/TestMultithreaded.py (1194 of 2110)
PASS: lldb-unit :: Utility/./UtilityTests/BinaryStreamTest.PutULEB128EightBytes (1195 of 2110)
PASS: lldb-api :: python_api/frame/get-variables/TestGetVariables.py (1196 of 2110)
PASS: lldb-unit :: Host/./HostTests/SocketAddressTest.Set (1197 of 2110)
PASS: lldb-api :: commands/help/TestHelp.py (1198 of 2110)
PASS: lldb-unit :: DataFormatter/./LLDBFormatterTests/TypeMatcherTests.ExactName (1199 of 2110)
PASS: lldb-api :: functionalities/thread/concurrent_events/TestConcurrentCrashWithWatchpointBreakpointSignal.py (1200 of 2110)
PASS: lldb-api :: lang/c/blocks/TestBlocks.py (1201 of 2110)
PASS: lldb-unit :: ObjectFile/Breakpad/./ObjectFileBreakpadTests/ModuleRecord.parse (1202 of 2110)
PASS: lldb-unit :: Utility/./UtilityTests/StringExtractorTest.GetHexU8_Extra_NoEof (1203 of 2110)
PASS: lldb-unit :: Utility/./UtilityTests/SerializationRountripTest.SerializeDeserializeCString (1204 of 2110)
PASS: lldb-api :: types/TestShortTypeExpr.py (1205 of 2110)
PASS: lldb-shell :: Driver/TestFile.test (1206 of 2110)
PASS: lldb-api :: lang/cpp/type_lookup/TestCppTypeLookup.py (1207 of 2110)
PASS: lldb-api :: functionalities/target_var/TestTargetVar.py (1208 of 2110)
PASS: lldb-api :: functionalities/plugins/python_os_plugin/stepping_plugin_threads/TestOSPluginStepping.py (1209 of 2110)
PASS: lldb-unit :: Language/Highlighting/./HighlighterTests/HighlighterTest.ClangIdentifiers (1210 of 2110)
PASS: lldb-unit :: Symbol/./SymbolTests/TestTypeSystemClang.TestRecordHasFields (1211 of 2110)
PASS: lldb-api :: commands/process/attach/TestProcessAttach.py (1212 of 2110)
PASS: lldb-api :: functionalities/breakpoint/breakpoint_names/TestBreakpointNames.py (1213 of 2110)
PASS: lldb-unit :: Symbol/./SymbolTests/TestTypeSystemClang.TestDeletingImplicitCopyCstrDueToMoveCStr (1214 of 2110)
PASS: lldb-api :: python_api/sbtype_typeclass/TestSBTypeTypeClass.py (1215 of 2110)
PASS: lldb-unit :: Utility/./UtilityTests/StreamTest.PutHex64ByteOrderBig (1216 of 2110)
PASS: lldb-unit :: Utility/./UtilityTests/StreamTest.PutRawBytesToLittleEndian (1217 of 2110)
PASS: lldb-api :: lang/cpp/class_types/TestClassTypesDisassembly.py (1218 of 2110)
PASS: lldb-unit :: UnwindAssembly/x86/./UnwindAssemblyx86Tests/Testx86AssemblyInspectionEngine.TestSimplex86_64Augmented (1219 of 2110)
PASS: lldb-api :: lang/objcxx/hide-runtime-values/TestObjCXXHideRuntimeValues.py (1220 of 2110)
PASS: lldb-unit :: ScriptInterpreter/Python/./ScriptInterpreterPythonTests/PythonDataObjectsTest.TestOwnedReferences (1221 of 2110)
PASS: lldb-unit :: Expression/./ExpressionTests/CppModuleConfigurationTest.AmbiguousCLib (1222 of 2110)
PASS: lldb-unit :: Utility/./UtilityTests/StringExtractorTest.GetHexBytes_Partial (1223 of 2110)
PASS: lldb-shell :: SymbolFile/DWARF/debug-types-address-ranges.s (1224 of 2110)
PASS: lldb-unit :: Utility/./UtilityTests/DataExtractorTest.GetCStrEmpty (1225 of 2110)
PASS: lldb-api :: commands/target/basic/TestTargetCommand.py (1226 of 2110)
PASS: lldb-api :: commands/expression/calculator_mode/TestCalculatorMode.py (1227 of 2110)
PASS: lldb-api :: tools/lldb-server/inferior-crash/TestGdbRemoteAbort.py (1228 of 2110)
PASS: lldb-unit :: Utility/./UtilityTests/StringLexerTest.Peek (1229 of 2110)
PASS: lldb-api :: lang/c/strings/TestCStrings.py (1230 of 2110)
PASS: lldb-unit :: Utility/./UtilityTests/BinaryStreamTest.PutSLEB128Zero (1231 of 2110)
PASS: lldb-api :: commands/expression/save_jit_objects/TestSaveJITObjects.py (1232 of 2110)
PASS: lldb-api :: functionalities/var_path/TestVarPath.py (1233 of 2110)
PASS: lldb-unit :: Utility/./UtilityTests/StringLexerTest.HasAtLeast (1234 of 2110)
PASS: lldb-shell :: Commands/command-disassemble-process.yaml (1235 of 2110)
UNSUPPORTED: lldb-api :: functionalities/tty/TestTerminal.py (1236 of 2110)
PASS: lldb-api :: api/log/TestAPILog.py (1237 of 2110)
PASS: lldb-api :: types/TestIntegerType.py (1238 of 2110)
PASS: lldb-shell :: Unwind/eh-frame-dwarf-unwind.test (1239 of 2110)
PASS: lldb-unit :: Host/./HostTests/FileSystemTest.Exists (1240 of 2110)
PASS: lldb-unit :: Utility/./UtilityTests/ScalarTest.LongLongAssigmentOperator (1241 of 2110)
PASS: lldb-shell :: Commands/command-target-modules-dump-sections.yaml (1242 of 2110)
PASS: lldb-unit :: SymbolFile/DWARF/./SymbolFileDWARFTests/XcodeSDKModuleTests.TestModuleGetXcodeSDK (1243 of 2110)
UNSUPPORTED: lldb-shell :: ScriptInterpreter/Lua/watchpoint_callback.test (1244 of 2110)
PASS: lldb-unit :: Utility/./UtilityTests/UriParserTest.BadPort2 (1245 of 2110)
PASS: lldb-unit :: Host/./HostTests/FileSystemTest.Resolve (1246 of 2110)
UNSUPPORTED: lldb-api :: functionalities/data-formatter/data-formatter-stl/libstdcpp/vector/TestDataFormatterStdVector.py (1247 of 2110)
UNSUPPORTED: lldb-api :: linux/mix-dwo-and-regular-objects/TestMixedDwarfBinary.py (1248 of 2110)
PASS: lldb-unit :: Utility/./UtilityTests/UserIDResolver.GetGroupName (1249 of 2110)
UNSUPPORTED: lldb-shell :: Register/x86-ymm-write.test (1250 of 2110)
PASS: lldb-shell :: SymbolFile/DWARF/find-basic-namespace.cpp (1251 of 2110)
PASS: lldb-unit :: Utility/./UtilityTests/DataExtractorTest.GetFloatUnaligned (1252 of 2110)
PASS: lldb-api :: functionalities/data-formatter/hexcaps/TestDataFormatterHexCaps.py (1253 of 2110)
PASS: lldb-unit :: Symbol/./SymbolTests/SymbolsTest.LocateExecutableSymbolFileForUnknownExecutableAndMissingSymbolFile (1254 of 2110)
PASS: lldb-unit :: Utility/./UtilityTests/StringListTest.Clear (1255 of 2110)
PASS: lldb-unit :: UnwindAssembly/x86/./UnwindAssemblyx86Tests/Testx86AssemblyInspectionEngine.TestPushEAX (1256 of 2110)
PASS: lldb-unit :: Core/./LLDBCoreTests/RichManglingContextTest.SwitchProvider (1257 of 2110)
PASS: lldb-unit :: Utility/./UtilityTests/IndexToObjectTest.ObjectForIndex (1258 of 2110)
PASS: lldb-unit :: Utility/./UtilityTests/AnsiTerminal.Unknown (1259 of 2110)
PASS: lldb-shell :: Reproducer/TestFileRepro.test (1260 of 2110)
PASS: lldb-api :: commands/expression/pr35310/TestExprsBug35310.py (1261 of 2110)
PASS: lldb-api :: lang/cpp/this/TestCPPThis.py (1262 of 2110)
PASS: lldb-api :: python_api/symbol-context/two-files/TestSymbolContextTwoFiles.py (1263 of 2110)
PASS: lldb-shell :: ObjectFile/PECOFF/invalid-export-table.yaml (1264 of 2110)
PASS: lldb-unit :: Utility/./UtilityTests/StatusTest.ErrorCodeConstructor (1265 of 2110)
PASS: lldb-unit :: ScriptInterpreter/Python/./ScriptInterpreterPythonTests/PythonDataObjectsTest.TestCallable (1266 of 2110)
PASS: lldb-api :: lang/c/local_variables/TestLocalVariables.py (1267 of 2110)
PASS: lldb-unit :: Expression/./ExpressionTests/ClangHostTest.ComputeClangResourceDirectory (1268 of 2110)
PASS: lldb-api :: functionalities/data-formatter/data-formatter-synth/TestDataFormatterSynth.py (1269 of 2110)
PASS: lldb-shell :: Reproducer/TestDiscard.test (1270 of 2110)
PASS: lldb-unit :: Utility/./UtilityTests/GeneratorTest.Create (1271 of 2110)
PASS: lldb-api :: lang/objc/objc-ivar-stripped/TestObjCIvarStripped.py (1272 of 2110)
PASS: lldb-shell :: Driver/TestHelp.test (1273 of 2110)
PASS: lldb-unit :: UnwindAssembly/x86/./UnwindAssemblyx86Tests/Testx86AssemblyInspectionEngine.TestPushEDI (1274 of 2110)
PASS: lldb-api :: functionalities/process_crash_info/TestProcessCrashInfo.py (1275 of 2110)
PASS: lldb-unit :: Utility/./UtilityTests/StringExtractorTest.GetHexBytes_OddPair2 (1276 of 2110)
PASS: lldb-api :: functionalities/avoids-fd-leak/TestFdLeak.py (1277 of 2110)
UNSUPPORTED: lldb-api :: tools/lldb-server/thread-name/TestGdbRemoteThreadName.py (1278 of 2110)
PASS: lldb-unit :: Utility/./UtilityTests/OptionsWithRawTest.WhitespaceInput (1279 of 2110)
PASS: lldb-unit :: Utility/./UtilityTests/ListenerTest.GetEventImmediate (1280 of 2110)
PASS: lldb-unit :: Utility/./UtilityTests/DataExtractorTest.GetFloat (1281 of 2110)
PASS: lldb-unit :: Symbol/./SymbolTests/TestTypeSystemClang.TestGetBasicTypeFromName (1282 of 2110)
PASS: lldb-api :: types/TestCharTypeExpr.py (1283 of 2110)
PASS: lldb-shell :: SymbolFile/DWARF/debug-types-signature-loop.s (1284 of 2110)
PASS: lldb-unit :: UnwindAssembly/x86/./UnwindAssemblyx86Tests/Testx86AssemblyInspectionEngine.TestSubRSP (1285 of 2110)
PASS: lldb-api :: functionalities/plugins/command_plugin/TestPluginCommands.py (1286 of 2110)
PASS: lldb-unit :: Utility/./UtilityTests/FileSpecTest.FormatFileSpec (1287 of 2110)
PASS: lldb-unit :: Utility/./UtilityTests/StringLexerTest.AdvanceIf (1288 of 2110)
PASS: lldb-api :: commands/expression/persist_objc_pointeetype/TestPersistObjCPointeeType.py (1289 of 2110)
PASS: lldb-api :: python_api/sbvalue_const_addrof/TestSBValueConstAddrOf.py (1290 of 2110)
PASS: lldb-unit :: Utility/./UtilityTests/VMRange.Ordering (1291 of 2110)
PASS: lldb-unit :: Process/gdb-remote/./ProcessGdbRemoteTests/GDBRemoteCommunicationServerTest.SendErrorResponse_ErrorNumber (1292 of 2110)
PASS: lldb-api :: commands/expression/regression-access-function-template-in-record/TestRegressionAccessFunctionTemplateInRecord.py (1293 of 2110)
PASS: lldb-api :: python_api/name_lookup/TestNameLookup.py (1294 of 2110)
PASS: lldb-unit :: Process/gdb-remote/./ProcessGdbRemoteTests/GDBRemoteCommunicationClientTest.SendGetTraceConfigPacket (1295 of 2110)
PASS: lldb-unit :: SymbolFile/NativePDB/./SymbolFileNativePDBTests/PDBFPOProgramToDWARFExpressionTests.SingleAssignmentRegisterRef (1296 of 2110)
PASS: lldb-shell :: SymbolFile/DWARF/DW_AT_declaration-with-children.s (1297 of 2110)
UNSUPPORTED: lldb-api :: tools/lldb-server/TestGdbRemoteModuleInfo.py (1298 of 2110)
PASS: lldb-api :: functionalities/load_using_paths/TestLoadUsingPaths.py (1299 of 2110)
PASS: lldb-unit :: UnwindAssembly/x86/./UnwindAssemblyx86Tests/Testx86AssemblyInspectionEngine.TestPopEBP (1300 of 2110)
PASS: lldb-api :: lang/cpp/operators/TestCppOperators.py (1301 of 2110)
PASS: lldb-api :: functionalities/memory/cache/TestMemoryCache.py (1302 of 2110)
PASS: lldb-unit :: Platform/./LLDBPlatformTests/PlatformAppleSimulatorTest.TestHostPlatformToSim (1303 of 2110)
PASS: lldb-shell :: Settings/TestSettingsWrite.test (1304 of 2110)
UNSUPPORTED: lldb-api :: benchmarks/expression/TestExpressionCmd.py (1305 of 2110)
PASS: lldb-api :: commands/expression/ir-interpreter/TestIRInterpreter.py (1306 of 2110)
UNSUPPORTED: lldb-api :: lang/cpp/static_members/TestCPPStaticMembers.py (1307 of 2110)
PASS: lldb-api :: commands/expression/top-level/TestTopLevelExprs.py (1308 of 2110)
PASS: lldb-api :: functionalities/thread/concurrent_events/TestConcurrentTwoBreakpointThreads.py (1309 of 2110)
PASS: lldb-shell :: Quit/TestQuitExitCodeTooManyArgs.test (1310 of 2110)
PASS: lldb-api :: commands/expression/import-std-module/forward_list/TestForwardListFromStdModule.py (1311 of 2110)
PASS: lldb-api :: lang/cpp/typedef/TestCppTypedef.py (1312 of 2110)
PASS: lldb-unit :: Utility/./UtilityTests/ArgsTest.BareSingleQuote (1313 of 2110)
PASS: lldb-api :: functionalities/type_completion/TestTypeCompletion.py (1314 of 2110)
PASS: lldb-api :: functionalities/breakpoint/breakpoint_command/TestBreakpointCommand.py (1315 of 2110)
PASS: lldb-api :: functionalities/multiword-commands/TestMultiWordCommands.py (1316 of 2110)
PASS: lldb-api :: commands/frame/var-scope/TestFrameVariableScope.py (1317 of 2110)
PASS: lldb-api :: commands/expression/dollar-in-variable/TestDollarInVariable.py (1318 of 2110)
PASS: lldb-unit :: Utility/./UtilityTests/StatusTest.ErrorConstructor (1319 of 2110)
PASS: lldb-unit :: Symbol/./SymbolTests/TestTypeSystemClang.TestOwningModule (1320 of 2110)
PASS: lldb-api :: functionalities/thread/num_threads/TestNumThreads.py (1321 of 2110)
PASS: lldb-api :: functionalities/breakpoint/debugbreak/TestDebugBreak.py (1322 of 2110)
PASS: lldb-shell :: SymbolFile/DWARF/dwarf5-debug_line.s (1323 of 2110)
PASS: lldb-api :: commands/expression/anonymous-struct/TestCallUserAnonTypedef.py (1324 of 2110)
PASS: lldb-unit :: ScriptInterpreter/Python/./ScriptInterpreterPythonTests/PythonDataObjectsTest.TestPythonByteArray (1325 of 2110)
PASS: lldb-api :: python_api/get-value-32bit-int/TestGetValue32BitInt.py (1326 of 2110)
UNSUPPORTED: lldb-api :: api/multiple-debuggers/TestMultipleDebuggers.py (1327 of 2110)
PASS: lldb-unit :: Utility/./UtilityTests/UriParserTest.BracketedHostnameWithColon (1328 of 2110)
PASS: lldb-unit :: Utility/./UtilityTests/StreamTest.PutChar (1329 of 2110)
PASS: lldb-api :: functionalities/load_unload/TestLoadUnload.py (1330 of 2110)
PASS: lldb-api :: commands/apropos/basic/TestApropos.py (1331 of 2110)
PASS: lldb-unit :: Utility/./UtilityTests/SubsystemRAIITest.NormalSubsystem (1332 of 2110)
PASS: lldb-shell :: SymbolFile/Breakpad/line-table-mixed-path-styles.test (1333 of 2110)
PASS: lldb-shell :: SymbolFile/DWARF/dwp-debug-types.s (1334 of 2110)
PASS: lldb-shell :: SymbolFile/NativePDB/tag-types.cpp (1335 of 2110)
PASS: lldb-unit :: Process/gdb-remote/./ProcessGdbRemoteTests/GDBRemoteCommunicationTest.ReadPacket_checksum (1336 of 2110)
PASS: lldb-api :: functionalities/signal/handle-abrt/TestHandleAbort.py (1337 of 2110)
PASS: lldb-shell :: Driver/TestCommands.test (1338 of 2110)
UNSUPPORTED: lldb-api :: functionalities/unwind/standard/TestStandardUnwind.py (1339 of 2110)
PASS: lldb-api :: commands/watchpoints/watchpoint_set_command/TestWatchLocationWithWatchSet.py (1340 of 2110)
UNSUPPORTED: lldb-shell :: SymbolFile/PDB/func-symbols.test (1341 of 2110)
PASS: lldb-api :: lang/cpp/dynamic-value/TestCppValueCast.py (1342 of 2110)
PASS: lldb-unit :: Utility/./UtilityTests/UriParserTest.TypicalPortPathIPv6 (1343 of 2110)
PASS: lldb-unit :: Utility/./UtilityTests/ReproducerTest.SetReplay (1344 of 2110)
PASS: lldb-api :: functionalities/float-display/TestFloatDisplay.py (1345 of 2110)
PASS: lldb-api :: functionalities/postmortem/wow64_minidump/TestWow64MiniDump.py (1346 of 2110)
PASS: lldb-api :: lang/cpp/symbols/TestSymbols.py (1347 of 2110)
PASS: lldb-unit :: Utility/./UtilityTests/StringListTest.AppendStringMove (1348 of 2110)
PASS: lldb-unit :: Utility/./UtilityTests/ConstStringTest.MangledCounterpart (1349 of 2110)
PASS: lldb-unit :: Utility/./UtilityTests/XcodeSDKTest.GetCanonicalNameAndConstruct (1350 of 2110)
PASS: lldb-unit :: Utility/./UtilityTests/StreamTest.PutHex8 (1351 of 2110)
PASS: lldb-unit :: Utility/./UtilityTests/RangeDataVector.FindEntryIndexesThatContain_Overlap (1352 of 2110)
PASS: lldb-api :: functionalities/gdb_remote_client/TestNoWatchpointSupportInfo.py (1353 of 2110)
PASS: lldb-unit :: Utility/./UtilityTests/ArgsTest.TestAppendArg (1354 of 2110)
PASS: lldb-api :: source-manager/TestSourceManager.py (1355 of 2110)
PASS: lldb-unit :: Utility/./UtilityTests/StringExtractorTest.GetNameColonValueContainsColon (1356 of 2110)
PASS: lldb-shell :: Breakpoint/split-dwarf-5-addrbase.test (1357 of 2110)
PASS: lldb-shell :: SymbolFile/Breakpad/stack-cfi-parsing.test (1358 of 2110)
PASS: lldb-unit :: Host/./HostTests/FileSystemTest.MakeAbsolute (1359 of 2110)
PASS: lldb-shell :: ObjectFile/wasm/embedded-debug-sections.yaml (1360 of 2110)
PASS: lldb-unit :: Process/gdb-remote/./ProcessGdbRemoteTests/GDBRemoteCommunicationClientTest.GetModulesInfo (1361 of 2110)
PASS: lldb-shell :: SymbolFile/DWARF/debug_loc.s (1362 of 2110)
PASS: lldb-unit :: Utility/./UtilityTests/ArgsTest.TestQuotedTrailingBackslash (1363 of 2110)
PASS: lldb-shell :: BuildScript/script-args.test (1364 of 2110)
PASS: lldb-api :: lang/objc/rdar-11355592/TestRdar11355592.py (1365 of 2110)
PASS: lldb-unit :: UnwindAssembly/x86/./UnwindAssemblyx86Tests/Testx86AssemblyInspectionEngine.Test64bitFramelessBigStackFrame (1366 of 2110)
PASS: lldb-api :: commands/frame/diagnose/dereference-argument/TestDiagnoseDereferenceArgument.py (1367 of 2110)
PASS: lldb-unit :: Utility/./UtilityTests/DataExtractorTest.GetMaxU64_unchecked (1368 of 2110)
PASS: lldb-api :: commands/expression/test/TestExprs2.py (1369 of 2110)
PASS: lldb-api :: functionalities/data-formatter/data-formatter-stl/libcxx/variant/TestDataFormatterLibcxxVariant.py (1370 of 2110)
UNSUPPORTED: lldb-api :: commands/expression/call-restarts/TestCallThatRestarts.py (1371 of 2110)
PASS: lldb-shell :: Reproducer/TestReuseDirectory.test (1372 of 2110)
PASS: lldb-unit :: Expression/./ExpressionTests/DiagnosticManagerTest.AppendMessageNoDiag (1373 of 2110)
PASS: lldb-api :: commands/expression/import-std-module/weak_ptr-dbg-info-content/TestDbgInfoContentWeakPtrFromStdModule.py (1374 of 2110)
PASS: lldb-unit :: Utility/./UtilityTests/SerializationRountripTest.SerializeDeserializePodReferences (1375 of 2110)
PASS: lldb-unit :: ObjectFile/ELF/./ObjectFileELFTests/ObjectFileELFTest.GetSymtab_NoSymEntryPointArmThumbAddressClass (1376 of 2110)
PASS: lldb-unit :: Language/Highlighting/./HighlighterTests/HighlighterTest.ClangCursorPosEndOfLine (1377 of 2110)
PASS: lldb-unit :: Utility/./UtilityTests/AnsiTerminal.Empty (1378 of 2110)
PASS: lldb-unit :: Language/Highlighting/./HighlighterTests/HighlighterTest.ClangBraces (1379 of 2110)
PASS: lldb-api :: tools/lldb-server/TestLldbGdbServer.py (1380 of 2110)
PASS: lldb-unit :: Utility/./UtilityTests/DataExtractorTest.GetDouble (1381 of 2110)
PASS: lldb-shell :: Host/TestCustomShell.test (1382 of 2110)
PASS: lldb-api :: sanity/TestModuleCacheSanity.py (1383 of 2110)
PASS: lldb-unit :: SymbolFile/NativePDB/./SymbolFileNativePDBTests/PDBFPOProgramToDWARFExpressionTests.InvalidAssignmentSingle (1384 of 2110)
PASS: lldb-api :: functionalities/value_md5_crash/TestValueMD5Crash.py (1385 of 2110)
PASS: lldb-shell :: SymbolFile/Breakpad/unwind-via-stack-cfi.test (1386 of 2110)
UNSUPPORTED: lldb-shell :: SymbolFile/PDB/enums-layout.test (1387 of 2110)
PASS: lldb-shell :: Process/Optimization.test (1388 of 2110)
PASS: lldb-shell :: SymbolFile/DWARF/dwarf5-partial-index.cpp (1389 of 2110)
PASS: lldb-shell :: ObjectFile/PECOFF/basic-info-arm64.yaml (1390 of 2110)
PASS: lldb-api :: lang/cpp/global_operators/TestCppGlobalOperators.py (1391 of 2110)
PASS: lldb-unit :: Utility/./UtilityTests/XcodeSDKTest.MergeTest (1392 of 2110)
PASS: lldb-shell :: ScriptInterpreter/Python/sb_address_exception.test (1393 of 2110)
PASS: lldb-unit :: Utility/./UtilityTests/StringListTest.ForRange (1394 of 2110)
PASS: lldb-api :: lang/cpp/bool/TestCPPBool.py (1395 of 2110)
PASS: lldb-api :: lang/objc/modules-app-update/TestClangModulesAppUpdate.py (1396 of 2110)
UNSUPPORTED: lldb-api :: functionalities/darwin_log/basic/TestDarwinLogBasic.py (1397 of 2110)
UNSUPPORTED: lldb-api :: functionalities/process_save_core/TestProcessSaveCore.py (1398 of 2110)
PASS: lldb-shell :: BuildScript/modes.test (1399 of 2110)
PASS: lldb-unit :: Process/minidump/./LLDBMinidumpTests/MinidumpParserTest.GetExceptionStream (1400 of 2110)
PASS: lldb-api :: macosx/queues/TestQueues.py (1401 of 2110)
PASS: lldb-unit :: UnwindAssembly/x86/./UnwindAssemblyx86Tests/Testx86AssemblyInspectionEngine.TestPushRBX (1402 of 2110)
PASS: lldb-unit :: Utility/./UtilityTests/DataExtractorTest.GetBitfield (1403 of 2110)
PASS: lldb-shell :: SymbolFile/DWARF/split-dwarf-multiple-cu.ll (1404 of 2110)
PASS: lldb-shell :: SymbolFile/Breakpad/unwind-via-raSearch.test (1405 of 2110)
PASS: lldb-api :: functionalities/pointer_num_children/TestPointerNumChildren.py (1406 of 2110)
UNSUPPORTED: lldb-api :: commands/gui/breakpoints/TestGuiBreakpoints.py (1407 of 2110)
PASS: lldb-unit :: Expression/./ExpressionTests/DiagnosticManagerTest.GetStringPreserveOrder (1408 of 2110)
PASS: lldb-api :: functionalities/gdb_remote_client/TestRecognizeBreakpoint.py (1409 of 2110)
PASS: lldb-api :: commands/target/stop-hook/disable/TestTargetStopHookDisable.py (1410 of 2110)
PASS: lldb-shell :: Reproducer/TestPythonImport.test (1411 of 2110)
PASS: lldb-api :: lang/cpp/incomplete-types/TestCppIncompleteTypes.py (1412 of 2110)
PASS: lldb-unit :: Symbol/./SymbolTests/TestClangASTImporter.DeportTypeTagDecl (1413 of 2110)
PASS: lldb-unit :: Symbol/./SymbolTests/TestTypeSystemClang.TestGetTypeClassDeclType (1414 of 2110)
PASS: lldb-unit :: Utility/./UtilityTests/VASprintfTest.EncodingError (1415 of 2110)
PASS: lldb-unit :: debugserver/./debugserverTests/JSON.Parse (1416 of 2110)
PASS: lldb-api :: commands/frame/diagnose/local-variable/TestLocalVariable.py (1417 of 2110)
PASS: lldb-api :: tools/lldb-vscode/stackTrace/TestVSCode_stackTrace.py (1418 of 2110)
UNSUPPORTED: lldb-shell :: BuildScript/toolchain-msvc.test (1419 of 2110)
PASS: lldb-api :: functionalities/breakpoint/auto_continue/TestBreakpointAutoContinue.py (1420 of 2110)
PASS: lldb-api :: python_api/sbenvironment/TestSBEnvironment.py (1421 of 2110)
PASS: lldb-shell :: SymbolFile/DWARF/dwo-type-in-main-file.s (1422 of 2110)
PASS: lldb-unit :: Host/./HostTests/NativeProcessProtocolTest.ReadMemoryWithoutTrap (1423 of 2110)
PASS: lldb-unit :: Symbol/./SymbolTests/TestClangASTImporter.CopyDeclTagDecl (1424 of 2110)
PASS: lldb-unit :: ScriptInterpreter/Python/./ScriptInterpreterPythonTests/PythonDataObjectsTest.TestPythonDictionaryManipulation (1425 of 2110)
PASS: lldb-api :: commands/reproducer/invalid-args/TestInvalidArgsReproducer.py (1426 of 2110)
PASS: lldb-unit :: Symbol/./SymbolTests/TestClangASTImporter.CompleteFwdDeclWithOtherOrigin (1427 of 2110)
PASS: lldb-unit :: Utility/./UtilityTests/BinaryStreamTest.PutSLEB128TwoBytes (1428 of 2110)
PASS: lldb-shell :: Minidump/memory-region-from-module.yaml (1429 of 2110)
PASS: lldb-shell :: Commands/command-source.test (1430 of 2110)
PASS: lldb-unit :: Utility/./UtilityTests/StringListTest.JoinThree (1431 of 2110)
PASS: lldb-api :: driver/batch_mode/TestBatchMode.py (1432 of 2110)
UNSUPPORTED: lldb-api :: functionalities/breakpoint/breakpoint_callback_command_source/TestBreakpointCallbackCommandSource.py (1433 of 2110)
PASS: lldb-unit :: Language/Highlighting/./HighlighterTests/HighlighterTest.ClangStringLiterals (1434 of 2110)
PASS: lldb-api :: functionalities/thread/concurrent_events/TestConcurrentDelayWatchBreak.py (1435 of 2110)
PASS: lldb-api :: functionalities/gdb_remote_client/TestRestartBug.py (1436 of 2110)
PASS: lldb-unit :: Target/./TargetTests/RemoteAwarePlatformTest.TestResolveExecutabelOnClientByPlatform (1437 of 2110)
PASS: lldb-unit :: Host/./HostTests/File.GetWaitableHandleFileno (1438 of 2110)
UNSUPPORTED: lldb-api :: lang/objc/ptr_refs/TestPtrRefsObjC.py (1439 of 2110)
PASS: lldb-unit :: Utility/./UtilityTests/StringExtractorTest.GetHexU8_InvalidHex (1440 of 2110)
PASS: lldb-unit :: Utility/./UtilityTests/StringExtractorTest.GetHexBytesAvail_Underflow (1441 of 2110)
PASS: lldb-api :: commands/command/nested_alias/TestNestedAlias.py (1442 of 2110)
PASS: lldb-unit :: Utility/./UtilityTests/XcodeSDKTest.FindXcodeContentsDirectoryInPath (1443 of 2110)
PASS: lldb-shell :: Quit/TestQuitExitCode-30.test (1444 of 2110)
PASS: lldb-shell :: Breakpoint/debug_rnglist_rlestartend.test (1445 of 2110)
UNSUPPORTED: lldb-api :: tools/lldb-server/TestGdbRemote_vContThreads.py (1446 of 2110)
PASS: lldb-unit :: Utility/./UtilityTests/ScalarTest.ExtractBitfield (1447 of 2110)
UNSUPPORTED: lldb-api :: functionalities/ubsan/basic/TestUbsanBasic.py (1448 of 2110)
PASS: lldb-unit :: ScriptInterpreter/Python/./ScriptInterpreterPythonTests/PythonDataObjectsTest.TestPythonListManipulation (1449 of 2110)
PASS: lldb-unit :: Process/minidump/./LLDBMinidumpTests/MinidumpParserTest.GetArchitecture (1450 of 2110)
UNSUPPORTED: lldb-api :: commands/gui/viewlarge/TestGuiViewLarge.py (1451 of 2110)
PASS: lldb-unit :: Symbol/./SymbolTests/LineEntryTest.GetSameLineContiguousAddressRangeOneInline (1452 of 2110)
PASS: lldb-unit :: Language/Highlighting/./HighlighterTests/HighlighterTest.ClangCursorPos (1453 of 2110)
PASS: lldb-api :: functionalities/data-formatter/data-formatter-synthval/TestDataFormatterSynthVal.py (1454 of 2110)
UNSUPPORTED: lldb-api :: functionalities/ptr_refs/TestPtrRefs.py (1455 of 2110)
PASS: lldb-unit :: Utility/./UtilityTests/FileSpecTest.RemoveLastPathComponent (1456 of 2110)
PASS: lldb-api :: functionalities/data-formatter/data-formatter-script/TestDataFormatterScript.py (1457 of 2110)
UNSUPPORTED: lldb-shell :: Register/x86-gp-read.test (1458 of 2110)
PASS: lldb-unit :: Symbol/./SymbolTests/TestTypeSystemClang.AddMethodToObjCObjectType (1459 of 2110)
PASS: lldb-api :: functionalities/plugins/python_os_plugin/TestPythonOSPlugin.py (1460 of 2110)
PASS: lldb-unit :: Host/./HostTests/SocketTest.TCPGetConnectURI (1461 of 2110)
UNSUPPORTED: lldb-api :: iohandler/resize/TestIOHandlerResize.py (1462 of 2110)
PASS: lldb-api :: python_api/lldbutil/iter/TestLLDBIterator.py (1463 of 2110)
UNSUPPORTED: lldb-api :: functionalities/asan/TestMemoryHistory.py (1464 of 2110)
PASS: lldb-unit :: Symbol/./SymbolTests/TestTypeSystemClang.TestGetEnumIntegerTypeBasicTypes (1465 of 2110)
PASS: lldb-unit :: Utility/./UtilityTests/ProcessInstanceInfo.DumpTable (1466 of 2110)
PASS: lldb-api :: commands/command/script/TestCommandScript.py (1467 of 2110)
PASS: lldb-unit :: Process/gdb-remote/./ProcessGdbRemoteTests/GDBRemoteCommunicationClientTest.SendGetDataPacket (1468 of 2110)
PASS: lldb-unit :: Expression/./ExpressionTests/DWARFExpression.DW_OP_convert (1469 of 2110)
PASS: lldb-api :: tools/lldb-vscode/console/TestVSCode_console.py (1470 of 2110)
UNSUPPORTED: lldb-api :: functionalities/ubsan/user-expression/TestUbsanUserExpression.py (1471 of 2110)
PASS: lldb-api :: functionalities/backticks/TestBackticksWithoutATarget.py (1472 of 2110)
PASS: lldb-api :: tools/lldb-vscode/variables/TestVSCode_variables.py (1473 of 2110)
PASS: lldb-api :: lang/c/struct_types/TestStructTypes.py (1474 of 2110)
PASS: lldb-api :: commands/expression/cast_int_to_anonymous_enum/TestCastIntToAnonymousEnum.py (1475 of 2110)
PASS: lldb-unit :: Utility/./UtilityTests/DataExtractorTest.GetCStrUnterminated (1476 of 2110)
PASS: lldb-api :: macosx/find-dsym/deep-bundle/TestDeepBundle.py (1477 of 2110)
PASS: lldb-shell :: Quit/TestQuitExitCodeNonInt.test (1478 of 2110)
PASS: lldb-unit :: Utility/./UtilityTests/AnsiTerminal.Basic (1479 of 2110)
PASS: lldb-api :: functionalities/tail_call_frames/disambiguate_tail_call_seq/TestDisambiguateTailCallSeq.py (1480 of 2110)
PASS: lldb-unit :: SymbolFile/NativePDB/./SymbolFileNativePDBTests/PDBFPOProgramToDWARFExpressionTests.UnresolvedCyclicRegisterAssignmentReference (1481 of 2110)
PASS: lldb-api :: functionalities/thread/step_out/TestThreadStepOut.py (1482 of 2110)
PASS: lldb-unit :: Utility/./UtilityTests/StringExtractorTest.DecodeHexU8_Extra (1483 of 2110)
PASS: lldb-api :: commands/add-dsym/uuid/TestAddDsymCommand.py (1484 of 2110)
PASS: lldb-unit :: Language/Highlighting/./HighlighterTests/HighlighterTest.ClangScalarLiterals (1485 of 2110)
UNSUPPORTED: lldb-shell :: SymbolFile/PDB/typedefs.test (1486 of 2110)
PASS: lldb-api :: functionalities/data-formatter/data-formatter-advanced/TestDataFormatterAdv.py (1487 of 2110)
PASS: lldb-api :: functionalities/thread/concurrent_events/TestConcurrentWatchpointWithDelayWatchpointThreads.py (1488 of 2110)
PASS: lldb-unit :: Utility/./UtilityTests/StreamTest.PutHex64ByteOrderLittle (1489 of 2110)
PASS: lldb-api :: lang/c/offsetof/TestOffsetof.py (1490 of 2110)
PASS: lldb-shell :: Commands/command-script-import.test (1491 of 2110)
PASS: lldb-shell :: ObjectFile/MachO/lc_build_version_notools.yaml (1492 of 2110)
PASS: lldb-unit :: Utility/./UtilityTests/SerializationRountripTest.SerializeDeserializeObjectReference (1493 of 2110)
PASS: lldb-api :: lang/cpp/global_variables/TestCPPGlobalVariables.py (1494 of 2110)
PASS: lldb-api :: functionalities/data-formatter/data-formatter-objc/TestDataFormatterObjCNSURL.py (1495 of 2110)
PASS: lldb-shell :: Commands/command-regex-delete.test (1496 of 2110)
PASS: lldb-unit :: Utility/./UtilityTests/ProcessInstanceInfoList.Yaml (1497 of 2110)
PASS: lldb-unit :: Process/gdb-remote/./ProcessGdbRemoteTests/GDBRemoteClientBaseTest.SendContinueAndAsyncSignal (1498 of 2110)
PASS: lldb-unit :: ScriptInterpreter/Python/./ScriptInterpreterPythonTests/PythonDataObjectsTest.TestPythonListValueEquality (1499 of 2110)
PASS: lldb-shell :: ObjectFile/ELF/duplicate-section.yaml (1500 of 2110)
PASS: lldb-api :: functionalities/tail_call_frames/ambiguous_tail_call_seq2/TestAmbiguousTailCallSeq2.py (1501 of 2110)
PASS: lldb-unit :: Utility/./UtilityTests/StreamTest.AddressRange (1502 of 2110)
PASS: lldb-unit :: Language/Highlighting/./HighlighterTests/HighlighterTest.ClangCursorOutOfBounds (1503 of 2110)
PASS: lldb-unit :: DataFormatter/./LLDBFormatterTests/TypeMatcherTests.CreatedBySameMatchStringExactNamePrefixes (1504 of 2110)
PASS: lldb-api :: python_api/file_handle/TestFileHandle.py (1505 of 2110)
PASS: lldb-unit :: UnwindAssembly/x86/./UnwindAssemblyx86Tests/Testx86AssemblyInspectionEngine.TestPopRBX (1506 of 2110)
UNSUPPORTED: lldb-shell :: SymbolFile/PDB/compilands.test (1507 of 2110)
UNSUPPORTED: lldb-api :: benchmarks/libcxxlist/TestBenchmarkLibcxxList.py (1508 of 2110)
PASS: lldb-unit :: Utility/./UtilityTests/RangeTest.Equal (1509 of 2110)
PASS: lldb-api :: commands/expression/call-throws/TestCallThatThrows.py (1510 of 2110)
PASS: lldb-shell :: SymbolFile/DWARF/debug-types-dwo-cross-reference.cpp (1511 of 2110)
UNSUPPORTED: lldb-shell :: Register/aarch64-gp-read.test (1512 of 2110)
PASS: lldb-unit :: Utility/./UtilityTests/SerializationRountripTest.SerializeDeserializeCStringArray (1513 of 2110)
PASS: lldb-api :: lang/objc/orderedset/TestOrderedSet.py (1514 of 2110)
PASS: lldb-api :: api/multiple-targets/TestMultipleTargets.py (1515 of 2110)
PASS: lldb-api :: commands/expression/import-std-module/list/TestListFromStdModule.py (1516 of 2110)
PASS: lldb-unit :: Process/minidump/./LLDBMinidumpTests/MinidumpParserTest.GetFilteredModuleList (1517 of 2110)
PASS: lldb-unit :: Utility/./UtilityTests/ScalarTest.SetValueFromCString (1518 of 2110)
PASS: lldb-unit :: Utility/./UtilityTests/StreamTeeTest.DefaultConstructor (1519 of 2110)
PASS: lldb-unit :: UnwindAssembly/x86/./UnwindAssemblyx86Tests/Testx86AssemblyInspectionEngine.Test64bitFramelessSmallStackFrame (1520 of 2110)
UNSUPPORTED: lldb-api :: commands/gui/basicdebug/TestGuiBasicDebug.py (1521 of 2110)
PASS: lldb-shell :: SymbolFile/NativePDB/nested-types.cpp (1522 of 2110)
PASS: lldb-api :: lang/cpp/bitfields/TestCppBitfields.py (1523 of 2110)
PASS: lldb-unit :: Utility/./UtilityTests/StreamTest.PutMaxHex64ByteOrderLittle (1524 of 2110)
UNSUPPORTED: lldb-api :: tools/lldb-server/TestGdbRemoteAuxvSupport.py (1525 of 2110)
UNSUPPORTED: lldb-shell :: SymbolFile/NativePDB/local-variables.cpp (1526 of 2110)
PASS: lldb-unit :: Utility/./UtilityTests/DataExtractorTest.GetMaxU64 (1527 of 2110)
PASS: lldb-unit :: Utility/./UtilityTests/FileSpecTest.Equal (1528 of 2110)
PASS: lldb-api :: tools/lldb-server/TestGdbRemote_vCont.py (1529 of 2110)
PASS: lldb-unit :: Target/./TargetTests/PathMappingListTest.RelativeTests (1530 of 2110)
PASS: lldb-unit :: UnwindAssembly/x86/./UnwindAssemblyx86Tests/Testx86AssemblyInspectionEngine.TestDisassemblyMidFunctionEpilogues (1531 of 2110)
PASS: lldb-unit :: Language/Highlighting/./HighlighterTests/HighlighterTest.HighlighterSelectionType (1532 of 2110)
PASS: lldb-unit :: UnwindAssembly/x86/./UnwindAssemblyx86Tests/Testx86AssemblyInspectionEngine.TestPushExtended (1533 of 2110)
PASS: lldb-api :: lang/cpp/dynamic-value-same-basename/TestDynamicValueSameBase.py (1534 of 2110)
PASS: lldb-unit :: Utility/./UtilityTests/RegisterValueTest.GetSet8 (1535 of 2110)
PASS: lldb-unit :: Utility/./UtilityTests/ArchSpecTest.TestParseMachCPUDashSubtypeTripleExtra (1536 of 2110)
PASS: lldb-api :: commands/command/delete/TestCommandDelete.py (1537 of 2110)
PASS: lldb-api :: functionalities/breakpoint/breakpoint_by_file_colon_line/TestBreakpointByFileColonLine.py (1538 of 2110)
PASS: lldb-api :: lang/cpp/virtual-overload/TestVirtualOverload.py (1539 of 2110)
UNSUPPORTED: lldb-api :: commands/register/register/intel_xtended_registers/mpx_offset_intersection/TestMPXOffsetIntersection.py (1540 of 2110)
FAIL: lldb-api :: macosx/simulator/TestSimulatorPlatform.py (1541 of 2110)
******************** TEST 'lldb-api :: macosx/simulator/TestSimulatorPlatform.py' FAILED ********************
Script:
--
/Users/buildslave/jenkins/workspace/lldb-cmake-sanitized/lldb-build/lldb-test-build.noindex/copied-python /Users/buildslave/jenkins/workspace/lldb-cmake-sanitized/llvm-project/lldb/test/API/dotest.py --arch x86_64 -s /Users/buildslave/jenkins/workspace/lldb-cmake-sanitized/lldb-build/lldb-test-traces -S nm -u CXXFLAGS -u CFLAGS --codesign-identity lldb_codesign --server /Users/buildslave/jenkins/workspace/lldb-cmake-sanitized/lldb-build/./bin/debugserver --arch x86_64 --build-dir /Users/buildslave/jenkins/workspace/lldb-cmake-sanitized/lldb-build/lldb-test-build.noindex -s=/Users/buildslave/jenkins/workspace/lldb-cmake-sanitized/test/logs -t --env TERM=vt100 --env LLVM_LIBS_DIR=/Users/buildslave/jenkins/workspace/lldb-cmake-sanitized/lldb-build/./lib --inferior-env ASAN_OPTIONS=detect_stack_use_after_return=1 --inferior-env DYLD_INSERT_LIBRARIES=/Users/buildslave/jenkins/workspace/lldb-cmake-sanitized/host-compiler/lib/clang/12.0.0/lib/darwin/libclang_rt.asan_osx_dynamic.dylib --build-dir /Users/buildslave/jenkins/workspace/lldb-cmake-sanitized/lldb-build/lldb-test-build.noindex --lldb-module-cache-dir /Users/buildslave/jenkins/workspace/lldb-cmake-sanitized/lldb-build/lldb-test-build.noindex/module-cache-lldb/lldb-api --clang-module-cache-dir /Users/buildslave/jenkins/workspace/lldb-cmake-sanitized/lldb-build/lldb-test-build.noindex/module-cache-clang/lldb-api --executable /Users/buildslave/jenkins/workspace/lldb-cmake-sanitized/lldb-build/./bin/lldb --compiler /Users/buildslave/jenkins/workspace/lldb-cmake-sanitized/lldb-build/./bin/clang --dsymutil /Users/buildslave/jenkins/workspace/lldb-cmake-sanitized/lldb-build/./bin/dsymutil --filecheck /Users/buildslave/jenkins/workspace/lldb-cmake-sanitized/lldb-build/./bin/FileCheck --yaml2obj /Users/buildslave/jenkins/workspace/lldb-cmake-sanitized/lldb-build/./bin/yaml2obj --lldb-libs-dir /Users/buildslave/jenkins/workspace/lldb-cmake-sanitized/lldb-build/./lib /Users/buildslave/jenkins/workspace/lldb-cmake-sanitized/llvm-project/lldb/test/API/macosx/simulator -p TestSimulatorPlatform.py
--
Exit Code: 1

Hide Details

Command Output (stdout): -- lldb version 12.0.99 clang revision 1da09b7214b4e487c371e5d1c5024d92aadc3c7a llvm revision 1da09b7214b4e487c371e5d1c5024d92aadc3c7a LLDB library dir: /Users/buildslave/jenkins/workspace/lldb-cmake-sanitized/lldb-build/bin LLDB import library dir: /Users/buildslave/jenkins/workspace/lldb-cmake-sanitized/lldb-build/./lib libstdcxx tests will not be run because: Don't know how to build with libstdcxx on macosx Skipping following debug info categories: ['dwo']

Hide Details

-- Command Output (stderr): --

Hide Details

Session logs for test failures/errors/unexpected successes will go into directory '/Users/buildslave/jenkins/workspace/lldb-cmake-sanitized/test/logs' Change dir to: /Users/buildslave/jenkins/workspace/lldb-cmake-sanitized/llvm-project/lldb/test/API/macosx/simulator runCmd: settings clear -all output:

Hide Details

runCmd: settings set symbols.enable-external-lookup false output:

Hide Details

runCmd: settings set target.inherit-tcc true output:

Hide Details

runCmd: settings set target.auto-apply-fixits false output:

Hide Details

runCmd: settings set plugin.process.gdb-remote.packet-timeout 60 output:

Hide Details

runCmd: settings set symbols.clang-modules-cache-path "/Users/buildslave/jenkins/workspace/lldb-cmake-sanitized/lldb-build/lldb-test-build.noindex/module-cache-lldb/lldb-api" output:

Hide Details

runCmd: settings set use-color false output:

Hide Details

runCmd: setting set target.prefer-dynamic-value no-dynamic-values output:

Hide Details

runCmd: settings set target.env-vars ASAN_OPTIONS=detect_stack_use_after_return=1 DYLD_INSERT_LIBRARIES=/Users/buildslave/jenkins/workspace/lldb-cmake-sanitized/host-compiler/lib/clang/12.0.0/lib/darwin/libclang_rt.asan_osx_dynamic.dylib output:

Hide Details

runCmd: log enable gdb-remote packets -f /Users/buildslave/jenkins/workspace/lldb-cmake-sanitized/lldb-build/lldb-test-build.noindex/macosx/simulator/TestSimulatorPlatform.test_ios/packets.log output:

Hide Details

runCmd: settings set target.env-vars ASAN_OPTIONS=detect_stack_use_after_return=1 DYLD_INSERT_LIBRARIES=/Users/buildslave/jenkins/workspace/lldb-cmake-sanitized/host-compiler/lib/clang/12.0.0/lib/darwin/libclang_rt.asan_osx_dynamic.dylib output:

Hide Details

FAIL: LLDB (/Users/buildslave/jenkins/workspace/lldb-cmake-sanitized/lldb-build/bin/clang-x86_64) :: test_ios (TestSimulatorPlatform.TestSimulatorPlatformLaunching) <bound method SBProcess.Kill of <lldb.SBProcess; proxy of <Swig Object of type 'lldb::SBProcess *' at 0x1151285a0> >>: success

Hide Details

runCmd: settings clear -all output:

Hide Details

runCmd: settings set symbols.enable-external-lookup false output:

Hide Details

runCmd: settings set target.inherit-tcc true output:

Hide Details

runCmd: settings set target.auto-apply-fixits false output:

Hide Details

runCmd: settings set plugin.process.gdb-remote.packet-timeout 60 output:

Hide Details

runCmd: settings set symbols.clang-modules-cache-path "/Users/buildslave/jenkins/workspace/lldb-cmake-sanitized/lldb-build/lldb-test-build.noindex/module-cache-lldb/lldb-api" output:

Hide Details

runCmd: settings set use-color false output:

Hide Details

runCmd: setting set target.prefer-dynamic-value no-dynamic-values output:

Hide Details

runCmd: settings set target.env-vars ASAN_OPTIONS=detect_stack_use_after_return=1 DYLD_INSERT_LIBRARIES=/Users/buildslave/jenkins/workspace/lldb-cmake-sanitized/host-compiler/lib/clang/12.0.0/lib/darwin/libclang_rt.asan_osx_dynamic.dylib output:

Hide Details

UNSUPPORTED: LLDB (/Users/buildslave/jenkins/workspace/lldb-cmake-sanitized/lldb-build/bin/clang-x86_64) :: test_ios_backdeploy_apple_silicon (TestSimulatorPlatform.TestSimulatorPlatformLaunching) (skipping due to the following parameter(s): architecture) runCmd: settings clear -all output:

Hide Details

runCmd: settings set symbols.enable-external-lookup false output:

Hide Details

runCmd: settings set target.inherit-tcc true output:

Hide Details

runCmd: settings set target.auto-apply-fixits false output:

Hide Details

runCmd: settings set plugin.process.gdb-remote.packet-timeout 60 output:

Hide Details

runCmd: settings set symbols.clang-modules-cache-path "/Users/buildslave/jenkins/workspace/lldb-cmake-sanitized/lldb-build/lldb-test-build.noindex/module-cache-lldb/lldb-api" output:

Hide Details

runCmd: settings set use-color false output:

Hide Details

runCmd: setting set target.prefer-dynamic-value no-dynamic-values output:

Hide Details

runCmd: settings set target.env-vars ASAN_OPTIONS=detect_stack_use_after_return=1 DYLD_INSERT_LIBRARIES=/Users/buildslave/jenkins/workspace/lldb-cmake-sanitized/host-compiler/lib/clang/12.0.0/lib/darwin/libclang_rt.asan_osx_dynamic.dylib output:

Hide Details

runCmd: log enable gdb-remote packets -f /Users/buildslave/jenkins/workspace/lldb-cmake-sanitized/lldb-build/lldb-test-build.noindex/macosx/simulator/TestSimulatorPlatform.test_ios_backdeploy_x86/packets.log output:

Hide Details

runCmd: settings set target.env-vars ASAN_OPTIONS=detect_stack_use_after_return=1 DYLD_INSERT_LIBRARIES=/Users/buildslave/jenkins/workspace/lldb-cmake-sanitized/host-compiler/lib/clang/12.0.0/lib/darwin/libclang_rt.asan_osx_dynamic.dylib output:

Hide Details

FAIL: LLDB (/Users/buildslave/jenkins/workspace/lldb-cmake-sanitized/lldb-build/bin/clang-x86_64) :: test_ios_backdeploy_x86 (TestSimulatorPlatform.TestSimulatorPlatformLaunching) <bound method SBProcess.Kill of <lldb.SBProcess; proxy of <Swig Object of type 'lldb::SBProcess *' at 0x1123ee900> >>: success

Hide Details

runCmd: settings clear -all output:

Hide Details

runCmd: settings set symbols.enable-external-lookup false output:

Hide Details

runCmd: settings set target.inherit-tcc true output:

Hide Details

runCmd: settings set target.auto-apply-fixits false output:

Hide Details

runCmd: settings set plugin.process.gdb-remote.packet-timeout 60 output:

Hide Details

runCmd: settings set symbols.clang-modules-cache-path "/Users/buildslave/jenkins/workspace/lldb-cmake-sanitized/lldb-build/lldb-test-build.noindex/module-cache-lldb/lldb-api" output:

Hide Details

runCmd: settings set use-color false output:

Hide Details

runCmd: setting set target.prefer-dynamic-value no-dynamic-values output:

Hide Details

runCmd: settings set target.env-vars ASAN_OPTIONS=detect_stack_use_after_return=1 DYLD_INSERT_LIBRARIES=/Users/buildslave/jenkins/workspace/lldb-cmake-sanitized/host-compiler/lib/clang/12.0.0/lib/darwin/libclang_rt.asan_osx_dynamic.dylib output:

Hide Details

runCmd: log enable gdb-remote packets -f /Users/buildslave/jenkins/workspace/lldb-cmake-sanitized/lldb-build/lldb-test-build.noindex/macosx/simulator/TestSimulatorPlatform.test_lc_version_min_iphoneos/packets.log output:

Hide Details

runCmd: settings set target.env-vars ASAN_OPTIONS=detect_stack_use_after_return=1 DYLD_INSERT_LIBRARIES=/Users/buildslave/jenkins/workspace/lldb-cmake-sanitized/host-compiler/lib/clang/12.0.0/lib/darwin/libclang_rt.asan_osx_dynamic.dylib output:

Hide Details

FAIL: LLDB (/Users/buildslave/jenkins/workspace/lldb-cmake-sanitized/lldb-build/bin/clang-x86_64) :: test_lc_version_min_iphoneos (TestSimulatorPlatform.TestSimulatorPlatformLaunching) <bound method SBProcess.Kill of <lldb.SBProcess; proxy of <Swig Object of type 'lldb::SBProcess *' at 0x111eb83f0> >>: success

Hide Details

runCmd: settings clear -all output:

Hide Details

runCmd: settings set symbols.enable-external-lookup false output:

Hide Details

runCmd: settings set target.inherit-tcc true output:

Hide Details

runCmd: settings set target.auto-apply-fixits false output:

Hide Details

runCmd: settings set plugin.process.gdb-remote.packet-timeout 60 output:

Hide Details

runCmd: settings set symbols.clang-modules-cache-path "/Users/buildslave/jenkins/workspace/lldb-cmake-sanitized/lldb-build/lldb-test-build.noindex/module-cache-lldb/lldb-api" output:

Hide Details

runCmd: settings set use-color false output:

Hide Details

runCmd: setting set target.prefer-dynamic-value no-dynamic-values output:

Hide Details

runCmd: settings set target.env-vars ASAN_OPTIONS=detect_stack_use_after_return=1 DYLD_INSERT_LIBRARIES=/Users/buildslave/jenkins/workspace/lldb-cmake-sanitized/host-compiler/lib/clang/12.0.0/lib/darwin/libclang_rt.asan_osx_dynamic.dylib output:

Hide Details

runCmd: log enable gdb-remote packets -f /Users/buildslave/jenkins/workspace/lldb-cmake-sanitized/lldb-build/lldb-test-build.noindex/macosx/simulator/TestSimulatorPlatform.test_lc_version_min_macosx/packets.log output:

Hide Details

runCmd: settings set target.env-vars ASAN_OPTIONS=detect_stack_use_after_return=1 DYLD_INSERT_LIBRARIES=/Users/buildslave/jenkins/workspace/lldb-cmake-sanitized/host-compiler/lib/clang/12.0.0/lib/darwin/libclang_rt.asan_osx_dynamic.dylib output:

Hide Details

runCmd: image list -b -t output: [ 0] a.out x86_64-apple-macosx10.9.0 [ 1] dyld x86_64-apple-macosx10.15.0 [ 2] libc++.1.dylib x86_64-apple-macosx10.15.0 [ 3] libSystem.B.dylib x86_64-apple-macosx10.15.0 [ 4] libc++abi.dylib x86_64-apple-macosx10.15.0 [ 5] libcache.dylib x86_64-apple-macosx10.15.0 [ 6] libcommonCrypto.dylib x86_64-apple-macosx10.15.0 [ 7] libcompiler_rt.dylib x86_64-apple-macosx10.15.0 [ 8] libcopyfile.dylib x86_64-apple-macosx10.15.0 [ 9] libcorecrypto.dylib x86_64-apple-macosx10.15.0 [ 10] libdispatch.dylib x86_64-apple-macosx10.15.0 [ 11] libdyld.dylib x86_64-apple-macosx10.15.0 [ 12] libkeymgr.dylib x86_64-apple-macosx10.15.0 [ 13] liblaunch.dylib x86_64-apple-macosx10.15.0 [ 14] libmacho.dylib x86_64-apple-macosx10.15.0 [ 15] libquarantine.dylib x86_64-apple-macosx10.15.0 [ 16] libremovefile.dylib x86_64-apple-macosx10.15.0 [ 17] libsystem_asl.dylib x86_64-apple-macosx10.15.0 [ 18] libsystem_blocks.dylib x86_64-apple-macosx10.15.0 [ 19] libsystem_c.dylib x86_64-apple-macosx10.15.0 [ 20] libsystem_configuration.dylib x86_64-apple-macosx10.15.0 [ 21] libsystem_coreservices.dylib x86_64-apple-macosx10.15.0 [ 22] libsystem_darwin.dylib x86_64-apple-macosx10.15.0 [ 23] libsystem_dnssd.dylib x86_64-apple-macosx10.15.0 [ 24] libsystem_featureflags.dylib x86_64-apple-macosx10.15.0 [ 25] libsystem_info.dylib x86_64-apple-macosx10.15.0 [ 26] libsystem_m.dylib x86_64-apple-macosx10.15.0 [ 27] libsystem_malloc.dylib x86_64-apple-macosx10.15.0 [ 28] libsystem_networkextension.dylib x86_64-apple-macosx10.15.0 [ 29] libsystem_notify.dylib x86_64-apple-macosx10.15.0 [ 30] libsystem_sandbox.dylib x86_64-apple-macosx10.15.0 [ 31] libsystem_secinit.dylib x86_64-apple-macosx10.15.0 [ 32] libsystem_kernel.dylib x86_64-apple-macosx10.15.0 [ 33] libsystem_platform.dylib x86_64-apple-macosx10.15.0 [ 34] libsystem_pthread.dylib x86_64-apple-macosx10.15.0 [ 35] libsystem_symptoms.dylib x86_64-apple-macosx10.15.0 [ 36] libsystem_trace.dylib x86_64-apple-macosx10.15.0 [ 37] libunwind.dylib x86_64-apple-macosx10.15.0 [ 38] libxpc.dylib x86_64-apple-macosx10.15.0 [ 39] libobjc.A.dylib x86_64-apple-macosx10.15.0 [ 40] libclang_rt.asan_osx_dynamic.dylib x86_64-apple-macosx10.9.0

Hide Details

Hide Details

Expecting pattern: a\.out x86_64-apple-macosx10.9.* Matched

Hide Details

FAIL: LLDB (/Users/buildslave/jenkins/workspace/lldb-cmake-sanitized/lldb-build/bin/clang-x86_64) :: test_lc_version_min_macosx (TestSimulatorPlatform.TestSimulatorPlatformLaunching) <bound method SBProcess.Kill of <lldb.SBProcess; proxy of <Swig Object of type 'lldb::SBProcess *' at 0x1123eeb40> >>: success

Hide Details

runCmd: settings clear -all output:

Hide Details

runCmd: settings set symbols.enable-external-lookup false output:

Hide Details

runCmd: settings set target.inherit-tcc true output:

Hide Details

runCmd: settings set target.auto-apply-fixits false output:

Hide Details

runCmd: settings set plugin.process.gdb-remote.packet-timeout 60 output:

Hide Details

runCmd: settings set symbols.clang-modules-cache-path "/Users/buildslave/jenkins/workspace/lldb-cmake-sanitized/lldb-build/lldb-test-build.noindex/module-cache-lldb/lldb-api" output:

Hide Details

runCmd: settings set use-color false output:

Hide Details

runCmd: setting set target.prefer-dynamic-value no-dynamic-values output:

Hide Details

runCmd: settings set target.env-vars ASAN_OPTIONS=detect_stack_use_after_return=1 DYLD_INSERT_LIBRARIES=/Users/buildslave/jenkins/workspace/lldb-cmake-sanitized/host-compiler/lib/clang/12.0.0/lib/darwin/libclang_rt.asan_osx_dynamic.dylib output:

Hide Details

runCmd: log enable gdb-remote packets -f /Users/buildslave/jenkins/workspace/lldb-cmake-sanitized/lldb-build/lldb-test-build.noindex/macosx/simulator/TestSimulatorPlatform.test_lc_version_min_tvos/packets.log output:

Hide Details

runCmd: settings set target.env-vars ASAN_OPTIONS=detect_stack_use_after_return=1 DYLD_INSERT_LIBRARIES=/Users/buildslave/jenkins/workspace/lldb-cmake-sanitized/host-compiler/lib/clang/12.0.0/lib/darwin/libclang_rt.asan_osx_dynamic.dylib output:

Hide Details

FAIL: LLDB (/Users/buildslave/jenkins/workspace/lldb-cmake-sanitized/lldb-build/bin/clang-x86_64) :: test_lc_version_min_tvos (TestSimulatorPlatform.TestSimulatorPlatformLaunching) <bound method SBProcess.Kill of <lldb.SBProcess; proxy of <Swig Object of type 'lldb::SBProcess *' at 0x111eb88d0> >>: success

Hide Details

UNSUPPORTED: LLDB (/Users/buildslave/jenkins/workspace/lldb-cmake-sanitized/lldb-build/bin/clang-x86_64) :: test_lc_version_min_watchos (TestSimulatorPlatform.TestSimulatorPlatformLaunching) (skip on macosx, darwin, ios, tvos, watchos, bridgeos) runCmd: settings clear -all output:

Hide Details

runCmd: settings set symbols.enable-external-lookup false output:

Hide Details

runCmd: settings set target.inherit-tcc true output:

Hide Details

runCmd: settings set target.auto-apply-fixits false output:

Hide Details

runCmd: settings set plugin.process.gdb-remote.packet-timeout 60 output:

Hide Details

runCmd: settings set symbols.clang-modules-cache-path "/Users/buildslave/jenkins/workspace/lldb-cmake-sanitized/lldb-build/lldb-test-build.noindex/module-cache-lldb/lldb-api" output:

Hide Details

runCmd: settings set use-color false output:

Hide Details

runCmd: setting set target.prefer-dynamic-value no-dynamic-values output:

Hide Details

runCmd: settings set target.env-vars ASAN_OPTIONS=detect_stack_use_after_return=1 DYLD_INSERT_LIBRARIES=/Users/buildslave/jenkins/workspace/lldb-cmake-sanitized/host-compiler/lib/clang/12.0.0/lib/darwin/libclang_rt.asan_osx_dynamic.dylib output:

Hide Details

runCmd: log enable gdb-remote packets -f /Users/buildslave/jenkins/workspace/lldb-cmake-sanitized/lldb-build/lldb-test-build.noindex/macosx/simulator/TestSimulatorPlatform.test_tvos/packets.log output:

Hide Details

runCmd: settings set target.env-vars ASAN_OPTIONS=detect_stack_use_after_return=1 DYLD_INSERT_LIBRARIES=/Users/buildslave/jenkins/workspace/lldb-cmake-sanitized/host-compiler/lib/clang/12.0.0/lib/darwin/libclang_rt.asan_osx_dynamic.dylib output:

Hide Details

FAIL: LLDB (/Users/buildslave/jenkins/workspace/lldb-cmake-sanitized/lldb-build/bin/clang-x86_64) :: test_tvos (TestSimulatorPlatform.TestSimulatorPlatformLaunching) <bound method SBProcess.Kill of <lldb.SBProcess; proxy of <Swig Object of type 'lldb::SBProcess *' at 0x1123ee900> >>: success

Hide Details

runCmd: settings clear -all output:

Hide Details

runCmd: settings set symbols.enable-external-lookup false output:

Hide Details

runCmd: settings set target.inherit-tcc true output:

Hide Details

runCmd: settings set target.auto-apply-fixits false output:

Hide Details

runCmd: settings set plugin.process.gdb-remote.packet-timeout 60 output:

Hide Details

runCmd: settings set symbols.clang-modules-cache-path "/Users/buildslave/jenkins/workspace/lldb-cmake-sanitized/lldb-build/lldb-test-build.noindex/module-cache-lldb/lldb-api" output:

Hide Details

runCmd: settings set use-color false output:

Hide Details

runCmd: setting set target.prefer-dynamic-value no-dynamic-values output:

Hide Details

runCmd: settings set target.env-vars ASAN_OPTIONS=detect_stack_use_after_return=1 DYLD_INSERT_LIBRARIES=/Users/buildslave/jenkins/workspace/lldb-cmake-sanitized/host-compiler/lib/clang/12.0.0/lib/darwin/libclang_rt.asan_osx_dynamic.dylib output:

Hide Details

UNSUPPORTED: LLDB (/Users/buildslave/jenkins/workspace/lldb-cmake-sanitized/lldb-build/bin/clang-x86_64) :: test_tvos_backdeploy_apple_silicon (TestSimulatorPlatform.TestSimulatorPlatformLaunching) (skipping due to the following parameter(s): architecture) UNSUPPORTED: LLDB (/Users/buildslave/jenkins/workspace/lldb-cmake-sanitized/lldb-build/bin/clang-x86_64) :: test_watchos_armv7k (TestSimulatorPlatform.TestSimulatorPlatformLaunching) (skip on macosx, darwin, ios, tvos, watchos, bridgeos) UNSUPPORTED: LLDB (/Users/buildslave/jenkins/workspace/lldb-cmake-sanitized/lldb-build/bin/clang-x86_64) :: test_watchos_backdeploy_apple_silicon (TestSimulatorPlatform.TestSimulatorPlatformLaunching) (skip on macosx, darwin, ios, tvos, watchos, bridgeos) UNSUPPORTED: LLDB (/Users/buildslave/jenkins/workspace/lldb-cmake-sanitized/lldb-build/bin/clang-x86_64) :: test_watchos_i386 (TestSimulatorPlatform.TestSimulatorPlatformLaunching) (skip on macosx, darwin, ios, tvos, watchos, bridgeos) Restore dir to: /Users/buildslave/jenkins/workspace/lldb-cmake-sanitized/lldb-build/tools/lldb/test ====================================================================== FAIL: test_ios (TestSimulatorPlatform.TestSimulatorPlatformLaunching) Test running an iOS simulator binary ---------------------------------------------------------------------- Traceback (most recent call last): File "/Users/buildslave/jenkins/workspace/lldb-cmake-sanitized/llvm-project/lldb/packages/Python/lldbsuite/test/decorators.py", line 135, in wrapper return func(*args, **kwargs) File "/Users/buildslave/jenkins/workspace/lldb-cmake-sanitized/llvm-project/lldb/packages/Python/lldbsuite/test/decorators.py", line 135, in wrapper return func(*args, **kwargs) File "/Users/buildslave/jenkins/workspace/lldb-cmake-sanitized/llvm-project/lldb/test/API/macosx/simulator/TestSimulatorPlatform.py", line 63, in test_ios expected_load_command='LC_BUILD_VERSION') File "/Users/buildslave/jenkins/workspace/lldb-cmake-sanitized/llvm-project/lldb/test/API/macosx/simulator/TestSimulatorPlatform.py", line 50, in run_with lldb.SBFileSpec("hello.c")) File "/Users/buildslave/jenkins/workspace/lldb-cmake-sanitized/llvm-project/lldb/packages/Python/lldbsuite/test/lldbutil.py", line 919, in run_to_source_breakpoint only_one_thread, extra_images) File "/Users/buildslave/jenkins/workspace/lldb-cmake-sanitized/llvm-project/lldb/packages/Python/lldbsuite/test/lldbutil.py", line 848, in run_to_breakpoint_do_run test.assertEqual(num_threads, 1, "Expected 1 thread to stop at breakpoint, %d did."%(num_threads)) AssertionError: 0 != 1 : Expected 1 thread to stop at breakpoint, 0 did. Config=x86_64-/Users/buildslave/jenkins/workspace/lldb-cmake-sanitized/lldb-build/bin/clang ====================================================================== FAIL: test_ios_backdeploy_x86 (TestSimulatorPlatform.TestSimulatorPlatformLaunching) Test running a back-deploying iOS simulator binary ---------------------------------------------------------------------- Traceback (most recent call last): File "/Users/buildslave/jenkins/workspace/lldb-cmake-sanitized/llvm-project/lldb/packages/Python/lldbsuite/test/decorators.py", line 135, in wrapper return func(*args, **kwargs) File "/Users/buildslave/jenkins/workspace/lldb-cmake-sanitized/llvm-project/lldb/packages/Python/lldbsuite/test/decorators.py", line 135, in wrapper return func(*args, **kwargs) File "/Users/buildslave/jenkins/workspace/lldb-cmake-sanitized/llvm-project/lldb/packages/Python/lldbsuite/test/decorators.py", line 135, in wrapper return func(*args, **kwargs) File "/Users/buildslave/jenkins/workspace/lldb-cmake-sanitized/llvm-project/lldb/test/API/macosx/simulator/TestSimulatorPlatform.py", line 139, in test_ios_backdeploy_x86 expected_load_command='LC_BUILD_VERSION') File "/Users/buildslave/jenkins/workspace/lldb-cmake-sanitized/llvm-project/lldb/test/API/macosx/simulator/TestSimulatorPlatform.py", line 50, in run_with lldb.SBFileSpec("hello.c")) File "/Users/buildslave/jenkins/workspace/lldb-cmake-sanitized/llvm-project/lldb/packages/Python/lldbsuite/test/lldbutil.py", line 919, in run_to_source_breakpoint only_one_thread, extra_images) File "/Users/buildslave/jenkins/workspace/lldb-cmake-sanitized/llvm-project/lldb/packages/Python/lldbsuite/test/lldbutil.py", line 848, in run_to_breakpoint_do_run test.assertEqual(num_threads, 1, "Expected 1 thread to stop at breakpoint, %d did."%(num_threads)) AssertionError: 0 != 1 : Expected 1 thread to stop at breakpoint, 0 did. Config=x86_64-/Users/buildslave/jenkins/workspace/lldb-cmake-sanitized/lldb-build/bin/clang ====================================================================== FAIL: test_lc_version_min_iphoneos (TestSimulatorPlatform.TestSimulatorPlatformLaunching) Test running a back-deploying iOS simulator binary ---------------------------------------------------------------------- Traceback (most recent call last): File "/Users/buildslave/jenkins/workspace/lldb-cmake-sanitized/llvm-project/lldb/packages/Python/lldbsuite/test/decorators.py", line 135, in wrapper return func(*args, **kwargs) File "/Users/buildslave/jenkins/workspace/lldb-cmake-sanitized/llvm-project/lldb/packages/Python/lldbsuite/test/decorators.py", line 135, in wrapper return func(*args, **kwargs) File "/Users/buildslave/jenkins/workspace/lldb-cmake-sanitized/llvm-project/lldb/packages/Python/lldbsuite/test/decorators.py", line 135, in wrapper return func(*args, **kwargs) File "/Users/buildslave/jenkins/workspace/lldb-cmake-sanitized/llvm-project/lldb/test/API/macosx/simulator/TestSimulatorPlatform.py", line 127, in test_lc_version_min_iphoneos expected_load_command='LC_VERSION_MIN_IPHONEOS') File "/Users/buildslave/jenkins/workspace/lldb-cmake-sanitized/llvm-project/lldb/test/API/macosx/simulator/TestSimulatorPlatform.py", line 50, in run_with lldb.SBFileSpec("hello.c")) File "/Users/buildslave/jenkins/workspace/lldb-cmake-sanitized/llvm-project/lldb/packages/Python/lldbsuite/test/lldbutil.py", line 919, in run_to_source_breakpoint only_one_thread, extra_images) File "/Users/buildslave/jenkins/workspace/lldb-cmake-sanitized/llvm-project/lldb/packages/Python/lldbsuite/test/lldbutil.py", line 848, in run_to_breakpoint_do_run test.assertEqual(num_threads, 1, "Expected 1 thread to stop at breakpoint, %d did."%(num_threads)) AssertionError: 0 != 1 : Expected 1 thread to stop at breakpoint, 0 did. Config=x86_64-/Users/buildslave/jenkins/workspace/lldb-cmake-sanitized/lldb-build/bin/clang ====================================================================== FAIL: test_lc_version_min_macosx (TestSimulatorPlatform.TestSimulatorPlatformLaunching) Test running a back-deploying non-simulator MacOS X binary ---------------------------------------------------------------------- Traceback (most recent call last): File "/Users/buildslave/jenkins/workspace/lldb-cmake-sanitized/llvm-project/lldb/packages/Python/lldbsuite/test/decorators.py", line 135, in wrapper return func(*args, **kwargs) File "/Users/buildslave/jenkins/workspace/lldb-cmake-sanitized/llvm-project/lldb/test/API/macosx/simulator/TestSimulatorPlatform.py", line 116, in test_lc_version_min_macosx expected_load_command='LC_VERSION_MIN_MACOSX') File "/Users/buildslave/jenkins/workspace/lldb-cmake-sanitized/llvm-project/lldb/test/API/macosx/simulator/TestSimulatorPlatform.py", line 53, in run_with self.check_debugserver(log, os+env, vers) File "/Users/buildslave/jenkins/workspace/lldb-cmake-sanitized/llvm-project/lldb/test/API/macosx/simulator/TestSimulatorPlatform.py", line 36, in check_debugserver self.assertTrue(aout_info) AssertionError: None is not True Config=x86_64-/Users/buildslave/jenkins/workspace/lldb-cmake-sanitized/lldb-build/bin/clang ====================================================================== FAIL: test_lc_version_min_tvos (TestSimulatorPlatform.TestSimulatorPlatformLaunching) Test running a back-deploying tvOS simulator binary ---------------------------------------------------------------------- Traceback (most recent call last): File "/Users/buildslave/jenkins/workspace/lldb-cmake-sanitized/llvm-project/lldb/packages/Python/lldbsuite/test/decorators.py", line 135, in wrapper return func(*args, **kwargs) File "/Users/buildslave/jenkins/workspace/lldb-cmake-sanitized/llvm-project/lldb/packages/Python/lldbsuite/test/decorators.py", line 135, in wrapper return func(*args, **kwargs) File "/Users/buildslave/jenkins/workspace/lldb-cmake-sanitized/llvm-project/lldb/packages/Python/lldbsuite/test/decorators.py", line 135, in wrapper return func(*args, **kwargs) File "/Users/buildslave/jenkins/workspace/lldb-cmake-sanitized/llvm-project/lldb/test/API/macosx/simulator/TestSimulatorPlatform.py", line 162, in test_lc_version_min_tvos expected_load_command='LC_VERSION_MIN_TVOS') File "/Users/buildslave/jenkins/workspace/lldb-cmake-sanitized/llvm-project/lldb/test/API/macosx/simulator/TestSimulatorPlatform.py", line 50, in run_with lldb.SBFileSpec("hello.c")) File "/Users/buildslave/jenkins/workspace/lldb-cmake-sanitized/llvm-project/lldb/packages/Python/lldbsuite/test/lldbutil.py", line 919, in run_to_source_breakpoint only_one_thread, extra_images) File "/Users/buildslave/jenkins/workspace/lldb-cmake-sanitized/llvm-project/lldb/packages/Python/lldbsuite/test/lldbutil.py", line 848, in run_to_breakpoint_do_run test.assertEqual(num_threads, 1, "Expected 1 thread to stop at breakpoint, %d did."%(num_threads)) AssertionError: 0 != 1 : Expected 1 thread to stop at breakpoint, 0 did. Config=x86_64-/Users/buildslave/jenkins/workspace/lldb-cmake-sanitized/lldb-build/bin/clang ====================================================================== FAIL: test_tvos (TestSimulatorPlatform.TestSimulatorPlatformLaunching) Test running an tvOS simulator binary ---------------------------------------------------------------------- Traceback (most recent call last): File "/Users/buildslave/jenkins/workspace/lldb-cmake-sanitized/llvm-project/lldb/packages/Python/lldbsuite/test/decorators.py", line 135, in wrapper return func(*args, **kwargs) File "/Users/buildslave/jenkins/workspace/lldb-cmake-sanitized/llvm-project/lldb/packages/Python/lldbsuite/test/decorators.py", line 135, in wrapper return func(*args, **kwargs) File "/Users/buildslave/jenkins/workspace/lldb-cmake-sanitized/llvm-project/lldb/test/API/macosx/simulator/TestSimulatorPlatform.py", line 73, in test_tvos expected_load_command='LC_BUILD_VERSION') File "/Users/buildslave/jenkins/workspace/lldb-cmake-sanitized/llvm-project/lldb/test/API/macosx/simulator/TestSimulatorPlatform.py", line 50, in run_with lldb.SBFileSpec("hello.c")) File "/Users/buildslave/jenkins/workspace/lldb-cmake-sanitized/llvm-project/lldb/packages/Python/lldbsuite/test/lldbutil.py", line 919, in run_to_source_breakpoint only_one_thread, extra_images) File "/Users/buildslave/jenkins/workspace/lldb-cmake-sanitized/llvm-project/lldb/packages/Python/lldbsuite/test/lldbutil.py", line 848, in run_to_breakpoint_do_run test.assertEqual(num_threads, 1, "Expected 1 thread to stop at breakpoint, %d did."%(num_threads)) AssertionError: 0 != 1 : Expected 1 thread to stop at breakpoint, 0 did. Config=x86_64-/Users/buildslave/jenkins/workspace/lldb-cmake-sanitized/lldb-build/bin/clang ---------------------------------------------------------------------- Ran 12 tests in 48.471s

Hide Details

RESULT: FAILED (0 passes, 6 failures, 0 errors, 6 skipped, 0 expected failures, 0 unexpected successes)

Hide Details

--

Hide Details

******************** PASS: lldb-unit :: Utility/./UtilityTests/RangeDataVector.FindEntryThatContains_Overlap (1542 of 2110) PASS: lldb-unit :: Utility/./UtilityTests/StringListTest.ForRangeEmpty (1543 of 2110) PASS: lldb-shell :: Minidump/dump-all.test (1544 of 2110) PASS: lldb-api :: functionalities/paths/TestPaths.py (1545 of 2110) PASS: lldb-unit :: Utility/./UtilityTests/BinaryStreamTest.PutULEB128SixBytes (1546 of 2110) PASS: lldb-api :: commands/frame/diagnose/bad-reference/TestBadReference.py (1547 of 2110) PASS: lldb-unit :: Expression/./ExpressionTests/ClangExpressionDeclMapTest.TestUnknownIdentifierLookup (1548 of 2110) PASS: lldb-unit :: Symbol/./SymbolTests/TestTypeSystemClang.TestDisplayName (1549 of 2110) PASS: lldb-unit :: Interpreter/./InterpreterTests/CompletionTest.DirCompletionAbsolute (1550 of 2110) PASS: lldb-unit :: Utility/./UtilityTests/ScalarTest.Comparison (1551 of 2110) PASS: lldb-api :: commands/platform/basic/TestPlatformPython.py (1552 of 2110) PASS: lldb-unit :: UnwindAssembly/x86/./UnwindAssemblyx86Tests/Testx86AssemblyInspectionEngine.TestPushR14 (1553 of 2110) PASS: lldb-unit :: ScriptInterpreter/Python/./ScriptInterpreterPythonTests/PythonDataObjectsTest.TestPythonTupleInitializerList (1554 of 2110) PASS: lldb-api :: lang/cpp/thread_local/TestThreadLocal.py (1555 of 2110) PASS: lldb-api :: commands/watchpoints/watchpoint_commands/command/TestWatchpointCommandLLDB.py (1556 of 2110) PASS: lldb-api :: commands/expression/import-std-module/sysroot/TestStdModuleSysroot.py (1557 of 2110) PASS: lldb-api :: commands/expression/timeout/TestCallWithTimeout.py (1558 of 2110) PASS: lldb-unit :: Expression/./ExpressionTests/CppModuleConfigurationTest.MissingLibCpp (1559 of 2110) PASS: lldb-unit :: Utility/./UtilityTests/PassiveReplayTest.InstrumentedBarPtr (1560 of 2110) PASS: lldb-unit :: UnwindAssembly/x86/./UnwindAssemblyx86Tests/Testx86AssemblyInspectionEngine.TestPushRBPWithREX (1561 of 2110) UNSUPPORTED: lldb-shell :: SymbolFile/PDB/type-quals.test (1562 of 2110) PASS: lldb-api :: functionalities/inferior-assert/TestInferiorAssert.py (1563 of 2110) PASS: lldb-unit :: Expression/./ExpressionTests/ClangHostTest.MacOSX (1564 of 2110) PASS: lldb-unit :: Utility/./UtilityTests/Flags.AnyClear (1565 of 2110) PASS: lldb-shell :: SymbolFile/NativePDB/bitfields.cpp (1566 of 2110) PASS: lldb-unit :: Utility/./UtilityTests/StringExtractorTest.GetHexBytes (1567 of 2110) PASS: lldb-api :: python_api/process/io/TestProcessIO.py (1568 of 2110) PASS: lldb-unit :: UnwindAssembly/x86/./UnwindAssemblyx86Tests/Testx86AssemblyInspectionEngine.TestPush0 (1569 of 2110) UNSUPPORTED: lldb-shell :: SymbolFile/PDB/variables-locations.test (1570 of 2110) PASS: lldb-unit :: Process/gdb-remote/./ProcessGdbRemoteTests/GDBRemoteCommunicationClientTest.GetQOffsets (1571 of 2110) PASS: lldb-api :: types/TestLongTypesExpr.py (1572 of 2110) PASS: lldb-api :: functionalities/pre_run_dylibs/TestPreRunDylibs.py (1573 of 2110) PASS: lldb-unit :: Utility/./UtilityTests/BinaryStreamTest.PutULEB128FiveBytes (1574 of 2110) PASS: lldb-unit :: Utility/./UtilityTests/StringListTest.AppendListCStringArrayEmpty (1575 of 2110) PASS: lldb-unit :: Symbol/./SymbolTests/TestTypeSystemClang.TestRemoveFastQualifiers (1576 of 2110) PASS: lldb-shell :: SymbolFile/DWARF/find-basic-variable.cpp (1577 of 2110) PASS: lldb-unit :: debugserver/./debugserverTests/RNBSocket.LoopBackListenIPv6 (1578 of 2110) PASS: lldb-shell :: ObjectFile/ELF/aarch64-relocations.yaml (1579 of 2110) PASS: lldb-unit :: Language/Highlighting/./HighlighterTests/HighlighterTest.ClangPreserveNewLine (1580 of 2110) PASS: lldb-unit :: Utility/./UtilityTests/StringExtractorTest.GetHexU8_Exact (1581 of 2110) PASS: lldb-shell :: SymbolFile/NativePDB/function-types-calling-conv.cpp (1582 of 2110) PASS: lldb-unit :: UnwindAssembly/x86/./UnwindAssemblyx86Tests/Testx86AssemblyInspectionEngine.TestPopRBP (1583 of 2110) PASS: lldb-unit :: Utility/./UtilityTests/VMRange.CollectionContains (1584 of 2110) PASS: lldb-api :: lang/cpp/nsimport/TestCppNsImport.py (1585 of 2110) PASS: lldb-unit :: Utility/./UtilityTests/StreamTest.PutMaxHex64ByteOrderBig (1586 of 2110) PASS: lldb-unit :: Utility/./UtilityTests/LogChannelEnabledTest.LogThread (1587 of 2110) PASS: lldb-api :: functionalities/memory/read/TestMemoryRead.py (1588 of 2110) PASS: lldb-api :: commands/watchpoints/step_over_watchpoint/TestStepOverWatchpoint.py (1589 of 2110) PASS: lldb-unit :: Utility/./UtilityTests/NameMatchesTest.StartsWith (1590 of 2110) PASS: lldb-unit :: Utility/./UtilityTests/OptionsWithRawTest.EmptySuffix (1591 of 2110) PASS: lldb-api :: functionalities/data-formatter/data-formatter-objc/TestDataFormatterObjCNSBundle.py (1592 of 2110) PASS: lldb-unit :: Utility/./UtilityTests/FileSpecTest.EqualSeparator (1593 of 2110) PASS: lldb-unit :: Process/gdb-remote/./ProcessGdbRemoteTests/GDBRemoteCommunicationClientTest.SendSignalsToIgnore (1594 of 2110) PASS: lldb-api :: functionalities/gdb_remote_client/TestStopPCs.py (1595 of 2110) PASS: lldb-unit :: Utility/./UtilityTests/PassiveReplayTest.InstrumentedFooInvalid (1596 of 2110) UNSUPPORTED: lldb-api :: functionalities/data-formatter/data-formatter-stl/libstdcpp/tuple/TestDataFormatterStdTuple.py (1597 of 2110) PASS: lldb-unit :: Language/Highlighting/./HighlighterTests/HighlighterTest.ClangSquareBrackets (1598 of 2110) PASS: lldb-api :: lang/objc/foundation/TestObjCMethodsNSArray.py (1599 of 2110) PASS: lldb-shell :: Driver/TestUseColor.test (1600 of 2110) PASS: lldb-unit :: ScriptInterpreter/Python/./ScriptInterpreterPythonTests/PythonDataObjectsTest.TestPythonListToStructuredList (1601 of 2110) PASS: lldb-api :: commands/expression/persistent_types/TestPersistentTypes.py (1602 of 2110) PASS: lldb-unit :: ScriptInterpreter/Python/./ScriptInterpreterPythonTests/PythonDataObjectsTest.TestPythonDictionaryValueEquality (1603 of 2110) PASS: lldb-unit :: Expression/./ExpressionTests/DiagnosticManagerTest.GetStringBasic (1604 of 2110) PASS: lldb-unit :: Symbol/./SymbolTests/TestClangASTImporter.RecordLayout (1605 of 2110) PASS: lldb-unit :: Host/./HostTests/NativeProcessProtocolTest.ReadCStringFromMemory_CrossPageBoundary (1606 of 2110) PASS: lldb-unit :: ScriptInterpreter/Python/./ScriptInterpreterPythonTests/PythonDataObjectsTest.TestPythonFile (1607 of 2110) PASS: lldb-unit :: Process/gdb-remote/./ProcessGdbRemoteTests/GDBRemoteCommunicationServerTest.SendErrorResponse_Status (1608 of 2110) PASS: lldb-unit :: Target/./TargetTests/MCBasedABI.MapRegisterName (1609 of 2110) PASS: lldb-api :: functionalities/breakpoint/breakpoint_locations/TestBreakpointLocations.py (1610 of 2110) PASS: lldb-unit :: Utility/./UtilityTests/FileSpecTest.FileAndDirectoryComponents (1611 of 2110) UNSUPPORTED: lldb-shell :: SymbolFile/PDB/vbases.test (1612 of 2110) PASS: lldb-api :: functionalities/rerun/TestRerun.py (1613 of 2110) PASS: lldb-shell :: Quit/TestQuitExitCodeHex0.test (1614 of 2110) UNSUPPORTED: lldb-api :: tools/lldb-server/signal-filtering/TestGdbRemote_QPassSignals.py (1615 of 2110) UNSUPPORTED: lldb-api :: functionalities/data-formatter/data-formatter-stl/libstdcpp/vbool/TestDataFormatterStdVBool.py (1616 of 2110) PASS: lldb-api :: functionalities/testid/TestTestId.py (1617 of 2110) PASS: lldb-shell :: ObjectFile/ELF/section-types.yaml (1618 of 2110) PASS: lldb-unit :: Utility/./UtilityTests/TimerTest.CategoryTimes (1619 of 2110) PASS: lldb-shell :: SymbolFile/NativePDB/ast-functions.cpp (1620 of 2110) PASS: lldb-unit :: Utility/./UtilityTests/StringExtractorTest.GetU64BigEndian (1621 of 2110) PASS: lldb-unit :: Utility/./UtilityTests/StringListTest.AppendStringStdString (1622 of 2110) PASS: lldb-shell :: Breakpoint/jitbp_elf.test (1623 of 2110) PASS: lldb-api :: functionalities/breakpoint/consecutive_breakpoints/TestConsecutiveBreakpoints.py (1624 of 2110) PASS: lldb-api :: functionalities/breakpoint/dummy_target_breakpoints/TestBreakpointsWithNoTargets.py (1625 of 2110) PASS: lldb-shell :: SymbolFile/DWARF/dir-separator-no-comp-dir.s (1626 of 2110) PASS: lldb-api :: commands/expression/options/TestExprOptions.py (1627 of 2110) PASS: lldb-api :: commands/platform/process/list/TestProcessList.py (1628 of 2110) PASS: lldb-shell :: ObjectFile/Breakpad/discontiguous-sections.test (1629 of 2110) UNSUPPORTED: lldb-shell :: Reproducer/TestLuaImport.test (1630 of 2110) PASS: lldb-api :: functionalities/tail_call_frames/sbapi_support/TestTailCallFrameSBAPI.py (1631 of 2110) PASS: lldb-unit :: ScriptInterpreter/Python/./ScriptInterpreterPythonTests/PythonDataObjectsTest.TestPythonStringToStr (1632 of 2110) PASS: lldb-api :: macosx/order/TestOrderFile.py (1633 of 2110) PASS: lldb-shell :: SymbolFile/DWARF/module-ownership.mm (1634 of 2110) PASS: lldb-shell :: SymbolFile/DWARF/dir-separator-no-comp-dir-relative-name.s (1635 of 2110) PASS: lldb-unit :: Utility/./UtilityTests/ProcessInstanceInfoMatch.Name (1636 of 2110) PASS: lldb-unit :: Utility/./UtilityTests/StreamTest.PutCharWhitespace (1637 of 2110) PASS: lldb-api :: lang/objc/objc-checker/TestObjCCheckers.py (1638 of 2110) PASS: lldb-api :: lang/cpp/rvalue-references/TestRvalueReferences.py (1639 of 2110) PASS: lldb-shell :: ScriptInterpreter/Python/eof.test (1640 of 2110) PASS: lldb-shell :: Reproducer/TestSynchronous.test (1641 of 2110) PASS: lldb-unit :: Language/Highlighting/./HighlighterTests/HighlighterTest.ClangCommas (1642 of 2110) PASS: lldb-unit :: ScriptInterpreter/Python/./ScriptInterpreterPythonTests/PythonDataObjectsTest.TestPythonTupleInitializerList2 (1643 of 2110) PASS: lldb-api :: lang/objc/foundation/TestObjCMethods.py (1644 of 2110) PASS: lldb-shell :: Commands/command-breakpoint-col.test (1645 of 2110) PASS: lldb-unit :: Utility/./UtilityTests/CompletionRequest.FakeLastArg (1646 of 2110) PASS: lldb-shell :: Breakpoint/debug_rnglist_basic.test (1647 of 2110) PASS: lldb-unit :: Language/Highlighting/./HighlighterTests/HighlighterTest.FallbackHighlighter (1648 of 2110) PASS: lldb-unit :: Utility/./UtilityTests/LogChannelEnabledTest.log_options (1649 of 2110) PASS: lldb-api :: commands/settings/TestSettings.py (1650 of 2110) PASS: lldb-unit :: Utility/./UtilityTests/StringListTest.AppendListCStringArray (1651 of 2110) PASS: lldb-unit :: ScriptInterpreter/Python/./ScriptInterpreterPythonTests/PythonDataObjectsTest.TestPythonCallableInvoke (1652 of 2110) PASS: lldb-api :: functionalities/thread/crash_during_step/TestCrashDuringStep.py (1653 of 2110) PASS: lldb-api :: functionalities/thread/exit_during_step/TestExitDuringStep.py (1654 of 2110) UNSUPPORTED: lldb-api :: functionalities/breakpoint/breakpoint_in_delayslot/TestAvoidBreakpointInDelaySlot.py (1655 of 2110) PASS: lldb-api :: functionalities/thread/concurrent_events/TestConcurrentCrashWithSignal.py (1656 of 2110) PASS: lldb-unit :: Core/./LLDBCoreTests/ModuleSpecTest.InvalidInMemoryBufferValidFile (1657 of 2110) PASS: lldb-unit :: Utility/./UtilityTests/FileSpecTest.IsRelative (1658 of 2110) PASS: lldb-unit :: Expression/./ExpressionTests/CppModuleConfigurationTest.UnknownLibCppFile (1659 of 2110) PASS: lldb-unit :: UnwindAssembly/x86/./UnwindAssemblyx86Tests/Testx86AssemblyInspectionEngine.TestReturnDetect (1660 of 2110) PASS: lldb-api :: api/command-return-object/TestSBCommandReturnObject.py (1661 of 2110) PASS: lldb-api :: commands/expression/call-function/TestCallStdStringFunction.py (1662 of 2110) PASS: lldb-unit :: Utility/./UtilityTests/ArchSpecTest.MergeFromMachOUnknown (1663 of 2110) PASS: lldb-unit :: ScriptInterpreter/Python/./ScriptInterpreterPythonTests/PythonDataObjectsTest.TestTypeNameResolutionNoDot (1664 of 2110) PASS: lldb-api :: commands/expression/import-std-module/vector-dbg-info-content/TestDbgInfoContentVectorFromStdModule.py (1665 of 2110) PASS: lldb-unit :: Process/gdb-remote/./ProcessGdbRemoteTests/GDBRemoteCommunicationServerTest.SendErrorResponse_ErrorList (1666 of 2110) UNSUPPORTED: lldb-api :: tools/lldb-vscode/completions/TestVSCode_completions.py (1667 of 2110) PASS: lldb-api :: functionalities/data-formatter/data-formatter-named-summaries/TestDataFormatterNamedSummaries.py (1668 of 2110) PASS: lldb-api :: functionalities/data-formatter/compactvectors/TestCompactVectors.py (1669 of 2110) PASS: lldb-api :: functionalities/breakpoint/breakpoint_by_line_and_column/TestBreakpointByLineAndColumn.py (1670 of 2110) PASS: lldb-api :: functionalities/breakpoint/source_regexp/TestSourceRegexBreakpoints.py (1671 of 2110) PASS: lldb-shell :: ObjectFile/wasm/basic.yaml (1672 of 2110) PASS: lldb-api :: lang/objc/modules-non-objc-target/TestObjCModulesNonObjCTarget.py (1673 of 2110) PASS: lldb-unit :: Utility/./UtilityTests/SerializationRountripTest.SerializeDeserializeCStringArrayNullptr (1674 of 2110) PASS: lldb-unit :: Utility/./UtilityTests/StreamTest.PutULEB128 (1675 of 2110) PASS: lldb-shell :: ObjectFile/MachO/lc_build_version.yaml (1676 of 2110) PASS: lldb-shell :: Settings/TestLineMarkerColor.test (1677 of 2110) PASS: lldb-api :: commands/expression/import_base_class_when_class_has_derived_member/TestImportBaseClassWhenClassHasDerivedMember.py (1678 of 2110) PASS: lldb-api :: commands/watchpoints/watchpoint_on_vectors/TestValueOfVectorVariable.py (1679 of 2110) PASS: lldb-api :: functionalities/fat_archives/TestFatArchives.py (1680 of 2110) PASS: lldb-unit :: Utility/./UtilityTests/BinaryStreamTest.PutULEB128NineBytes (1681 of 2110) PASS: lldb-unit :: Thread/./ThreadTests/ThreadTest.SetStopInfo (1682 of 2110) PASS: lldb-unit :: Utility/./UtilityTests/BroadcasterTest.EventTypeHasListeners (1683 of 2110) UNSUPPORTED: lldb-api :: functionalities/thread/break_after_join/TestBreakAfterJoin.py (1684 of 2110) PASS: lldb-api :: commands/expression/import-std-module/deque-basic/TestDequeFromStdModule.py (1685 of 2110) PASS: lldb-api :: lang/c/unions/TestUnionMembers.py (1686 of 2110) PASS: lldb-api :: lang/objc/variadic_methods/TestVariadicMethods.py (1687 of 2110) UNSUPPORTED: lldb-api :: lang/c/unicode/TestUnicodeSymbols.py (1688 of 2110) PASS: lldb-unit :: Expression/./ExpressionTests/CppModuleConfigurationTest.MissingUsrInclude (1689 of 2110) PASS: lldb-unit :: Process/gdb-remote/./ProcessGdbRemoteTests/GDBRemoteClientBaseTest.SendContinueAndWait (1690 of 2110) PASS: lldb-shell :: SymbolFile/NativePDB/function-types-builtins.cpp (1691 of 2110) PASS: lldb-unit :: Symbol/./SymbolTests/DWARFCallFrameInfoTest.Basic_dwarf4 (1692 of 2110) PASS: lldb-unit :: Utility/./UtilityTests/GeneratorTest.YamlMultiProvider (1693 of 2110) PASS: lldb-api :: macosx/save_crashlog/TestSaveCrashlog.py (1694 of 2110) PASS: lldb-unit :: API/./APITests/SBCommandInterpreterTest.SingleWordCommand (1695 of 2110) PASS: lldb-api :: lang/objc/objc-foundation-dictionary-empty/TestNSDictionary0.py (1696 of 2110) PASS: lldb-unit :: Symbol/./SymbolTests/TestTypeSystemClang.TestGetTypeClassTypeOfExpr (1697 of 2110) PASS: lldb-api :: python_api/sbstructureddata/TestStructuredDataAPI.py (1698 of 2110) PASS: lldb-api :: lang/objc/foundation/TestObjCMethods2.py (1699 of 2110) PASS: lldb-unit :: Utility/./UtilityTests/RegularExpression.Match (1700 of 2110) PASS: lldb-api :: functionalities/data-formatter/data-formatter-stl/libcxx/atomic/TestLibCxxAtomic.py (1701 of 2110) PASS: lldb-unit :: Host/./HostTests/SocketAddressTest.GetAddressInfo (1702 of 2110) PASS: lldb-unit :: Utility/./UtilityTests/UUIDTest.RelationalOperators (1703 of 2110) PASS: lldb-unit :: Language/Highlighting/./HighlighterTests/HighlighterTest.ClangCursorPosAfterOtherToken (1704 of 2110) PASS: lldb-unit :: Symbol/./SymbolTests/TestClangASTImporter.MetadataPropagation (1705 of 2110) PASS: lldb-unit :: SymbolFile/NativePDB/./SymbolFileNativePDBTests/PDBFPOProgramToDWARFExpressionTests.UnknownOp (1706 of 2110) UNSUPPORTED: lldb-shell :: ScriptInterpreter/Lua/breakpoint_callback.test (1707 of 2110) PASS: lldb-unit :: Utility/./UtilityTests/StreamTest.PutCString (1708 of 2110) PASS: lldb-shell :: ObjectFile/PECOFF/sections-names.yaml (1709 of 2110) PASS: lldb-api :: commands/log/invalid-args/TestInvalidArgsLog.py (1710 of 2110) PASS: lldb-unit :: UnwindAssembly/x86/./UnwindAssemblyx86Tests/Testx86AssemblyInspectionEngine.TestPopR12 (1711 of 2110) UNSUPPORTED: lldb-api :: linux/thread/create_during_instruction_step/TestCreateDuringInstructionStep.py (1712 of 2110) PASS: lldb-unit :: UnwindAssembly/x86/./UnwindAssemblyx86Tests/Testx86AssemblyInspectionEngine.TestPushRBP (1713 of 2110) PASS: lldb-api :: functionalities/data-formatter/data-formatter-python-synth/TestDataFormatterPythonSynth.py (1714 of 2110) PASS: lldb-api :: functionalities/tail_call_frames/inlining_and_tail_calls/TestInliningAndTailCalls.py (1715 of 2110) PASS: lldb-unit :: Host/./HostTests/File.GetStreamFromDescriptor (1716 of 2110) PASS: lldb-unit :: Process/gdb-remote/./ProcessGdbRemoteTests/GDBRemoteCommunicationClientTest.GetMemoryRegionInfo (1717 of 2110) PASS: lldb-api :: functionalities/memory-region/TestMemoryRegion.py (1718 of 2110) PASS: lldb-shell :: Settings/TestFrameFormatColor.test (1719 of 2110) PASS: lldb-api :: functionalities/data-formatter/ostypeformatting/TestFormattersOsType.py (1720 of 2110) PASS: lldb-unit :: Language/Highlighting/./HighlighterTests/HighlighterTest.HighlighterSelectionPath (1721 of 2110) PASS: lldb-api :: commands/expression/xvalue/TestXValuePrinting.py (1722 of 2110) PASS: lldb-shell :: SymbolFile/Breakpad/unwind-via-stack-win-no-memory-info.yaml (1723 of 2110) PASS: lldb-unit :: Utility/./UtilityTests/OptionsWithRawTest.TerminatedQuote (1724 of 2110) PASS: lldb-unit :: Utility/./UtilityTests/ArgsTest.AppendArguments (1725 of 2110) PASS: lldb-api :: functionalities/thread/concurrent_events/TestConcurrentBreakpointDelayBreakpointOneSignal.py (1726 of 2110) PASS: lldb-api :: commands/expression/completion-in-lambda-and-unnamed-class/TestCompletionInLambdaAndUnnamedClass.py (1727 of 2110) PASS: lldb-unit :: Utility/./UtilityTests/AnsiTerminal.Twice (1728 of 2110) UNSUPPORTED: lldb-api :: commands/expression/multiline-completion/TestMultilineCompletion.py (1729 of 2110) PASS: lldb-api :: python_api/watchpoint/TestWatchpointIgnoreCount.py (1730 of 2110) PASS: lldb-unit :: Utility/./UtilityTests/StreamTeeTest.SetStreamAtIndexOverwrite (1731 of 2110) PASS: lldb-unit :: Language/Highlighting/./HighlighterTests/HighlighterTest.ClangEmptyInput (1732 of 2110) PASS: lldb-api :: functionalities/breakpoint/address_breakpoints/TestBadAddressBreakpoints.py (1733 of 2110) PASS: lldb-unit :: Core/./LLDBCoreTests/RichManglingContextTest.FromCxxMethodName (1734 of 2110) UNSUPPORTED: lldb-api :: functionalities/darwin_log/filter/regex/activity/TestDarwinLogFilterRegexActivity.py (1735 of 2110) PASS: lldb-unit :: Utility/./UtilityTests/ListenerTest.GetEventWait (1736 of 2110) PASS: lldb-shell :: SymbolFile/DWARF/dwp-separate-debug-file.cpp (1737 of 2110) PASS: lldb-unit :: Process/minidump/./LLDBMinidumpTests/MinidumpParserTest.MinidumpDuplicateModuleMinAddress (1738 of 2110) PASS: lldb-api :: lang/objc/modules-incomplete/TestIncompleteModules.py (1739 of 2110) PASS: lldb-unit :: Utility/./UtilityTests/LogChannelEnabledTest.LLDB_LOG_ERROR (1740 of 2110) UNSUPPORTED: lldb-api :: lang/objc/objc-dynamic-value/TestObjCDynamicValue.py (1741 of 2110) PASS: lldb-unit :: UnwindAssembly/x86/./UnwindAssemblyx86Tests/Testx86AssemblyInspectionEngine.TestStackRealign8BitDisp_i386 (1742 of 2110) PASS: lldb-shell :: Minidump/memory-region.yaml (1743 of 2110) PASS: lldb-shell :: Minidump/disassemble-no-module.yaml (1744 of 2110) PASS: lldb-api :: tools/lldb-server/TestGdbRemoteExitCode.py (1745 of 2110) PASS: lldb-unit :: Utility/./UtilityTests/OptionsWithRawTest.ArgsButNoDelimiter (1746 of 2110) PASS: lldb-unit :: Utility/./UtilityTests/Flags.GetBitSize (1747 of 2110) PASS: lldb-api :: functionalities/thread/concurrent_events/TestConcurrentBreakpointsDelayedBreakpointOneWatchpoint.py (1748 of 2110) PASS: lldb-api :: functionalities/dlopen_other_executable/TestDlopenOtherExecutable.py (1749 of 2110) PASS: lldb-api :: macosx/universal/TestUniversal.py (1750 of 2110) UNSUPPORTED: lldb-api :: functionalities/darwin_log/source/info/TestDarwinLogSourceInfo.py (1751 of 2110) PASS: lldb-unit :: Utility/./UtilityTests/SubsystemRAIITest.SubsystemWithErrorSuccess (1752 of 2110) PASS: lldb-api :: functionalities/thread/jump/TestThreadJump.py (1753 of 2110) PASS: lldb-unit :: Symbol/./SymbolTests/DWARFCallFrameInfoTest.Basic_eh (1754 of 2110) PASS: lldb-unit :: Utility/./UtilityTests/AnsiTerminal.KnownPrefix (1755 of 2110) PASS: lldb-api :: lang/objcxx/cxx-bridged-po/TestObjCXXBridgedPO.py (1756 of 2110) PASS: lldb-unit :: Utility/./UtilityTests/TimerTest.CategoryTimes2 (1757 of 2110) PASS: lldb-unit :: Host/./HostTests/FileSystemTest.GetByteSize (1758 of 2110) PASS: lldb-unit :: Utility/./UtilityTests/StringListTest.RemoveBlankLines (1759 of 2110) PASS: lldb-api :: commands/expression/weak_symbols/TestWeakSymbols.py (1760 of 2110) PASS: lldb-api :: tools/lldb-vscode/launch/TestVSCode_launch.py (1761 of 2110) PASS: lldb-api :: python_api/formatters/TestFormattersSBAPI.py (1762 of 2110) PASS: lldb-unit :: Utility/./UtilityTests/BinaryStreamTest.PutULEB128ThreeBytes (1763 of 2110) PASS: lldb-unit :: Utility/./UtilityTests/StringExtractorTest.GetU32BigEndian (1764 of 2110) PASS: lldb-api :: macosx/safe-to-func-call/TestSafeFuncCalls.py (1765 of 2110) PASS: lldb-shell :: SymbolFile/DWARF/debug_loclists-dwo.s (1766 of 2110) PASS: lldb-shell :: SymbolFile/Breakpad/unwind-via-stack-win.test (1767 of 2110) PASS: lldb-unit :: Expression/./ExpressionTests/DiagnosticManagerTest.HasFixits (1768 of 2110) PASS: lldb-shell :: SymbolFile/DWARF/find-basic-type.cpp (1769 of 2110) PASS: lldb-api :: commands/expression/import-std-module/unique_ptr-dbg-info-content/TestUniquePtrDbgInfoContent.py (1770 of 2110) PASS: lldb-unit :: Host/./HostTests/FileSystemTest.EnumerateDirectory (1771 of 2110) PASS: lldb-api :: python_api/value/linked_list/TestValueAPILinkedList.py (1772 of 2110) PASS: lldb-unit :: Utility/./UtilityTests/StringLexerTest.GetUnlexed (1773 of 2110) UNSUPPORTED: lldb-shell :: SymbolFile/DWARF/debug-types-expressions.test (1774 of 2110) PASS: lldb-unit :: SymbolFile/NativePDB/./SymbolFileNativePDBTests/PDBFPOProgramToDWARFExpressionTests.UnresolvedDependentCyclicRegisterAssignmentReference (1775 of 2110) PASS: lldb-unit :: Utility/./UtilityTests/StreamTest.PutBytesAsRawHex8ToLittleEndian (1776 of 2110) PASS: lldb-shell :: SymbolFile/DWARF/dwarf5-atomic.s (1777 of 2110) PASS: lldb-shell :: SymbolFile/NativePDB/source-list.cpp (1778 of 2110) PASS: lldb-unit :: Utility/./UtilityTests/Flags.Test (1779 of 2110) PASS: lldb-unit :: Utility/./UtilityTests/ScalarTest.ComparisonFloat (1780 of 2110) PASS: lldb-unit :: Utility/./UtilityTests/VMRange.IsValid (1781 of 2110) PASS: lldb-api :: lang/objc/modules/TestObjCModules.py (1782 of 2110) PASS: lldb-api :: functionalities/tail_call_frames/unambiguous_sequence/TestUnambiguousTailCalls.py (1783 of 2110) PASS: lldb-unit :: Utility/./UtilityTests/BinaryStreamTest.PutSLEB128SixBytes (1784 of 2110) PASS: lldb-unit :: Utility/./UtilityTests/RangeTest.SlideZero (1785 of 2110) PASS: lldb-api :: functionalities/tail_call_frames/disambiguate_call_site/TestDisambiguateCallSite.py (1786 of 2110) UNSUPPORTED: lldb-api :: benchmarks/expression/TestRepeatedExprs.py (1787 of 2110) PASS: lldb-unit :: UnwindAssembly/x86/./UnwindAssemblyx86Tests/Testx86AssemblyInspectionEngine.TestCALLNextInsn (1788 of 2110) PASS: lldb-unit :: UnwindAssembly/x86/./UnwindAssemblyx86Tests/Testx86AssemblyInspectionEngine.TestStackRealignMSVC_i386 (1789 of 2110) PASS: lldb-unit :: debugserver/./debugserverTests/RNBSocket.LoopBackListenIPv4 (1790 of 2110) PASS: lldb-shell :: Register/x86-64-ymm-read.test (1791 of 2110) PASS: lldb-shell :: Reproducer/Modules/TestModuleCXX.test (1792 of 2110) UNSUPPORTED: lldb-shell :: Register/x86-64-zmm-read.test (1793 of 2110) PASS: lldb-shell :: SymbolFile/Breakpad/line-table-edgecases.test (1794 of 2110) PASS: lldb-unit :: Utility/./UtilityTests/StreamTest.AddressPrefix (1795 of 2110) PASS: lldb-unit :: Utility/./UtilityTests/StringExtractorTest.GetHexBytesAvail_Partial (1796 of 2110) PASS: lldb-api :: functionalities/data-formatter/data-formatter-objc/TestDataFormatterObjCPlain.py (1797 of 2110) UNSUPPORTED: lldb-shell :: SymbolFile/dissassemble-entry-point.s (1798 of 2110) PASS: lldb-shell :: Expr/TestMultilineExpr.test (1799 of 2110) UNSUPPORTED: lldb-api :: functionalities/data-formatter/data-formatter-stl/libstdcpp/unique_ptr/TestDataFormatterStdUniquePtr.py (1800 of 2110) PASS: lldb-unit :: Utility/./UtilityTests/StringListTest.CopyListEmpty (1801 of 2110) PASS: lldb-unit :: Thread/./ThreadTests/ThreadTest.GetPrivateStopInfo (1802 of 2110) PASS: lldb-api :: lang/cpp/function-qualifiers/TestCppFunctionQualifiers.py (1803 of 2110) UNSUPPORTED: lldb-api :: android/platform/TestDefaultCacheLineSize.py (1804 of 2110) PASS: lldb-api :: api/check_public_api_headers/TestPublicAPIHeaders.py (1805 of 2110) PASS: lldb-unit :: Expression/./ExpressionTests/CppModuleConfigurationTest.IgnoreLibStdCpp (1806 of 2110) PASS: lldb-unit :: Utility/./UtilityTests/StringListTest.JoinSingle (1807 of 2110) UNSUPPORTED: lldb-api :: commands/target/auto-install-main-executable/TestAutoInstallMainExecutable.py (1808 of 2110) PASS: lldb-api :: functionalities/breakpoint/breakpoint_conditions/TestBreakpointConditions.py (1809 of 2110) PASS: lldb-api :: functionalities/breakpoint/hardware_breakpoints/require_hw_breakpoints/TestRequireHWBreakpoints.py (1810 of 2110) PASS: lldb-api :: lang/c/find_struct_type/TestFindStructTypes.py (1811 of 2110) PASS: lldb-unit :: Utility/./UtilityTests/StringListTest.Assignment (1812 of 2110) PASS: lldb-shell :: SymbolFile/DWARF/gnu-style-compression.cpp (1813 of 2110) UNSUPPORTED: lldb-api :: linux/sepdebugsymlink/TestTargetSymbolsSepDebugSymlink.py (1814 of 2110) PASS: lldb-api :: functionalities/thread/concurrent_events/TestConcurrentWatchBreak.py (1815 of 2110) PASS: lldb-api :: commands/frame/select/TestFrameSelect.py (1816 of 2110) PASS: lldb-api :: functionalities/thread/thread_specific_break/TestThreadSpecificBreakpoint.py (1817 of 2110) PASS: lldb-unit :: Utility/./UtilityTests/StringExtractorTest.GetHexBytesAvail_OddPair (1818 of 2110) PASS: lldb-unit :: Expression/./ExpressionTests/CppModuleConfigurationTest.LibCppV2 (1819 of 2110) PASS: lldb-api :: commands/expression/import-std-module/no-std-module/TestMissingStdModule.py (1820 of 2110) PASS: lldb-api :: commands/process/attach/attach_denied/TestAttachDenied.py (1821 of 2110) PASS: lldb-unit :: SymbolFile/NativePDB/./SymbolFileNativePDBTests/PDBFPOProgramToDWARFExpressionTests.InvalidOpUnary (1822 of 2110) PASS: lldb-unit :: Symbol/./SymbolTests/TestClangASTImporter.MetadataPropagationAfterCopying (1823 of 2110) PASS: lldb-unit :: Symbol/./SymbolTests/Type.GetTypeScopeAndBasename (1824 of 2110) UNSUPPORTED: lldb-shell :: SymbolFile/PDB/expressions.test (1825 of 2110) PASS: lldb-api :: functionalities/data-formatter/cstring-utf8-summary/TestCstringUnicode.py (1826 of 2110) PASS: lldb-api :: lang/objc/foundation/TestConstStrings.py (1827 of 2110) PASS: lldb-shell :: SymbolFile/NativePDB/disassembly.cpp (1828 of 2110) UNSUPPORTED: lldb-api :: functionalities/darwin_log/filter/regex/subsystem/TestDarwinLogFilterRegexSubsystem.py (1829 of 2110) PASS: lldb-unit :: Target/./TargetTests/ModuleCacheTest.GetAndPut (1830 of 2110) PASS: lldb-unit :: Utility/./UtilityTests/PassiveReplayTest.InstrumentedBarRef (1831 of 2110) PASS: lldb-unit :: Utility/./UtilityTests/TimeoutTest.Format (1832 of 2110) PASS: lldb-api :: functionalities/breakpoint/global_constructor/TestBreakpointInGlobalConstructor.py (1833 of 2110) PASS: lldb-unit :: Utility/./UtilityTests/RangeTest.Union (1834 of 2110) PASS: lldb-api :: lang/cpp/stl/TestStdCXXDisassembly.py (1835 of 2110) PASS: lldb-shell :: ObjectFile/PECOFF/basic-info-arm.yaml (1836 of 2110) PASS: lldb-unit :: Utility/./UtilityTests/Predicate.WaitForValueNotEqualTo (1837 of 2110) UNSUPPORTED: lldb-shell :: SymbolFile/PDB/variables.test (1838 of 2110) PASS: lldb-unit :: Process/gdb-remote/./ProcessGdbRemoteTests/GDBRemoteCommunicationClientTest.TestPacketSpeedJSON (1839 of 2110) PASS: lldb-unit :: tools/lldb-server/tests/./LLDBServerTests/TestBase.LaunchModePreservesEnvironment (1840 of 2110) PASS: lldb-unit :: Utility/./UtilityTests/StringExtractorTest.GetNameColonValueSuccess (1841 of 2110) PASS: lldb-unit :: SymbolFile/NativePDB/./SymbolFileNativePDBTests/PDBFPOProgramToDWARFExpressionTests.UnsupportedRASearch (1842 of 2110) PASS: lldb-unit :: Core/./LLDBCoreTests/MangledTest.ResultForBlockInvocation (1843 of 2110) PASS: lldb-api :: tools/lldb-vscode/step/TestVSCode_step.py (1844 of 2110) PASS: lldb-api :: python_api/value/empty_class/TestValueAPIEmptyClass.py (1845 of 2110) PASS: lldb-unit :: Utility/./UtilityTests/BinaryStreamTest.PutSLEB128One (1846 of 2110) PASS: lldb-api :: functionalities/history/TestHistoryRecall.py (1847 of 2110) PASS: lldb-unit :: Utility/./UtilityTests/StringListTest.GetMaxStringLengthMixed (1848 of 2110) PASS: lldb-api :: functionalities/inline-stepping/TestInlineStepping.py (1849 of 2110) PASS: lldb-unit :: Utility/./UtilityTests/OptionsWithRawTest.MultiWordSuffix (1850 of 2110) PASS: lldb-api :: functionalities/data-formatter/parray/TestPrintArray.py (1851 of 2110) PASS: lldb-unit :: Expression/./ExpressionTests/CppModuleConfigurationTest.Sysroot (1852 of 2110) PASS: lldb-api :: lang/c/modules/TestCModules.py (1853 of 2110) PASS: lldb-api :: functionalities/thread/concurrent_events/TestConcurrentCrashWithWatchpoint.py (1854 of 2110) PASS: lldb-api :: lang/objc/radar-9691614/TestObjCMethodReturningBOOL.py (1855 of 2110) PASS: lldb-shell :: ObjectFile/MachO/lc_version_min.yaml (1856 of 2110) PASS: lldb-unit :: Utility/./UtilityTests/UriParserTest.MinimalPath (1857 of 2110) PASS: lldb-unit :: Utility/./UtilityTests/StringListTest.InsertStringAtIndexStart (1858 of 2110) PASS: lldb-api :: functionalities/memory/find/TestMemoryFind.py (1859 of 2110) PASS: lldb-unit :: Utility/./UtilityTests/StreamTest.AddressRangeEmptyRange (1860 of 2110) PASS: lldb-api :: lang/cpp/const_this/TestConstThis.py (1861 of 2110) UNSUPPORTED: lldb-shell :: ScriptInterpreter/Lua/command_script_import.test (1862 of 2110) PASS: lldb-api :: functionalities/lazy-loading/TestLazyLoading.py (1863 of 2110) PASS: lldb-api :: functionalities/tail_call_frames/thread_step_out_message/TestArtificialFrameStepOutMessage.py (1864 of 2110) PASS: lldb-unit :: Language/Highlighting/./HighlighterTests/HighlighterTest.ClangPPDirectives (1865 of 2110) PASS: lldb-api :: python_api/objc_type/TestObjCType.py (1866 of 2110) PASS: lldb-shell :: Settings/TestSettingsSet.test (1867 of 2110) PASS: lldb-unit :: DataFormatter/./LLDBFormatterTests/TypeMatcherTests.RegexMatchPart (1868 of 2110) PASS: lldb-api :: commands/expression/expr-in-syscall/TestExpressionInSyscall.py (1869 of 2110) PASS: lldb-api :: functionalities/tail_call_frames/disambiguate_paths_to_common_sink/TestDisambiguatePathsToCommonSink.py (1870 of 2110) PASS: lldb-api :: python_api/default-constructor/TestDefaultConstructorForAPIObjects.py (1871 of 2110) PASS: lldb-unit :: Utility/./UtilityTests/ScalarTest.TruncOrExtendTo (1872 of 2110) PASS: lldb-api :: functionalities/data-formatter/data-formatter-objc/nsindexpath/TestDataFormatterNSIndexPath.py (1873 of 2110) PASS: lldb-api :: python_api/hello_world/TestHelloWorld.py (1874 of 2110) PASS: lldb-api :: functionalities/data-formatter/data-formatter-caching/TestDataFormatterCaching.py (1875 of 2110) PASS: lldb-shell :: ObjectFile/ELF/section-permissions.yaml (1876 of 2110) PASS: lldb-unit :: Utility/./UtilityTests/BroadcasterTest.BroadcastEvent (1877 of 2110) PASS: lldb-api :: lang/cpp/inlines/TestInlines.py (1878 of 2110) PASS: lldb-api :: python_api/watchpoint/TestWatchpointIter.py (1879 of 2110) PASS: lldb-shell :: SymbolFile/DWARF/array-sizes.s (1880 of 2110) PASS: lldb-api :: commands/expression/dont_allow_jit/TestAllowJIT.py (1881 of 2110) UNSUPPORTED: lldb-shell :: Breakpoint/ppc64-localentry.test (1882 of 2110) PASS: lldb-unit :: Utility/./UtilityTests/RangeTest.SetRangeBase (1883 of 2110) UNSUPPORTED: lldb-api :: functionalities/data-formatter/data-formatter-stl/libstdcpp/string/TestDataFormatterStdString.py (1884 of 2110) PASS: lldb-unit :: Process/minidump/./LLDBMinidumpTests/MinidumpParserTest.GetPidWindows (1885 of 2110) PASS: lldb-api :: lang/cpp/template/TestTemplateArgs.py (1886 of 2110) PASS: lldb-api :: lang/cpp/multiple-inheritance/TestCppMultipleInheritance.py (1887 of 2110) PASS: lldb-unit :: Utility/./UtilityTests/ScalarTest.APIntConstructor (1888 of 2110) PASS: lldb-api :: functionalities/data-formatter/data-formatter-categories/TestDataFormatterCategories.py (1889 of 2110) PASS: lldb-api :: macosx/indirect_symbol/TestIndirectSymbols.py (1890 of 2110) PASS: lldb-unit :: Utility/./UtilityTests/StringListTest.GetMaxStringLengthDecreasingSize (1891 of 2110) PASS: lldb-unit :: Host/./HostTests/FileActionTest.Open (1892 of 2110) PASS: lldb-unit :: Utility/./UtilityTests/OptionsWithRawTest.LeadingSpaceArgs (1893 of 2110) PASS: lldb-unit :: UnwindAssembly/x86/./UnwindAssemblyx86Tests/Testx86AssemblyInspectionEngine.TestSpillRegToStackViaMOVx86_64 (1894 of 2110) PASS: lldb-api :: lang/cpp/operator-overload/TestOperatorOverload.py (1895 of 2110) PASS: lldb-api :: functionalities/data-formatter/data-formatter-objc/TestDataFormatterObjCExpr.py (1896 of 2110) PASS: lldb-shell :: Recognizer/assert.test (1897 of 2110) PASS: lldb-api :: commands/expression/ignore-artificial-constructors/TestIgnoreArtificialConstructors.py (1898 of 2110) UNSUPPORTED: lldb-shell :: Expr/TestIRMemoryMapWindows.test (1899 of 2110) PASS: lldb-unit :: Utility/./UtilityTests/ArgsTest.TestSingleArg (1900 of 2110) PASS: lldb-api :: python_api/section/TestSectionAPI.py (1901 of 2110) PASS: lldb-shell :: SymbolFile/DWARF/find-method.cpp (1902 of 2110) PASS: lldb-api :: commands/session/save/TestSessionSave.py (1903 of 2110) PASS: lldb-shell :: Reproducer/TestGDBRemoteRepro.test (1904 of 2110) PASS: lldb-unit :: Process/gdb-remote/./ProcessGdbRemoteTests/GDBRemoteCommunicationClientTest.GetModulesInfoInvalidResponse (1905 of 2110) PASS: lldb-shell :: SymbolFile/DWARF/DW_AT_loclists_base.s (1906 of 2110) PASS: lldb-api :: functionalities/data-formatter/var-in-aggregate-misuse/TestVarInAggregateMisuse.py (1907 of 2110) PASS: lldb-unit :: Symbol/./SymbolTests/TestTypeSystemClang.TestNotDeletingUserCopyCstrDueToMoveCStr (1908 of 2110) FAIL: lldb-api :: macosx/macCatalyst/TestMacCatalyst.py (1909 of 2110) ******************** TEST 'lldb-api :: macosx/macCatalyst/TestMacCatalyst.py' FAILED ******************** Script: -- /Users/buildslave/jenkins/workspace/lldb-cmake-sanitized/lldb-build/lldb-test-build.noindex/copied-python /Users/buildslave/jenkins/workspace/lldb-cmake-sanitized/llvm-project/lldb/test/API/dotest.py --arch x86_64 -s /Users/buildslave/jenkins/workspace/lldb-cmake-sanitized/lldb-build/lldb-test-traces -S nm -u CXXFLAGS -u CFLAGS --codesign-identity lldb_codesign --server /Users/buildslave/jenkins/workspace/lldb-cmake-sanitized/lldb-build/./bin/debugserver --arch x86_64 --build-dir /Users/buildslave/jenkins/workspace/lldb-cmake-sanitized/lldb-build/lldb-test-build.noindex -s=/Users/buildslave/jenkins/workspace/lldb-cmake-sanitized/test/logs -t --env TERM=vt100 --env LLVM_LIBS_DIR=/Users/buildslave/jenkins/workspace/lldb-cmake-sanitized/lldb-build/./lib --inferior-env ASAN_OPTIONS=detect_stack_use_after_return=1 --inferior-env DYLD_INSERT_LIBRARIES=/Users/buildslave/jenkins/workspace/lldb-cmake-sanitized/host-compiler/lib/clang/12.0.0/lib/darwin/libclang_rt.asan_osx_dynamic.dylib --build-dir /Users/buildslave/jenkins/workspace/lldb-cmake-sanitized/lldb-build/lldb-test-build.noindex --lldb-module-cache-dir /Users/buildslave/jenkins/workspace/lldb-cmake-sanitized/lldb-build/lldb-test-build.noindex/module-cache-lldb/lldb-api --clang-module-cache-dir /Users/buildslave/jenkins/workspace/lldb-cmake-sanitized/lldb-build/lldb-test-build.noindex/module-cache-clang/lldb-api --executable /Users/buildslave/jenkins/workspace/lldb-cmake-sanitized/lldb-build/./bin/lldb --compiler /Users/buildslave/jenkins/workspace/lldb-cmake-sanitized/lldb-build/./bin/clang --dsymutil /Users/buildslave/jenkins/workspace/lldb-cmake-sanitized/lldb-build/./bin/dsymutil --filecheck /Users/buildslave/jenkins/workspace/lldb-cmake-sanitized/lldb-build/./bin/FileCheck --yaml2obj /Users/buildslave/jenkins/workspace/lldb-cmake-sanitized/lldb-build/./bin/yaml2obj --lldb-libs-dir /Users/buildslave/jenkins/workspace/lldb-cmake-sanitized/lldb-build/./lib /Users/buildslave/jenkins/workspace/lldb-cmake-sanitized/llvm-project/lldb/test/API/macosx/macCatalyst -p TestMacCatalyst.py -- Exit Code: 1

Hide Details

Command Output (stdout): -- lldb version 12.0.99 clang revision 1da09b7214b4e487c371e5d1c5024d92aadc3c7a llvm revision 1da09b7214b4e487c371e5d1c5024d92aadc3c7a LLDB library dir: /Users/buildslave/jenkins/workspace/lldb-cmake-sanitized/lldb-build/bin LLDB import library dir: /Users/buildslave/jenkins/workspace/lldb-cmake-sanitized/lldb-build/./lib libstdcxx tests will not be run because: Don't know how to build with libstdcxx on macosx Skipping following debug info categories: ['dwo']

Hide Details

-- Command Output (stderr): --

Hide Details

Session logs for test failures/errors/unexpected successes will go into directory '/Users/buildslave/jenkins/workspace/lldb-cmake-sanitized/test/logs' Change dir to: /Users/buildslave/jenkins/workspace/lldb-cmake-sanitized/llvm-project/lldb/test/API/macosx/macCatalyst runCmd: settings clear -all output:

Hide Details

runCmd: settings set symbols.enable-external-lookup false output:

Hide Details

runCmd: settings set target.inherit-tcc true output:

Hide Details

runCmd: settings set target.auto-apply-fixits false output:

Hide Details

runCmd: settings set plugin.process.gdb-remote.packet-timeout 60 output:

Hide Details

runCmd: settings set symbols.clang-modules-cache-path "/Users/buildslave/jenkins/workspace/lldb-cmake-sanitized/lldb-build/lldb-test-build.noindex/module-cache-lldb/lldb-api" output:

Hide Details

runCmd: settings set use-color false output:

Hide Details

runCmd: setting set target.prefer-dynamic-value no-dynamic-values output:

Hide Details

runCmd: settings set target.env-vars ASAN_OPTIONS=detect_stack_use_after_return=1 DYLD_INSERT_LIBRARIES=/Users/buildslave/jenkins/workspace/lldb-cmake-sanitized/host-compiler/lib/clang/12.0.0/lib/darwin/libclang_rt.asan_osx_dynamic.dylib output:

Hide Details

runCmd: log enable gdb-remote packets -f /Users/buildslave/jenkins/workspace/lldb-cmake-sanitized/lldb-build/lldb-test-build.noindex/macosx/macCatalyst/TestMacCatalyst.test_macabi_dsym/packets.log output:

Hide Details

runCmd: settings set target.env-vars ASAN_OPTIONS=detect_stack_use_after_return=1 DYLD_INSERT_LIBRARIES=/Users/buildslave/jenkins/workspace/lldb-cmake-sanitized/host-compiler/lib/clang/12.0.0/lib/darwin/libclang_rt.asan_osx_dynamic.dylib output:

Hide Details

runCmd: image list -t -b output: [ 0] x86_64-apple-ios13.0.0-macabi a.out [ 1] x86_64-apple-macosx10.15.0 dyld [ 2] x86_64-apple-ios13.0-macabi libc++.1.dylib [ 3] x86_64-apple-ios13.5-macabi libSystem.B.dylib [ 4] x86_64-apple-ios13.0-macabi libc++abi.dylib [ 5] x86_64-apple-ios13.4-macabi libcache.dylib [ 6] x86_64-apple-ios13.4-macabi libcommonCrypto.dylib [ 7] x86_64-apple-macosx10.15.0 libcompiler_rt.dylib [ 8] x86_64-apple-ios13.4-macabi libcopyfile.dylib [ 9] x86_64-apple-ios13.4-macabi libcorecrypto.dylib [ 10] x86_64-apple-ios13.4-macabi libdispatch.dylib [ 11] x86_64-apple-ios13.4-macabi libdyld.dylib [ 12] x86_64-apple-ios13.4-macabi libkeymgr.dylib [ 13] x86_64-apple-ios13.4-macabi liblaunch.dylib [ 14] x86_64-apple-ios13.0-macabi libmacho.dylib [ 15] x86_64-apple-ios13.4-macabi libquarantine.dylib [ 16] x86_64-apple-ios13.4-macabi libremovefile.dylib [ 17] x86_64-apple-ios13.4-macabi libsystem_asl.dylib [ 18] x86_64-apple-ios13.4-macabi libsystem_blocks.dylib [ 19] x86_64-apple-ios13.4-macabi libsystem_c.dylib [ 20] x86_64-apple-ios13.4-macabi libsystem_configuration.dylib [ 21] x86_64-apple-ios13.4-macabi libsystem_coreservices.dylib [ 22] x86_64-apple-ios13.4-macabi libsystem_darwin.dylib [ 23] x86_64-apple-ios13.4-macabi libsystem_dnssd.dylib [ 24] x86_64-apple-ios13.4-macabi libsystem_featureflags.dylib [ 25] x86_64-apple-ios13.4-macabi libsystem_info.dylib [ 26] x86_64-apple-ios13.4-macabi libsystem_m.dylib [ 27] x86_64-apple-ios13.4-macabi libsystem_malloc.dylib [ 28] x86_64-apple-ios13.4-macabi libsystem_networkextension.dylib [ 29] x86_64-apple-ios13.4-macabi libsystem_notify.dylib [ 30] x86_64-apple-ios13.4-macabi libsystem_sandbox.dylib [ 31] x86_64-apple-ios13.4-macabi libsystem_secinit.dylib [ 32] x86_64-apple-ios13.5-macabi libsystem_kernel.dylib [ 33] x86_64-apple-ios13.4-macabi libsystem_platform.dylib [ 34] x86_64-apple-ios13.4-macabi libsystem_pthread.dylib [ 35] x86_64-apple-ios13.4-macabi libsystem_symptoms.dylib [ 36] x86_64-apple-ios13.4-macabi libsystem_trace.dylib [ 37] x86_64-apple-ios13.4-macabi libunwind.dylib [ 38] x86_64-apple-ios13.4-macabi libxpc.dylib [ 39] x86_64-apple-ios13.4-macabi libobjc.A.dylib [ 40] x86_64-apple-macosx10.9.0 libclang_rt.asan_osx_dynamic.dylib

Hide Details

Hide Details

Expecting pattern: x86_64.*-apple-ios.*-macabi a\.out Matched

Hide Details

runCmd: fr v s output: (const char *) s = 0x0000000100000f9a "Hello macCatalyst!"

Hide Details

Hide Details

runCmd: p s output: (const char *) $0 = 0x0000000100000f9a "Hello macCatalyst!"

Hide Details

Hide Details

FAIL: LLDB (/Users/buildslave/jenkins/workspace/lldb-cmake-sanitized/lldb-build/bin/clang-x86_64) :: test_macabi_dsym (TestMacCatalyst.TestMacCatalyst) <bound method SBProcess.Kill of <lldb.SBProcess; proxy of <Swig Object of type 'lldb::SBProcess *' at 0x110e765a0> >>: success

Hide Details

runCmd: settings clear -all output:

Hide Details

runCmd: settings set symbols.enable-external-lookup false output:

Hide Details

runCmd: settings set target.inherit-tcc true output:

Hide Details

runCmd: settings set target.auto-apply-fixits false output:

Hide Details

runCmd: settings set plugin.process.gdb-remote.packet-timeout 60 output:

Hide Details

runCmd: settings set symbols.clang-modules-cache-path "/Users/buildslave/jenkins/workspace/lldb-cmake-sanitized/lldb-build/lldb-test-build.noindex/module-cache-lldb/lldb-api" output:

Hide Details

runCmd: settings set use-color false output:

Hide Details

runCmd: setting set target.prefer-dynamic-value no-dynamic-values output:

Hide Details

runCmd: settings set target.env-vars ASAN_OPTIONS=detect_stack_use_after_return=1 DYLD_INSERT_LIBRARIES=/Users/buildslave/jenkins/workspace/lldb-cmake-sanitized/host-compiler/lib/clang/12.0.0/lib/darwin/libclang_rt.asan_osx_dynamic.dylib output:

Hide Details

runCmd: log enable gdb-remote packets -f /Users/buildslave/jenkins/workspace/lldb-cmake-sanitized/lldb-build/lldb-test-build.noindex/macosx/macCatalyst/TestMacCatalyst.test_macabi_dwarf/packets.log output:

Hide Details

runCmd: settings set target.env-vars ASAN_OPTIONS=detect_stack_use_after_return=1 DYLD_INSERT_LIBRARIES=/Users/buildslave/jenkins/workspace/lldb-cmake-sanitized/host-compiler/lib/clang/12.0.0/lib/darwin/libclang_rt.asan_osx_dynamic.dylib output:

Hide Details

runCmd: image list -t -b output: [ 0] x86_64-apple-ios13.0.0-macabi a.out [ 1] x86_64-apple-macosx10.15.0 dyld [ 2] x86_64-apple-ios13.0-macabi libc++.1.dylib [ 3] x86_64-apple-ios13.5-macabi libSystem.B.dylib [ 4] x86_64-apple-ios13.0-macabi libc++abi.dylib [ 5] x86_64-apple-ios13.4-macabi libcache.dylib [ 6] x86_64-apple-ios13.4-macabi libcommonCrypto.dylib [ 7] x86_64-apple-macosx10.15.0 libcompiler_rt.dylib [ 8] x86_64-apple-ios13.4-macabi libcopyfile.dylib [ 9] x86_64-apple-ios13.4-macabi libcorecrypto.dylib [ 10] x86_64-apple-ios13.4-macabi libdispatch.dylib [ 11] x86_64-apple-ios13.4-macabi libdyld.dylib [ 12] x86_64-apple-ios13.4-macabi libkeymgr.dylib [ 13] x86_64-apple-ios13.4-macabi liblaunch.dylib [ 14] x86_64-apple-ios13.0-macabi libmacho.dylib [ 15] x86_64-apple-ios13.4-macabi libquarantine.dylib [ 16] x86_64-apple-ios13.4-macabi libremovefile.dylib [ 17] x86_64-apple-ios13.4-macabi libsystem_asl.dylib [ 18] x86_64-apple-ios13.4-macabi libsystem_blocks.dylib [ 19] x86_64-apple-ios13.4-macabi libsystem_c.dylib [ 20] x86_64-apple-ios13.4-macabi libsystem_configuration.dylib [ 21] x86_64-apple-ios13.4-macabi libsystem_coreservices.dylib [ 22] x86_64-apple-ios13.4-macabi libsystem_darwin.dylib [ 23] x86_64-apple-ios13.4-macabi libsystem_dnssd.dylib [ 24] x86_64-apple-ios13.4-macabi libsystem_featureflags.dylib [ 25] x86_64-apple-ios13.4-macabi libsystem_info.dylib [ 26] x86_64-apple-ios13.4-macabi libsystem_m.dylib [ 27] x86_64-apple-ios13.4-macabi libsystem_malloc.dylib [ 28] x86_64-apple-ios13.4-macabi libsystem_networkextension.dylib [ 29] x86_64-apple-ios13.4-macabi libsystem_notify.dylib [ 30] x86_64-apple-ios13.4-macabi libsystem_sandbox.dylib [ 31] x86_64-apple-ios13.4-macabi libsystem_secinit.dylib [ 32] x86_64-apple-ios13.5-macabi libsystem_kernel.dylib [ 33] x86_64-apple-ios13.4-macabi libsystem_platform.dylib [ 34] x86_64-apple-ios13.4-macabi libsystem_pthread.dylib [ 35] x86_64-apple-ios13.4-macabi libsystem_symptoms.dylib [ 36] x86_64-apple-ios13.4-macabi libsystem_trace.dylib [ 37] x86_64-apple-ios13.4-macabi libunwind.dylib [ 38] x86_64-apple-ios13.4-macabi libxpc.dylib [ 39] x86_64-apple-ios13.4-macabi libobjc.A.dylib [ 40] x86_64-apple-macosx10.9.0 libclang_rt.asan_osx_dynamic.dylib

Hide Details

Hide Details

Expecting pattern: x86_64.*-apple-ios.*-macabi a\.out Matched

Hide Details

runCmd: fr v s output: (const char *) s = 0x0000000100000f9a "Hello macCatalyst!"

Hide Details

Hide Details

runCmd: p s output: (const char *) $0 = 0x0000000100000f9a "Hello macCatalyst!"

Hide Details

Hide Details

FAIL: LLDB (/Users/buildslave/jenkins/workspace/lldb-cmake-sanitized/lldb-build/bin/clang-x86_64) :: test_macabi_dwarf (TestMacCatalyst.TestMacCatalyst) <bound method SBProcess.Kill of <lldb.SBProcess; proxy of <Swig Object of type 'lldb::SBProcess *' at 0x1101e68d0> >>: success

Hide Details

UNSUPPORTED: LLDB (/Users/buildslave/jenkins/workspace/lldb-cmake-sanitized/lldb-build/bin/clang-x86_64) :: test_macabi_dwo (TestMacCatalyst.TestMacCatalyst) (test case does not fall in any category of interest for this run) runCmd: settings clear -all output:

Hide Details

runCmd: settings set symbols.enable-external-lookup false output:

Hide Details

runCmd: settings set target.inherit-tcc true output:

Hide Details

runCmd: settings set target.auto-apply-fixits false output:

Hide Details

runCmd: settings set plugin.process.gdb-remote.packet-timeout 60 output:

Hide Details

runCmd: settings set symbols.clang-modules-cache-path "/Users/buildslave/jenkins/workspace/lldb-cmake-sanitized/lldb-build/lldb-test-build.noindex/module-cache-lldb/lldb-api" output:

Hide Details

runCmd: settings set use-color false output:

Hide Details

runCmd: setting set target.prefer-dynamic-value no-dynamic-values output:

Hide Details

runCmd: settings set target.env-vars ASAN_OPTIONS=detect_stack_use_after_return=1 DYLD_INSERT_LIBRARIES=/Users/buildslave/jenkins/workspace/lldb-cmake-sanitized/host-compiler/lib/clang/12.0.0/lib/darwin/libclang_rt.asan_osx_dynamic.dylib output:

Hide Details

runCmd: log enable gdb-remote packets -f /Users/buildslave/jenkins/workspace/lldb-cmake-sanitized/lldb-build/lldb-test-build.noindex/macosx/macCatalyst/TestMacCatalyst.test_macabi_gmodules/packets.log output:

Hide Details

runCmd: settings set target.env-vars ASAN_OPTIONS=detect_stack_use_after_return=1 DYLD_INSERT_LIBRARIES=/Users/buildslave/jenkins/workspace/lldb-cmake-sanitized/host-compiler/lib/clang/12.0.0/lib/darwin/libclang_rt.asan_osx_dynamic.dylib output:

Hide Details

runCmd: image list -t -b output: [ 0] x86_64-apple-ios13.0.0-macabi a.out [ 1] x86_64-apple-macosx10.15.0 dyld [ 2] x86_64-apple-ios13.0-macabi libc++.1.dylib [ 3] x86_64-apple-ios13.5-macabi libSystem.B.dylib [ 4] x86_64-apple-ios13.0-macabi libc++abi.dylib [ 5] x86_64-apple-ios13.4-macabi libcache.dylib [ 6] x86_64-apple-ios13.4-macabi libcommonCrypto.dylib [ 7] x86_64-apple-macosx10.15.0 libcompiler_rt.dylib [ 8] x86_64-apple-ios13.4-macabi libcopyfile.dylib [ 9] x86_64-apple-ios13.4-macabi libcorecrypto.dylib [ 10] x86_64-apple-ios13.4-macabi libdispatch.dylib [ 11] x86_64-apple-ios13.4-macabi libdyld.dylib [ 12] x86_64-apple-ios13.4-macabi libkeymgr.dylib [ 13] x86_64-apple-ios13.4-macabi liblaunch.dylib [ 14] x86_64-apple-ios13.0-macabi libmacho.dylib [ 15] x86_64-apple-ios13.4-macabi libquarantine.dylib [ 16] x86_64-apple-ios13.4-macabi libremovefile.dylib [ 17] x86_64-apple-ios13.4-macabi libsystem_asl.dylib [ 18] x86_64-apple-ios13.4-macabi libsystem_blocks.dylib [ 19] x86_64-apple-ios13.4-macabi libsystem_c.dylib [ 20] x86_64-apple-ios13.4-macabi libsystem_configuration.dylib [ 21] x86_64-apple-ios13.4-macabi libsystem_coreservices.dylib [ 22] x86_64-apple-ios13.4-macabi libsystem_darwin.dylib [ 23] x86_64-apple-ios13.4-macabi libsystem_dnssd.dylib [ 24] x86_64-apple-ios13.4-macabi libsystem_featureflags.dylib [ 25] x86_64-apple-ios13.4-macabi libsystem_info.dylib [ 26] x86_64-apple-ios13.4-macabi libsystem_m.dylib [ 27] x86_64-apple-ios13.4-macabi libsystem_malloc.dylib [ 28] x86_64-apple-ios13.4-macabi libsystem_networkextension.dylib [ 29] x86_64-apple-ios13.4-macabi libsystem_notify.dylib [ 30] x86_64-apple-ios13.4-macabi libsystem_sandbox.dylib [ 31] x86_64-apple-ios13.4-macabi libsystem_secinit.dylib [ 32] x86_64-apple-ios13.5-macabi libsystem_kernel.dylib [ 33] x86_64-apple-ios13.4-macabi libsystem_platform.dylib [ 34] x86_64-apple-ios13.4-macabi libsystem_pthread.dylib [ 35] x86_64-apple-ios13.4-macabi libsystem_symptoms.dylib [ 36] x86_64-apple-ios13.4-macabi libsystem_trace.dylib [ 37] x86_64-apple-ios13.4-macabi libunwind.dylib [ 38] x86_64-apple-ios13.4-macabi libxpc.dylib [ 39] x86_64-apple-ios13.4-macabi libobjc.A.dylib [ 40] x86_64-apple-macosx10.9.0 libclang_rt.asan_osx_dynamic.dylib

Hide Details

Hide Details

Expecting pattern: x86_64.*-apple-ios.*-macabi a\.out Matched

Hide Details

runCmd: fr v s output: (const char *) s = 0x0000000100000f9a "Hello macCatalyst!"

Hide Details

Hide Details

runCmd: p s output: (const char *) $0 = 0x0000000100000f9a "Hello macCatalyst!"

Hide Details

Hide Details

FAIL: LLDB (/Users/buildslave/jenkins/workspace/lldb-cmake-sanitized/lldb-build/bin/clang-x86_64) :: test_macabi_gmodules (TestMacCatalyst.TestMacCatalyst) <bound method SBProcess.Kill of <lldb.SBProcess; proxy of <Swig Object of type 'lldb::SBProcess *' at 0x110e76b40> >>: success

Hide Details

Restore dir to: /Users/buildslave/jenkins/workspace/lldb-cmake-sanitized/lldb-build/tools/lldb/test ====================================================================== FAIL: test_macabi_dsym (TestMacCatalyst.TestMacCatalyst) Test the x86_64-apple-ios-macabi target linked against a macos dylib ---------------------------------------------------------------------- Traceback (most recent call last): File "/Users/buildslave/jenkins/workspace/lldb-cmake-sanitized/llvm-project/lldb/packages/Python/lldbsuite/test/lldbtest.py", line 1812, in test_method return attrvalue(self) File "/Users/buildslave/jenkins/workspace/lldb-cmake-sanitized/llvm-project/lldb/packages/Python/lldbsuite/test/decorators.py", line 135, in wrapper return func(*args, **kwargs) File "/Users/buildslave/jenkins/workspace/lldb-cmake-sanitized/llvm-project/lldb/packages/Python/lldbsuite/test/decorators.py", line 135, in wrapper return func(*args, **kwargs) File "/Users/buildslave/jenkins/workspace/lldb-cmake-sanitized/llvm-project/lldb/test/API/macosx/macCatalyst/TestMacCatalyst.py", line 29, in test_macabi self.check_debugserver(log) File "/Users/buildslave/jenkins/workspace/lldb-cmake-sanitized/llvm-project/lldb/test/API/macosx/macCatalyst/TestMacCatalyst.py", line 42, in check_debugserver self.assertTrue(aout_info) AssertionError: None is not True Config=x86_64-/Users/buildslave/jenkins/workspace/lldb-cmake-sanitized/lldb-build/bin/clang ====================================================================== FAIL: test_macabi_dwarf (TestMacCatalyst.TestMacCatalyst) Test the x86_64-apple-ios-macabi target linked against a macos dylib ---------------------------------------------------------------------- Traceback (most recent call last): File "/Users/buildslave/jenkins/workspace/lldb-cmake-sanitized/llvm-project/lldb/packages/Python/lldbsuite/test/lldbtest.py", line 1812, in test_method return attrvalue(self) File "/Users/buildslave/jenkins/workspace/lldb-cmake-sanitized/llvm-project/lldb/packages/Python/lldbsuite/test/decorators.py", line 135, in wrapper return func(*args, **kwargs) File "/Users/buildslave/jenkins/workspace/lldb-cmake-sanitized/llvm-project/lldb/packages/Python/lldbsuite/test/decorators.py", line 135, in wrapper return func(*args, **kwargs) File "/Users/buildslave/jenkins/workspace/lldb-cmake-sanitized/llvm-project/lldb/test/API/macosx/macCatalyst/TestMacCatalyst.py", line 29, in test_macabi self.check_debugserver(log) File "/Users/buildslave/jenkins/workspace/lldb-cmake-sanitized/llvm-project/lldb/test/API/macosx/macCatalyst/TestMacCatalyst.py", line 42, in check_debugserver self.assertTrue(aout_info) AssertionError: None is not True Config=x86_64-/Users/buildslave/jenkins/workspace/lldb-cmake-sanitized/lldb-build/bin/clang ====================================================================== FAIL: test_macabi_gmodules (TestMacCatalyst.TestMacCatalyst) Test the x86_64-apple-ios-macabi target linked against a macos dylib ---------------------------------------------------------------------- Traceback (most recent call last): File "/Users/buildslave/jenkins/workspace/lldb-cmake-sanitized/llvm-project/lldb/packages/Python/lldbsuite/test/lldbtest.py", line 1812, in test_method return attrvalue(self) File "/Users/buildslave/jenkins/workspace/lldb-cmake-sanitized/llvm-project/lldb/packages/Python/lldbsuite/test/decorators.py", line 135, in wrapper return func(*args, **kwargs) File "/Users/buildslave/jenkins/workspace/lldb-cmake-sanitized/llvm-project/lldb/packages/Python/lldbsuite/test/decorators.py", line 135, in wrapper return func(*args, **kwargs) File "/Users/buildslave/jenkins/workspace/lldb-cmake-sanitized/llvm-project/lldb/test/API/macosx/macCatalyst/TestMacCatalyst.py", line 29, in test_macabi self.check_debugserver(log) File "/Users/buildslave/jenkins/workspace/lldb-cmake-sanitized/llvm-project/lldb/test/API/macosx/macCatalyst/TestMacCatalyst.py", line 42, in check_debugserver self.assertTrue(aout_info) AssertionError: None is not True Config=x86_64-/Users/buildslave/jenkins/workspace/lldb-cmake-sanitized/lldb-build/bin/clang ---------------------------------------------------------------------- Ran 4 tests in 12.181s

Hide Details

RESULT: FAILED (0 passes, 3 failures, 0 errors, 1 skipped, 0 expected failures, 0 unexpected successes)

Hide Details

--

Hide Details

******************** PASS: lldb-unit :: Utility/./UtilityTests/StringListTest.SplitIntoLinesSingleTrailingCR (1910 of 2110) PASS: lldb-api :: lang/objc/objc-static-method-stripped/TestObjCStaticMethodStripped.py (1911 of 2110) PASS: lldb-unit :: debugserver/./debugserverTests/RNBSocket.AnyListen (1912 of 2110) PASS: lldb-api :: sanity/TestSettingSkipping.py (1913 of 2110) PASS: lldb-api :: lang/cpp/static_methods/TestCPPStaticMethods.py (1914 of 2110) PASS: lldb-api :: functionalities/unwind/noreturn/module-end/TestNoReturnModuleEnd.py (1915 of 2110) PASS: lldb-api :: functionalities/conditional_break/TestConditionalBreak.py (1916 of 2110) PASS: lldb-api :: tools/lldb-vscode/breakpoint-events/TestVSCode_breakpointEvents.py (1917 of 2110) PASS: lldb-api :: tools/lldb-vscode/breakpoint/TestVSCode_setExceptionBreakpoints.py (1918 of 2110) UNSUPPORTED: lldb-shell :: Register/x86-64-zmm-write.test (1919 of 2110) PASS: lldb-unit :: Utility/./UtilityTests/StringListTest.LongestCommonPrefixDuplicateElement (1920 of 2110) PASS: lldb-unit :: Utility/./UtilityTests/RangeTest.NotEqualInvalid (1921 of 2110) PASS: lldb-shell :: SymbolFile/DWARF/find-function-regex.cpp (1922 of 2110) PASS: lldb-api :: commands/disassemble/basic/TestFrameDisassemble.py (1923 of 2110) PASS: lldb-shell :: SymbolFile/DWARF/debug-names-compressed.cpp (1924 of 2110) PASS: lldb-api :: lang/cpp/scope/TestCppScope.py (1925 of 2110) PASS: lldb-unit :: Utility/./UtilityTests/StringExtractorTest.GetU64LittleEndian (1926 of 2110) PASS: lldb-api :: macosx/find-app-in-bundle/TestFindAppInBundle.py (1927 of 2110) PASS: lldb-unit :: UnwindAssembly/x86/./UnwindAssemblyx86Tests/Testx86AssemblyInspectionEngine.TestPushEBX (1928 of 2110) PASS: lldb-api :: functionalities/data-formatter/builtin-formats/TestBuiltinFormats.py (1929 of 2110) PASS: lldb-unit :: Core/./LLDBCoreTests/StreamCallbackTest.Callback (1930 of 2110) PASS: lldb-unit :: Utility/./UtilityTests/StreamTest.ShiftOperatorStrings (1931 of 2110) PASS: lldb-shell :: SymbolFile/DWARF/apple-index-is-used.cpp (1932 of 2110) PASS: lldb-unit :: Process/minidump/./LLDBMinidumpTests/MinidumpParserTest.GetThreadContext_x86_32_wow64 (1933 of 2110) PASS: lldb-unit :: UnwindAssembly/x86/./UnwindAssemblyx86Tests/Testx86AssemblyInspectionEngine.TestAddESP (1934 of 2110) PASS: lldb-unit :: Core/./LLDBCoreTests/SourceFileCache.FindSourceFileFound (1935 of 2110) PASS: lldb-api :: commands/expression/diagnostics/TestExprDiagnostics.py (1936 of 2110) UNSUPPORTED: lldb-api :: functionalities/darwin_log/source/debug/TestDarwinLogSourceDebug.py (1937 of 2110) PASS: lldb-api :: lang/objc/objc-runtime-ivars/TestRuntimeIvars.py (1938 of 2110) PASS: lldb-unit :: Signals/./SignalsTests/UnixSignalsTest.GetFilteredSignals (1939 of 2110) PASS: lldb-api :: functionalities/completion/TestCompletion.py (1940 of 2110) PASS: lldb-shell :: ObjectFile/PECOFF/symbol.yaml (1941 of 2110) PASS: lldb-shell :: Settings/TestModuleCacheSanity.test (1942 of 2110) PASS: lldb-unit :: Process/minidump/./LLDBMinidumpTests/MinidumpParserTest.GetMemoryRegionInfo (1943 of 2110) PASS: lldb-api :: lang/cpp/template-specialization-type/TestTemplateSpecializationType.py (1944 of 2110) PASS: lldb-shell :: SymbolFile/DWARF/debug-types-dwarf5.s (1945 of 2110) PASS: lldb-unit :: Process/gdb-remote/./ProcessGdbRemoteTests/GDBRemoteCommunicationClientTest.SendGetMetaDataPacket (1946 of 2110) PASS: lldb-unit :: Utility/./UtilityTests/StringExtractorTest.GetHexBytes_FullString (1947 of 2110) PASS: lldb-api :: lang/c/inlines/TestRedefinitionsInInlines.py (1948 of 2110) PASS: lldb-unit :: Process/minidump/./LLDBMinidumpTests/MinidumpParserTest.GetMemoryRegionInfoFromMemory64List (1949 of 2110) PASS: lldb-unit :: Utility/./UtilityTests/RangeVector.CombineConsecutiveRanges (1950 of 2110) PASS: lldb-api :: lang/objc/rdar-10967107/TestRdar10967107.py (1951 of 2110) PASS: lldb-api :: lang/cpp/char8_t/TestCxxChar8_t.py (1952 of 2110) PASS: lldb-api :: functionalities/thread/concurrent_events/TestConcurrentManyCrash.py (1953 of 2110) PASS: lldb-api :: lang/cpp/dynamic-value/TestDynamicValue.py (1954 of 2110) PASS: lldb-unit :: UnwindAssembly/x86/./UnwindAssemblyx86Tests/Testx86AssemblyInspectionEngine.TestPushEBP (1955 of 2110) PASS: lldb-api :: functionalities/data-formatter/data-formatter-stl/libcxx/multiset/TestDataFormatterLibcxxMultiSet.py (1956 of 2110) PASS: lldb-unit :: ObjectFile/Breakpad/./ObjectFileBreakpadTests/PublicRecord.parse (1957 of 2110) PASS: lldb-api :: linux/builtin_trap/TestBuiltinTrap.py (1958 of 2110) PASS: lldb-api :: commands/expression/import-std-module/forward_list-dbg-info-content/TestDbgInfoContentForwardListFromStdModule.py (1959 of 2110) PASS: lldb-unit :: Utility/./UtilityTests/RangeTest.ContainsRange (1960 of 2110) PASS: lldb-api :: functionalities/thread/concurrent_events/TestConcurrentSignalWatchBreak.py (1961 of 2110) PASS: lldb-unit :: Utility/./UtilityTests/StateTest.Formatv (1962 of 2110) PASS: lldb-unit :: Utility/./UtilityTests/ScalarTest.GetValue (1963 of 2110) PASS: lldb-api :: functionalities/data-formatter/data-formatter-stl/libcxx/set/TestDataFormatterLibcxxSet.py (1964 of 2110) PASS: lldb-unit :: Core/./LLDBCoreTests/RichManglingContextTest.IPDRealloc (1965 of 2110) PASS: lldb-shell :: Commands/command-regex-unalias.test (1966 of 2110) PASS: lldb-api :: lang/objc/objc-new-syntax/TestObjCNewSyntaxArray.py (1967 of 2110) PASS: lldb-unit :: Utility/./UtilityTests/VMRange.ContainsAddr (1968 of 2110) PASS: lldb-unit :: Language/Highlighting/./HighlighterTests/HighlighterTest.ClangComments (1969 of 2110) PASS: lldb-unit :: Utility/./UtilityTests/StringListTest.SetSize (1970 of 2110) PASS: lldb-unit :: Process/gdb-remote/./ProcessGdbRemoteTests/GDBRemoteClientBaseTest.InterruptNoResponse (1971 of 2110) PASS: lldb-api :: commands/expression/unicode-in-variable/TestUnicodeInVariable.py (1972 of 2110) UNSUPPORTED: lldb-shell :: Unwind/eh-frame-small-fde.test (1973 of 2110) PASS: lldb-unit :: Utility/./UtilityTests/StringExtractorTest.InitEmpty (1974 of 2110) PASS: lldb-unit :: Utility/./UtilityTests/DeserializerTest.HasData (1975 of 2110) PASS: lldb-api :: functionalities/data-formatter/nsdictionarysynth/TestNSDictionarySynthetic.py (1976 of 2110) PASS: lldb-api :: commands/settings/quoting/TestQuoting.py (1977 of 2110) PASS: lldb-shell :: Reproducer/TestWorkingDir.test (1978 of 2110) PASS: lldb-shell :: SymbolFile/DWARF/DW_TAG_variable-DW_AT_const_value.s (1979 of 2110) PASS: lldb-shell :: SymbolFile/NativePDB/globals-fundamental.cpp (1980 of 2110) PASS: lldb-unit :: Utility/./UtilityTests/ArgsTest.DoubleQuotedItem (1981 of 2110) PASS: lldb-unit :: Breakpoint/./LLDBBreakpointTests/BreakpointIDTest.StringIsBreakpointName (1982 of 2110) PASS: lldb-unit :: Utility/./UtilityTests/SharedCluster.ClusterManager (1983 of 2110) PASS: lldb-api :: lang/objc/objc-new-syntax/TestObjCNewSyntaxLiteral.py (1984 of 2110) PASS: lldb-unit :: Symbol/./SymbolTests/PostfixExpression.ParseFPOProgram (1985 of 2110) PASS: lldb-unit :: Utility/./UtilityTests/FileSpecTest.GetPath (1986 of 2110) PASS: lldb-shell :: Quit/TestQuitExitCode0.test (1987 of 2110) PASS: lldb-unit :: ScriptInterpreter/Python/./ScriptInterpreterPythonTests/PythonDataObjectsTest.TestPythonDictionaryToStructuredDictionary (1988 of 2110) PASS: lldb-api :: commands/expression/test/TestExprs.py (1989 of 2110) UNSUPPORTED: lldb-api :: benchmarks/startup/TestStartupDelays.py (1990 of 2110) PASS: lldb-unit :: Symbol/./SymbolTests/TestTypeSystemClang.TestFunctionTemplateInRecordConstruction (1991 of 2110) PASS: lldb-unit :: UnwindAssembly/x86/./UnwindAssemblyx86Tests/Testx86AssemblyInspectionEngine.TestMovRSPtoRBP (1992 of 2110) PASS: lldb-api :: lang/c/local_types/TestUseClosestType.py (1993 of 2110) PASS: lldb-unit :: Utility/./UtilityTests/FileSpecTest.EqualDotsPosix (1994 of 2110) PASS: lldb-unit :: Expression/./ExpressionTests/CppModuleConfigurationTest.AmbiguousLibCpp (1995 of 2110) PASS: lldb-unit :: Utility/./UtilityTests/ArchSpecTest.TestParseMachCPUDashSubtypeTripleSimple (1996 of 2110) PASS: lldb-api :: lang/c/bitfields/TestBitfields.py (1997 of 2110) PASS: lldb-api :: functionalities/data-formatter/data-formatter-stl/libcxx/vbool/TestDataFormatterLibcxxVBool.py (1998 of 2110) PASS: lldb-unit :: SymbolFile/DWARF/./SymbolFileDWARFTests/SymbolFileDWARFTests.ParseArangesNonzeroSegmentSize (1999 of 2110) PASS: lldb-unit :: Utility/./UtilityTests/ArgsTest.TestArgv (2000 of 2110) PASS: lldb-unit :: Host/./HostTests/FileSystemTest.EmptyTest (2001 of 2110) PASS: lldb-api :: functionalities/optimized_code/TestNoASanExceptionAfterEvalOP_piece.py (2002 of 2110) PASS: lldb-unit :: Utility/./UtilityTests/StringListTest.AppendStringCString (2003 of 2110) UNSUPPORTED: lldb-api :: functionalities/tsan/thread_leak/TestTsanThreadLeak.py (2004 of 2110) PASS: lldb-unit :: Core/./LLDBCoreTests/MangledTest.ResultForValidName (2005 of 2110) PASS: lldb-unit :: Utility/./UtilityTests/RangeTest.Constructor (2006 of 2110) PASS: lldb-unit :: Utility/./UtilityTests/XcodeSDKTest.ParseTest (2007 of 2110) UNSUPPORTED: lldb-api :: functionalities/darwin_log/filter/exact_match/activity/TestDarwinLogFilterMatchActivity.py (2008 of 2110) UNSUPPORTED: lldb-shell :: Register/x86-gp-write.test (2009 of 2110) PASS: lldb-unit :: Language/Highlighting/./HighlighterTests/HighlighterTest.ClangTrailingBackslashWithWhitespace (2010 of 2110) PASS: lldb-unit :: Expression/./ExpressionTests/DiagnosticManagerTest.AppendMessageSubsequentDiags (2011 of 2110) PASS: lldb-shell :: SymbolFile/DWARF/dir-separator-windows.s (2012 of 2110) PASS: lldb-shell :: Settings/TestDisableColor.test (2013 of 2110) PASS: lldb-api :: lang/objcxx/class-name-clash/TestNameClash.py (2014 of 2110) PASS: lldb-unit :: Utility/./UtilityTests/StringListTest.JoinEmpty (2015 of 2110) PASS: lldb-unit :: UnwindAssembly/x86/./UnwindAssemblyx86Tests/Testx86AssemblyInspectionEngine.TestSpillRegToStackViaMOVi386 (2016 of 2110) PASS: lldb-api :: commands/expression/static-initializers/TestStaticInitializers.py (2017 of 2110) PASS: lldb-api :: commands/source/info/TestSourceInfo.py (2018 of 2110) UNSUPPORTED: lldb-shell :: ScriptInterpreter/Lua/nested_sessions.test (2019 of 2110) UNSUPPORTED: lldb-api :: lang/cpp/printf/TestPrintf.py (2020 of 2110) PASS: lldb-unit :: Utility/./UtilityTests/StringListTest.InsertStringAtIndexMove (2021 of 2110) PASS: lldb-unit :: ScriptInterpreter/Python/./ScriptInterpreterPythonTests/PythonDataObjectsTest.TestScript (2022 of 2110) PASS: lldb-api :: python_api/sblaunchinfo/TestSBLaunchInfo.py (2023 of 2110) PASS: lldb-shell :: SymbolFile/DWARF/compilercontext.ll (2024 of 2110) PASS: lldb-api :: functionalities/dynamic_value_child_count/TestDynamicValueChildCount.py (2025 of 2110) UNSUPPORTED: lldb-shell :: Register/x86-64-xmm16-write.test (2026 of 2110) PASS: lldb-unit :: Process/minidump/./LLDBMinidumpTests/MinidumpParserTest.GetLinuxProcStatus_no_stream (2027 of 2110) PASS: lldb-unit :: Signals/./SignalsTests/UnixSignalsTest.Iteration (2028 of 2110) PASS: lldb-api :: lang/cpp/diamond/TestDiamond.py (2029 of 2110) PASS: lldb-api :: lang/cpp/extern_c/TestExternCSymbols.py (2030 of 2110) PASS: lldb-api :: lang/c/forward/TestForwardDeclaration.py (2031 of 2110) PASS: lldb-unit :: Utility/./UtilityTests/StringLexerTest.NextIf (2032 of 2110) PASS: lldb-unit :: Utility/./UtilityTests/StringExtractorTest.GetNameColonValueNoColon (2033 of 2110) PASS: lldb-shell :: Reproducer/TestCrash.test (2034 of 2110) PASS: lldb-unit :: SymbolFile/DWARF/./SymbolFileDWARFTests/DWARFASTParserClangTests.EnsureAllDIEsInDeclContextHaveBeenParsedParsesOnlyMatchingEntries (2035 of 2110) PASS: lldb-unit :: Utility/./UtilityTests/ConstStringTest.YAML (2036 of 2110) PASS: lldb-unit :: ObjectFile/PECOFF/./ObjectFilePECOFFTests/PECallFrameInfoTest.Chained_eh (2037 of 2110) PASS: lldb-api :: functionalities/gdb_remote_client/TestTargetXMLArch.py (2038 of 2110) PASS: lldb-api :: functionalities/data-formatter/typedef_array/TestTypedefArray.py (2039 of 2110) PASS: lldb-unit :: Utility/./UtilityTests/StreamTest.PutBytesAsRawHex8ToMixedEndian (2040 of 2110) PASS: lldb-api :: lang/objc/objc-property/TestObjCProperty.py (2041 of 2110) PASS: lldb-api :: lang/cpp/covariant-return-types/TestCovariantReturnTypes.py (2042 of 2110) PASS: lldb-unit :: Utility/./UtilityTests/StringListTest.InsertStringAtIndexOutOfBounds (2043 of 2110) PASS: lldb-api :: lang/objc/self/TestObjCSelf.py (2044 of 2110) PASS: lldb-shell :: ExecControl/StopHook/stop-hook.test (2045 of 2110) PASS: lldb-unit :: Symbol/./SymbolTests/TestTypeSystemClang.TestFunctionTemplateConstruction (2046 of 2110) PASS: lldb-shell :: Reproducer/Functionalities/TestExpressionEvaluation.test (2047 of 2110) PASS: lldb-api :: commands/expression/import-std-module/basic/TestImportStdModule.py (2048 of 2110) PASS: lldb-api :: functionalities/gdb_remote_client/TestArmRegisterDefinition.py (2049 of 2110) PASS: lldb-api :: lang/cpp/wchar_t/TestCxxWCharT.py (2050 of 2110) PASS: lldb-api :: lang/cpp/limit-debug-info/TestWithLimitDebugInfo.py (2051 of 2110) UNSUPPORTED: lldb-shell :: ObjectFile/ELF/minidebuginfo-no-lzma.yaml (2052 of 2110) PASS: lldb-api :: lang/objc/objc-builtin-types/TestObjCBuiltinTypes.py (2053 of 2110) PASS: lldb-api :: commands/expression/namespace_local_var_same_name_cpp_and_c/TestNamespaceLocalVarSameNameCppAndC.py (2054 of 2110) PASS: lldb-unit :: Symbol/./SymbolTests/TestTypeSystemClang.TestBuiltinTypeForEncodingAndBitSize (2055 of 2110) PASS: lldb-api :: functionalities/data-formatter/data-formatter-stl/libstdcpp/unique_ptr/invalid/TestDataFormatterInvalidStdUniquePtr.py (2056 of 2110) UNSUPPORTED: lldb-shell :: Register/x86-64-gp-write.test (2057 of 2110) PASS: lldb-unit :: Process/gdb-remote/./ProcessGdbRemoteTests/GDBRemoteCommunicationClientTest.GetModulesInfo_UUID20 (2058 of 2110) PASS: lldb-unit :: Utility/./UtilityTests/StreamTest.PutCharNull (2059 of 2110) PASS: lldb-unit :: Host/./HostTests/MainLoopTest.DetectsEOF (2060 of 2110) PASS: lldb-shell :: Unwind/trap_frame_sym_ctx.test (2061 of 2110) PASS: lldb-shell :: Breakpoint/debug_rnglist_offset_pair.test (2062 of 2110) PASS: lldb-unit :: Process/minidump/./LLDBMinidumpTests/MinidumpParserTest.GetLinuxProcStatus (2063 of 2110) PASS: lldb-api :: lang/objc/objc-stepping/TestObjCStepping.py (2064 of 2110) PASS: lldb-unit :: Utility/./UtilityTests/AnsiTerminal.AtStart (2065 of 2110) PASS: lldb-unit :: Utility/./UtilityTests/StringListTest.InsertStringAtIndexEnd (2066 of 2110) PASS: lldb-unit :: ScriptInterpreter/Python/./ScriptInterpreterPythonTests/PythonDataObjectsTest.TestPythonCallableCheck (2067 of 2110) PASS: lldb-unit :: Utility/./UtilityTests/UriParserTest.PortOverflow (2068 of 2110) PASS: lldb-unit :: Utility/./UtilityTests/StatusTest.ErrorConversion (2069 of 2110) PASS: lldb-unit :: Utility/./UtilityTests/DataExtractorTest.GetCStrAtNullOffset (2070 of 2110) PASS: lldb-shell :: Register/x86-64-gp-read.test (2071 of 2110) PASS: lldb-unit :: SymbolFile/NativePDB/./SymbolFileNativePDBTests/PDBFPOProgramToDWARFExpressionTests.InvalidAssignmentMultiple (2072 of 2110) PASS: lldb-shell :: SymbolFile/Breakpad/line-table-discontinuous-file-ids.test (2073 of 2110) PASS: lldb-api :: functionalities/unwind/zeroth_frame/TestZerothFrame.py (2074 of 2110) PASS: lldb-unit :: Utility/./UtilityTests/BinaryStreamTest.PutULEB128OneByte (2075 of 2110) PASS: lldb-unit :: Utility/./UtilityTests/RangeDataVector.CustomSort (2076 of 2110) UNSUPPORTED: lldb-api :: commands/expression/macros/TestMacros.py (2077 of 2110) UNSUPPORTED: lldb-api :: functionalities/darwin_log/filter/exact_match/activity-chain/TestDarwinLogFilterMatchActivityChain.py (2078 of 2110) PASS: lldb-api :: macosx/find-dsym/bundle-with-dot-in-filename/TestBundleWithDotInFilename.py (2079 of 2110) PASS: lldb-api :: lang/cpp/constructors/TestCppConstructors.py (2080 of 2110) PASS: lldb-api :: functionalities/gdb_remote_client/TestNoGPacketSupported.py (2081 of 2110) PASS: lldb-api :: tools/lldb-vscode/module/TestVSCode_module.py (2082 of 2110) PASS: lldb-api :: macosx/version_zero/TestGetVersionZeroVersion.py (2083 of 2110) PASS: lldb-unit :: Utility/./UtilityTests/StreamTest.PutRawBytesToMixedEndian (2084 of 2110) PASS: lldb-unit :: Core/./LLDBCoreTests/SourceFileCache.FindSourceFileNotFound (2085 of 2110) UNSUPPORTED: lldb-api :: functionalities/asan/TestReportData.py (2086 of 2110) PASS: lldb-unit :: Utility/./UtilityTests/StreamTest.PutStringAsRawHex8 (2087 of 2110) PASS: lldb-api :: functionalities/data-formatter/data-formatter-stl/libcxx/optional/TestDataFormatterLibcxxOptional.py (2088 of 2110) PASS: lldb-unit :: Utility/./UtilityTests/StreamTest.PutHex32ByteOrderLittle (2089 of 2110) PASS: lldb-api :: functionalities/data-formatter/data-formatter-objc/TestDataFormatterObjCNSError.py (2090 of 2110) PASS: lldb-unit :: Utility/./UtilityTests/UriParserTest.LongPath (2091 of 2110) PASS: lldb-shell :: Breakpoint/case-sensitive.test (2092 of 2110) UNSUPPORTED: lldb-api :: functionalities/data-formatter/data-formatter-stl/libstdcpp/map/TestDataFormatterStdMap.py (2093 of 2110) PASS: lldb-api :: lang/cpp/namespace_conflicts/TestNamespaceConflicts.py (2094 of 2110) PASS: lldb-unit :: Symbol/./SymbolTests/TestTypeSystemClang.TestConvertAccessTypeToAccessSpecifier (2095 of 2110) UNSUPPORTED: lldb-shell :: Register/x86-zmm-write.test (2096 of 2110) PASS: lldb-api :: lang/cpp/call-function/TestCallCPPFunction.py (2097 of 2110) PASS: lldb-unit :: Process/minidump/./LLDBMinidumpTests/MinidumpParserTest.GetMiscInfo_no_stream (2098 of 2110) PASS: lldb-unit :: Utility/./UtilityTests/StreamTest.AddressSize (2099 of 2110) PASS: lldb-api :: python_api/watchpoint/watchlocation/TestSetWatchlocation.py (2100 of 2110) PASS: lldb-unit :: Utility/./UtilityTests/UriParserTest.SchemeHostSeparator3 (2101 of 2110) PASS: lldb-unit :: UnwindAssembly/x86/./UnwindAssemblyx86Tests/Testx86AssemblyInspectionEngine.TestSimple64bitFrameFunction (2102 of 2110) PASS: lldb-shell :: SymbolFile/DWARF/childless-compile-unit.s (2103 of 2110) XFAIL: lldb-shell :: SymbolFile/DWARF/find-type-in-function.cpp (2104 of 2110) PASS: lldb-unit :: Process/gdb-remote/./ProcessGdbRemoteTests/GDBRemoteCommunicationClientTest.WriteRegisterNoSuffix (2105 of 2110) PASS: lldb-unit :: Symbol/./SymbolTests/LineEntryTest.GetSameLineContiguousAddressRangeNoInlines (2106 of 2110) PASS: lldb-unit :: Language/CPlusPlus/./LanguageCPlusPlusTests/CPlusPlusLanguage.CPlusPlusNameParser (2107 of 2110) PASS: lldb-api :: python_api/findvalue_duplist/TestSBFrameFindValue.py (2108 of 2110) PASS: lldb-api :: lang/cpp/namespace/TestNamespaceLookup.py (2109 of 2110) PASS: lldb-api :: lang/objc/hidden-ivars/TestHiddenIvars.py (2110 of 2110) Slowest Tests: -------------------------------------------------------------------------- 650.86s: lldb-api :: tools/lldb-server/TestLldbGdbServer.py 259.53s: lldb-api :: lang/cpp/enum_types/TestCPP11EnumTypes.py 239.83s: lldb-api :: api/multithreaded/TestMultithreaded.py 204.70s: lldb-api :: lang/objc/foundation/TestObjCMethods.py 183.71s: lldb-api :: lang/objc/hidden-ivars/TestHiddenIvars.py 143.82s: lldb-api :: lang/objc/exceptions/TestObjCExceptions.py 138.87s: lldb-api :: lang/objc/objc-new-syntax/TestObjCNewSyntaxLiteral.py 134.35s: lldb-api :: lang/objc/real-definition/TestRealDefinition.py 134.06s: lldb-api :: lang/cpp/namespace/TestNamespaceLookup.py 127.53s: lldb-api :: types/TestLongTypesExpr.py 122.78s: lldb-api :: types/TestIntegerTypeExpr.py 109.53s: lldb-api :: lang/objc/foundation/TestObjCMethodsString.py 107.41s: lldb-api :: lang/objc/foundation/TestObjCMethodsNSError.py 105.26s: lldb-api :: lang/objc/objc-new-syntax/TestObjCNewSyntaxDictionary.py 105.11s: lldb-api :: lang/objc/objc-new-syntax/TestObjCNewSyntaxArray.py 95.64s: lldb-api :: lang/objcxx/objcxx-ivar-vector/TestIvarVector.py 92.15s: lldb-api :: functionalities/gdb_remote_client/TestWasm.py 88.70s: lldb-api :: commands/settings/TestSettings.py 87.81s: lldb-api :: functionalities/data-formatter/compactvectors/TestCompactVectors.py 86.80s: lldb-api :: lang/objc/conflicting-definition/TestConflictingDefinition.py

Hide Details

Tests Times: -------------------------------------------------------------------------- [ Range ] :: [ Percentage ] :: [ Count ] -------------------------------------------------------------------------- [650s,700s) :: [ ] :: [ 1/2110] [600s,650s) :: [ ] :: [ 0/2110] [550s,600s) :: [ ] :: [ 0/2110] [500s,550s) :: [ ] :: [ 0/2110] [450s,500s) :: [ ] :: [ 0/2110] [400s,450s) :: [ ] :: [ 0/2110] [350s,400s) :: [ ] :: [ 0/2110] [300s,350s) :: [ ] :: [ 0/2110] [250s,300s) :: [ ] :: [ 2/2110] [200s,250s) :: [ ] :: [ 1/2110] [150s,200s) :: [ ] :: [ 2/2110] [100s,150s) :: [ ] :: [ 10/2110] [ 50s,100s) :: [* ] :: [ 53/2110] [ 0s, 50s) :: [************************************** ] :: [2041/2110] -------------------------------------------------------------------------- ******************** Failed Tests (3): lldb-api :: python_api/target/TestTargetAPI.py lldb-api :: macosx/simulator/TestSimulatorPlatform.py lldb-api :: macosx/macCatalyst/TestMacCatalyst.py

Hide Details

Hide Details

Testing Time: 4361.12s Unsupported : 182 Passed : 1919 Expectedly Failed: 6 Failed : 3 FAILED: tools/lldb/test/CMakeFiles/check-lldb-lit cd /Users/buildslave/jenkins/workspace/lldb-cmake-sanitized/lldb-build/tools/lldb/test && /usr/local/Frameworks/Python.framework/Versions/3.7/bin/python3.7 /Users/buildslave/jenkins/workspace/lldb-cmake-sanitized/lldb-build/./bin/llvm-lit -v --time-tests --shuffle --xunit-xml-output=/Users/buildslave/jenkins/workspace/lldb-cmake-sanitized/test/results.xml -v -j 4 --timeout 1200 /Users/buildslave/jenkins/workspace/lldb-cmake-sanitized/lldb-build/tools/lldb/test ninja: build stopped: subcommand failed. Command failed: Command '['/usr/bin/env', 'TERM=vt100', '/usr/local/bin/ninja', '-v', 'check-lldb']' returned non-zero exit status 1. Command: ['/usr/bin/env', 'TERM=vt100', '/usr/local/bin/ninja', '-v', 'check-lldb'] [Pipeline] } [Pipeline] // timeout [Pipeline] } [Pipeline] // stage [Pipeline] stage [Pipeline] { (Declarative: Post Actions) [Pipeline] scanForIssues [Clang (LLVM based)] Sleeping for 5 seconds due to JENKINS-32191... [Clang (LLVM based)] Parsing console log (workspace: '/Users/buildslave/jenkins/workspace/lldb-cmake-sanitized') [Clang (LLVM based)] Successfully parsed console log [Clang (LLVM based)] -> found 6 issues (skipped 0 duplicates) [Clang (LLVM based)] Post processing issues on 'green-dragon-23' with source code encoding 'UTF-8' [Clang (LLVM based)] Creating SCM blamer to obtain author and commit information for affected files [Clang (LLVM based)] Creating SCM miner to obtain statistics for affected repository files [Clang (LLVM based)] Resolving file names for all issues in source directory '/Users/buildslave/jenkins/workspace/lldb-cmake-sanitized' [Clang (LLVM based)] -> resolved paths in source directory (3 found, 0 not found) [Clang (LLVM based)] Resolving module names from module definitions (build.xml, pom.xml, or Manifest.mf files) [Clang (LLVM based)] -> resolved module names for 6 issues [Clang (LLVM based)] Resolving package names (or namespaces) by parsing the affected files [Clang (LLVM based)] -> resolved package names of 3 affected files [Clang (LLVM based)] No filter has been set, publishing all 6 issues [Clang (LLVM based)] Creating fingerprints for all affected code blocks to track issues over different builds [Clang (LLVM based)] -> created fingerprints for 6 issues (skipped 0 issues) [Clang (LLVM based)] Copying affected files to Jenkins' build folder '/Users/Shared/Jenkins/Home/jobs/lldb-cmake-sanitized/builds/1699/files-with-issues' [Clang (LLVM based)] -> 3 copied, 0 not in workspace, 0 not-found, 0 with I/O error [Pipeline] junit Recording test results [Pipeline] } [Pipeline] // stage [Pipeline] } [Pipeline] // withEnv [Pipeline] } [Pipeline] // node [Pipeline] End of Pipeline ERROR: script returned exit code 1 Finished: FAILURE