FailedConsole Output

Skipping 33,870 KB.. Full Log
symbol_context_with_address_dwarf/a.out", arch = "x86_64"
CompileUnit: id = {0x00000000}, file = "/Users/buildslave/jenkins/workspace/lldb-cmake-sanitized/llvm-project/lldb/test/API/python_api/target/main.c", language = "unknown"
   Function: id = {0x10000004e}, name = "a", range = [0x0000000100000dd0-0x0000000100000e18)
   FuncType: id = {0x10000004e}, byte-size = 0, decl = main.c:19, compiler_type = "int (int)"
     Blocks: id = {0x10000004e}, range = [0x100000dd0-0x100000e18)
  LineEntry: [0x0000000100000e0f-0x0000000100000e12): /Users/buildslave/jenkins/workspace/lldb-cmake-sanitized/llvm-project/lldb/test/API/python_api/target/main.c:26:12, is_start_of_statement = TRUE
     Symbol: id = {0x00000005}, range = [0x0000000100000dd0-0x0000000100000e20), name="a"

Hide Details

symbol1: id = {0x00000005}, range = [0x0000000100000dd0-0x0000000100000e20), name="a"

Hide Details

symbol2: id = {0x00000005}, range = [0x0000000100000dd0-0x0000000100000e20), name="a"

Hide Details

<bound method SBProcess.Kill of <lldb.SBProcess; proxy of <Swig Object of type 'lldb::SBProcess *' at 0x11324ecf0> >>: success

Hide Details

PASS: LLDB (/Users/buildslave/jenkins/workspace/lldb-cmake-sanitized/lldb-build/bin/clang-x86_64) :: test_resolve_symbol_context_with_address_dwarf (TestTargetAPI.TargetAPITestCase) UNSUPPORTED: LLDB (/Users/buildslave/jenkins/workspace/lldb-cmake-sanitized/lldb-build/bin/clang-x86_64) :: test_resolve_symbol_context_with_address_dwo (TestTargetAPI.TargetAPITestCase) (test case does not fall in any category of interest for this run) runCmd: settings clear -all output:

Hide Details

runCmd: settings set symbols.enable-external-lookup false output:

Hide Details

runCmd: settings set target.inherit-tcc true output:

Hide Details

runCmd: settings set target.auto-apply-fixits false output:

Hide Details

runCmd: settings set plugin.process.gdb-remote.packet-timeout 60 output:

Hide Details

runCmd: settings set symbols.clang-modules-cache-path "/Users/buildslave/jenkins/workspace/lldb-cmake-sanitized/lldb-build/lldb-test-build.noindex/module-cache-lldb/lldb-api" output:

Hide Details

runCmd: settings set use-color false output:

Hide Details

runCmd: setting set target.prefer-dynamic-value no-dynamic-values output:

Hide Details

runCmd: settings set target.env-vars ASAN_OPTIONS=detect_stack_use_after_return=1 DYLD_INSERT_LIBRARIES=/Users/buildslave/jenkins/workspace/lldb-cmake-sanitized/host-compiler/lib/clang/12.0.0/lib/darwin/libclang_rt.asan_osx_dynamic.dylib output:

Hide Details

breakpoint1: SBBreakpoint: id = 1, file = 'main.c', line = 21, exact_match = 0, locations = 1

Hide Details

breakpoint2: SBBreakpoint: id = 2, file = 'main.c', line = 26, exact_match = 0, locations = 1

Hide Details

address1: a.out`a + 11 at main.c:21:13

Hide Details

address2: a.out`a + 63 at main.c:26:12

Hide Details

context1: Module: file = "/Users/buildslave/jenkins/workspace/lldb-cmake-sanitized/lldb-build/lldb-test-build.noindex/python_api/target/TestTargetAPI.test_resolve_symbol_context_with_address_gmodules/a.out", arch = "x86_64" CompileUnit: id = {0x00000000}, file = "/Users/buildslave/jenkins/workspace/lldb-cmake-sanitized/llvm-project/lldb/test/API/python_api/target/main.c", language = "unknown" Function: id = {0x100000072}, name = "a", range = [0x0000000100000dd0-0x0000000100000e18) FuncType: id = {0x100000072}, byte-size = 0, decl = main.c:19, compiler_type = "int (int)" Blocks: id = {0x100000072}, range = [0x100000dd0-0x100000e18) LineEntry: [0x0000000100000ddb-0x0000000100000ddf): /Users/buildslave/jenkins/workspace/lldb-cmake-sanitized/llvm-project/lldb/test/API/python_api/target/main.c:21:13, is_start_of_statement = TRUE, is_prologue_end = TRUE Symbol: id = {0x00000005}, range = [0x0000000100000dd0-0x0000000100000e20), name="a"

Hide Details

context2: Module: file = "/Users/buildslave/jenkins/workspace/lldb-cmake-sanitized/lldb-build/lldb-test-build.noindex/python_api/target/TestTargetAPI.test_resolve_symbol_context_with_address_gmodules/a.out", arch = "x86_64" CompileUnit: id = {0x00000000}, file = "/Users/buildslave/jenkins/workspace/lldb-cmake-sanitized/llvm-project/lldb/test/API/python_api/target/main.c", language = "unknown" Function: id = {0x100000072}, name = "a", range = [0x0000000100000dd0-0x0000000100000e18) FuncType: id = {0x100000072}, byte-size = 0, decl = main.c:19, compiler_type = "int (int)" Blocks: id = {0x100000072}, range = [0x100000dd0-0x100000e18) LineEntry: [0x0000000100000e0f-0x0000000100000e12): /Users/buildslave/jenkins/workspace/lldb-cmake-sanitized/llvm-project/lldb/test/API/python_api/target/main.c:26:12, is_start_of_statement = TRUE Symbol: id = {0x00000005}, range = [0x0000000100000dd0-0x0000000100000e20), name="a"

Hide Details

symbol1: id = {0x00000005}, range = [0x0000000100000dd0-0x0000000100000e20), name="a"

Hide Details

symbol2: id = {0x00000005}, range = [0x0000000100000dd0-0x0000000100000e20), name="a"

Hide Details

<bound method SBProcess.Kill of <lldb.SBProcess; proxy of <Swig Object of type 'lldb::SBProcess *' at 0x1139471e0> >>: success

Hide Details

PASS: LLDB (/Users/buildslave/jenkins/workspace/lldb-cmake-sanitized/lldb-build/bin/clang-x86_64) :: test_resolve_symbol_context_with_address_gmodules (TestTargetAPI.TargetAPITestCase) Restore dir to: /Users/buildslave/jenkins/workspace/lldb-cmake-sanitized/lldb-build/tools/lldb/test ====================================================================== FAIL: test_launch_simple (TestTargetAPI.TargetAPITestCase) ---------------------------------------------------------------------- Traceback (most recent call last): File "/Users/buildslave/jenkins/workspace/lldb-cmake-sanitized/llvm-project/lldb/packages/Python/lldbsuite/test/decorators.py", line 135, in wrapper return func(*args, **kwargs) File "/Users/buildslave/jenkins/workspace/lldb-cmake-sanitized/llvm-project/lldb/packages/Python/lldbsuite/test/decorators.py", line 345, in wrapper return func(self, *args, **kwargs) File "/Users/buildslave/jenkins/workspace/lldb-cmake-sanitized/llvm-project/lldb/test/API/python_api/target/TestTargetAPI.py", line 172, in test_launch_simple self.assertEqual(process.GetState(), lldb.eStateExited) AssertionError: 0 != 10 Config=x86_64-/Users/buildslave/jenkins/workspace/lldb-cmake-sanitized/lldb-build/bin/clang ---------------------------------------------------------------------- Ran 42 tests in 56.610s

Hide Details

RESULT: FAILED (31 passes, 1 failures, 0 errors, 10 skipped, 0 expected failures, 0 unexpected successes)

Hide Details

--

Hide Details

******************** PASS: lldb-shell :: Commands/command-thread-select.test (942 of 2110) PASS: lldb-api :: lang/objc/modules-auto-import/TestModulesAutoImport.py (943 of 2110) PASS: lldb-api :: lang/objc/conflicting-definition/TestConflictingDefinition.py (944 of 2110) UNSUPPORTED: lldb-shell :: Minidump/Windows/arm-fp-unwind.test (945 of 2110) PASS: lldb-api :: functionalities/postmortem/netbsd-core/TestNetBSDCore.py (946 of 2110) UNSUPPORTED: lldb-api :: benchmarks/frame_variable/TestFrameVariableResponse.py (947 of 2110) PASS: lldb-unit :: Utility/./UtilityTests/RangeTest.LessThan (948 of 2110) PASS: lldb-api :: lang/c/blocks/TestBlocks.py (949 of 2110) PASS: lldb-api :: functionalities/data-formatter/data-formatter-stl/libstdcpp/unique_ptr/invalid/TestDataFormatterInvalidStdUniquePtr.py (950 of 2110) PASS: lldb-unit :: Process/./ProcessEventDataTests/ProcessEventDataTest.ShouldStop (951 of 2110) PASS: lldb-api :: commands/expression/issue_11588/Test11588.py (952 of 2110) PASS: lldb-api :: lang/objc/bitfield_ivars/TestBitfieldIvars.py (953 of 2110) PASS: lldb-unit :: Utility/./UtilityTests/RangeTest.LessThanInvalid (954 of 2110) PASS: lldb-unit :: ObjectFile/Breakpad/./ObjectFileBreakpadTests/FuncRecord.parse (955 of 2110) PASS: lldb-unit :: Utility/./UtilityTests/StringExtractorTest.GetU64LittleEndian (956 of 2110) PASS: lldb-unit :: DataFormatter/./LLDBFormatterTests/TypeMatcherTests.GetMatchStringExactName (957 of 2110) PASS: lldb-unit :: Utility/./UtilityTests/RangeTest.ContainsAddr (958 of 2110) PASS: lldb-unit :: Expression/./ExpressionTests/DiagnosticManagerTest.GetStringSeverityLabels (959 of 2110) PASS: lldb-unit :: Utility/./UtilityTests/StringExtractorTest.GetHexBytesAvail_Underflow (960 of 2110) PASS: lldb-unit :: ScriptInterpreter/Python/./ScriptInterpreterPythonTests/PythonDataObjectsTest.TestPythonIntegerToStructuredInteger (961 of 2110) PASS: lldb-api :: functionalities/inferior-crashing/recursive-inferior/TestRecursiveInferiorStep.py (962 of 2110) PASS: lldb-api :: lang/c/stepping/TestStepAndBreakpoints.py (963 of 2110) PASS: lldb-shell :: SymbolFile/DWARF/debug-line-basic.s (964 of 2110) PASS: lldb-unit :: UnwindAssembly/x86/./UnwindAssemblyx86Tests/Testx86AssemblyInspectionEngine.TestSimple64bitFrameFunction (965 of 2110) PASS: lldb-unit :: Utility/./UtilityTests/CompletionRequest.TestCompletionOwnership (966 of 2110) PASS: lldb-shell :: SymbolFile/Breakpad/unwind-via-stack-cfi.test (967 of 2110) PASS: lldb-unit :: Utility/./UtilityTests/StringExtractorTest.DecodeHexU8_InvalidHex (968 of 2110) PASS: lldb-unit :: Utility/./UtilityTests/SubsystemRAIITest.SubsystemWithErrorSuccess (969 of 2110) UNSUPPORTED: lldb-api :: commands/expression/multiline-completion/TestMultilineCompletion.py (970 of 2110) PASS: lldb-shell :: ObjectFile/PECOFF/sections-names.yaml (971 of 2110) PASS: lldb-api :: functionalities/testid/TestTestId.py (972 of 2110) PASS: lldb-unit :: Process/gdb-remote/./ProcessGdbRemoteTests/GDBRemoteCommunicationClientTest.WriteRegisterNoSuffix (973 of 2110) PASS: lldb-unit :: Utility/./UtilityTests/RangeTest.Constructor (974 of 2110) PASS: lldb-api :: macosx/DBGSourcePathRemapping/TestDSYMSourcePathRemapping.py (975 of 2110) PASS: lldb-unit :: Utility/./UtilityTests/NameMatchesTest.Contains (976 of 2110) PASS: lldb-api :: tools/lldb-server/inferior-crash/TestGdbRemoteSegFault.py (977 of 2110) PASS: lldb-unit :: Utility/./UtilityTests/StringExtractorTest.GetHexU8_Exact_NoEof (978 of 2110) PASS: lldb-unit :: ScriptInterpreter/Python/./ScriptInterpreterPythonTests/PythonDataObjectsTest.TestPythonStringToStructuredString (979 of 2110) PASS: lldb-unit :: DataFormatter/./LLDBFormatterTests/TypeMatcherTests.RegexName (980 of 2110) PASS: lldb-api :: functionalities/data-formatter/data-formatter-synth/TestDataFormatterSynth.py (981 of 2110) PASS: lldb-api :: commands/command/script/TestCommandScript.py (982 of 2110) PASS: lldb-api :: functionalities/data-formatter/ptr_ref_typedef/TestPtrRef2Typedef.py (983 of 2110) PASS: lldb-unit :: Host/./HostTests/NativeProcessProtocolTest.ReadCStringFromMemory (984 of 2110) PASS: lldb-shell :: Quit/TestQuitExitCodeHex0.test (985 of 2110) PASS: lldb-shell :: SymbolFile/DWARF/debug-types-missing-signature.test (986 of 2110) PASS: lldb-shell :: Minidump/Windows/find-module.test (987 of 2110) PASS: lldb-api :: lang/objc/direct-dispatch-step/TestObjCDirectDispatchStepping.py (988 of 2110) PASS: lldb-api :: functionalities/data-formatter/frameformat_smallstruct/TestFrameFormatSmallStruct.py (989 of 2110) PASS: lldb-api :: lang/objc/objc-new-syntax/TestObjCNewSyntaxArray.py (990 of 2110) PASS: lldb-unit :: Process/gdb-remote/./ProcessGdbRemoteTests/GDBRemoteCommunicationClientTest.SendSignalsToIgnore (991 of 2110) PASS: lldb-unit :: Utility/./UtilityTests/BinaryStreamTest.PutSLEB128SixBytes (992 of 2110) PASS: lldb-api :: functionalities/breakpoint/global_constructor/TestBreakpointInGlobalConstructor.py (993 of 2110) PASS: lldb-shell :: SymbolFile/DWARF/DW_TAG_variable-DW_AT_const_value.s (994 of 2110) PASS: lldb-api :: functionalities/gdb_remote_client/TestNestedRegDefinitions.py (995 of 2110) PASS: lldb-api :: functionalities/data-formatter/data-formatter-objc/TestDataFormatterObjCNSError.py (996 of 2110) PASS: lldb-unit :: Symbol/./SymbolTests/TestTypeSystemClang.TestGetEnumIntegerTypeBasicTypes (997 of 2110) UNSUPPORTED: lldb-shell :: ObjectFile/ELF/minidebuginfo-no-lzma.yaml (998 of 2110) PASS: lldb-api :: python_api/frame/inlines/TestInlinedFrame.py (999 of 2110) UNSUPPORTED: lldb-shell :: SymbolFile/DWARF/debug-types-expressions.test (1000 of 2110) PASS: lldb-unit :: Utility/./UtilityTests/RegularExpression.Valid (1001 of 2110) PASS: lldb-unit :: UnwindAssembly/x86/./UnwindAssemblyx86Tests/Testx86AssemblyInspectionEngine.TestPopR15 (1002 of 2110) PASS: lldb-shell :: SymbolFile/DWARF/dwarf5-debug_line.s (1003 of 2110) PASS: lldb-api :: lang/objc/objc-dyn-sbtype/TestObjCDynamicSBType.py (1004 of 2110) PASS: lldb-shell :: Breakpoint/debug_rnglistx_rlex.test (1005 of 2110) PASS: lldb-api :: functionalities/tail_call_frames/disambiguate_paths_to_common_sink/TestDisambiguatePathsToCommonSink.py (1006 of 2110) PASS: lldb-api :: functionalities/postmortem/elf-core/thread_crash/TestLinuxCoreThreads.py (1007 of 2110) PASS: lldb-shell :: Quit/TestQuitExitCode0.test (1008 of 2110) PASS: lldb-unit :: Utility/./UtilityTests/StateTest.Formatv (1009 of 2110) PASS: lldb-unit :: Utility/./UtilityTests/StreamTest.AddressPrefix (1010 of 2110) PASS: lldb-shell :: ObjectFile/PECOFF/basic-info.yaml (1011 of 2110) PASS: lldb-unit :: Utility/./UtilityTests/ArgsTest.ReplaceArgumentAtIndexEqual (1012 of 2110) PASS: lldb-shell :: Commands/command-regex-unalias.test (1013 of 2110) PASS: lldb-api :: commands/expression/calculator_mode/TestCalculatorMode.py (1014 of 2110) UNSUPPORTED: lldb-api :: python_api/disassemble-raw-data/TestDisassemble_VST1_64.py (1015 of 2110) PASS: lldb-unit :: Process/gdb-remote/./ProcessGdbRemoteTests/GDBRemoteCommunicationClientTest.GetModulesInfo (1016 of 2110) PASS: lldb-api :: tools/lldb-server/TestGdbRemoteExpeditedRegisters.py (1017 of 2110) PASS: lldb-shell :: ObjectFile/PECOFF/basic-info-arm.yaml (1018 of 2110) PASS: lldb-api :: functionalities/tail_call_frames/disambiguate_tail_call_seq/TestDisambiguateTailCallSeq.py (1019 of 2110) PASS: lldb-shell :: SymbolFile/DWARF/dwarf5_locations.s (1020 of 2110) PASS: lldb-api :: functionalities/thread/exit_during_expression/TestExitDuringExpression.py (1021 of 2110) PASS: lldb-unit :: Utility/./UtilityTests/StreamTeeTest.DefaultConstructor (1022 of 2110) PASS: lldb-unit :: ScriptInterpreter/Python/./ScriptInterpreterPythonTests/PythonDataObjectsTest.TestExtractingUInt64ThroughStructuredData (1023 of 2110) PASS: lldb-shell :: ScriptInterpreter/None/none.test (1024 of 2110) PASS: lldb-unit :: Utility/./UtilityTests/OptionsWithRawTest.EmptySuffixSingleWhitespace (1025 of 2110) PASS: lldb-api :: lang/cpp/template/TestTemplateArgs.py (1026 of 2110) PASS: lldb-unit :: Process/gdb-remote/./ProcessGdbRemoteTests/GDBRemoteCommunicationClientTest.GetModulesInfoInvalidResponse (1027 of 2110) PASS: lldb-api :: functionalities/show_location/TestShowLocationDwarf5.py (1028 of 2110) PASS: lldb-unit :: Utility/./UtilityTests/StreamTest.PutHex8 (1029 of 2110) PASS: lldb-unit :: Utility/./UtilityTests/CompletionRequest.TryCompleteCurrentArgBad (1030 of 2110) PASS: lldb-unit :: Utility/./UtilityTests/StringListTest.PopBack (1031 of 2110) PASS: lldb-shell :: Breakpoint/split-dwarf5-debug-stroffsets.test (1032 of 2110) PASS: lldb-api :: functionalities/thread/concurrent_events/TestConcurrentTwoWatchpointThreads.py (1033 of 2110) PASS: lldb-shell :: SymbolFile/DWARF/find-variable-dwo.cpp (1034 of 2110) PASS: lldb-unit :: Utility/./UtilityTests/Predicate.WaitForValueNotEqualTo (1035 of 2110) UNSUPPORTED: lldb-shell :: Register/x86-ymm-read.test (1036 of 2110) PASS: lldb-api :: functionalities/data-formatter/data-formatter-stl/libcxx/queue/TestDataFormatterLibcxxQueue.py (1037 of 2110) PASS: lldb-unit :: Expression/./ExpressionTests/DWARFExpression.DW_OP_convert (1038 of 2110) PASS: lldb-unit :: Utility/./UtilityTests/EnvironmentTest.EnvpConversion (1039 of 2110) PASS: lldb-shell :: ScriptInterpreter/Python/sb_address_exception.test (1040 of 2110) PASS: lldb-unit :: Utility/./UtilityTests/ReproducerTest.SetReplay (1041 of 2110) UNSUPPORTED: lldb-api :: lang/cpp/static_members/TestCPPStaticMembers.py (1042 of 2110) PASS: lldb-unit :: Utility/./UtilityTests/OptionsWithRawTest.EmptyInput (1043 of 2110) PASS: lldb-unit :: Symbol/./SymbolTests/TestTypeSystemClang.TestRecordHasFields (1044 of 2110) PASS: lldb-unit :: tools/lldb-server/tests/./LLDBServerTests/TestBase.LaunchModePreservesEnvironment (1045 of 2110) PASS: lldb-shell :: BuildScript/modes.test (1046 of 2110) PASS: lldb-api :: tools/lldb-server/commandline/TestStubReverseConnect.py (1047 of 2110) UNSUPPORTED: lldb-api :: commands/expression/completion-crash-invalid-iterator/TestInvalidIteratorCompletionCrash.py (1048 of 2110) PASS: lldb-unit :: Expression/./ExpressionTests/CppModuleConfigurationTest.Xcode (1049 of 2110) PASS: lldb-unit :: Utility/./UtilityTests/StringListTest.ForRange (1050 of 2110) PASS: lldb-api :: functionalities/data-formatter/hexcaps/TestDataFormatterHexCaps.py (1051 of 2110) PASS: lldb-api :: tools/lldb-vscode/console/TestVSCode_console.py (1052 of 2110) PASS: lldb-unit :: Host/./HostTests/MainLoopTest.ReadObject (1053 of 2110) PASS: lldb-api :: tools/lldb-server/TestLldbGdbServer.py (1054 of 2110) PASS: lldb-api :: python_api/lldbutil/process/TestPrintStackTraces.py (1055 of 2110) PASS: lldb-unit :: Process/minidump/./LLDBMinidumpTests/MinidumpParserTest.GetMemoryRegionInfoFromMemory64List (1056 of 2110) PASS: lldb-unit :: ScriptInterpreter/Python/./ScriptInterpreterPythonTests/PythonDataObjectsTest.TestPythonTupleSize (1057 of 2110) PASS: lldb-api :: python_api/watchpoint/TestSetWatchpoint.py (1058 of 2110) PASS: lldb-api :: tools/lldb-server/TestGdbRemoteThreadsInStopReply.py (1059 of 2110) UNSUPPORTED: lldb-api :: functionalities/ubsan/user-expression/TestUbsanUserExpression.py (1060 of 2110) PASS: lldb-unit :: Symbol/./SymbolTests/TestTypeSystemClang.TestGetTypeClassTypeOfExpr (1061 of 2110) PASS: lldb-api :: functionalities/data-formatter/data-formatter-stl/libcxx/iterator/TestDataFormatterLibccIterator.py (1062 of 2110) PASS: lldb-unit :: Utility/./UtilityTests/ArchSpecTest.TestSetTriple (1063 of 2110) PASS: lldb-unit :: Utility/./UtilityTests/UriParserTest.BracketedHostname (1064 of 2110) PASS: lldb-unit :: Utility/./UtilityTests/StringExtractorTest.GetU32LittleEndian (1065 of 2110) PASS: lldb-api :: commands/settings/TestSettings.py (1066 of 2110) PASS: lldb-unit :: Host/./HostTests/SocketTest.DecodeHostAndPort (1067 of 2110) PASS: lldb-api :: macosx/version_zero/TestGetVersionZeroVersion.py (1068 of 2110) PASS: lldb-api :: lang/objc/objc-new-syntax/TestObjCNewSyntaxDictionary.py (1069 of 2110) PASS: lldb-api :: functionalities/thread/concurrent_events/TestConcurrentDelayWatchBreak.py (1070 of 2110) PASS: lldb-unit :: ObjectFile/Breakpad/./ObjectFileBreakpadTests/Record.classify (1071 of 2110) PASS: lldb-api :: functionalities/thread/concurrent_events/TestConcurrentNWatchNBreak.py (1072 of 2110) PASS: lldb-api :: functionalities/thread/create_after_attach/TestCreateAfterAttach.py (1073 of 2110) PASS: lldb-unit :: Symbol/./SymbolTests/TestTypeSystemClang.TestDisplayName (1074 of 2110) PASS: lldb-api :: functionalities/breakpoint/breakpoint_options/TestBreakpointOptions.py (1075 of 2110) UNSUPPORTED: lldb-api :: functionalities/tsan/thread_numbers/TestTsanThreadNumbers.py (1076 of 2110) PASS: lldb-api :: commands/expression/char/TestExprsChar.py (1077 of 2110) PASS: lldb-shell :: ObjectFile/Breakpad/sections.test (1078 of 2110) PASS: lldb-shell :: ObjectFile/MachO/symtab.yaml (1079 of 2110) PASS: lldb-api :: functionalities/gdb_remote_client/TestGDBRemoteLoad.py (1080 of 2110) PASS: lldb-unit :: Target/./TargetTests/ModuleCacheTest.GetAndPut (1081 of 2110) UNSUPPORTED: lldb-shell :: SymbolFile/PDB/function-level-linking.test (1082 of 2110) PASS: lldb-unit :: Core/./LLDBCoreTests/RichManglingContextTest.Basic (1083 of 2110) PASS: lldb-unit :: Utility/./UtilityTests/ScalarTest.Promotion (1084 of 2110) PASS: lldb-api :: lang/c/stepping/TestThreadStepping.py (1085 of 2110) PASS: lldb-shell :: Quit/TestQuitExitCodeTooManyArgs.test (1086 of 2110) PASS: lldb-unit :: UnwindAssembly/x86/./UnwindAssemblyx86Tests/Testx86AssemblyInspectionEngine.Test64bitFramelessSmallStackFrame (1087 of 2110) PASS: lldb-api :: functionalities/thread/concurrent_events/TestConcurrentTwoWatchpointsOneBreakpoint.py (1088 of 2110) PASS: lldb-api :: functionalities/return-value/TestReturnValue.py (1089 of 2110) PASS: lldb-unit :: Utility/./UtilityTests/SerializationRountripTest.SerializeDeserializeCStringArrayNullptr (1090 of 2110) PASS: lldb-api :: commands/expression/po_verbosity/TestPoVerbosity.py (1091 of 2110) PASS: lldb-unit :: ScriptInterpreter/Python/./ScriptInterpreterPythonTests/PythonDataObjectsTest.TestObjectAttributes (1092 of 2110) PASS: lldb-unit :: Core/./LLDBCoreTests/RichManglingContextTest.IPDRealloc (1093 of 2110) PASS: lldb-api :: python_api/frame/TestFrames.py (1094 of 2110) PASS: lldb-unit :: UnwindAssembly/x86/./UnwindAssemblyx86Tests/Testx86AssemblyInspectionEngine.TestStackRealignMSVC_i386 (1095 of 2110) PASS: lldb-unit :: Utility/./UtilityTests/PassiveReplayTest.InstrumentedFoo (1096 of 2110) PASS: lldb-unit :: Utility/./UtilityTests/LogTest.LLDB_LOG_nullptr (1097 of 2110) PASS: lldb-shell :: Driver/TestPositionalArgs.test (1098 of 2110) UNSUPPORTED: lldb-api :: benchmarks/turnaround/TestCompileRunToBreakpointTurnaround.py (1099 of 2110) PASS: lldb-api :: functionalities/gdb_remote_client/TestRegDefinitionInParts.py (1100 of 2110) PASS: lldb-api :: functionalities/breakpoint/debugbreak/TestDebugBreak.py (1101 of 2110) PASS: lldb-unit :: Utility/./UtilityTests/StreamTeeTest.GetStreamAtIndexOutOfBounds (1102 of 2110) PASS: lldb-unit :: UnwindAssembly/x86/./UnwindAssemblyx86Tests/Testx86AssemblyInspectionEngine.TestPushEDX (1103 of 2110) PASS: lldb-shell :: SymbolFile/DWARF/debug_rnglists.s (1104 of 2110) PASS: lldb-api :: macosx/thread_suspend/TestInternalThreadSuspension.py (1105 of 2110) PASS: lldb-unit :: Symbol/./SymbolTests/TestTypeSystemClang.TestBuiltinTypeForEncodingAndBitSize (1106 of 2110) PASS: lldb-unit :: Utility/./UtilityTests/ScalarTest.Division (1107 of 2110) PASS: lldb-api :: lang/cpp/std-function-step-into-callable/TestStdFunctionStepIntoCallable.py (1108 of 2110) PASS: lldb-unit :: Core/./LLDBCoreTests/UniqueCStringMap.NoDefaultConstructor (1109 of 2110) PASS: lldb-api :: functionalities/process_group/TestChangeProcessGroup.py (1110 of 2110) PASS: lldb-api :: python_api/sbenvironment/TestSBEnvironment.py (1111 of 2110) PASS: lldb-api :: tools/lldb-server/TestGdbRemoteHostInfo.py (1112 of 2110) UNSUPPORTED: lldb-api :: commands/gui/basicdebug/TestGuiBasicDebug.py (1113 of 2110) PASS: lldb-unit :: Symbol/./SymbolTests/DWARFCallFrameInfoTest.Basic_dwarf4 (1114 of 2110) UNSUPPORTED: lldb-api :: functionalities/unwind/ehframe/TestEhFrameUnwind.py (1115 of 2110) PASS: lldb-api :: lang/objc/objc-struct-argument/TestObjCStructArgument.py (1116 of 2110) UNSUPPORTED: lldb-shell :: ScriptInterpreter/Lua/bindings.test (1117 of 2110) PASS: lldb-api :: functionalities/data-formatter/data-formatter-objc/TestDataFormatterObjCNSContainer.py (1118 of 2110) PASS: lldb-api :: functionalities/optimized_code/TestNoASanExceptionAfterEvalOP_piece.py (1119 of 2110) PASS: lldb-api :: lang/c/vla/TestVLA.py (1120 of 2110) PASS: lldb-unit :: Utility/./UtilityTests/SubsystemRAIITest.NormalSubsystem (1121 of 2110) PASS: lldb-shell :: Reproducer/TestWorkingDir.test (1122 of 2110) PASS: lldb-unit :: Symbol/./SymbolTests/TestTypeSystemClang.TemplateArguments (1123 of 2110) PASS: lldb-unit :: Utility/./UtilityTests/NameMatchesTest.Equals (1124 of 2110) PASS: lldb-shell :: Breakpoint/jitbp_elf.test (1125 of 2110) PASS: lldb-api :: python_api/watchpoint/TestWatchpointIter.py (1126 of 2110) PASS: lldb-unit :: Utility/./UtilityTests/StringExtractorTest.GetHexBytes (1127 of 2110) PASS: lldb-unit :: Utility/./UtilityTests/RangeTest.DoesAdjoinOrIntersect (1128 of 2110) PASS: lldb-api :: lang/cpp/enum_types/TestCPP11EnumTypes.py (1129 of 2110) PASS: lldb-api :: functionalities/thread/concurrent_events/TestConcurrentWatchBreak.py (1130 of 2110) PASS: lldb-shell :: ObjectFile/ELF/basic-info.yaml (1131 of 2110) PASS: lldb-unit :: SymbolFile/NativePDB/./SymbolFileNativePDBTests/PDBFPOProgramToDWARFExpressionTests.UnresolvedCyclicRegisterAssignmentReference (1132 of 2110) PASS: lldb-unit :: Utility/./UtilityTests/StringListTest.GetMaxStringLengthEqualSize (1133 of 2110) PASS: lldb-api :: lang/cpp/bool/TestCPPBool.py (1134 of 2110) PASS: lldb-api :: functionalities/postmortem/elf-core/TestLinuxCore.py (1135 of 2110) PASS: lldb-api :: functionalities/data-formatter/data-formatter-objc/TestDataFormatterObjCNSURL.py (1136 of 2110) PASS: lldb-api :: functionalities/thread/jump/TestThreadJump.py (1137 of 2110) PASS: lldb-unit :: Symbol/./SymbolTests/TestTypeSystemClang.TestOwningModule (1138 of 2110) PASS: lldb-unit :: ScriptInterpreter/Python/./ScriptInterpreterPythonTests/PythonDataObjectsTest.TestBorrowedReferences (1139 of 2110) PASS: lldb-unit :: Utility/./UtilityTests/StringListTest.DefaultConstructor (1140 of 2110) PASS: lldb-unit :: Utility/./UtilityTests/UriParserTest.SchemeHostSeparator2 (1141 of 2110) PASS: lldb-api :: functionalities/thread/concurrent_events/TestConcurrentSignalNWatchNBreak.py (1142 of 2110) PASS: lldb-api :: functionalities/deleted-executable/TestDeletedExecutable.py (1143 of 2110) PASS: lldb-api :: python_api/watchpoint/condition/TestWatchpointConditionAPI.py (1144 of 2110) PASS: lldb-unit :: Process/gdb-remote/./ProcessGdbRemoteTests/GDBRemoteCommunicationClientTest.WriteRegister (1145 of 2110) PASS: lldb-api :: commands/frame/diagnose/dereference-function-return/TestDiagnoseDereferenceFunctionReturn.py (1146 of 2110) PASS: lldb-unit :: Expression/./ExpressionTests/ClangHostTest.ComputeClangResourceDirectory (1147 of 2110) PASS: lldb-unit :: Utility/./UtilityTests/ListenerTest.GetEventWait (1148 of 2110) PASS: lldb-unit :: Language/CPlusPlus/./LanguageCPlusPlusTests/CPlusPlusLanguage.FindAlternateFunctionManglings (1149 of 2110) PASS: lldb-api :: commands/target/select/TestTargetSelect.py (1150 of 2110) PASS: lldb-api :: lang/objc/real-definition/TestRealDefinition.py (1151 of 2110) PASS: lldb-api :: functionalities/multiword-commands/TestMultiWordCommands.py (1152 of 2110) PASS: lldb-api :: commands/target/basic/TestTargetCommand.py (1153 of 2110) PASS: lldb-unit :: Expression/./ExpressionTests/DiagnosticManagerTest.GetStringNoDiags (1154 of 2110) PASS: lldb-unit :: Utility/./UtilityTests/ConstStringTest.CompareConstString (1155 of 2110) PASS: lldb-unit :: Language/Highlighting/./HighlighterTests/HighlighterTest.ClangCursorPosAfterOtherToken (1156 of 2110) PASS: lldb-unit :: Utility/./UtilityTests/FileSpecTest.EqualDotsPosix (1157 of 2110) PASS: lldb-api :: functionalities/breakpoint/breakpoint_ignore_count/TestBreakpointIgnoreCount.py (1158 of 2110) PASS: lldb-api :: commands/expression/import-std-module/queue/TestQueueFromStdModule.py (1159 of 2110) PASS: lldb-unit :: Host/./HostTests/MainLoopTest.UnmonitoredSignal (1160 of 2110) PASS: lldb-api :: lang/objc/print-obj/TestPrintObj.py (1161 of 2110) PASS: lldb-unit :: Utility/./UtilityTests/StringExtractorTest.GetU64BigEndian (1162 of 2110) PASS: lldb-unit :: Utility/./UtilityTests/RangeTest.SetRangeBase (1163 of 2110) PASS: lldb-shell :: ScriptInterpreter/Python/scripted_breakpoint.test (1164 of 2110) PASS: lldb-unit :: DataFormatter/./LLDBFormatterTests/StringPrinterTests.CxxUTF8 (1165 of 2110) PASS: lldb-unit :: Utility/./UtilityTests/PassiveReplayTest.InstrumentedBar (1166 of 2110) PASS: lldb-api :: commands/expression/import-std-module/deque-dbg-info-content/TestDbgInfoContentDequeFromStdModule.py (1167 of 2110) PASS: lldb-unit :: Core/./LLDBCoreTests/MangledTest.ResultForValidName (1168 of 2110) PASS: lldb-api :: lang/cpp/stl/TestSTL.py (1169 of 2110) PASS: lldb-api :: python_api/watchpoint/watchlocation/TestTargetWatchAddress.py (1170 of 2110) PASS: lldb-unit :: Utility/./UtilityTests/StringListTest.Clear (1171 of 2110) PASS: lldb-api :: lang/cpp/namespace_conflicts/TestNamespaceConflicts.py (1172 of 2110) PASS: lldb-unit :: DataFormatter/./LLDBFormatterTests/TypeMatcherTests.RegexMatchPart (1173 of 2110) PASS: lldb-api :: commands/expression/inline-namespace/TestInlineNamespace.py (1174 of 2110) PASS: lldb-api :: functionalities/dlopen_other_executable/TestDlopenOtherExecutable.py (1175 of 2110) PASS: lldb-unit :: Utility/./UtilityTests/UriParserTest.MinimalPath (1176 of 2110) PASS: lldb-api :: macosx/add-dsym/TestAddDsymMidExecutionCommand.py (1177 of 2110) PASS: lldb-unit :: Utility/./UtilityTests/BinaryStreamTest.PutSLEB128MaxValue (1178 of 2110) PASS: lldb-unit :: UnwindAssembly/x86/./UnwindAssemblyx86Tests/Testx86AssemblyInspectionEngine.Test32bitFramelessSmallStackFrame (1179 of 2110) PASS: lldb-shell :: SymbolFile/DWARF/dwarf5-partial-index.cpp (1180 of 2110) PASS: lldb-api :: lang/objcxx/hide-runtime-values/TestObjCXXHideRuntimeValues.py (1181 of 2110) PASS: lldb-unit :: Editline/./EditlineTests/EditlineTestFixture.EditlineReceivesMultiLineText (1182 of 2110) PASS: lldb-unit :: Utility/./UtilityTests/BinaryStreamTest.PutULEB128FiveBytes (1183 of 2110) UNSUPPORTED: lldb-shell :: SymbolFile/DWARF/split-dwarf-expression-eval-bug.cpp (1184 of 2110) PASS: lldb-shell :: Driver/TestSingleQuote.test (1185 of 2110) PASS: lldb-api :: functionalities/inferior-assert/TestInferiorAssert.py (1186 of 2110) PASS: lldb-shell :: SymbolFile/Breakpad/stack-cfi-parsing.test (1187 of 2110) PASS: lldb-api :: lang/objc/objc_direct-methods/TestObjCDirectMethods.py (1188 of 2110) UNSUPPORTED: lldb-api :: functionalities/tsan/global_location/TestTsanGlobalLocation.py (1189 of 2110) PASS: lldb-unit :: Symbol/./SymbolTests/LineEntryTest.GetSameLineContiguousAddressRangeOneInline (1190 of 2110) PASS: lldb-api :: commands/frame/diagnose/virtual-method-call/TestDiagnoseDereferenceVirtualMethodCall.py (1191 of 2110) PASS: lldb-shell :: SymbolFile/DWARF/DW_TAG_basic_type_DW_ATE_UTF_nonC.ll (1192 of 2110) PASS: lldb-unit :: Symbol/./SymbolTests/TestTypeSystemClang.TestGetTypeClassDeclType (1193 of 2110) PASS: lldb-api :: commands/watchpoints/watchpoint_disable/TestWatchpointDisable.py (1194 of 2110) PASS: lldb-api :: functionalities/thread/concurrent_events/TestConcurrentTwoBreakpointThreads.py (1195 of 2110) PASS: lldb-api :: lang/cpp/type_lookup/TestCppTypeLookup.py (1196 of 2110) PASS: lldb-shell :: ObjectFile/ELF/section-addresses.yaml (1197 of 2110) PASS: lldb-api :: functionalities/recursion/TestValueObjectRecursion.py (1198 of 2110) PASS: lldb-api :: tools/lldb-server/TestGdbRemoteSingleStep.py (1199 of 2110) PASS: lldb-api :: commands/expression/namespace_local_var_same_name_obj_c/TestNamespaceLocalVarSameNameObjC.py (1200 of 2110) PASS: lldb-api :: functionalities/postmortem/minidump/TestMiniDump.py (1201 of 2110) PASS: lldb-unit :: Host/./HostTests/File.GetStreamFromDescriptor (1202 of 2110) PASS: lldb-api :: functionalities/data-formatter/language_category_updates/TestDataFormatterLanguageCategoryUpdates.py (1203 of 2110) UNSUPPORTED: lldb-api :: lang/c/typedef/Testtypedef.py (1204 of 2110) PASS: lldb-unit :: Utility/./UtilityTests/StringListTest.LongestCommonPrefixNoPrefix (1205 of 2110) PASS: lldb-unit :: Utility/./UtilityTests/StreamTest.PutCString (1206 of 2110) UNSUPPORTED: lldb-api :: functionalities/darwin_log/basic/TestDarwinLogBasic.py (1207 of 2110) PASS: lldb-unit :: Utility/./UtilityTests/StringListTest.ForRangeEmpty (1208 of 2110) PASS: lldb-unit :: Process/gdb-remote/./ProcessGdbRemoteTests/GDBRemoteCommunicationServerTest.SendErrorResponse_ErrorNumber (1209 of 2110) PASS: lldb-unit :: Process/gdb-remote/./ProcessGdbRemoteTests/GDBRemoteCommunicationClientTest.TestPacketSpeedJSON (1210 of 2110) UNSUPPORTED: lldb-shell :: SymbolFile/PDB/ast-restore.test (1211 of 2110) PASS: lldb-shell :: SymbolFile/DWARF/DW_AT_declaration-with-children.s (1212 of 2110) PASS: lldb-unit :: Utility/./UtilityTests/StringListTest.AppendStringStdString (1213 of 2110) PASS: lldb-shell :: SymbolFile/DWARF/win-i386-line-table.s (1214 of 2110) PASS: lldb-api :: lang/objc/objc-class-method/TestObjCClassMethod.py (1215 of 2110) PASS: lldb-unit :: UnwindAssembly/x86/./UnwindAssemblyx86Tests/Testx86AssemblyInspectionEngine.TestPushImm (1216 of 2110) PASS: lldb-api :: lang/cpp/wchar_t/TestCxxWCharT.py (1217 of 2110) PASS: lldb-api :: commands/watchpoints/watchpoint_commands/condition/TestWatchpointConditionCmd.py (1218 of 2110) PASS: lldb-unit :: Utility/./UtilityTests/UserIDResolver.GetUserName (1219 of 2110) PASS: lldb-api :: lang/cpp/breakpoint-commands/TestCPPBreakpointCommands.py (1220 of 2110) PASS: lldb-shell :: SymbolFile/DWARF/find-basic-type.cpp (1221 of 2110) PASS: lldb-api :: lang/cpp/scope/TestCppScope.py (1222 of 2110) PASS: lldb-api :: lang/objc/objc-static-method/TestObjCStaticMethod.py (1223 of 2110) PASS: lldb-unit :: Utility/./UtilityTests/UriParserTest.SchemeHostSeparator (1224 of 2110) UNSUPPORTED: lldb-shell :: SymbolFile/PDB/variables-locations.test (1225 of 2110) PASS: lldb-unit :: Utility/./UtilityTests/RecordReplayTest.InstrumentedBarRef (1226 of 2110) PASS: lldb-unit :: Utility/./UtilityTests/ArgsTest.TestAppendArg (1227 of 2110) PASS: lldb-unit :: Utility/./UtilityTests/GeneratorTest.YamlMultiProvider (1228 of 2110) PASS: lldb-unit :: Utility/./UtilityTests/StatusTest.ErrorConstructor (1229 of 2110) PASS: lldb-unit :: Process/minidump/./LLDBMinidumpTests/RegisterContextMinidump.ConvertMinidumpContext_x86_64 (1230 of 2110) PASS: lldb-api :: commands/quit/TestQuit.py (1231 of 2110) PASS: lldb-unit :: Utility/./UtilityTests/StringListTest.InsertStringAtIndexStdString (1232 of 2110) PASS: lldb-unit :: Host/./HostTests/NativeProcessProtocolTest.SetBreakpointFailVerify (1233 of 2110) PASS: lldb-unit :: Host/./HostTests/ConnectionFileDescriptorTest.TCPGetURIv6 (1234 of 2110) PASS: lldb-unit :: Utility/./UtilityTests/StringListTest.ShiftCString (1235 of 2110) PASS: lldb-api :: functionalities/inferior-changed/TestInferiorChanged.py (1236 of 2110) UNSUPPORTED: lldb-api :: functionalities/tsan/multiple/TestTsanMultiple.py (1237 of 2110) PASS: lldb-unit :: Utility/./UtilityTests/StreamTest.PutULEB128 (1238 of 2110) PASS: lldb-unit :: Utility/./UtilityTests/DataExtractorTest.GetCStrAtEnd (1239 of 2110) PASS: lldb-api :: commands/statistics/basic/TestStats.py (1240 of 2110) UNSUPPORTED: lldb-api :: linux/thread/create_during_instruction_step/TestCreateDuringInstructionStep.py (1241 of 2110) PASS: lldb-api :: functionalities/backticks/TestBackticksWithoutATarget.py (1242 of 2110) UNSUPPORTED: lldb-api :: functionalities/data-formatter/data-formatter-stl/libstdcpp/vector/TestDataFormatterStdVector.py (1243 of 2110) PASS: lldb-unit :: Expression/./ExpressionTests/CppModuleConfigurationTest.Linux (1244 of 2110) PASS: lldb-unit :: ScriptInterpreter/Python/./ScriptInterpreterPythonTests/PythonDataObjectsTest.TestPythonBytes (1245 of 2110) PASS: lldb-api :: functionalities/load_using_paths/TestLoadUsingPaths.py (1246 of 2110) PASS: lldb-api :: functionalities/data-formatter/data-formatter-globals/TestDataFormatterGlobals.py (1247 of 2110) UNSUPPORTED: lldb-api :: lang/cpp/printf/TestPrintf.py (1248 of 2110) PASS: lldb-unit :: Utility/./UtilityTests/BinaryStreamTest.PutULEB128SevenBytes (1249 of 2110) PASS: lldb-api :: lang/cpp/class_types/TestClassTypesDisassembly.py (1250 of 2110) PASS: lldb-unit :: Expression/./ExpressionTests/DiagnosticManagerTest.PutString (1251 of 2110) PASS: lldb-api :: commands/expression/timeout/TestCallWithTimeout.py (1252 of 2110) PASS: lldb-unit :: Utility/./UtilityTests/BinaryStreamTest.PutSLEB128Zero (1253 of 2110) PASS: lldb-unit :: Utility/./UtilityTests/ArgsTest.TestQuotedTrailingBackslash (1254 of 2110) PASS: lldb-api :: lang/objc/foundation/TestRuntimeTypes.py (1255 of 2110) PASS: lldb-shell :: ObjectFile/PECOFF/uuid.yaml (1256 of 2110) PASS: lldb-unit :: ObjectFile/Breakpad/./ObjectFileBreakpadTests/StackWinRecord.parse (1257 of 2110) PASS: lldb-api :: commands/expression/import_builtin_fileid/TestImportBuiltinFileID.py (1258 of 2110) PASS: lldb-api :: lang/objc/foundation/TestConstStrings.py (1259 of 2110) PASS: lldb-unit :: Process/gdb-remote/./ProcessGdbRemoteTests/GDBRemoteCommunicationClientTest.GetMemoryRegionInfo (1260 of 2110) PASS: lldb-api :: functionalities/gdb_remote_client/TestRecognizeBreakpoint.py (1261 of 2110) PASS: lldb-shell :: SymbolFile/DWARF/DW_AT_low_pc-addrx.s (1262 of 2110) PASS: lldb-shell :: SymbolFile/DWARF/debug_line-tombstone.s (1263 of 2110) PASS: lldb-api :: functionalities/data-formatter/data-formatter-objc/nsstring/TestDataFormatterNSString.py (1264 of 2110) UNSUPPORTED: lldb-api :: tools/lldb-server/platform-process-connect/TestPlatformProcessConnect.py (1265 of 2110) PASS: lldb-unit :: Utility/./UtilityTests/LogTest.Unregister (1266 of 2110) PASS: lldb-api :: functionalities/gdb_remote_client/TestGDBRemoteClient.py (1267 of 2110) PASS: lldb-unit :: Host/./HostTests/FileSystemTest.FileAndDirectoryComponents (1268 of 2110) PASS: lldb-api :: lang/c/enum_types/TestEnumTypes.py (1269 of 2110) PASS: lldb-api :: lang/c/step-target/TestStepTarget.py (1270 of 2110) PASS: lldb-unit :: Platform/./LLDBPlatformTests/PlatformDarwinTest.TestParseVersionBuildDir (1271 of 2110) PASS: lldb-api :: functionalities/data-formatter/var-in-aggregate-misuse/TestVarInAggregateMisuse.py (1272 of 2110) PASS: lldb-api :: functionalities/rerun/TestRerun.py (1273 of 2110) PASS: lldb-unit :: UnwindAssembly/x86/./UnwindAssemblyx86Tests/Testx86AssemblyInspectionEngine.Test64bitFramelessBigStackFrame (1274 of 2110) PASS: lldb-api :: lang/cpp/virtual-overload/TestVirtualOverload.py (1275 of 2110) PASS: lldb-unit :: Utility/./UtilityTests/StatusTest.Formatv (1276 of 2110) PASS: lldb-shell :: SymbolFile/DWARF/find-method-local-struct.cpp (1277 of 2110) PASS: lldb-unit :: Utility/./UtilityTests/VASprintfTest.EncodingError (1278 of 2110) PASS: lldb-unit :: Utility/./UtilityTests/StringListTest.CopyListEmpty (1279 of 2110) PASS: lldb-api :: commands/expression/unicode-in-variable/TestUnicodeInVariable.py (1280 of 2110) PASS: lldb-shell :: Minidump/dump-all.test (1281 of 2110) PASS: lldb-api :: python_api/sbtype_typeclass/TestSBTypeTypeClass.py (1282 of 2110) PASS: lldb-unit :: Utility/./UtilityTests/StreamTest.PutHex32ByteOrderBig (1283 of 2110) PASS: lldb-unit :: Utility/./UtilityTests/StringExtractorTest.GetHexU8_InvalidHex (1284 of 2110) PASS: lldb-api :: lang/objcxx/class-name-clash/TestNameClash.py (1285 of 2110) PASS: lldb-shell :: Commands/CommandScriptImmediateOutput/CommandScriptImmediateOutputConsole.test (1286 of 2110) UNSUPPORTED: lldb-api :: functionalities/longjmp/TestLongjmp.py (1287 of 2110) PASS: lldb-unit :: Utility/./UtilityTests/ArchSpecTest.MergeFromMachOUnknown (1288 of 2110) PASS: lldb-shell :: SymbolFile/DWARF/split-dwarf-multiple-cu.ll (1289 of 2110) PASS: lldb-shell :: SymbolFile/DWARF/find-qualified-variable.cpp (1290 of 2110) PASS: lldb-unit :: Utility/./UtilityTests/StringExtractorTest.GetHexBytes_OddPair (1291 of 2110) UNSUPPORTED: lldb-api :: lang/objc/foundation/TestFoundationDisassembly.py (1292 of 2110) PASS: lldb-unit :: Language/Highlighting/./HighlighterTests/HighlighterTest.ClangBraces (1293 of 2110) XFAIL: lldb-shell :: Register/x86-64-ymm-write.test (1294 of 2110) PASS: lldb-unit :: ScriptInterpreter/Python/./ScriptInterpreterPythonTests/PythonDataObjectsTest.TestPythonTupleInitializerList (1295 of 2110) PASS: lldb-unit :: Utility/./UtilityTests/SerializationRountripTest.SerializeDeserializePodPointers (1296 of 2110) PASS: lldb-unit :: Utility/./UtilityTests/StringExtractorTest.GetHexU8_Underflow (1297 of 2110) PASS: lldb-api :: functionalities/data-formatter/typedef_array/TestTypedefArray.py (1298 of 2110) PASS: lldb-api :: commands/settings/quoting/TestQuoting.py (1299 of 2110) PASS: lldb-unit :: SymbolFile/NativePDB/./SymbolFileNativePDBTests/PDBFPOProgramToDWARFExpressionTests.SingleAssignmentRegisterRef (1300 of 2110) UNSUPPORTED: lldb-api :: functionalities/ubsan/basic/TestUbsanBasic.py (1301 of 2110) PASS: lldb-api :: commands/expression/import-std-module/forward_list/TestForwardListFromStdModule.py (1302 of 2110) UNSUPPORTED: lldb-api :: functionalities/thread/multi_break/TestMultipleBreakpoints.py (1303 of 2110) PASS: lldb-api :: tools/lldb-vscode/coreFile/TestVSCode_coreFile.py (1304 of 2110) PASS: lldb-shell :: SymbolFile/DWARF/find-function-regex.cpp (1305 of 2110) PASS: lldb-api :: tools/lldb-vscode/attach/TestVSCode_attach.py (1306 of 2110) PASS: lldb-unit :: Utility/./UtilityTests/UUIDTest.Validity (1307 of 2110) PASS: lldb-unit :: Process/gdb-remote/./ProcessGdbRemoteTests/GDBRemoteCommunicationClientTest.GetMemoryRegionInfoInvalidResponse (1308 of 2110) PASS: lldb-unit :: Utility/./UtilityTests/StringListTest.AppendListCStringArray (1309 of 2110) PASS: lldb-api :: commands/frame/var-scope/TestFrameVariableScope.py (1310 of 2110) PASS: lldb-api :: commands/watchpoints/watchpoint_set_command/TestWatchLocationWithWatchSet.py (1311 of 2110) PASS: lldb-api :: commands/expression/regression-access-function-template-in-record/TestRegressionAccessFunctionTemplateInRecord.py (1312 of 2110) PASS: lldb-api :: functionalities/thread/concurrent_events/TestConcurrentWatchBreakDelay.py (1313 of 2110) PASS: lldb-api :: commands/expression/persist_objc_pointeetype/TestPersistObjCPointeeType.py (1314 of 2110) PASS: lldb-unit :: Utility/./UtilityTests/DataExtractorTest.GetCStrEmpty (1315 of 2110) PASS: lldb-shell :: Driver/TestUseColor.test (1316 of 2110) PASS: lldb-api :: functionalities/breakpoint/cpp/TestCPPBreakpointLocations.py (1317 of 2110) PASS: lldb-api :: lang/cpp/breakpoint_in_member_func_w_non_primitive_params/TestBreakpointInMemberFuncWNonPrimitiveParams.py (1318 of 2110) PASS: lldb-api :: functionalities/thread/concurrent_events/TestConcurrentCrashWithWatchpointBreakpointSignal.py (1319 of 2110) PASS: lldb-unit :: Utility/./UtilityTests/BinaryStreamTest.PutULEB128EightBytes (1320 of 2110) PASS: lldb-api :: commands/frame/diagnose/local-variable/TestLocalVariable.py (1321 of 2110) PASS: lldb-unit :: debugserver/./debugserverTests/RNBSocket.LoopBackConnectIPv4 (1322 of 2110) PASS: lldb-unit :: Utility/./UtilityTests/FileSpecTest.EqualDotsPosixRoot (1323 of 2110) PASS: lldb-api :: commands/target/create-deps/TestTargetCreateDeps.py (1324 of 2110) PASS: lldb-shell :: Process/UnsupportedLanguage.test (1325 of 2110) PASS: lldb-unit :: Host/./HostTests/FileSystemTest.GetPermissions (1326 of 2110) PASS: lldb-unit :: Process/gdb-remote/./ProcessGdbRemoteTests/GDBRemoteCommunicationClientTest.GetModulesInfo_UUID20 (1327 of 2110) PASS: lldb-api :: functionalities/data-formatter/data-formatter-objc/nsindexpath/TestDataFormatterNSIndexPath.py (1328 of 2110) PASS: lldb-api :: functionalities/stats_api/TestStatisticsAPI.py (1329 of 2110) PASS: lldb-shell :: SymbolFile/Breakpad/line-table-edgecases.test (1330 of 2110) PASS: lldb-unit :: ScriptInterpreter/Python/./ScriptInterpreterPythonTests/PythonDataObjectsTest.TestPythonListManipulation (1331 of 2110) PASS: lldb-unit :: Utility/./UtilityTests/StringListTest.LongestCommonPrefixEmpty (1332 of 2110) PASS: lldb-unit :: Symbol/./SymbolTests/TestTypeSystemClang.TestGetBasicTypeFromName (1333 of 2110) PASS: lldb-unit :: UnwindAssembly/x86/./UnwindAssemblyx86Tests/Testx86AssemblyInspectionEngine.TestSpillRegToStackViaMOVx86_64 (1334 of 2110) PASS: lldb-shell :: Breakpoint/case-sensitive.test (1335 of 2110) PASS: lldb-unit :: Utility/./UtilityTests/SharedCluster.ClusterManager (1336 of 2110) PASS: lldb-unit :: Utility/./UtilityTests/ArgsTest.TestQuotedUnknownEscape (1337 of 2110) PASS: lldb-api :: commands/expression/options/TestExprOptions.py (1338 of 2110) PASS: lldb-unit :: Signals/./SignalsTests/UnixSignalsTest.Iteration (1339 of 2110) PASS: lldb-api :: lang/cpp/function_refs/TestFunctionRefs.py (1340 of 2110) PASS: lldb-api :: functionalities/completion/TestCompletion.py (1341 of 2110) PASS: lldb-unit :: Expression/./ExpressionTests/DiagnosticManagerTest.GetStringPreserveOrder (1342 of 2110) PASS: lldb-unit :: Utility/./UtilityTests/StringExtractorTest.GetNameColonValueContainsColon (1343 of 2110) PASS: lldb-unit :: Utility/./UtilityTests/ArgsTest.TestInsertArg (1344 of 2110) PASS: lldb-api :: python_api/class_members/TestSBTypeClassMembers.py (1345 of 2110) PASS: lldb-api :: functionalities/postmortem/minidump-new/TestMiniDumpNew.py (1346 of 2110) PASS: lldb-unit :: Host/./HostTests/HostInfoTest.GetXcodeSDK (1347 of 2110) UNSUPPORTED: lldb-shell :: Register/x86-ymm-write.test (1348 of 2110) PASS: lldb-shell :: SymbolFile/Breakpad/unwind-via-stack-win-no-memory-info.yaml (1349 of 2110) PASS: lldb-unit :: Utility/./UtilityTests/StreamTest.Indent (1350 of 2110) PASS: lldb-unit :: Utility/./UtilityTests/UriParserTest.BracketedHostnameWithPortIPv6 (1351 of 2110) PASS: lldb-api :: lang/cpp/template-function/TestTemplateFunctions.py (1352 of 2110) PASS: lldb-unit :: SymbolFile/DWARF/./SymbolFileDWARFTests/SymbolFileDWARFTests.TestAbbrevNullAttrValidForm (1353 of 2110) PASS: lldb-api :: commands/frame/recognizer/TestFrameRecognizer.py (1354 of 2110) PASS: lldb-unit :: Expression/./ExpressionTests/DiagnosticManagerTest.AddDiagnostic (1355 of 2110) PASS: lldb-api :: commands/frame/diagnose/bad-reference/TestBadReference.py (1356 of 2110) PASS: lldb-unit :: Utility/./UtilityTests/ArchSpecTest.YAML (1357 of 2110) UNSUPPORTED: lldb-api :: functionalities/signal/handle-segv/TestHandleSegv.py (1358 of 2110) PASS: lldb-shell :: Minidump/no-process-id.yaml (1359 of 2110) PASS: lldb-api :: functionalities/unwind/sigtramp/TestSigtrampUnwind.py (1360 of 2110) PASS: lldb-shell :: SymbolFile/NativePDB/tag-types.cpp (1361 of 2110) UNSUPPORTED: lldb-api :: arm/breakpoint-thumb-codesection/TestBreakpointThumbCodesection.py (1362 of 2110) PASS: lldb-unit :: Symbol/./SymbolTests/TestTypeSystemClang.TestConvertAccessTypeToAccessSpecifier (1363 of 2110) PASS: lldb-unit :: Process/minidump/./LLDBMinidumpTests/MinidumpParserTest.GetMiscInfoWindows (1364 of 2110) PASS: lldb-unit :: UnwindAssembly/x86/./UnwindAssemblyx86Tests/Testx86AssemblyInspectionEngine.TestSimple32bitFrameFunction (1365 of 2110) PASS: lldb-api :: lang/cpp/virtual-functions/TestCppVirtualFunctions.py (1366 of 2110) PASS: lldb-api :: functionalities/data-formatter/user-format-vs-summary/TestUserFormatVsSummary.py (1367 of 2110) PASS: lldb-unit :: Utility/./UtilityTests/AnsiTerminal.Empty (1368 of 2110) PASS: lldb-unit :: Utility/./UtilityTests/OptionsWithRawTest.QuotedSuffix (1369 of 2110) PASS: lldb-unit :: Platform/./LLDBPlatformTests/PlatformAppleSimulatorTest.TestSimHasSimEnvionament (1370 of 2110) PASS: lldb-api :: functionalities/limit-debug-info/TestLimitDebugInfo.py (1371 of 2110) PASS: lldb-api :: functionalities/data-formatter/data-formatter-stl/libcxx/vector/TestDataFormatterLibcxxVector.py (1372 of 2110) PASS: lldb-unit :: Utility/./UtilityTests/ArgsTest.DoubleQuotedItem (1373 of 2110) UNSUPPORTED: lldb-api :: functionalities/darwin_log/filter/regex/subsystem/TestDarwinLogFilterRegexSubsystem.py (1374 of 2110) PASS: lldb-api :: functionalities/thread/crash_during_step/TestCrashDuringStep.py (1375 of 2110) PASS: lldb-api :: functionalities/var_path/TestVarPath.py (1376 of 2110) PASS: lldb-api :: lang/objc/objc-builtin-types/TestObjCBuiltinTypes.py (1377 of 2110) PASS: lldb-shell :: Commands/command-breakpoint-col.test (1378 of 2110) PASS: lldb-api :: commands/watchpoints/watchpoint_commands/command/TestWatchpointCommandLLDB.py (1379 of 2110) PASS: lldb-api :: lang/c/tls_globals/TestTlsGlobals.py (1380 of 2110) PASS: lldb-unit :: Utility/./UtilityTests/RegularExpression.Invalid (1381 of 2110) PASS: lldb-api :: lang/c/const_variables/TestConstVariables.py (1382 of 2110) UNSUPPORTED: lldb-shell :: SymbolFile/PDB/typedefs.test (1383 of 2110) PASS: lldb-unit :: Expression/./ExpressionTests/DiagnosticManagerTest.AppendMessageNoDiag (1384 of 2110) UNSUPPORTED: lldb-api :: functionalities/asan/TestReportData.py (1385 of 2110) PASS: lldb-shell :: Reproducer/TestDiscard.test (1386 of 2110) PASS: lldb-api :: lang/c/unions/TestUnionMembers.py (1387 of 2110) UNSUPPORTED: lldb-api :: tools/lldb-server/TestGdbRemoteAuxvSupport.py (1388 of 2110) PASS: lldb-unit :: Utility/./UtilityTests/DataExtractorTest.GetCStr (1389 of 2110) PASS: lldb-unit :: Language/Highlighting/./HighlighterTests/HighlighterTest.DefaultHighlighter (1390 of 2110) PASS: lldb-unit :: Utility/./UtilityTests/ConstStringTest.MangledCounterpart (1391 of 2110) PASS: lldb-api :: lang/cpp/extern_c/TestExternCSymbols.py (1392 of 2110) PASS: lldb-shell :: SymbolFile/DWARF/find-method.cpp (1393 of 2110) PASS: lldb-shell :: ObjectFile/PECOFF/symbol.yaml (1394 of 2110) PASS: lldb-unit :: Utility/./UtilityTests/StringListTest.JoinMultiCharSeparator (1395 of 2110) PASS: lldb-unit :: Host/./HostTests/NativeProcessProtocolTest.SetBreakpointFailRead (1396 of 2110) PASS: lldb-api :: lang/objc/rdar-10967107/TestRdar10967107.py (1397 of 2110) PASS: lldb-unit :: Host/./HostTests/File.GetWaitableHandleFileno (1398 of 2110) PASS: lldb-api :: functionalities/thread/state_after_expression/TestStateAfterExpression.py (1399 of 2110) UNSUPPORTED: lldb-shell :: SymbolFile/PDB/variables.test (1400 of 2110) PASS: lldb-unit :: UnwindAssembly/x86/./UnwindAssemblyx86Tests/Testx86AssemblyInspectionEngine.TestSubRSP (1401 of 2110) PASS: lldb-unit :: Utility/./UtilityTests/StringExtractorTest.GetHexU8_Underflow2 (1402 of 2110) PASS: lldb-unit :: Utility/./UtilityTests/TimerTest.CategoryTimesStats (1403 of 2110) PASS: lldb-api :: commands/expression/xvalue/TestXValuePrinting.py (1404 of 2110) PASS: lldb-unit :: Process/minidump/./LLDBMinidumpTests/RegisterContextMinidump.CheckRegisterContextMinidump_ARM (1405 of 2110) PASS: lldb-shell :: BuildScript/script-args.test (1406 of 2110) PASS: lldb-shell :: Driver/LocalLLDBInit.test (1407 of 2110) UNSUPPORTED: lldb-api :: tools/lldb-server/TestGdbRemoteModuleInfo.py (1408 of 2110) PASS: lldb-unit :: Target/./TargetTests/ModuleCacheTest.GetAndPutUuidExists (1409 of 2110) UNSUPPORTED: lldb-shell :: ObjectFile/PECOFF/disassemble-thumb.yaml (1410 of 2110) UNSUPPORTED: lldb-api :: commands/gui/viewlarge/TestGuiViewLarge.py (1411 of 2110) PASS: lldb-api :: functionalities/wrong_commands/TestWrongCommands.py (1412 of 2110) PASS: lldb-shell :: SymbolFile/DWARF/debug_rnglists-dwo.s (1413 of 2110) PASS: lldb-unit :: ObjectFile/Breakpad/./ObjectFileBreakpadTests/InfoRecord.parse (1414 of 2110) PASS: lldb-shell :: ObjectFile/ELF/many-sections.s (1415 of 2110) PASS: lldb-api :: lang/objc/objc-ivar-stripped/TestObjCIvarStripped.py (1416 of 2110) PASS: lldb-api :: linux/builtin_trap/TestBuiltinTrap.py (1417 of 2110) PASS: lldb-unit :: Utility/./UtilityTests/ArgsTest.GetQuotedCommandString (1418 of 2110) PASS: lldb-api :: commands/frame/language/TestGuessLanguage.py (1419 of 2110) PASS: lldb-shell :: Breakpoint/debug_rnglist_basic.test (1420 of 2110) PASS: lldb-api :: macosx/thread-names/TestInterruptThreadNames.py (1421 of 2110) PASS: lldb-api :: functionalities/data-formatter/varscript_formatting/TestDataFormatterVarScriptFormatting.py (1422 of 2110) UNSUPPORTED: lldb-api :: functionalities/darwin_log/filter/regex/activity-chain/TestDarwinLogFilterRegexActivityChain.py (1423 of 2110) PASS: lldb-unit :: Utility/./UtilityTests/StringListTest.RemoveBlankLines (1424 of 2110) PASS: lldb-unit :: Host/./HostTests/SocketTest.TCPGetAddress (1425 of 2110) PASS: lldb-unit :: Utility/./UtilityTests/Flags.AllSet (1426 of 2110) PASS: lldb-api :: tools/lldb-server/TestGdbRemote_vCont.py (1427 of 2110) PASS: lldb-shell :: SymbolFile/NativePDB/function-types-builtins.cpp (1428 of 2110) PASS: lldb-shell :: SymbolFile/DWARF/compilercontext.ll (1429 of 2110) PASS: lldb-api :: lang/objc/hidden-ivars/TestHiddenIvars.py (1430 of 2110) UNSUPPORTED: lldb-api :: commands/register/register/intel_xtended_registers/mpx_bound_violation/TestBoundViolation.py (1431 of 2110) PASS: lldb-api :: functionalities/data-formatter/nssetsynth/TestNSSetSynthetic.py (1432 of 2110) PASS: lldb-api :: commands/gui/invalid-args/TestInvalidArgsGui.py (1433 of 2110) PASS: lldb-shell :: ObjectFile/ELF/aarch64-relocations.yaml (1434 of 2110) PASS: lldb-shell :: Reproducer/TestVersionCheck.test (1435 of 2110) PASS: lldb-unit :: Utility/./UtilityTests/RangeTest.Clear (1436 of 2110) PASS: lldb-unit :: Utility/./UtilityTests/StatusTest.ErrorCodeConstructor (1437 of 2110) PASS: lldb-shell :: Settings/TestDisassemblyFormat.test (1438 of 2110) PASS: lldb-unit :: Utility/./UtilityTests/ScalarTest.Scalar_512 (1439 of 2110) PASS: lldb-api :: functionalities/multidebugger_commands/TestMultipleDebuggersCommands.py (1440 of 2110) PASS: lldb-shell :: SymbolFile/DWARF/debug-types-dwo-cross-reference.cpp (1441 of 2110) PASS: lldb-api :: commands/expression/function_template_specialization_temp_args/TestFunctionTemplateSpecializationTempArgs.py (1442 of 2110) PASS: lldb-unit :: Utility/./UtilityTests/BinaryStreamTest.PutULEB128NineBytes (1443 of 2110) PASS: lldb-shell :: Reproducer/TestGDBRemoteRepro.test (1444 of 2110) PASS: lldb-api :: lang/cpp/class_types/TestClassTypes.py (1445 of 2110) PASS: lldb-api :: commands/expression/radar_9673664/TestExprHelpExamples.py (1446 of 2110) PASS: lldb-unit :: Utility/./UtilityTests/XcodeSDKTest.SDKSupportsSwift (1447 of 2110) PASS: lldb-unit :: UnwindAssembly/x86/./UnwindAssemblyx86Tests/Testx86AssemblyInspectionEngine.TestSubESP (1448 of 2110) PASS: lldb-unit :: ScriptInterpreter/Python/./ScriptInterpreterPythonTests/PythonDataObjectsTest.TestPythonListValueEquality (1449 of 2110) PASS: lldb-api :: commands/expression/radar_8638051/Test8638051.py (1450 of 2110) UNSUPPORTED: lldb-api :: functionalities/darwin_log/filter/exact_match/subsystem/TestDarwinLogFilterMatchSubsystem.py (1451 of 2110) PASS: lldb-unit :: SymbolFile/NativePDB/./SymbolFileNativePDBTests/PDBFPOProgramToDWARFExpressionTests.UnresolvedRegisterReference (1452 of 2110) PASS: lldb-api :: commands/target/stop-hook/disable/TestTargetStopHookDisable.py (1453 of 2110) PASS: lldb-unit :: Host/./HostTests/MainLoopTest.TerminatesImmediately (1454 of 2110) PASS: lldb-api :: functionalities/data-formatter/stringprinter/TestStringPrinter.py (1455 of 2110) PASS: lldb-api :: commands/expression/persistent_variables/TestPersistentVariables.py (1456 of 2110) PASS: lldb-shell :: ObjectFile/ELF/PT_LOAD-overlap-section.yaml (1457 of 2110) PASS: lldb-unit :: Symbol/./SymbolTests/TestTypeSystemClang.TestFunctionTemplateConstruction (1458 of 2110) PASS: lldb-unit :: Utility/./UtilityTests/SerializationRountripTest.SerializeDeserializePod (1459 of 2110) PASS: lldb-shell :: Commands/command-script-import.test (1460 of 2110) PASS: lldb-api :: functionalities/breakpoint/inlined_breakpoints/TestInlinedBreakpoints.py (1461 of 2110) PASS: lldb-api :: functionalities/data-formatter/data-formatter-smart-array/TestDataFormatterSmartArray.py (1462 of 2110) PASS: lldb-shell :: Reproducer/TestCaptureEnvOverride.test (1463 of 2110) PASS: lldb-unit :: Process/gdb-remote/./ProcessGdbRemoteTests/GDBRemoteClientBaseTest.InterruptNoResponse (1464 of 2110) PASS: lldb-unit :: Utility/./UtilityTests/StreamTest.PutPtr (1465 of 2110) UNSUPPORTED: lldb-shell :: Unwind/unwind-plan-dwarf-dump.test (1466 of 2110) UNSUPPORTED: lldb-shell :: ScriptInterpreter/Lua/lua.test (1467 of 2110) PASS: lldb-unit :: Utility/./UtilityTests/BroadcasterTest.BroadcastEvent (1468 of 2110) PASS: lldb-unit :: ScriptInterpreter/Python/./ScriptInterpreterPythonTests/PythonDataObjectsTest.TestPythonDictionaryValueEquality (1469 of 2110) PASS: lldb-unit :: Utility/./UtilityTests/StringListTest.ShiftMove (1470 of 2110) PASS: lldb-shell :: ObjectFile/ELF/minidebuginfo-corrupt-xz.yaml (1471 of 2110) PASS: lldb-unit :: Utility/./UtilityTests/ScalarTest.APIntConstructor (1472 of 2110) PASS: lldb-unit :: Utility/./UtilityTests/Flags.GetBitSize (1473 of 2110) PASS: lldb-unit :: Utility/./UtilityTests/FileSpecTest.AppendPathComponent (1474 of 2110) PASS: lldb-api :: tools/lldb-server/TestGdbRemoteKill.py (1475 of 2110) PASS: lldb-api :: commands/command/delete/TestCommandDelete.py (1476 of 2110) PASS: lldb-shell :: SymbolFile/DWARF/static_scope.s (1477 of 2110) PASS: lldb-unit :: Utility/./UtilityTests/AnsiTerminal.WhiteSpace (1478 of 2110) XFAIL: lldb-shell :: Unwind/prefer-debug-over-eh-frame.test (1479 of 2110) PASS: lldb-unit :: Utility/./UtilityTests/RangeTest.Slide (1480 of 2110) PASS: lldb-api :: lang/cpp/dynamic-value-same-basename/TestDynamicValueSameBase.py (1481 of 2110) PASS: lldb-unit :: Process/minidump/./LLDBMinidumpTests/MinidumpParserTest.MinidumpDuplicateModuleMinAddress (1482 of 2110) PASS: lldb-unit :: ScriptInterpreter/Python/./ScriptInterpreterPythonTests/PythonDataObjectsTest.TestPythonStringToStr (1483 of 2110) PASS: lldb-api :: functionalities/data-formatter/vector-types/TestVectorTypesFormatting.py (1484 of 2110) PASS: lldb-unit :: Expression/./ExpressionTests/DWARFExpression.DW_OP_stack_value (1485 of 2110) PASS: lldb-api :: tools/lldb-server/register-reading/TestGdbRemoteGPacket.py (1486 of 2110) PASS: lldb-api :: commands/expression/context-object-objc/TestContextObjectObjc.py (1487 of 2110) PASS: lldb-unit :: Utility/./UtilityTests/ArchSpecTest.OperatorBool (1488 of 2110) PASS: lldb-api :: functionalities/load_unload/TestLoadUnload.py (1489 of 2110) PASS: lldb-unit :: Utility/./UtilityTests/OptionsWithRawTest.EmptyArgsOnlySuffix (1490 of 2110) PASS: lldb-unit :: Utility/./UtilityTests/StringListTest.SplitIntoLinesEmpty (1491 of 2110) PASS: lldb-unit :: Utility/./UtilityTests/StringExtractorTest.DecodeHexU8_Underflow2 (1492 of 2110) PASS: lldb-unit :: UnwindAssembly/x86/./UnwindAssemblyx86Tests/Testx86AssemblyInspectionEngine.TestPushEDI (1493 of 2110) PASS: lldb-shell :: Recognizer/assert.test (1494 of 2110) UNSUPPORTED: lldb-api :: functionalities/thread/state/TestThreadStates.py (1495 of 2110) PASS: lldb-unit :: Process/gdb-remote/./ProcessGdbRemoteTests/GDBRemoteClientBaseTest.SendContinueAndLateInterrupt (1496 of 2110) UNSUPPORTED: lldb-api :: functionalities/data-formatter/data-formatter-stl/libstdcpp/list/TestDataFormatterStdList.py (1497 of 2110) PASS: lldb-api :: commands/platform/file/read/TestPlatformFileRead.py (1498 of 2110) PASS: lldb-unit :: Utility/./UtilityTests/ArgsTest.AppendArguments (1499 of 2110) PASS: lldb-unit :: Utility/./UtilityTests/FileSpecTest.Match (1500 of 2110) PASS: lldb-api :: tools/lldb-server/commandline/TestStubSetSID.py (1501 of 2110) PASS: lldb-api :: macosx/dyld-trie-symbols/TestDyldTrieSymbols.py (1502 of 2110) PASS: lldb-shell :: Breakpoint/debug_rnglist_offset_pair.test (1503 of 2110) PASS: lldb-shell :: ObjectFile/Breakpad/sections-trailing-func.test (1504 of 2110) PASS: lldb-api :: commands/log/invalid-args/TestInvalidArgsLog.py (1505 of 2110) PASS: lldb-shell :: SymbolFile/DWARF/dwarf5-atomic.s (1506 of 2110) FAIL: lldb-api :: macosx/simulator/TestSimulatorPlatform.py (1507 of 2110) ******************** TEST 'lldb-api :: macosx/simulator/TestSimulatorPlatform.py' FAILED ******************** Script: -- /Users/buildslave/jenkins/workspace/lldb-cmake-sanitized/lldb-build/lldb-test-build.noindex/copied-python /Users/buildslave/jenkins/workspace/lldb-cmake-sanitized/llvm-project/lldb/test/API/dotest.py --arch x86_64 -s /Users/buildslave/jenkins/workspace/lldb-cmake-sanitized/lldb-build/lldb-test-traces -S nm -u CXXFLAGS -u CFLAGS --codesign-identity lldb_codesign --server /Users/buildslave/jenkins/workspace/lldb-cmake-sanitized/lldb-build/./bin/debugserver --arch x86_64 --build-dir /Users/buildslave/jenkins/workspace/lldb-cmake-sanitized/lldb-build/lldb-test-build.noindex -s=/Users/buildslave/jenkins/workspace/lldb-cmake-sanitized/test/logs -t --env TERM=vt100 --env LLVM_LIBS_DIR=/Users/buildslave/jenkins/workspace/lldb-cmake-sanitized/lldb-build/./lib --inferior-env ASAN_OPTIONS=detect_stack_use_after_return=1 --inferior-env DYLD_INSERT_LIBRARIES=/Users/buildslave/jenkins/workspace/lldb-cmake-sanitized/host-compiler/lib/clang/12.0.0/lib/darwin/libclang_rt.asan_osx_dynamic.dylib --build-dir /Users/buildslave/jenkins/workspace/lldb-cmake-sanitized/lldb-build/lldb-test-build.noindex --lldb-module-cache-dir /Users/buildslave/jenkins/workspace/lldb-cmake-sanitized/lldb-build/lldb-test-build.noindex/module-cache-lldb/lldb-api --clang-module-cache-dir /Users/buildslave/jenkins/workspace/lldb-cmake-sanitized/lldb-build/lldb-test-build.noindex/module-cache-clang/lldb-api --executable /Users/buildslave/jenkins/workspace/lldb-cmake-sanitized/lldb-build/./bin/lldb --compiler /Users/buildslave/jenkins/workspace/lldb-cmake-sanitized/lldb-build/./bin/clang --dsymutil /Users/buildslave/jenkins/workspace/lldb-cmake-sanitized/lldb-build/./bin/dsymutil --filecheck /Users/buildslave/jenkins/workspace/lldb-cmake-sanitized/lldb-build/./bin/FileCheck --yaml2obj /Users/buildslave/jenkins/workspace/lldb-cmake-sanitized/lldb-build/./bin/yaml2obj --lldb-libs-dir /Users/buildslave/jenkins/workspace/lldb-cmake-sanitized/lldb-build/./lib /Users/buildslave/jenkins/workspace/lldb-cmake-sanitized/llvm-project/lldb/test/API/macosx/simulator -p TestSimulatorPlatform.py -- Exit Code: 1

Hide Details

Command Output (stdout): -- lldb version 12.0.99 clang revision 449b4d2a8b2ad1ae9555338a810a8fb74158d16b llvm revision 449b4d2a8b2ad1ae9555338a810a8fb74158d16b LLDB library dir: /Users/buildslave/jenkins/workspace/lldb-cmake-sanitized/lldb-build/bin LLDB import library dir: /Users/buildslave/jenkins/workspace/lldb-cmake-sanitized/lldb-build/./lib libstdcxx tests will not be run because: Don't know how to build with libstdcxx on macosx Skipping following debug info categories: ['dwo']

Hide Details

-- Command Output (stderr): --

Hide Details

Session logs for test failures/errors/unexpected successes will go into directory '/Users/buildslave/jenkins/workspace/lldb-cmake-sanitized/test/logs' Change dir to: /Users/buildslave/jenkins/workspace/lldb-cmake-sanitized/llvm-project/lldb/test/API/macosx/simulator runCmd: settings clear -all output:

Hide Details

runCmd: settings set symbols.enable-external-lookup false output:

Hide Details

runCmd: settings set target.inherit-tcc true output:

Hide Details

runCmd: settings set target.auto-apply-fixits false output:

Hide Details

runCmd: settings set plugin.process.gdb-remote.packet-timeout 60 output:

Hide Details

runCmd: settings set symbols.clang-modules-cache-path "/Users/buildslave/jenkins/workspace/lldb-cmake-sanitized/lldb-build/lldb-test-build.noindex/module-cache-lldb/lldb-api" output:

Hide Details

runCmd: settings set use-color false output:

Hide Details

runCmd: setting set target.prefer-dynamic-value no-dynamic-values output:

Hide Details

runCmd: settings set target.env-vars ASAN_OPTIONS=detect_stack_use_after_return=1 DYLD_INSERT_LIBRARIES=/Users/buildslave/jenkins/workspace/lldb-cmake-sanitized/host-compiler/lib/clang/12.0.0/lib/darwin/libclang_rt.asan_osx_dynamic.dylib output:

Hide Details

runCmd: log enable gdb-remote packets -f /Users/buildslave/jenkins/workspace/lldb-cmake-sanitized/lldb-build/lldb-test-build.noindex/macosx/simulator/TestSimulatorPlatform.test_ios/packets.log output:

Hide Details

runCmd: settings set target.env-vars ASAN_OPTIONS=detect_stack_use_after_return=1 DYLD_INSERT_LIBRARIES=/Users/buildslave/jenkins/workspace/lldb-cmake-sanitized/host-compiler/lib/clang/12.0.0/lib/darwin/libclang_rt.asan_osx_dynamic.dylib output:

Hide Details

FAIL: LLDB (/Users/buildslave/jenkins/workspace/lldb-cmake-sanitized/lldb-build/bin/clang-x86_64) :: test_ios (TestSimulatorPlatform.TestSimulatorPlatformLaunching) <bound method SBProcess.Kill of <lldb.SBProcess; proxy of <Swig Object of type 'lldb::SBProcess *' at 0x113dab5a0> >>: success

Hide Details

runCmd: settings clear -all output:

Hide Details

runCmd: settings set symbols.enable-external-lookup false output:

Hide Details

runCmd: settings set target.inherit-tcc true output:

Hide Details

runCmd: settings set target.auto-apply-fixits false output:

Hide Details

runCmd: settings set plugin.process.gdb-remote.packet-timeout 60 output:

Hide Details

runCmd: settings set symbols.clang-modules-cache-path "/Users/buildslave/jenkins/workspace/lldb-cmake-sanitized/lldb-build/lldb-test-build.noindex/module-cache-lldb/lldb-api" output:

Hide Details

runCmd: settings set use-color false output:

Hide Details

runCmd: setting set target.prefer-dynamic-value no-dynamic-values output:

Hide Details

runCmd: settings set target.env-vars ASAN_OPTIONS=detect_stack_use_after_return=1 DYLD_INSERT_LIBRARIES=/Users/buildslave/jenkins/workspace/lldb-cmake-sanitized/host-compiler/lib/clang/12.0.0/lib/darwin/libclang_rt.asan_osx_dynamic.dylib output:

Hide Details

UNSUPPORTED: LLDB (/Users/buildslave/jenkins/workspace/lldb-cmake-sanitized/lldb-build/bin/clang-x86_64) :: test_ios_backdeploy_apple_silicon (TestSimulatorPlatform.TestSimulatorPlatformLaunching) (skipping due to the following parameter(s): architecture) runCmd: settings clear -all output:

Hide Details

runCmd: settings set symbols.enable-external-lookup false output:

Hide Details

runCmd: settings set target.inherit-tcc true output:

Hide Details

runCmd: settings set target.auto-apply-fixits false output:

Hide Details

runCmd: settings set plugin.process.gdb-remote.packet-timeout 60 output:

Hide Details

runCmd: settings set symbols.clang-modules-cache-path "/Users/buildslave/jenkins/workspace/lldb-cmake-sanitized/lldb-build/lldb-test-build.noindex/module-cache-lldb/lldb-api" output:

Hide Details

runCmd: settings set use-color false output:

Hide Details

runCmd: setting set target.prefer-dynamic-value no-dynamic-values output:

Hide Details

runCmd: settings set target.env-vars ASAN_OPTIONS=detect_stack_use_after_return=1 DYLD_INSERT_LIBRARIES=/Users/buildslave/jenkins/workspace/lldb-cmake-sanitized/host-compiler/lib/clang/12.0.0/lib/darwin/libclang_rt.asan_osx_dynamic.dylib output:

Hide Details

runCmd: log enable gdb-remote packets -f /Users/buildslave/jenkins/workspace/lldb-cmake-sanitized/lldb-build/lldb-test-build.noindex/macosx/simulator/TestSimulatorPlatform.test_ios_backdeploy_x86/packets.log output:

Hide Details

runCmd: settings set target.env-vars ASAN_OPTIONS=detect_stack_use_after_return=1 DYLD_INSERT_LIBRARIES=/Users/buildslave/jenkins/workspace/lldb-cmake-sanitized/host-compiler/lib/clang/12.0.0/lib/darwin/libclang_rt.asan_osx_dynamic.dylib output:

Hide Details

FAIL: LLDB (/Users/buildslave/jenkins/workspace/lldb-cmake-sanitized/lldb-build/bin/clang-x86_64) :: test_ios_backdeploy_x86 (TestSimulatorPlatform.TestSimulatorPlatformLaunching) <bound method SBProcess.Kill of <lldb.SBProcess; proxy of <Swig Object of type 'lldb::SBProcess *' at 0x111065900> >>: success

Hide Details

runCmd: settings clear -all output:

Hide Details

runCmd: settings set symbols.enable-external-lookup false output:

Hide Details

runCmd: settings set target.inherit-tcc true output:

Hide Details

runCmd: settings set target.auto-apply-fixits false output:

Hide Details

runCmd: settings set plugin.process.gdb-remote.packet-timeout 60 output:

Hide Details

runCmd: settings set symbols.clang-modules-cache-path "/Users/buildslave/jenkins/workspace/lldb-cmake-sanitized/lldb-build/lldb-test-build.noindex/module-cache-lldb/lldb-api" output:

Hide Details

runCmd: settings set use-color false output:

Hide Details

runCmd: setting set target.prefer-dynamic-value no-dynamic-values output:

Hide Details

runCmd: settings set target.env-vars ASAN_OPTIONS=detect_stack_use_after_return=1 DYLD_INSERT_LIBRARIES=/Users/buildslave/jenkins/workspace/lldb-cmake-sanitized/host-compiler/lib/clang/12.0.0/lib/darwin/libclang_rt.asan_osx_dynamic.dylib output:

Hide Details

runCmd: log enable gdb-remote packets -f /Users/buildslave/jenkins/workspace/lldb-cmake-sanitized/lldb-build/lldb-test-build.noindex/macosx/simulator/TestSimulatorPlatform.test_lc_version_min_iphoneos/packets.log output:

Hide Details

runCmd: settings set target.env-vars ASAN_OPTIONS=detect_stack_use_after_return=1 DYLD_INSERT_LIBRARIES=/Users/buildslave/jenkins/workspace/lldb-cmake-sanitized/host-compiler/lib/clang/12.0.0/lib/darwin/libclang_rt.asan_osx_dynamic.dylib output:

Hide Details

FAIL: LLDB (/Users/buildslave/jenkins/workspace/lldb-cmake-sanitized/lldb-build/bin/clang-x86_64) :: test_lc_version_min_iphoneos (TestSimulatorPlatform.TestSimulatorPlatformLaunching) <bound method SBProcess.Kill of <lldb.SBProcess; proxy of <Swig Object of type 'lldb::SBProcess *' at 0x110b4ce40> >>: success

Hide Details

runCmd: settings clear -all output:

Hide Details

runCmd: settings set symbols.enable-external-lookup false output:

Hide Details

runCmd: settings set target.inherit-tcc true output:

Hide Details

runCmd: settings set target.auto-apply-fixits false output:

Hide Details

runCmd: settings set plugin.process.gdb-remote.packet-timeout 60 output:

Hide Details

runCmd: settings set symbols.clang-modules-cache-path "/Users/buildslave/jenkins/workspace/lldb-cmake-sanitized/lldb-build/lldb-test-build.noindex/module-cache-lldb/lldb-api" output:

Hide Details

runCmd: settings set use-color false output:

Hide Details

runCmd: setting set target.prefer-dynamic-value no-dynamic-values output:

Hide Details

runCmd: settings set target.env-vars ASAN_OPTIONS=detect_stack_use_after_return=1 DYLD_INSERT_LIBRARIES=/Users/buildslave/jenkins/workspace/lldb-cmake-sanitized/host-compiler/lib/clang/12.0.0/lib/darwin/libclang_rt.asan_osx_dynamic.dylib output:

Hide Details

runCmd: log enable gdb-remote packets -f /Users/buildslave/jenkins/workspace/lldb-cmake-sanitized/lldb-build/lldb-test-build.noindex/macosx/simulator/TestSimulatorPlatform.test_lc_version_min_macosx/packets.log output:

Hide Details

runCmd: settings set target.env-vars ASAN_OPTIONS=detect_stack_use_after_return=1 DYLD_INSERT_LIBRARIES=/Users/buildslave/jenkins/workspace/lldb-cmake-sanitized/host-compiler/lib/clang/12.0.0/lib/darwin/libclang_rt.asan_osx_dynamic.dylib output:

Hide Details

runCmd: image list -b -t output: [ 0] a.out x86_64-apple-macosx10.9.0 [ 1] dyld x86_64-apple-macosx10.15.0 [ 2] libc++.1.dylib x86_64-apple-macosx10.15.0 [ 3] libSystem.B.dylib x86_64-apple-macosx10.15.0 [ 4] libc++abi.dylib x86_64-apple-macosx10.15.0 [ 5] libcache.dylib x86_64-apple-macosx10.15.0 [ 6] libcommonCrypto.dylib x86_64-apple-macosx10.15.0 [ 7] libcompiler_rt.dylib x86_64-apple-macosx10.15.0 [ 8] libcopyfile.dylib x86_64-apple-macosx10.15.0 [ 9] libcorecrypto.dylib x86_64-apple-macosx10.15.0 [ 10] libdispatch.dylib x86_64-apple-macosx10.15.0 [ 11] libdyld.dylib x86_64-apple-macosx10.15.0 [ 12] libkeymgr.dylib x86_64-apple-macosx10.15.0 [ 13] liblaunch.dylib x86_64-apple-macosx10.15.0 [ 14] libmacho.dylib x86_64-apple-macosx10.15.0 [ 15] libquarantine.dylib x86_64-apple-macosx10.15.0 [ 16] libremovefile.dylib x86_64-apple-macosx10.15.0 [ 17] libsystem_asl.dylib x86_64-apple-macosx10.15.0 [ 18] libsystem_blocks.dylib x86_64-apple-macosx10.15.0 [ 19] libsystem_c.dylib x86_64-apple-macosx10.15.0 [ 20] libsystem_configuration.dylib x86_64-apple-macosx10.15.0 [ 21] libsystem_coreservices.dylib x86_64-apple-macosx10.15.0 [ 22] libsystem_darwin.dylib x86_64-apple-macosx10.15.0 [ 23] libsystem_dnssd.dylib x86_64-apple-macosx10.15.0 [ 24] libsystem_featureflags.dylib x86_64-apple-macosx10.15.0 [ 25] libsystem_info.dylib x86_64-apple-macosx10.15.0 [ 26] libsystem_m.dylib x86_64-apple-macosx10.15.0 [ 27] libsystem_malloc.dylib x86_64-apple-macosx10.15.0 [ 28] libsystem_networkextension.dylib x86_64-apple-macosx10.15.0 [ 29] libsystem_notify.dylib x86_64-apple-macosx10.15.0 [ 30] libsystem_sandbox.dylib x86_64-apple-macosx10.15.0 [ 31] libsystem_secinit.dylib x86_64-apple-macosx10.15.0 [ 32] libsystem_kernel.dylib x86_64-apple-macosx10.15.0 [ 33] libsystem_platform.dylib x86_64-apple-macosx10.15.0 [ 34] libsystem_pthread.dylib x86_64-apple-macosx10.15.0 [ 35] libsystem_symptoms.dylib x86_64-apple-macosx10.15.0 [ 36] libsystem_trace.dylib x86_64-apple-macosx10.15.0 [ 37] libunwind.dylib x86_64-apple-macosx10.15.0 [ 38] libxpc.dylib x86_64-apple-macosx10.15.0 [ 39] libobjc.A.dylib x86_64-apple-macosx10.15.0 [ 40] libclang_rt.asan_osx_dynamic.dylib x86_64-apple-macosx10.9.0

Hide Details

Hide Details

Expecting pattern: a\.out x86_64-apple-macosx10.9.* Matched

Hide Details

FAIL: LLDB (/Users/buildslave/jenkins/workspace/lldb-cmake-sanitized/lldb-build/bin/clang-x86_64) :: test_lc_version_min_macosx (TestSimulatorPlatform.TestSimulatorPlatformLaunching) <bound method SBProcess.Kill of <lldb.SBProcess; proxy of <Swig Object of type 'lldb::SBProcess *' at 0x111065b40> >>: success

Hide Details

runCmd: settings clear -all output:

Hide Details

runCmd: settings set symbols.enable-external-lookup false output:

Hide Details

runCmd: settings set target.inherit-tcc true output:

Hide Details

runCmd: settings set target.auto-apply-fixits false output:

Hide Details

runCmd: settings set plugin.process.gdb-remote.packet-timeout 60 output:

Hide Details

runCmd: settings set symbols.clang-modules-cache-path "/Users/buildslave/jenkins/workspace/lldb-cmake-sanitized/lldb-build/lldb-test-build.noindex/module-cache-lldb/lldb-api" output:

Hide Details

runCmd: settings set use-color false output:

Hide Details

runCmd: setting set target.prefer-dynamic-value no-dynamic-values output:

Hide Details

runCmd: settings set target.env-vars ASAN_OPTIONS=detect_stack_use_after_return=1 DYLD_INSERT_LIBRARIES=/Users/buildslave/jenkins/workspace/lldb-cmake-sanitized/host-compiler/lib/clang/12.0.0/lib/darwin/libclang_rt.asan_osx_dynamic.dylib output:

Hide Details

runCmd: log enable gdb-remote packets -f /Users/buildslave/jenkins/workspace/lldb-cmake-sanitized/lldb-build/lldb-test-build.noindex/macosx/simulator/TestSimulatorPlatform.test_lc_version_min_tvos/packets.log output:

Hide Details

runCmd: settings set target.env-vars ASAN_OPTIONS=detect_stack_use_after_return=1 DYLD_INSERT_LIBRARIES=/Users/buildslave/jenkins/workspace/lldb-cmake-sanitized/host-compiler/lib/clang/12.0.0/lib/darwin/libclang_rt.asan_osx_dynamic.dylib output:

Hide Details

FAIL: LLDB (/Users/buildslave/jenkins/workspace/lldb-cmake-sanitized/lldb-build/bin/clang-x86_64) :: test_lc_version_min_tvos (TestSimulatorPlatform.TestSimulatorPlatformLaunching) <bound method SBProcess.Kill of <lldb.SBProcess; proxy of <Swig Object of type 'lldb::SBProcess *' at 0x110b4c3c0> >>: success

Hide Details

UNSUPPORTED: LLDB (/Users/buildslave/jenkins/workspace/lldb-cmake-sanitized/lldb-build/bin/clang-x86_64) :: test_lc_version_min_watchos (TestSimulatorPlatform.TestSimulatorPlatformLaunching) (skip on macosx, darwin, ios, tvos, watchos, bridgeos) runCmd: settings clear -all output:

Hide Details

runCmd: settings set symbols.enable-external-lookup false output:

Hide Details

runCmd: settings set target.inherit-tcc true output:

Hide Details

runCmd: settings set target.auto-apply-fixits false output:

Hide Details

runCmd: settings set plugin.process.gdb-remote.packet-timeout 60 output:

Hide Details

runCmd: settings set symbols.clang-modules-cache-path "/Users/buildslave/jenkins/workspace/lldb-cmake-sanitized/lldb-build/lldb-test-build.noindex/module-cache-lldb/lldb-api" output:

Hide Details

runCmd: settings set use-color false output:

Hide Details

runCmd: setting set target.prefer-dynamic-value no-dynamic-values output:

Hide Details

runCmd: settings set target.env-vars ASAN_OPTIONS=detect_stack_use_after_return=1 DYLD_INSERT_LIBRARIES=/Users/buildslave/jenkins/workspace/lldb-cmake-sanitized/host-compiler/lib/clang/12.0.0/lib/darwin/libclang_rt.asan_osx_dynamic.dylib output:

Hide Details

runCmd: log enable gdb-remote packets -f /Users/buildslave/jenkins/workspace/lldb-cmake-sanitized/lldb-build/lldb-test-build.noindex/macosx/simulator/TestSimulatorPlatform.test_tvos/packets.log output:

Hide Details

runCmd: settings set target.env-vars ASAN_OPTIONS=detect_stack_use_after_return=1 DYLD_INSERT_LIBRARIES=/Users/buildslave/jenkins/workspace/lldb-cmake-sanitized/host-compiler/lib/clang/12.0.0/lib/darwin/libclang_rt.asan_osx_dynamic.dylib output:

Hide Details

FAIL: LLDB (/Users/buildslave/jenkins/workspace/lldb-cmake-sanitized/lldb-build/bin/clang-x86_64) :: test_tvos (TestSimulatorPlatform.TestSimulatorPlatformLaunching) <bound method SBProcess.Kill of <lldb.SBProcess; proxy of <Swig Object of type 'lldb::SBProcess *' at 0x111065900> >>: success

Hide Details

runCmd: settings clear -all output:

Hide Details

runCmd: settings set symbols.enable-external-lookup false output:

Hide Details

runCmd: settings set target.inherit-tcc true output:

Hide Details

runCmd: settings set target.auto-apply-fixits false output:

Hide Details

runCmd: settings set plugin.process.gdb-remote.packet-timeout 60 output:

Hide Details

runCmd: settings set symbols.clang-modules-cache-path "/Users/buildslave/jenkins/workspace/lldb-cmake-sanitized/lldb-build/lldb-test-build.noindex/module-cache-lldb/lldb-api" output:

Hide Details

runCmd: settings set use-color false output:

Hide Details

runCmd: setting set target.prefer-dynamic-value no-dynamic-values output:

Hide Details

runCmd: settings set target.env-vars ASAN_OPTIONS=detect_stack_use_after_return=1 DYLD_INSERT_LIBRARIES=/Users/buildslave/jenkins/workspace/lldb-cmake-sanitized/host-compiler/lib/clang/12.0.0/lib/darwin/libclang_rt.asan_osx_dynamic.dylib output:

Hide Details

UNSUPPORTED: LLDB (/Users/buildslave/jenkins/workspace/lldb-cmake-sanitized/lldb-build/bin/clang-x86_64) :: test_tvos_backdeploy_apple_silicon (TestSimulatorPlatform.TestSimulatorPlatformLaunching) (skipping due to the following parameter(s): architecture) UNSUPPORTED: LLDB (/Users/buildslave/jenkins/workspace/lldb-cmake-sanitized/lldb-build/bin/clang-x86_64) :: test_watchos_armv7k (TestSimulatorPlatform.TestSimulatorPlatformLaunching) (skip on macosx, darwin, ios, tvos, watchos, bridgeos) UNSUPPORTED: LLDB (/Users/buildslave/jenkins/workspace/lldb-cmake-sanitized/lldb-build/bin/clang-x86_64) :: test_watchos_backdeploy_apple_silicon (TestSimulatorPlatform.TestSimulatorPlatformLaunching) (skip on macosx, darwin, ios, tvos, watchos, bridgeos) UNSUPPORTED: LLDB (/Users/buildslave/jenkins/workspace/lldb-cmake-sanitized/lldb-build/bin/clang-x86_64) :: test_watchos_i386 (TestSimulatorPlatform.TestSimulatorPlatformLaunching) (skip on macosx, darwin, ios, tvos, watchos, bridgeos) Restore dir to: /Users/buildslave/jenkins/workspace/lldb-cmake-sanitized/lldb-build/tools/lldb/test ====================================================================== FAIL: test_ios (TestSimulatorPlatform.TestSimulatorPlatformLaunching) Test running an iOS simulator binary ---------------------------------------------------------------------- Traceback (most recent call last): File "/Users/buildslave/jenkins/workspace/lldb-cmake-sanitized/llvm-project/lldb/packages/Python/lldbsuite/test/decorators.py", line 135, in wrapper return func(*args, **kwargs) File "/Users/buildslave/jenkins/workspace/lldb-cmake-sanitized/llvm-project/lldb/packages/Python/lldbsuite/test/decorators.py", line 135, in wrapper return func(*args, **kwargs) File "/Users/buildslave/jenkins/workspace/lldb-cmake-sanitized/llvm-project/lldb/test/API/macosx/simulator/TestSimulatorPlatform.py", line 63, in test_ios expected_load_command='LC_BUILD_VERSION') File "/Users/buildslave/jenkins/workspace/lldb-cmake-sanitized/llvm-project/lldb/test/API/macosx/simulator/TestSimulatorPlatform.py", line 50, in run_with lldb.SBFileSpec("hello.c")) File "/Users/buildslave/jenkins/workspace/lldb-cmake-sanitized/llvm-project/lldb/packages/Python/lldbsuite/test/lldbutil.py", line 919, in run_to_source_breakpoint only_one_thread, extra_images) File "/Users/buildslave/jenkins/workspace/lldb-cmake-sanitized/llvm-project/lldb/packages/Python/lldbsuite/test/lldbutil.py", line 848, in run_to_breakpoint_do_run test.assertEqual(num_threads, 1, "Expected 1 thread to stop at breakpoint, %d did."%(num_threads)) AssertionError: 0 != 1 : Expected 1 thread to stop at breakpoint, 0 did. Config=x86_64-/Users/buildslave/jenkins/workspace/lldb-cmake-sanitized/lldb-build/bin/clang ====================================================================== FAIL: test_ios_backdeploy_x86 (TestSimulatorPlatform.TestSimulatorPlatformLaunching) Test running a back-deploying iOS simulator binary ---------------------------------------------------------------------- Traceback (most recent call last): File "/Users/buildslave/jenkins/workspace/lldb-cmake-sanitized/llvm-project/lldb/packages/Python/lldbsuite/test/decorators.py", line 135, in wrapper return func(*args, **kwargs) File "/Users/buildslave/jenkins/workspace/lldb-cmake-sanitized/llvm-project/lldb/packages/Python/lldbsuite/test/decorators.py", line 135, in wrapper return func(*args, **kwargs) File "/Users/buildslave/jenkins/workspace/lldb-cmake-sanitized/llvm-project/lldb/packages/Python/lldbsuite/test/decorators.py", line 135, in wrapper return func(*args, **kwargs) File "/Users/buildslave/jenkins/workspace/lldb-cmake-sanitized/llvm-project/lldb/test/API/macosx/simulator/TestSimulatorPlatform.py", line 139, in test_ios_backdeploy_x86 expected_load_command='LC_BUILD_VERSION') File "/Users/buildslave/jenkins/workspace/lldb-cmake-sanitized/llvm-project/lldb/test/API/macosx/simulator/TestSimulatorPlatform.py", line 50, in run_with lldb.SBFileSpec("hello.c")) File "/Users/buildslave/jenkins/workspace/lldb-cmake-sanitized/llvm-project/lldb/packages/Python/lldbsuite/test/lldbutil.py", line 919, in run_to_source_breakpoint only_one_thread, extra_images) File "/Users/buildslave/jenkins/workspace/lldb-cmake-sanitized/llvm-project/lldb/packages/Python/lldbsuite/test/lldbutil.py", line 848, in run_to_breakpoint_do_run test.assertEqual(num_threads, 1, "Expected 1 thread to stop at breakpoint, %d did."%(num_threads)) AssertionError: 0 != 1 : Expected 1 thread to stop at breakpoint, 0 did. Config=x86_64-/Users/buildslave/jenkins/workspace/lldb-cmake-sanitized/lldb-build/bin/clang ====================================================================== FAIL: test_lc_version_min_iphoneos (TestSimulatorPlatform.TestSimulatorPlatformLaunching) Test running a back-deploying iOS simulator binary ---------------------------------------------------------------------- Traceback (most recent call last): File "/Users/buildslave/jenkins/workspace/lldb-cmake-sanitized/llvm-project/lldb/packages/Python/lldbsuite/test/decorators.py", line 135, in wrapper return func(*args, **kwargs) File "/Users/buildslave/jenkins/workspace/lldb-cmake-sanitized/llvm-project/lldb/packages/Python/lldbsuite/test/decorators.py", line 135, in wrapper return func(*args, **kwargs) File "/Users/buildslave/jenkins/workspace/lldb-cmake-sanitized/llvm-project/lldb/packages/Python/lldbsuite/test/decorators.py", line 135, in wrapper return func(*args, **kwargs) File "/Users/buildslave/jenkins/workspace/lldb-cmake-sanitized/llvm-project/lldb/test/API/macosx/simulator/TestSimulatorPlatform.py", line 127, in test_lc_version_min_iphoneos expected_load_command='LC_VERSION_MIN_IPHONEOS') File "/Users/buildslave/jenkins/workspace/lldb-cmake-sanitized/llvm-project/lldb/test/API/macosx/simulator/TestSimulatorPlatform.py", line 50, in run_with lldb.SBFileSpec("hello.c")) File "/Users/buildslave/jenkins/workspace/lldb-cmake-sanitized/llvm-project/lldb/packages/Python/lldbsuite/test/lldbutil.py", line 919, in run_to_source_breakpoint only_one_thread, extra_images) File "/Users/buildslave/jenkins/workspace/lldb-cmake-sanitized/llvm-project/lldb/packages/Python/lldbsuite/test/lldbutil.py", line 848, in run_to_breakpoint_do_run test.assertEqual(num_threads, 1, "Expected 1 thread to stop at breakpoint, %d did."%(num_threads)) AssertionError: 0 != 1 : Expected 1 thread to stop at breakpoint, 0 did. Config=x86_64-/Users/buildslave/jenkins/workspace/lldb-cmake-sanitized/lldb-build/bin/clang ====================================================================== FAIL: test_lc_version_min_macosx (TestSimulatorPlatform.TestSimulatorPlatformLaunching) Test running a back-deploying non-simulator MacOS X binary ---------------------------------------------------------------------- Traceback (most recent call last): File "/Users/buildslave/jenkins/workspace/lldb-cmake-sanitized/llvm-project/lldb/packages/Python/lldbsuite/test/decorators.py", line 135, in wrapper return func(*args, **kwargs) File "/Users/buildslave/jenkins/workspace/lldb-cmake-sanitized/llvm-project/lldb/test/API/macosx/simulator/TestSimulatorPlatform.py", line 116, in test_lc_version_min_macosx expected_load_command='LC_VERSION_MIN_MACOSX') File "/Users/buildslave/jenkins/workspace/lldb-cmake-sanitized/llvm-project/lldb/test/API/macosx/simulator/TestSimulatorPlatform.py", line 53, in run_with self.check_debugserver(log, os+env, vers) File "/Users/buildslave/jenkins/workspace/lldb-cmake-sanitized/llvm-project/lldb/test/API/macosx/simulator/TestSimulatorPlatform.py", line 36, in check_debugserver self.assertTrue(aout_info) AssertionError: None is not True Config=x86_64-/Users/buildslave/jenkins/workspace/lldb-cmake-sanitized/lldb-build/bin/clang ====================================================================== FAIL: test_lc_version_min_tvos (TestSimulatorPlatform.TestSimulatorPlatformLaunching) Test running a back-deploying tvOS simulator binary ---------------------------------------------------------------------- Traceback (most recent call last): File "/Users/buildslave/jenkins/workspace/lldb-cmake-sanitized/llvm-project/lldb/packages/Python/lldbsuite/test/decorators.py", line 135, in wrapper return func(*args, **kwargs) File "/Users/buildslave/jenkins/workspace/lldb-cmake-sanitized/llvm-project/lldb/packages/Python/lldbsuite/test/decorators.py", line 135, in wrapper return func(*args, **kwargs) File "/Users/buildslave/jenkins/workspace/lldb-cmake-sanitized/llvm-project/lldb/packages/Python/lldbsuite/test/decorators.py", line 135, in wrapper return func(*args, **kwargs) File "/Users/buildslave/jenkins/workspace/lldb-cmake-sanitized/llvm-project/lldb/test/API/macosx/simulator/TestSimulatorPlatform.py", line 162, in test_lc_version_min_tvos expected_load_command='LC_VERSION_MIN_TVOS') File "/Users/buildslave/jenkins/workspace/lldb-cmake-sanitized/llvm-project/lldb/test/API/macosx/simulator/TestSimulatorPlatform.py", line 50, in run_with lldb.SBFileSpec("hello.c")) File "/Users/buildslave/jenkins/workspace/lldb-cmake-sanitized/llvm-project/lldb/packages/Python/lldbsuite/test/lldbutil.py", line 919, in run_to_source_breakpoint only_one_thread, extra_images) File "/Users/buildslave/jenkins/workspace/lldb-cmake-sanitized/llvm-project/lldb/packages/Python/lldbsuite/test/lldbutil.py", line 848, in run_to_breakpoint_do_run test.assertEqual(num_threads, 1, "Expected 1 thread to stop at breakpoint, %d did."%(num_threads)) AssertionError: 0 != 1 : Expected 1 thread to stop at breakpoint, 0 did. Config=x86_64-/Users/buildslave/jenkins/workspace/lldb-cmake-sanitized/lldb-build/bin/clang ====================================================================== FAIL: test_tvos (TestSimulatorPlatform.TestSimulatorPlatformLaunching) Test running an tvOS simulator binary ---------------------------------------------------------------------- Traceback (most recent call last): File "/Users/buildslave/jenkins/workspace/lldb-cmake-sanitized/llvm-project/lldb/packages/Python/lldbsuite/test/decorators.py", line 135, in wrapper return func(*args, **kwargs) File "/Users/buildslave/jenkins/workspace/lldb-cmake-sanitized/llvm-project/lldb/packages/Python/lldbsuite/test/decorators.py", line 135, in wrapper return func(*args, **kwargs) File "/Users/buildslave/jenkins/workspace/lldb-cmake-sanitized/llvm-project/lldb/test/API/macosx/simulator/TestSimulatorPlatform.py", line 73, in test_tvos expected_load_command='LC_BUILD_VERSION') File "/Users/buildslave/jenkins/workspace/lldb-cmake-sanitized/llvm-project/lldb/test/API/macosx/simulator/TestSimulatorPlatform.py", line 50, in run_with lldb.SBFileSpec("hello.c")) File "/Users/buildslave/jenkins/workspace/lldb-cmake-sanitized/llvm-project/lldb/packages/Python/lldbsuite/test/lldbutil.py", line 919, in run_to_source_breakpoint only_one_thread, extra_images) File "/Users/buildslave/jenkins/workspace/lldb-cmake-sanitized/llvm-project/lldb/packages/Python/lldbsuite/test/lldbutil.py", line 848, in run_to_breakpoint_do_run test.assertEqual(num_threads, 1, "Expected 1 thread to stop at breakpoint, %d did."%(num_threads)) AssertionError: 0 != 1 : Expected 1 thread to stop at breakpoint, 0 did. Config=x86_64-/Users/buildslave/jenkins/workspace/lldb-cmake-sanitized/lldb-build/bin/clang ---------------------------------------------------------------------- Ran 12 tests in 47.296s

Hide Details

RESULT: FAILED (0 passes, 6 failures, 0 errors, 6 skipped, 0 expected failures, 0 unexpected successes)

Hide Details

--

Hide Details

******************** PASS: lldb-unit :: Utility/./UtilityTests/DataExtractorTest.GetBitfield (1508 of 2110) PASS: lldb-unit :: Utility/./UtilityTests/UriParserTest.LongPath (1509 of 2110) PASS: lldb-unit :: Utility/./UtilityTests/ListenerTest.GetEventImmediate (1510 of 2110) PASS: lldb-api :: lang/cpp/class-template-parameter-pack/TestClassTemplateParameterPack.py (1511 of 2110) PASS: lldb-api :: tools/lldb-server/TestGdbRemote_qThreadStopInfo.py (1512 of 2110) PASS: lldb-unit :: Process/minidump/./LLDBMinidumpTests/MinidumpParserTest.FindMemoryRangeWithFullMemoryMinidump (1513 of 2110) PASS: lldb-shell :: Reproducer/Functionalities/TestDataFormatter.test (1514 of 2110) PASS: lldb-shell :: Reproducer/TestDriverOptions.test (1515 of 2110) PASS: lldb-unit :: Host/./HostTests/NativeProcessProtocolTest.ReadCStringFromMemory_CrossPageBoundary (1516 of 2110) UNSUPPORTED: lldb-api :: tools/intel-features/intel-pt/test/TestIntelPTSimpleBinary.py (1517 of 2110) PASS: lldb-shell :: SymbolFile/DWARF/debug_ranges-missing-section.s (1518 of 2110) PASS: lldb-unit :: Utility/./UtilityTests/FileSpecTest.FormatFileSpec (1519 of 2110) PASS: lldb-api :: lang/cpp/exceptions/TestCPPExceptionBreakpoints.py (1520 of 2110) PASS: lldb-unit :: ScriptInterpreter/Python/./ScriptInterpreterPythonTests/PythonDataObjectsTest.TestTypeNameResolutionNoDot (1521 of 2110) PASS: lldb-api :: lang/cpp/operator-overload/TestOperatorOverload.py (1522 of 2110) PASS: lldb-shell :: Reproducer/Functionalities/TestImageList.test (1523 of 2110) PASS: lldb-api :: lang/objc/foundation/TestObjCMethodsString.py (1524 of 2110) PASS: lldb-api :: functionalities/breakpoint/objc/TestObjCBreakpoints.py (1525 of 2110) UNSUPPORTED: lldb-shell :: SymbolFile/NativePDB/ast-functions-msvc.cpp (1526 of 2110) UNSUPPORTED: lldb-api :: commands/target/auto-install-main-executable/TestAutoInstallMainExecutable.py (1527 of 2110) PASS: lldb-api :: functionalities/unwind/noreturn/TestNoreturnUnwind.py (1528 of 2110) PASS: lldb-api :: commands/expression/completion/TestExprCompletion.py (1529 of 2110) UNSUPPORTED: lldb-api :: commands/expression/macros/TestMacros.py (1530 of 2110) PASS: lldb-api :: python_api/lldbutil/TestSwigVersion.py (1531 of 2110) PASS: lldb-unit :: Utility/./UtilityTests/LogChannelTest.Enable (1532 of 2110) UNSUPPORTED: lldb-shell :: SymbolFile/NativePDB/stack_unwinding01.cpp (1533 of 2110) PASS: lldb-unit :: Utility/./UtilityTests/RecordReplayTest.InstrumentedBar (1534 of 2110) PASS: lldb-api :: types/TestShortTypeExpr.py (1535 of 2110) PASS: lldb-api :: functionalities/inline-stepping/TestInlineStepping.py (1536 of 2110) PASS: lldb-api :: functionalities/dynamic_value_child_count/TestDynamicValueChildCount.py (1537 of 2110) PASS: lldb-unit :: Utility/./UtilityTests/StreamTest.PutBytesAsRawHex8ToBigEndian (1538 of 2110) PASS: lldb-api :: python_api/exprpath_synthetic/TestExprPathSynthetic.py (1539 of 2110) PASS: lldb-api :: commands/breakpoint/command/list/TestBreakpointCommandList.py (1540 of 2110) PASS: lldb-api :: python_api/file_handle/TestFileHandle.py (1541 of 2110) PASS: lldb-api :: python_api/sbdata/TestSBData.py (1542 of 2110) PASS: lldb-api :: commands/expression/import-std-module/no-std-module/TestMissingStdModule.py (1543 of 2110) PASS: lldb-api :: functionalities/data-formatter/data-formatter-stl/libcxx/map/TestDataFormatterLibccMap.py (1544 of 2110) PASS: lldb-api :: commands/expression/weak_symbols/TestWeakSymbols.py (1545 of 2110) PASS: lldb-unit :: Utility/./UtilityTests/RegularExpression.Match (1546 of 2110) UNSUPPORTED: lldb-api :: benchmarks/libcxxlist/TestBenchmarkLibcxxList.py (1547 of 2110) PASS: lldb-api :: functionalities/data-formatter/refpointer-recursion/TestDataFormatterRefPtrRecursion.py (1548 of 2110) PASS: lldb-shell :: ObjectFile/ELF/PT_LOAD-overlap.yaml (1549 of 2110) PASS: lldb-shell :: ObjectFile/ELF/netbsd-core-amd64.test (1550 of 2110) PASS: lldb-api :: lang/cpp/bitfields/TestCppBitfields.py (1551 of 2110) PASS: lldb-unit :: UnwindAssembly/x86/./UnwindAssemblyx86Tests/Testx86AssemblyInspectionEngine.TestPopRBP (1552 of 2110) PASS: lldb-unit :: Utility/./UtilityTests/TimerTest.CategoryTimesNested (1553 of 2110) PASS: lldb-unit :: SymbolFile/NativePDB/./SymbolFileNativePDBTests/PDBFPOProgramToDWARFExpressionTests.MissingTargetRegister (1554 of 2110) PASS: lldb-api :: functionalities/data-formatter/data-formatter-objc/TestDataFormatterObjNSException.py (1555 of 2110) PASS: lldb-shell :: SymbolFile/DWARF/DW_OP_piece-struct.s (1556 of 2110) PASS: lldb-api :: lang/c/inlines/TestRedefinitionsInInlines.py (1557 of 2110) PASS: lldb-shell :: ObjectFile/ELF/build-id-case.yaml (1558 of 2110) PASS: lldb-api :: functionalities/data-formatter/array_typedef/TestArrayTypedef.py (1559 of 2110) PASS: lldb-unit :: Symbol/./SymbolTests/SymbolsTest.TerminateLocateExecutableSymbolFileForUnknownExecutableAndUnknownSymbolFile (1560 of 2110) PASS: lldb-unit :: Utility/./UtilityTests/XcodeSDKTest.SDKSupportsModules (1561 of 2110) UNSUPPORTED: lldb-api :: commands/gui/basic/TestGuiBasic.py (1562 of 2110) PASS: lldb-unit :: Host/./HostTests/FileSystemTest.GetByteSize (1563 of 2110) PASS: lldb-unit :: Utility/./UtilityTests/StringExtractorTest.GetHexBytesAvail (1564 of 2110) PASS: lldb-shell :: ObjectFile/MachO/lc_version_min.yaml (1565 of 2110) PASS: lldb-unit :: Utility/./UtilityTests/VMRange.Clear (1566 of 2110) PASS: lldb-unit :: Symbol/./SymbolTests/TestTypeSystemClang.TestDeletingImplicitCopyCstrDueToMoveCStr (1567 of 2110) PASS: lldb-api :: lang/objc/objc++/TestObjCXX.py (1568 of 2110) PASS: lldb-unit :: Utility/./UtilityTests/StringListTest.InsertStringAtIndexMove (1569 of 2110) PASS: lldb-unit :: Process/gdb-remote/./ProcessGdbRemoteTests/GDBRemoteCommunicationServerTest.SendErrorResponse_StringError (1570 of 2110) PASS: lldb-unit :: Utility/./UtilityTests/BinaryStreamTest.PutSLEB128EightBytes (1571 of 2110) PASS: lldb-api :: functionalities/unwind/zeroth_frame/TestZerothFrame.py (1572 of 2110) PASS: lldb-api :: lang/cpp/thread_local/TestThreadLocal.py (1573 of 2110) PASS: lldb-unit :: Utility/./UtilityTests/ScalarTest.GetValue (1574 of 2110) PASS: lldb-unit :: Utility/./UtilityTests/StringExtractorTest.GetHexBytes_Partial (1575 of 2110) PASS: lldb-api :: functionalities/lazy-loading/TestLazyLoading.py (1576 of 2110) PASS: lldb-api :: functionalities/signal/raise/TestRaise.py (1577 of 2110) PASS: lldb-shell :: ScriptInterpreter/Python/crashlog.test (1578 of 2110) PASS: lldb-api :: functionalities/data-formatter/compactvectors/TestCompactVectors.py (1579 of 2110) PASS: lldb-shell :: Settings/TestLineMarkerColor.test (1580 of 2110) PASS: lldb-api :: functionalities/gdb_remote_client/TestProcessConnect.py (1581 of 2110) PASS: lldb-unit :: Utility/./UtilityTests/BinaryStreamTest.PutSLEB128TwoBytes (1582 of 2110) PASS: lldb-api :: commands/expression/deleting-implicit-copy-constructor/TestDeletingImplicitCopyConstructor.py (1583 of 2110) PASS: lldb-unit :: Utility/./UtilityTests/SerializationRountripTest.SerializeDeserializeCStringNull (1584 of 2110) PASS: lldb-unit :: Expression/./ExpressionTests/DiagnosticManagerTest.FixedExpression (1585 of 2110) PASS: lldb-api :: commands/watchpoints/watchpoint_size/TestWatchpointSizes.py (1586 of 2110) PASS: lldb-shell :: SymbolFile/DWARF/find-basic-namespace.cpp (1587 of 2110) PASS: lldb-shell :: SymbolFile/Breakpad/line-table-missing-file.test (1588 of 2110) PASS: lldb-api :: functionalities/value_md5_crash/TestValueMD5Crash.py (1589 of 2110) PASS: lldb-unit :: SymbolFile/DWARF/./SymbolFileDWARFTests/SymbolFileDWARFTests.TestAbilitiesForDWARF (1590 of 2110) PASS: lldb-unit :: Utility/./UtilityTests/OptionsWithRawTest.UnterminatedQuote (1591 of 2110) PASS: lldb-api :: lang/objc/foundation/TestObjCMethods.py (1592 of 2110) PASS: lldb-unit :: Process/minidump/./LLDBMinidumpTests/MinidumpParserTest.GetThreadContext_x86_32 (1593 of 2110) PASS: lldb-unit :: Utility/./UtilityTests/ArgsTest.GetArgumentArrayRef (1594 of 2110) PASS: lldb-unit :: Utility/./UtilityTests/CompletionRequest.DuplicateFiltering (1595 of 2110) PASS: lldb-unit :: Utility/./UtilityTests/XcodeSDKTest.GetSDKTypeForTriple (1596 of 2110) PASS: lldb-api :: functionalities/data-formatter/setvaluefromcstring/TestSetValueFromCString.py (1597 of 2110) PASS: lldb-unit :: Process/gdb-remote/./ProcessGdbRemoteTests/GDBRemoteClientBaseTest.SendContinueAndAsyncSignal (1598 of 2110) PASS: lldb-api :: functionalities/thread/step_out/TestThreadStepOut.py (1599 of 2110) PASS: lldb-shell :: ScriptInterpreter/Python/eof.test (1600 of 2110) PASS: lldb-unit :: Utility/./UtilityTests/FileSpecTest.GuessPathStyle (1601 of 2110) UNSUPPORTED: lldb-api :: functionalities/data-formatter/data-formatter-stl/libstdcpp/smart_ptr/TestDataFormatterStdSmartPtr.py (1602 of 2110) UNSUPPORTED: lldb-api :: commands/gui/breakpoints/TestGuiBreakpoints.py (1603 of 2110) PASS: lldb-api :: lang/cpp/rvalue-references/TestRvalueReferences.py (1604 of 2110) UNSUPPORTED: lldb-api :: benchmarks/startup/TestStartupDelays.py (1605 of 2110) PASS: lldb-api :: lang/cpp/limit-debug-info/TestWithLimitDebugInfo.py (1606 of 2110) PASS: lldb-api :: commands/expression/test/TestExprs.py (1607 of 2110) PASS: lldb-api :: functionalities/plugins/command_plugin/TestPluginCommands.py (1608 of 2110) UNSUPPORTED: lldb-api :: functionalities/thread/create_during_step/TestCreateDuringStep.py (1609 of 2110) UNSUPPORTED: lldb-api :: lang/c/unicode/TestUnicodeSymbols.py (1610 of 2110) PASS: lldb-shell :: SymbolFile/NativePDB/break-by-line.cpp (1611 of 2110) PASS: lldb-api :: python_api/sbvalue_persist/TestSBValuePersist.py (1612 of 2110) PASS: lldb-api :: lang/cpp/const_this/TestConstThis.py (1613 of 2110) PASS: lldb-unit :: Symbol/./SymbolTests/TestTypeSystemClang.AddMethodToObjCObjectType (1614 of 2110) PASS: lldb-api :: commands/expression/formatters/TestFormatters.py (1615 of 2110) PASS: lldb-api :: commands/process/attach-resume/TestAttachResume.py (1616 of 2110) PASS: lldb-api :: functionalities/breakpoint/dummy_target_breakpoints/TestBreakpointsWithNoTargets.py (1617 of 2110) PASS: lldb-unit :: SymbolFile/NativePDB/./SymbolFileNativePDBTests/PDBFPOProgramToDWARFExpressionTests.UnresolvedDependentCyclicRegisterAssignmentReference (1618 of 2110) PASS: lldb-unit :: Utility/./UtilityTests/BroadcasterTest.EventTypeHasListeners (1619 of 2110) PASS: lldb-shell :: SymbolFile/DWARF/DW_AT_loclists_base.s (1620 of 2110) PASS: lldb-unit :: Utility/./UtilityTests/CompletionRequest.ShiftArguments (1621 of 2110) UNSUPPORTED: lldb-api :: functionalities/tsan/thread_leak/TestTsanThreadLeak.py (1622 of 2110) UNSUPPORTED: lldb-api :: functionalities/darwin_log/filter/exact_match/message/TestDarwinLogFilterMatchMessage.py (1623 of 2110) PASS: lldb-unit :: Utility/./UtilityTests/StreamTest.AddressEmptyPrefix (1624 of 2110) PASS: lldb-api :: python_api/value/empty_class/TestValueAPIEmptyClass.py (1625 of 2110) PASS: lldb-shell :: SymbolFile/Breakpad/line-table.test (1626 of 2110) PASS: lldb-shell :: Minidump/breakpad-symbols.test (1627 of 2110) PASS: lldb-api :: lang/objc/objc-checker/TestObjCCheckers.py (1628 of 2110) PASS: lldb-api :: commands/expression/import-std-module/empty-module/TestEmptyStdModule.py (1629 of 2110) PASS: lldb-api :: functionalities/data-formatter/parray/TestPrintArray.py (1630 of 2110) PASS: lldb-api :: functionalities/process_crash_info/TestProcessCrashInfo.py (1631 of 2110) PASS: lldb-unit :: Utility/./UtilityTests/StringListTest.Join (1632 of 2110) PASS: lldb-api :: commands/command/invalid-args/TestInvalidArgsCommand.py (1633 of 2110) PASS: lldb-api :: lang/objc/objc-static-method-stripped/TestObjCStaticMethodStripped.py (1634 of 2110) UNSUPPORTED: lldb-api :: linux/sepdebugsymlink/TestTargetSymbolsSepDebugSymlink.py (1635 of 2110) PASS: lldb-api :: types/TestFloatTypes.py (1636 of 2110) PASS: lldb-api :: commands/frame/diagnose/array/TestArray.py (1637 of 2110) PASS: lldb-unit :: Utility/./UtilityTests/Flags.IsClear (1638 of 2110) PASS: lldb-shell :: Minidump/fb-dump.test (1639 of 2110) PASS: lldb-api :: functionalities/thread/concurrent_events/TestConcurrentBreakpointsDelayedBreakpointOneWatchpoint.py (1640 of 2110) PASS: lldb-unit :: Expression/./ExpressionTests/CppModuleConfigurationTest.AmbiguousLibCpp (1641 of 2110) PASS: lldb-api :: commands/expression/test/TestExprs2.py (1642 of 2110) PASS: lldb-api :: functionalities/plugins/python_os_plugin/TestPythonOSPlugin.py (1643 of 2110) PASS: lldb-api :: functionalities/postmortem/elf-core/gcore/TestGCore.py (1644 of 2110) PASS: lldb-api :: functionalities/data-formatter/data-formatter-objc/TestDataFormatterObjCCF.py (1645 of 2110) PASS: lldb-api :: lang/objc/variadic_methods/TestVariadicMethods.py (1646 of 2110) PASS: lldb-shell :: ObjectFile/ELF/PT_TLS-overlap-PT_LOAD.yaml (1647 of 2110) PASS: lldb-unit :: Utility/./UtilityTests/RegularExpression.CopyAssignment (1648 of 2110) UNSUPPORTED: lldb-api :: lang/objc/ptr_refs/TestPtrRefsObjC.py (1649 of 2110) PASS: lldb-shell :: SymbolFile/NativePDB/disassembly.cpp (1650 of 2110) PASS: lldb-api :: python_api/lldbutil/frame/TestFrameUtils.py (1651 of 2110) PASS: lldb-unit :: Utility/./UtilityTests/FileSpecTest.PrependPathComponent (1652 of 2110) PASS: lldb-shell :: SymbolFile/DWARF/DW_TAG_variable-invalid_location.s (1653 of 2110) PASS: lldb-api :: tools/lldb-vscode/stackTrace/TestVSCode_stackTrace.py (1654 of 2110) PASS: lldb-unit :: Utility/./UtilityTests/RegularExpression.Empty (1655 of 2110) PASS: lldb-api :: lang/objc/foundation/TestObjCMethodsNSArray.py (1656 of 2110) UNSUPPORTED: lldb-shell :: Register/x86-64-gp-write.test (1657 of 2110) PASS: lldb-shell :: ObjectFile/ELF/compressed-sections.yaml (1658 of 2110) UNSUPPORTED: lldb-shell :: Register/x86-gp-read.test (1659 of 2110) PASS: lldb-unit :: Target/./TargetTests/ExecutionContextTest.GetByteOrderTarget (1660 of 2110) PASS: lldb-unit :: Utility/./UtilityTests/StringExtractorTest.GetHexBytes_OddPair2 (1661 of 2110) UNSUPPORTED: lldb-api :: android/platform/TestDefaultCacheLineSize.py (1662 of 2110) PASS: lldb-shell :: Process/Optimization.test (1663 of 2110) PASS: lldb-unit :: Utility/./UtilityTests/ArgsTest.TestSingleArgWithQuotedSpace (1664 of 2110) PASS: lldb-unit :: Utility/./UtilityTests/StreamTest.PutHex64ByteOrderLittle (1665 of 2110) PASS: lldb-unit :: Utility/./UtilityTests/RangeDataVector.FindEntryIndexesThatContain_Overlap (1666 of 2110) PASS: lldb-unit :: DataFormatter/./LLDBFormatterTests/TypeMatcherTests.CreatedBySameMatchString (1667 of 2110) PASS: lldb-unit :: Symbol/./SymbolTests/TestTypeSystemClang.TestRemoveFastQualifiers (1668 of 2110) PASS: lldb-unit :: Utility/./UtilityTests/StringExtractorTest.GetHexU8_Underflow_NoEof (1669 of 2110) PASS: lldb-unit :: Symbol/./SymbolTests/TestClangASTImporter.ImportInvalidType (1670 of 2110) PASS: lldb-unit :: Utility/./UtilityTests/RangeTest.ContainsAddrInvalid (1671 of 2110) UNSUPPORTED: lldb-api :: functionalities/asan/TestMemoryHistory.py (1672 of 2110) PASS: lldb-api :: functionalities/thread/concurrent_events/TestConcurrentDelayedCrashWithBreakpointSignal.py (1673 of 2110) PASS: lldb-unit :: Utility/./UtilityTests/StreamTest.PutRawBytesToLittleEndian (1674 of 2110) PASS: lldb-shell :: ObjectFile/ELF/PT_LOAD-overlap-PT_TLS.yaml (1675 of 2110) PASS: lldb-unit :: Utility/./UtilityTests/DataExtractorTest.GetCStrAtNullOffset (1676 of 2110) PASS: lldb-unit :: UnwindAssembly/x86/./UnwindAssemblyx86Tests/Testx86AssemblyInspectionEngine.TestPopR12 (1677 of 2110) PASS: lldb-unit :: Utility/./UtilityTests/StreamTest.PutChar (1678 of 2110) PASS: lldb-api :: commands/target/modules/search-paths/insert/TestTargetModulesSearchpathsInsert.py (1679 of 2110) PASS: lldb-unit :: Utility/./UtilityTests/VMRange.CollectionContains (1680 of 2110) PASS: lldb-unit :: Utility/./UtilityTests/StructuredDataTest.ParseJSONFromFile (1681 of 2110) PASS: lldb-shell :: Driver/TestTarget.test (1682 of 2110) PASS: lldb-unit :: Utility/./UtilityTests/StringListTest.LongestCommonPrefixSingleElement (1683 of 2110) PASS: lldb-unit :: Utility/./UtilityTests/StringExtractorTest.GetHexBytesAvail_FullString (1684 of 2110) PASS: lldb-unit :: Language/Highlighting/./HighlighterTests/HighlighterTest.DefaultHighlighterWithCursor (1685 of 2110) PASS: lldb-unit :: Language/CLanguages/./LanguageCLanguagesTests/CLanguages.LookupCLanguagesByLanguageType (1686 of 2110) PASS: lldb-api :: functionalities/gdb_remote_client/TestThreadSelectionBug.py (1687 of 2110) PASS: lldb-shell :: Settings/TestStopCommandSourceOnError.test (1688 of 2110) PASS: lldb-unit :: Utility/./UtilityTests/ArgsTest.TestSingleArg (1689 of 2110) PASS: lldb-unit :: Utility/./UtilityTests/ArgsTest.StringListConstructor (1690 of 2110) PASS: lldb-api :: lang/c/set_values/TestSetValues.py (1691 of 2110) PASS: lldb-api :: python_api/sbvalue_const_addrof/TestSBValueConstAddrOf.py (1692 of 2110) PASS: lldb-unit :: ScriptInterpreter/Python/./ScriptInterpreterPythonTests/PythonDataObjectsTest.TestResetting (1693 of 2110) PASS: lldb-api :: functionalities/data-formatter/data-formatter-stl/libcxx/tuple/TestDataFormatterLibcxxTuple.py (1694 of 2110) PASS: lldb-api :: commands/platform/process/list/TestProcessList.py (1695 of 2110) PASS: lldb-unit :: Expression/./ExpressionTests/CppModuleConfigurationTest.AmbiguousCLib (1696 of 2110) PASS: lldb-api :: lang/cpp/template-specialization-type/TestTemplateSpecializationType.py (1697 of 2110) PASS: lldb-unit :: SymbolFile/DWARF/./SymbolFileDWARFTests/SymbolFileDWARFTests.TestAbbrevInvalidNULLTag (1698 of 2110) PASS: lldb-api :: commands/source/info/TestSourceInfo.py (1699 of 2110) PASS: lldb-api :: commands/expression/import-std-module/weak_ptr-dbg-info-content/TestDbgInfoContentWeakPtrFromStdModule.py (1700 of 2110) PASS: lldb-unit :: Symbol/./SymbolTests/PostfixExpression.ParseFPOProgram (1701 of 2110) PASS: lldb-unit :: Expression/./ExpressionTests/DiagnosticManagerTest.AppendMessageSubsequentDiags (1702 of 2110) PASS: lldb-api :: lang/cpp/diamond/TestDiamond.py (1703 of 2110) PASS: lldb-unit :: Utility/./UtilityTests/ConstStringTest.format_provider (1704 of 2110) PASS: lldb-api :: functionalities/tail_call_frames/cross_dso/TestCrossDSOTailCalls.py (1705 of 2110) PASS: lldb-unit :: Utility/./UtilityTests/StringListTest.SplitIntoLinesSingleTrailingCR (1706 of 2110) PASS: lldb-unit :: ObjectFile/Breakpad/./ObjectFileBreakpadTests/PublicRecord.parse (1707 of 2110) PASS: lldb-api :: python_api/thread/TestThreadAPI.py (1708 of 2110) PASS: lldb-shell :: ObjectFile/PECOFF/section-types.yaml (1709 of 2110) PASS: lldb-unit :: Process/gdb-remote/./ProcessGdbRemoteTests/GDBRemoteCommunicationClientTest.SendStartTracePacket (1710 of 2110) UNSUPPORTED: lldb-api :: functionalities/thread/concurrent_events/TestConcurrentManySignals.py (1711 of 2110) PASS: lldb-api :: types/TestShortType.py (1712 of 2110) PASS: lldb-unit :: Symbol/./SymbolTests/TestClangASTImporter.CompleteFwdDeclWithOtherOrigin (1713 of 2110) PASS: lldb-unit :: UnwindAssembly/x86/./UnwindAssemblyx86Tests/Testx86AssemblyInspectionEngine.Test32bitFramelessBigStackFrame (1714 of 2110) PASS: lldb-unit :: ScriptInterpreter/Python/./ScriptInterpreterPythonTests/PythonDataObjectsTest.TestModuleNameResolutionNoDot (1715 of 2110) PASS: lldb-unit :: Utility/./UtilityTests/NameMatchesTest.RegularExpression (1716 of 2110) PASS: lldb-shell :: SymbolFile/Breakpad/unwind-via-raSearch.test (1717 of 2110) PASS: lldb-shell :: ObjectFile/ELF/base-address.yaml (1718 of 2110) PASS: lldb-unit :: UnwindAssembly/x86/./UnwindAssemblyx86Tests/Testx86AssemblyInspectionEngine.TestPushRBX (1719 of 2110) PASS: lldb-shell :: SymbolFile/NativePDB/break-by-function.cpp (1720 of 2110) PASS: lldb-shell :: Unwind/thread-step-out-ret-addr-check.test (1721 of 2110) PASS: lldb-unit :: Symbol/./SymbolTests/Type.GetTypeScopeAndBasename (1722 of 2110) PASS: lldb-unit :: Host/./HostTests/SocketTest.DomainGetConnectURI (1723 of 2110) PASS: lldb-api :: commands/platform/basic/TestPlatformCommand.py (1724 of 2110) PASS: lldb-unit :: Utility/./UtilityTests/ProcessInstanceInfo.Dump (1725 of 2110) PASS: lldb-api :: lang/cpp/trivial_abi/TestTrivialABI.py (1726 of 2110) PASS: lldb-unit :: Utility/./UtilityTests/ConstStringTest.FromMidOfBufferStringRef (1727 of 2110) PASS: lldb-api :: commands/session/history/TestSessionHistory.py (1728 of 2110) PASS: lldb-api :: commands/expression/import-std-module/vector-bool/TestVectorBoolFromStdModule.py (1729 of 2110) UNSUPPORTED: lldb-api :: lang/objc/objc-dynamic-value/TestObjCDynamicValue.py (1730 of 2110) PASS: lldb-api :: sanity/TestSettingSkipping.py (1731 of 2110) PASS: lldb-unit :: Symbol/./SymbolTests/TestClangASTImporter.CopyDeclTagDecl (1732 of 2110) PASS: lldb-shell :: Settings/TestModuleCacheSanity.test (1733 of 2110) PASS: lldb-unit :: Symbol/./SymbolTests/SymbolsTest.LocateExecutableSymbolFileForUnknownExecutableAndMissingSymbolFile (1734 of 2110) PASS: lldb-shell :: ObjectFile/wasm/unified-debug-sections.yaml (1735 of 2110) PASS: lldb-api :: commands/expression/radar_9531204/TestPrintfAfterUp.py (1736 of 2110) PASS: lldb-api :: commands/expression/cast_int_to_anonymous_enum/TestCastIntToAnonymousEnum.py (1737 of 2110) PASS: lldb-unit :: Host/./HostTests/SocketTest.UDPGetConnectURI (1738 of 2110) PASS: lldb-unit :: Utility/./UtilityTests/StreamTest.PutHex64ByteOrderBig (1739 of 2110) PASS: lldb-api :: functionalities/gdb_remote_client/TestNoGPacketSupported.py (1740 of 2110) PASS: lldb-unit :: Utility/./UtilityTests/AnsiTerminal.Unknown (1741 of 2110) PASS: lldb-unit :: Utility/./UtilityTests/StringListTest.AppendStringMove (1742 of 2110) PASS: lldb-api :: functionalities/thread/concurrent_events/TestConcurrentDelaySignalBreak.py (1743 of 2110) PASS: lldb-api :: python_api/sbstructureddata/TestStructuredDataAPI.py (1744 of 2110) PASS: lldb-unit :: Utility/./UtilityTests/DataExtractorTest.GetCStrUnterminated (1745 of 2110) PASS: lldb-unit :: Interpreter/./InterpreterTests/OptionArgParserTest.toBoolean (1746 of 2110) PASS: lldb-unit :: Utility/./UtilityTests/DataExtractorTest.GetFloat (1747 of 2110) PASS: lldb-unit :: debugserver/./debugserverTests/JSON.Parse (1748 of 2110) PASS: lldb-api :: lang/objcxx/cxx-bridged-po/TestObjCXXBridgedPO.py (1749 of 2110) PASS: lldb-unit :: Utility/./UtilityTests/ReproducerTest.SetCapture (1750 of 2110) PASS: lldb-shell :: Reproducer/TestReuseDirectory.test (1751 of 2110) PASS: lldb-api :: functionalities/thread/concurrent_events/TestConcurrentTwoWatchpointsOneSignal.py (1752 of 2110) PASS: lldb-unit :: UnwindAssembly/x86/./UnwindAssemblyx86Tests/Testx86AssemblyInspectionEngine.TestPushEAX (1753 of 2110) PASS: lldb-api :: functionalities/object-file/TestImageListMultiArchitecture.py (1754 of 2110) PASS: lldb-unit :: Process/minidump/./LLDBMinidumpTests/RegisterContextMinidump.ConvertMinidumpContext_x86_32 (1755 of 2110) PASS: lldb-shell :: SymbolFile/DWARF/dwp-debug-types.s (1756 of 2110) PASS: lldb-api :: lang/c/struct_types/TestStructTypes.py (1757 of 2110) PASS: lldb-api :: commands/expression/import-std-module/list/TestListFromStdModule.py (1758 of 2110) PASS: lldb-unit :: Utility/./UtilityTests/ScalarTest.Comparison (1759 of 2110) UNSUPPORTED: lldb-api :: tools/lldb-vscode/completions/TestVSCode_completions.py (1760 of 2110) PASS: lldb-shell :: SymbolFile/DWARF/limit-debug-info.s (1761 of 2110) PASS: lldb-shell :: Quit/TestQuitExitCodeNonInt.test (1762 of 2110) UNSUPPORTED: lldb-shell :: ScriptInterpreter/Lua/breakpoint_callback.test (1763 of 2110) PASS: lldb-unit :: Language/Highlighting/./HighlighterTests/HighlighterTest.ClangOperators (1764 of 2110) PASS: lldb-unit :: Host/./HostTests/HostInfoTest.GetAugmentedArchSpec (1765 of 2110) PASS: lldb-api :: functionalities/data-formatter/data-formatter-stl/libcxx/list/loop/TestDataFormatterLibcxxListLoop.py (1766 of 2110) PASS: lldb-unit :: Signals/./SignalsTests/UnixSignalsTest.GetFilteredSignals (1767 of 2110) UNSUPPORTED: lldb-shell :: SymbolFile/PDB/expressions.test (1768 of 2110) PASS: lldb-unit :: Host/./HostTests/FileSystemTest.EmptyTest (1769 of 2110) PASS: lldb-unit :: Utility/./UtilityTests/PassiveReplayTest.InstrumentedBarPtr (1770 of 2110) PASS: lldb-shell :: SymbolFile/Breakpad/line-table-mixed-path-styles.test (1771 of 2110) PASS: lldb-api :: lang/objc/objc-runtime-ivars/TestRuntimeIvars.py (1772 of 2110) PASS: lldb-api :: lang/c/bitfields/TestBitfields.py (1773 of 2110) PASS: lldb-shell :: SymbolFile/Breakpad/line-table-discontinuous-file-ids.test (1774 of 2110) PASS: lldb-api :: lang/cpp/operators/TestCppOperators.py (1775 of 2110) PASS: lldb-unit :: Utility/./UtilityTests/PassiveReplayTest.InstrumentedFooInvalid (1776 of 2110) PASS: lldb-unit :: Language/Highlighting/./HighlighterTests/HighlighterTest.ClangUnterminatedString (1777 of 2110) PASS: lldb-unit :: Expression/./ExpressionTests/DWARFExpression.DW_OP_pick (1778 of 2110) PASS: lldb-unit :: Symbol/./SymbolTests/TestClangASTImporter.CanImportInvalidType (1779 of 2110) PASS: lldb-unit :: Utility/./UtilityTests/StringListTest.InsertStringAtIndexOutOfBounds (1780 of 2110) PASS: lldb-unit :: Utility/./UtilityTests/UriParserTest.BracketedHostnameWithColon (1781 of 2110) PASS: lldb-api :: lang/objc/self/TestObjCSelf.py (1782 of 2110) PASS: lldb-unit :: Utility/./UtilityTests/StreamTest.SetIndentLevel (1783 of 2110) PASS: lldb-unit :: UnwindAssembly/x86/./UnwindAssemblyx86Tests/Testx86AssemblyInspectionEngine.TestStackRealign32BitDisp_x86_64 (1784 of 2110) PASS: lldb-unit :: UnwindAssembly/x86/./UnwindAssemblyx86Tests/Testx86AssemblyInspectionEngine.TestPopRBPWithREX (1785 of 2110) PASS: lldb-api :: commands/process/signal/TestProcessSignal.py (1786 of 2110) PASS: lldb-unit :: ObjectFile/PECOFF/./ObjectFilePECOFFTests/PECallFrameInfoTest.Frame_reg_eh (1787 of 2110) PASS: lldb-unit :: Target/./TargetTests/PathMappingListTest.RelativeTests (1788 of 2110) UNSUPPORTED: lldb-shell :: ExecControl/StopHook/stop-hook-threads.test (1789 of 2110) PASS: lldb-unit :: Utility/./UtilityTests/ProcessInstanceInfo.DumpTable_invalidUID (1790 of 2110) PASS: lldb-shell :: Reproducer/Functionalities/TestStepping.test (1791 of 2110) UNSUPPORTED: lldb-api :: commands/watchpoints/multi_watchpoint_slots/TestWatchpointMultipleSlots.py (1792 of 2110) PASS: lldb-unit :: Utility/./UtilityTests/TimeoutTest.Format (1793 of 2110) PASS: lldb-unit :: UnwindAssembly/x86/./UnwindAssemblyx86Tests/Testx86AssemblyInspectionEngine.TestPush0 (1794 of 2110) PASS: lldb-api :: functionalities/data-formatter/data-formatter-objc/TestDataFormatterObjCExpr.py (1795 of 2110) PASS: lldb-api :: commands/reproducer/invalid-args/TestInvalidArgsReproducer.py (1796 of 2110) PASS: lldb-unit :: Utility/./UtilityTests/BinaryStreamTest.PutULEB128Zero (1797 of 2110) PASS: lldb-api :: functionalities/data-formatter/data-formatter-stl/libcxx/optional/TestDataFormatterLibcxxOptional.py (1798 of 2110) UNSUPPORTED: lldb-shell :: ScriptInterpreter/Lua/independent_state.test (1799 of 2110) PASS: lldb-api :: functionalities/history/TestHistoryRecall.py (1800 of 2110) PASS: lldb-unit :: Utility/./UtilityTests/StringListTest.LongestCommonPrefixDuplicateElement (1801 of 2110) PASS: lldb-api :: commands/expression/static-initializers/TestStaticInitializers.py (1802 of 2110) PASS: lldb-api :: functionalities/thread/concurrent_events/TestConcurrentTwoBreakpointsOneDelaySignal.py (1803 of 2110) PASS: lldb-unit :: Utility/./UtilityTests/DataExtractorTest.GetSLEB128_bit63 (1804 of 2110) PASS: lldb-api :: commands/expression/import-std-module/unique_ptr/TestUniquePtrFromStdModule.py (1805 of 2110) PASS: lldb-unit :: Utility/./UtilityTests/StreamTest.ShiftOperatorStrings (1806 of 2110) PASS: lldb-unit :: Process/gdb-remote/./ProcessGdbRemoteTests/GDBRemoteCommunicationClientTest.SendGetTraceConfigPacket (1807 of 2110) PASS: lldb-unit :: Utility/./UtilityTests/StringExtractorTest.GetHexU8_Exact (1808 of 2110) UNSUPPORTED: lldb-shell :: SymbolFile/PDB/function-nested-block.test (1809 of 2110) PASS: lldb-unit :: Utility/./UtilityTests/UUIDTest.StringConverion (1810 of 2110) PASS: lldb-unit :: SymbolFile/NativePDB/./SymbolFileNativePDBTests/PDBFPOProgramToDWARFExpressionTests.UnknownOp (1811 of 2110) UNSUPPORTED: lldb-api :: functionalities/thread/break_after_join/TestBreakAfterJoin.py (1812 of 2110) PASS: lldb-api :: functionalities/data-formatter/data-formatter-stl/libcxx/string/TestDataFormatterLibcxxString.py (1813 of 2110) PASS: lldb-api :: functionalities/thread/ignore_suspended/TestIgnoreSuspendedThread.py (1814 of 2110) PASS: lldb-api :: commands/expression/import-std-module/list-dbg-info-content/TestDbgInfoContentListFromStdModule.py (1815 of 2110) PASS: lldb-shell :: SymbolFile/DWARF/inline-function-address-shared.test (1816 of 2110) PASS: lldb-unit :: ScriptInterpreter/Python/./ScriptInterpreterPythonTests/PythonDataObjectsTest.TestPythonDictionaryToStructuredDictionary (1817 of 2110) PASS: lldb-api :: python_api/disassemble-raw-data/TestDisassembleRawData.py (1818 of 2110) PASS: lldb-unit :: Utility/./UtilityTests/VMRange.ContainsRange (1819 of 2110) PASS: lldb-api :: commands/expression/invalid-args/TestInvalidArgsExpression.py (1820 of 2110) PASS: lldb-unit :: ScriptInterpreter/Python/./ScriptInterpreterPythonTests/PythonDataObjectsTest.TestPythonFile (1821 of 2110) PASS: lldb-unit :: Utility/./UtilityTests/ScalarTest.ExtractBitfield (1822 of 2110) PASS: lldb-shell :: ObjectFile/ELF/PT_LOAD-overlap-PT_INTERP.yaml (1823 of 2110) PASS: lldb-api :: commands/expression/result_numbering/TestResultNumbering.py (1824 of 2110) UNSUPPORTED: lldb-api :: tools/lldb-server/thread-name/TestGdbRemoteThreadName.py (1825 of 2110) PASS: lldb-unit :: Host/./HostTests/FileSystemTest.Exists (1826 of 2110) PASS: lldb-api :: commands/target/create-no-such-arch/TestNoSuchArch.py (1827 of 2110) PASS: lldb-unit :: Utility/./UtilityTests/BinaryStreamTest.PutSLEB128FiveBytes (1828 of 2110) PASS: lldb-unit :: Utility/./UtilityTests/StreamTest.PutBytesAsRawHex8ToMixedEndian (1829 of 2110) UNSUPPORTED: lldb-api :: functionalities/darwin_log/filter/regex/activity/TestDarwinLogFilterRegexActivity.py (1830 of 2110) PASS: lldb-unit :: Utility/./UtilityTests/BinaryStreamTest.PutSLEB128OneByte (1831 of 2110) PASS: lldb-api :: functionalities/gdb_remote_client/TestIOSSimulator.py (1832 of 2110) PASS: lldb-api :: functionalities/data-formatter/data-formatter-objc/TestDataFormatterObjCNSDate.py (1833 of 2110) PASS: lldb-unit :: Utility/./UtilityTests/LogChannelEnabledTest.LLDB_LOG_ERROR (1834 of 2110) PASS: lldb-unit :: Utility/./UtilityTests/RangeTest.ContainsRange (1835 of 2110) UNSUPPORTED: lldb-shell :: ScriptInterpreter/Lua/watchpoint_callback.test (1836 of 2110) PASS: lldb-unit :: Utility/./UtilityTests/DataExtractorTest.PeekData (1837 of 2110) PASS: lldb-shell :: Process/TestEnvironment.test (1838 of 2110) PASS: lldb-unit :: Symbol/./SymbolTests/TestTypeSystemClang.TestFunctionTemplateInRecordConstruction (1839 of 2110) PASS: lldb-api :: lang/cpp/call-function/TestCallCPPFunction.py (1840 of 2110) PASS: lldb-api :: lang/objc/modules-cache/TestClangModulesCache.py (1841 of 2110) UNSUPPORTED: lldb-api :: functionalities/tsan/basic/TestTsanBasic.py (1842 of 2110) PASS: lldb-api :: commands/expression/persistent_types/TestNestedPersistentTypes.py (1843 of 2110) PASS: lldb-api :: functionalities/gdb_remote_client/TestNoWatchpointSupportInfo.py (1844 of 2110) PASS: lldb-api :: functionalities/data-formatter/cstring-utf8-summary/TestCstringUnicode.py (1845 of 2110) PASS: lldb-unit :: Utility/./UtilityTests/NameMatchesTest.StartsWith (1846 of 2110) PASS: lldb-api :: functionalities/type_lookup/TestTypeLookup.py (1847 of 2110) PASS: lldb-unit :: Utility/./UtilityTests/ScalarTest.TruncOrExtendTo (1848 of 2110) PASS: lldb-shell :: Reproducer/TestDump.test (1849 of 2110) PASS: lldb-shell :: SymbolFile/DWARF/childless-compile-unit.s (1850 of 2110) UNSUPPORTED: lldb-shell :: SymbolFile/PDB/pointers.test (1851 of 2110) PASS: lldb-unit :: Process/minidump/./LLDBMinidumpTests/MinidumpParserTest.GetFilteredModuleList (1852 of 2110) PASS: lldb-api :: functionalities/inferior-crashing/TestInferiorCrashing.py (1853 of 2110) PASS: lldb-unit :: Process/gdb-remote/./ProcessGdbRemoteTests/GDBRemoteClientBaseTest.SendContinueDelegateInterface (1854 of 2110) PASS: lldb-unit :: Utility/./UtilityTests/StringListTest.GetMaxStringLengthEmpty (1855 of 2110) PASS: lldb-api :: macosx/duplicate-archive-members/TestDuplicateMembers.py (1856 of 2110) PASS: lldb-api :: python_api/function_symbol/TestSymbolAPI.py (1857 of 2110) PASS: lldb-api :: commands/expression/ignore-artificial-constructors/TestIgnoreArtificialConstructors.py (1858 of 2110) PASS: lldb-unit :: Utility/./UtilityTests/UUIDTest.RelationalOperators (1859 of 2110) PASS: lldb-api :: commands/frame/diagnose/dereference-this/TestDiagnoseDereferenceThis.py (1860 of 2110) PASS: lldb-unit :: Symbol/./SymbolTests/TestClangASTImporter.RecordLayout (1861 of 2110) PASS: lldb-unit :: Symbol/./SymbolTests/PostfixExpression.ToDWARF (1862 of 2110) UNSUPPORTED: lldb-shell :: Register/x86-64-zmm-write.test (1863 of 2110) PASS: lldb-api :: lang/cpp/global_operators/TestCppGlobalOperators.py (1864 of 2110) PASS: lldb-unit :: Target/./TargetTests/ExecutionContextTest.GetByteOrderProcess (1865 of 2110) PASS: lldb-unit :: Expression/./ExpressionTests/DWARFExpression.DW_OP_unknown (1866 of 2110) PASS: lldb-unit :: Utility/./UtilityTests/FileSpecTest.CopyByAppendingPathComponent (1867 of 2110) UNSUPPORTED: lldb-shell :: SymbolFile/Breakpad/stack-cfi-arm.yaml (1868 of 2110) PASS: lldb-unit :: Utility/./UtilityTests/GeneratorTest.Create (1869 of 2110) PASS: lldb-unit :: Utility/./UtilityTests/StringExtractorTest.InitEmpty (1870 of 2110) PASS: lldb-shell :: ObjectFile/wasm/stripped-debug-sections.yaml (1871 of 2110) PASS: lldb-unit :: Utility/./UtilityTests/StreamTeeTest.AppendStream (1872 of 2110) PASS: lldb-api :: lang/c/modules/TestCModules.py (1873 of 2110) PASS: lldb-unit :: Utility/./UtilityTests/StreamTest.PutCharWhitespace (1874 of 2110) UNSUPPORTED: lldb-api :: functionalities/darwin_log/source/debug/TestDarwinLogSourceDebug.py (1875 of 2110) PASS: lldb-unit :: Utility/./UtilityTests/StringListTest.AppendList (1876 of 2110) PASS: lldb-api :: commands/frame/select/TestFrameSelect.py (1877 of 2110) PASS: lldb-api :: lang/cpp/accelerator-table/TestCPPAccelerator.py (1878 of 2110) PASS: lldb-api :: lang/c/register_variables/TestRegisterVariables.py (1879 of 2110) PASS: lldb-unit :: Utility/./UtilityTests/StringListTest.InsertStringAtIndexStart (1880 of 2110) PASS: lldb-unit :: Utility/./UtilityTests/StringListTest.GetMaxStringLengthIncreasingSize (1881 of 2110) PASS: lldb-api :: functionalities/dead-strip/TestDeadStrip.py (1882 of 2110) PASS: lldb-api :: macosx/profile_vrs_detach/TestDetachVrsProfile.py (1883 of 2110) PASS: lldb-unit :: DataFormatter/./LLDBFormatterTests/TypeMatcherTests.CreatedBySameMatchStringExactNamePrefixes (1884 of 2110) UNSUPPORTED: lldb-shell :: SymbolFile/DWARF/DW_TAG_GNU_call_site-DW_AT_low_pc.s (1885 of 2110) PASS: lldb-api :: commands/expression/vector_of_enums/TestVectorOfEnums.py (1886 of 2110) PASS: lldb-unit :: Interpreter/./InterpreterTests/OptionArgParserTest.toChar (1887 of 2110) UNSUPPORTED: lldb-api :: functionalities/tsan/cpp_global_location/TestTsanCPPGlobalLocation.py (1888 of 2110) PASS: lldb-unit :: Utility/./UtilityTests/StreamTeeTest.SetStreamAtIndexOutOfBounds (1889 of 2110) PASS: lldb-api :: functionalities/data-formatter/nsdictionarysynth/TestNSDictionarySynthetic.py (1890 of 2110) UNSUPPORTED: lldb-shell :: Register/x86-64-xmm16-write.test (1891 of 2110) PASS: lldb-unit :: Language/Highlighting/./HighlighterTests/HighlighterTest.ClangCursorPosBeforeOtherToken (1892 of 2110) PASS: lldb-api :: python_api/default-constructor/TestDefaultConstructorForAPIObjects.py (1893 of 2110) PASS: lldb-unit :: ScriptInterpreter/Python/./ScriptInterpreterPythonTests/PythonDataObjectsTest.TestGlobalNameResolutionNoDot (1894 of 2110) PASS: lldb-unit :: Utility/./UtilityTests/LogChannelTest.EnableOptions (1895 of 2110) PASS: lldb-api :: functionalities/thread/step_until/TestStepUntil.py (1896 of 2110) PASS: lldb-unit :: Utility/./UtilityTests/StringLexerTest.NextIfList (1897 of 2110) PASS: lldb-unit :: Process/gdb-remote/./ProcessGdbRemoteTests/GDBRemoteClientBaseTest.SendContinueAndAsyncPacket (1898 of 2110) PASS: lldb-unit :: Process/gdb-remote/./ProcessGdbRemoteTests/GDBRemoteCommunicationTest.ReadPacket_checksum (1899 of 2110) PASS: lldb-api :: commands/expression/import-std-module/conflicts/TestStdModuleWithConflicts.py (1900 of 2110) PASS: lldb-api :: commands/command/script_alias/TestCommandScriptAlias.py (1901 of 2110) PASS: lldb-unit :: Host/./HostTests/SocketAddressTest.Set (1902 of 2110) PASS: lldb-api :: macosx/save_crashlog/TestSaveCrashlog.py (1903 of 2110) PASS: lldb-api :: lang/c/offsetof/TestOffsetof.py (1904 of 2110) PASS: lldb-shell :: Driver/TestFile.test (1905 of 2110) UNSUPPORTED: lldb-api :: functionalities/data-formatter/data-formatter-stl/libstdcpp/string/TestDataFormatterStdString.py (1906 of 2110) PASS: lldb-api :: commands/frame/diagnose/dereference-argument/TestDiagnoseDereferenceArgument.py (1907 of 2110) UNSUPPORTED: lldb-api :: tools/lldb-vscode/disconnect/TestVSCode_disconnect.py (1908 of 2110) PASS: lldb-unit :: Utility/./UtilityTests/RangeDataVector.FindEntryThatContains (1909 of 2110) UNSUPPORTED: lldb-api :: benchmarks/expression/TestExpressionCmd.py (1910 of 2110) PASS: lldb-api :: terminal/TestSTTYBeforeAndAfter.py (1911 of 2110) PASS: lldb-unit :: Utility/./UtilityTests/StringListTest.CopyList (1912 of 2110) PASS: lldb-api :: lang/c/shared_lib_stripped_symbols/TestSharedLibStrippedSymbols.py (1913 of 2110) PASS: lldb-shell :: Commands/CommandScriptImmediateOutput/CommandScriptImmediateOutputFile.test (1914 of 2110) PASS: lldb-shell :: ObjectFile/MachO/lc_build_version_notools.yaml (1915 of 2110) PASS: lldb-shell :: Register/x86-64-gp-read.test (1916 of 2110) PASS: lldb-unit :: Language/Highlighting/./HighlighterTests/HighlighterTest.ClangScalarLiterals (1917 of 2110) PASS: lldb-unit :: Language/Highlighting/./HighlighterTests/HighlighterTest.ClangCursorPosInOtherToken (1918 of 2110) PASS: lldb-api :: functionalities/data-formatter/data-formatter-objc/TestDataFormatterObjCKVO.py (1919 of 2110) PASS: lldb-shell :: Commands/command-source.test (1920 of 2110) PASS: lldb-unit :: Expression/./ExpressionTests/DiagnosticManagerTest.PutStringSeverities (1921 of 2110) PASS: lldb-api :: commands/watchpoints/multiple_threads/TestWatchpointMultipleThreads.py (1922 of 2110) PASS: lldb-api :: lang/cpp/inlines/TestInlines.py (1923 of 2110) PASS: lldb-api :: functionalities/gdb_remote_client/TestPlatformClient.py (1924 of 2110) PASS: lldb-shell :: SymbolFile/NativePDB/globals-fundamental.cpp (1925 of 2110) PASS: lldb-api :: lang/c/shared_lib/TestSharedLib.py (1926 of 2110) PASS: lldb-api :: lang/c/complex_int/TestComplexInt.py (1927 of 2110) PASS: lldb-api :: commands/expression/no-deadlock/TestExprDoesntBlock.py (1928 of 2110) PASS: lldb-api :: functionalities/data-formatter/data-formatter-stl/libcxx/initializerlist/TestInitializerList.py (1929 of 2110) PASS: lldb-unit :: Utility/./UtilityTests/OptionsWithRawTest.ArgsButNoLeadingDash (1930 of 2110) PASS: lldb-shell :: Minidump/memory-region-from-module.yaml (1931 of 2110) PASS: lldb-api :: functionalities/data-formatter/data-formatter-stl/libcxx/multimap/TestDataFormatterLibccMultiMap.py (1932 of 2110) PASS: lldb-api :: lang/objc/ivar-IMP/TestObjCiVarIMP.py (1933 of 2110) PASS: lldb-api :: functionalities/plugins/python_os_plugin/stepping_plugin_threads/TestOSPluginStepping.py (1934 of 2110) PASS: lldb-api :: functionalities/non-overlapping-index-variable-i/TestIndexVariable.py (1935 of 2110) PASS: lldb-shell :: SymbolFile/Breakpad/symtab-macho.test (1936 of 2110) PASS: lldb-api :: commands/command/script/import/TestImport.py (1937 of 2110) PASS: lldb-api :: commands/expression/two-files/TestObjCTypeQueryFromOtherCompileUnit.py (1938 of 2110) PASS: lldb-api :: functionalities/data-formatter/poarray/TestPrintObjectArray.py (1939 of 2110) PASS: lldb-shell :: BuildScript/toolchain-clang.test (1940 of 2110) PASS: lldb-unit :: SymbolFile/NativePDB/./SymbolFileNativePDBTests/PDBFPOProgramToDWARFExpressionTests.InvalidAssignmentSingle (1941 of 2110) PASS: lldb-unit :: Utility/./UtilityTests/CompletionRequest.FakeLastArg (1942 of 2110) PASS: lldb-unit :: debugserver/./debugserverTests/RNBSocket.AnyListen (1943 of 2110) PASS: lldb-unit :: Utility/./UtilityTests/FileSpecTest.Yaml (1944 of 2110) PASS: lldb-shell :: SymbolFile/DWARF/dwp-separate-debug-file.cpp (1945 of 2110) UNSUPPORTED: lldb-shell :: Register/x86-zmm-read.test (1946 of 2110) PASS: lldb-shell :: Settings/TestFrameFormatColor.test (1947 of 2110) PASS: lldb-unit :: Utility/./UtilityTests/StreamTest.PutCStringWithStringRef (1948 of 2110) PASS: lldb-api :: tools/lldb-vscode/breakpoint/TestVSCode_setExceptionBreakpoints.py (1949 of 2110) PASS: lldb-unit :: Symbol/./SymbolTests/LineEntryTest.GetSameLineContiguousAddressRangeNoInlines (1950 of 2110) PASS: lldb-unit :: Utility/./UtilityTests/StreamTest.PutCharNull (1951 of 2110) PASS: lldb-unit :: Utility/./UtilityTests/Flags.AnyClear (1952 of 2110) PASS: lldb-api :: commands/watchpoints/watchpoint_commands/command/TestWatchpointCommandPython.py (1953 of 2110) PASS: lldb-unit :: ScriptInterpreter/Python/./ScriptInterpreterPythonTests/PythonDataObjectsTest.TestPythonTupleInitializerList2 (1954 of 2110) PASS: lldb-api :: commands/expression/call-throws/TestCallThatThrows.py (1955 of 2110) PASS: lldb-unit :: Utility/./UtilityTests/RangeTest.Copy (1956 of 2110) UNSUPPORTED: lldb-shell :: SymbolFile/PDB/compilands.test (1957 of 2110) PASS: lldb-api :: commands/expression/ir-interpreter-phi-nodes/TestIRInterpreterPHINodes.py (1958 of 2110) PASS: lldb-shell :: ObjectFile/PECOFF/invalid-export-table.yaml (1959 of 2110) PASS: lldb-unit :: Language/Highlighting/./HighlighterTests/HighlighterTest.ClangTrailingBackslashWithWhitespace (1960 of 2110) PASS: lldb-shell :: SymbolFile/DWARF/debug_ranges_and_rnglists.test (1961 of 2110) PASS: lldb-api :: types/TestRecursiveTypes.py (1962 of 2110) PASS: lldb-api :: commands/expression/call-function/TestCallUserDefinedFunction.py (1963 of 2110) PASS: lldb-unit :: Process/gdb-remote/./ProcessGdbRemoteTests/GDBRemoteClientBaseTest.SendPacketAndReceiveResponseWithOutputSupport (1964 of 2110) PASS: lldb-unit :: Process/minidump/./LLDBMinidumpTests/MinidumpParserTest.FindMemoryRange (1965 of 2110) UNSUPPORTED: lldb-shell :: Register/x86-64-ymm16-write.test (1966 of 2110) PASS: lldb-api :: commands/expression/diagnostics/TestExprDiagnostics.py (1967 of 2110) PASS: lldb-unit :: ObjectFile/MachO/./ObjectFileMachOTests/ObjectFileMachOTest.ModuleFromSharedCacheInfo (1968 of 2110) PASS: lldb-unit :: Interpreter/./InterpreterTests/CompletionTest.DirCompletionUsername (1969 of 2110) PASS: lldb-api :: functionalities/postmortem/minidump-new/TestMiniDumpUUID.py (1970 of 2110) PASS: lldb-unit :: Utility/./UtilityTests/VMRange.SetEndAddress (1971 of 2110) PASS: lldb-unit :: Language/Highlighting/./HighlighterTests/HighlighterTest.ClangComments (1972 of 2110) UNSUPPORTED: lldb-api :: functionalities/breakpoint/breakpoint_callback_command_source/TestBreakpointCallbackCommandSource.py (1973 of 2110) PASS: lldb-api :: functionalities/data-formatter/data-formatter-stl/libcxx/unique_ptr/TestDataFormatterLibcxxUniquePtr.py (1974 of 2110) PASS: lldb-shell :: SymbolFile/DWARF/debug-types-address-ranges.s (1975 of 2110) PASS: lldb-unit :: Utility/./UtilityTests/StringExtractorTest.DecodeHexU8_Extra (1976 of 2110) PASS: lldb-unit :: Utility/./UtilityTests/ArchSpecTest.TripleComponentsWereSpecified (1977 of 2110) PASS: lldb-unit :: Language/Highlighting/./HighlighterTests/HighlighterTest.Keywords (1978 of 2110) PASS: lldb-unit :: Utility/./UtilityTests/AnsiTerminal.Twice (1979 of 2110) PASS: lldb-api :: commands/target/stop-hooks/TestStopHooks.py (1980 of 2110) PASS: lldb-unit :: Utility/./UtilityTests/RangeDataVector.FindEntryIndexesThatContain (1981 of 2110) PASS: lldb-unit :: Utility/./UtilityTests/Predicate.WaitForValueEqualTo (1982 of 2110) PASS: lldb-api :: tools/lldb-server/TestAppleSimulatorOSType.py (1983 of 2110) PASS: lldb-unit :: Host/./HostTests/ProcessLaunchInfoTest.Constructor (1984 of 2110) UNSUPPORTED: lldb-api :: functionalities/data-formatter/data-formatter-stl/libstdcpp/vbool/TestDataFormatterStdVBool.py (1985 of 2110) PASS: lldb-api :: commands/process/attach/TestProcessAttach.py (1986 of 2110) PASS: lldb-unit :: Utility/./UtilityTests/StreamTeeTest.Constructor2Streams (1987 of 2110) PASS: lldb-unit :: Utility/./UtilityTests/BinaryStreamTest.PutSLEB128SevenBytes (1988 of 2110) PASS: lldb-unit :: API/./APITests/SBCommandInterpreterTest.SingleWordCommand (1989 of 2110) PASS: lldb-unit :: Target/./TargetTests/StackFrameRecognizerTest.NullModuleRegex (1990 of 2110) PASS: lldb-unit :: Process/minidump/./LLDBMinidumpTests/MinidumpParserTest.GetArchitecture (1991 of 2110) PASS: lldb-api :: functionalities/data-formatter/data-formatter-advanced/TestDataFormatterAdv.py (1992 of 2110) PASS: lldb-api :: functionalities/thread/backtrace_limit/TestBacktraceLimit.py (1993 of 2110) PASS: lldb-unit :: Symbol/./SymbolTests/TestTypeSystemClang.TestNotDeletingUserCopyCstrDueToMoveCStr (1994 of 2110) PASS: lldb-unit :: Core/./LLDBCoreTests/SourceFileCache.FindSourceFileNotFound (1995 of 2110) PASS: lldb-api :: functionalities/thread_plan/TestThreadPlanCommands.py (1996 of 2110) UNSUPPORTED: lldb-shell :: ScriptInterpreter/Lua/convenience_variables.test (1997 of 2110) PASS: lldb-unit :: Utility/./UtilityTests/UriParserTest.TypicalPortPathIPv6 (1998 of 2110) PASS: lldb-api :: functionalities/gdb_remote_client/TestStopPCs.py (1999 of 2110) PASS: lldb-api :: functionalities/step-avoids-no-debug/TestStepNoDebug.py (2000 of 2110) PASS: lldb-api :: lang/objc/forward-decl/TestForwardDecl.py (2001 of 2110) PASS: lldb-unit :: Interpreter/./InterpreterTests/CompletionTest.DirCompletionAbsolute (2002 of 2110) PASS: lldb-unit :: Thread/./ThreadTests/ThreadTest.SetStopInfo (2003 of 2110) PASS: lldb-api :: python_api/formatters/TestFormattersSBAPI.py (2004 of 2110) PASS: lldb-unit :: Utility/./UtilityTests/EnvironmentTest.EnvpConstruction (2005 of 2110) PASS: lldb-unit :: Utility/./UtilityTests/RangeVector.CombineConsecutiveRanges (2006 of 2110) PASS: lldb-unit :: Utility/./UtilityTests/StreamTest.PutMaxHex64ByteOrderLittle (2007 of 2110) PASS: lldb-api :: functionalities/data-formatter/builtin-formats/TestBuiltinFormats.py (2008 of 2110) PASS: lldb-shell :: ObjectFile/ELF/PT_LOAD-empty.yaml (2009 of 2110) PASS: lldb-unit :: Utility/./UtilityTests/StringLexerTest.Next (2010 of 2110) UNSUPPORTED: lldb-shell :: ScriptInterpreter/Lua/nested_sessions.test (2011 of 2110) PASS: lldb-unit :: Target/./TargetTests/PathMappingListTest.AbsoluteTests (2012 of 2110) UNSUPPORTED: lldb-api :: benchmarks/libcxxmap/TestBenchmarkLibcxxMap.py (2013 of 2110) PASS: lldb-api :: python_api/value/TestValueAPI.py (2014 of 2110) PASS: lldb-unit :: tools/lldb-server/tests/./LLDBServerTests/TestBase.DebugserverEnv (2015 of 2110) PASS: lldb-unit :: Symbol/./SymbolTests/TestTypeSystemClang.TestGetEnumIntegerTypeUnexpectedType (2016 of 2110) UNSUPPORTED: lldb-shell :: Register/arm-fp-read.test (2017 of 2110) PASS: lldb-api :: functionalities/thread/concurrent_events/TestConcurrentSignalDelayBreak.py (2018 of 2110) PASS: lldb-api :: lang/cpp/class_static/TestStaticVariables.py (2019 of 2110) PASS: lldb-shell :: ObjectFile/ELF/minidebuginfo-find-symbols.yaml (2020 of 2110) PASS: lldb-api :: lang/cpp/multiple-inheritance/TestCppMultipleInheritance.py (2021 of 2110) PASS: lldb-unit :: Utility/./UtilityTests/LogChannelTest.Disable (2022 of 2110) UNSUPPORTED: lldb-shell :: SymbolFile/PDB/enums-layout.test (2023 of 2110) PASS: lldb-unit :: Utility/./UtilityTests/StringListTest.LongestCommonPrefix (2024 of 2110) PASS: lldb-shell :: SymbolFile/DWARF/dwarf5-index-is-used.cpp (2025 of 2110) UNSUPPORTED: lldb-api :: functionalities/darwin_log/format/TestDarwinLogMessageFormat.py (2026 of 2110) PASS: lldb-unit :: ObjectFile/Breakpad/./ObjectFileBreakpadTests/FileRecord.parse (2027 of 2110) PASS: lldb-shell :: ObjectFile/Breakpad/breakpad-identification.test (2028 of 2110) PASS: lldb-unit :: SymbolFile/DWARF/./SymbolFileDWARFTests/SymbolFileDWARFTests.TestAbbrevOrder1Start5 (2029 of 2110) PASS: lldb-api :: python_api/watchpoint/watchlocation/TestSetWatchlocation.py (2030 of 2110) PASS: lldb-shell :: SymbolFile/NativePDB/bitfields.cpp (2031 of 2110) PASS: lldb-api :: sample_test/TestSampleInlineTest.py (2032 of 2110) PASS: lldb-unit :: ScriptInterpreter/Python/./ScriptInterpreterPythonTests/PythonDataObjectsTest.TestInstanceNameResolutionNoDot (2033 of 2110) PASS: lldb-api :: commands/expression/persistent_types/TestPersistentTypes.py (2034 of 2110) PASS: lldb-unit :: UnwindAssembly/x86/./UnwindAssemblyx86Tests/Testx86AssemblyInspectionEngine.TestPopEBX (2035 of 2110) PASS: lldb-unit :: Utility/./UtilityTests/RegisterValueTest.GetSet8 (2036 of 2110) PASS: lldb-unit :: UnwindAssembly/x86/./UnwindAssemblyx86Tests/Testx86AssemblyInspectionEngine.TestPushR14 (2037 of 2110) PASS: lldb-api :: functionalities/thread/concurrent_events/TestConcurrentTwoWatchpointsOneDelayBreakpoint.py (2038 of 2110) PASS: lldb-api :: macosx/nslog/TestDarwinNSLogOutput.py (2039 of 2110) PASS: lldb-unit :: Utility/./UtilityTests/ArgsTest.BareSingleQuote (2040 of 2110) PASS: lldb-unit :: Process/gdb-remote/./ProcessGdbRemoteTests/GDBRemoteClientBaseTest.SendContinueDelegateStructuredDataReceipt (2041 of 2110) PASS: lldb-unit :: Host/./HostTests/FileActionTest.Open (2042 of 2110) UNSUPPORTED: lldb-shell :: SymbolFile/PDB/class-layout.test (2043 of 2110) PASS: lldb-api :: commands/expression/rdar42038760/TestScalarURem.py (2044 of 2110) PASS: lldb-unit :: Process/minidump/./LLDBMinidumpTests/MinidumpParserTest.GetThreadContext_x86_32_wow64 (2045 of 2110) PASS: lldb-unit :: Utility/./UtilityTests/StringLexerTest.AdvanceIf (2046 of 2110) PASS: lldb-api :: functionalities/breakpoint/comp_dir_symlink/TestCompDirSymLink.py (2047 of 2110) PASS: lldb-unit :: Utility/./UtilityTests/StringListTest.AppendListCStringArrayEmpty (2048 of 2110) PASS: lldb-api :: lang/cpp/chained-calls/TestCppChainedCalls.py (2049 of 2110) PASS: lldb-unit :: Expression/./ExpressionTests/CppModuleConfigurationTest.Sysroot (2050 of 2110) PASS: lldb-api :: tools/lldb-vscode/step/TestVSCode_step.py (2051 of 2110) PASS: lldb-api :: lang/objc/objc-stepping/TestObjCStepping.py (2052 of 2110) PASS: lldb-api :: commands/apropos/basic/TestApropos.py (2053 of 2110) PASS: lldb-unit :: tools/lldb-server/tests/./LLDBServerTests/StandardStartupTest.TestStopReplyContainsThreadPcs (2054 of 2110) PASS: lldb-api :: lang/cpp/stl/TestStdCXXDisassembly.py (2055 of 2110) PASS: lldb-api :: lang/cpp/unsigned_types/TestUnsignedTypes.py (2056 of 2110) PASS: lldb-unit :: Utility/./UtilityTests/SubsystemRAIITest.SubsystemWithErrorFailure (2057 of 2110) PASS: lldb-shell :: ScriptInterpreter/None/import_module.test (2058 of 2110) PASS: lldb-unit :: Process/minidump/./LLDBMinidumpTests/MinidumpParserTest.GetMiscInfo_no_stream (2059 of 2110) PASS: lldb-shell :: Unwind/trap_frame_sym_ctx.test (2060 of 2110) PASS: lldb-api :: commands/thread/select/TestThreadSelect.py (2061 of 2110) PASS: lldb-api :: functionalities/thread/concurrent_events/TestConcurrentTwoBreakpointsOneSignal.py (2062 of 2110) PASS: lldb-shell :: Commands/command-disassemble-process.yaml (2063 of 2110) PASS: lldb-api :: functionalities/jitloader_gdb/TestJITLoaderGDB.py (2064 of 2110) PASS: lldb-api :: lang/objc/global_ptrs/TestGlobalObjects.py (2065 of 2110) PASS: lldb-shell :: Driver/TestRepl.test (2066 of 2110) PASS: lldb-unit :: debugserver/./debugserverTests/RNBSocket.LoopBackConnectIPv6 (2067 of 2110) PASS: lldb-api :: functionalities/data-formatter/data-formatter-objc/TestDataFormatterObjCNSData.py (2068 of 2110) PASS: lldb-unit :: ObjectFile/ELF/./ObjectFileELFTests/ObjectFileELFTest.SectionsResolveConsistently (2069 of 2110) PASS: lldb-api :: functionalities/data-formatter/ostypeformatting/TestFormattersOsType.py (2070 of 2110) PASS: lldb-unit :: Utility/./UtilityTests/StreamTest.PutHex16ByteOrderLittle (2071 of 2110) PASS: lldb-api :: commands/expression/fixits/TestFixIts.py (2072 of 2110) PASS: lldb-unit :: Utility/./UtilityTests/LogChannelEnabledTest.log_options (2073 of 2110) PASS: lldb-unit :: Host/./HostTests/Host.WaitStatusFormat (2074 of 2110) PASS: lldb-unit :: Utility/./UtilityTests/CompletionRequest.TryCompleteCurrentArgGood (2075 of 2110) PASS: lldb-unit :: Symbol/./SymbolTests/TestTypeSystemClang.TestGetTypeClassTypeOf (2076 of 2110) PASS: lldb-unit :: Symbol/./SymbolTests/TestClangASTImporter.MetadataPropagationAfterCopying (2077 of 2110) PASS: lldb-api :: functionalities/thread/concurrent_events/TestConcurrentManyBreakpoints.py (2078 of 2110) PASS: lldb-api :: functionalities/breakpoint/breakpoint_command/TestBreakpointCommandsFromPython.py (2079 of 2110) PASS: lldb-api :: python_api/findvalue_duplist/TestSBFrameFindValue.py (2080 of 2110) PASS: lldb-unit :: Utility/./UtilityTests/UUIDTest.SetFromStringRef (2081 of 2110) PASS: lldb-shell :: Settings/TestEchoCommands.test (2082 of 2110) UNSUPPORTED: lldb-api :: commands/register/register/intel_xtended_registers/TestMPXRegisters.py (2083 of 2110) PASS: lldb-api :: functionalities/memory-region/TestMemoryRegion.py (2084 of 2110) PASS: lldb-api :: commands/add-dsym/uuid/TestAddDsymCommand.py (2085 of 2110) PASS: lldb-unit :: Utility/./UtilityTests/BinaryStreamTest.PutSLEB128NineBytes (2086 of 2110) PASS: lldb-unit :: Utility/./UtilityTests/StringExtractorTest.GetNameColonValueSuccess (2087 of 2110) PASS: lldb-shell :: Breakpoint/debug_rnglist_rlestartend.test (2088 of 2110) PASS: lldb-unit :: Utility/./UtilityTests/XcodeSDKTest.MergeTest (2089 of 2110) PASS: lldb-unit :: Utility/./UtilityTests/ArchSpecTest.MergeFrom (2090 of 2110) PASS: lldb-api :: commands/expression/namespace_local_var_same_name_cpp_and_c/TestNamespaceLocalVarSameNameCppAndC.py (2091 of 2110) PASS: lldb-unit :: Utility/./UtilityTests/ConstStringTest.YAML (2092 of 2110) PASS: lldb-api :: lang/cpp/namespace_definitions/TestNamespaceDefinitions.py (2093 of 2110) PASS: lldb-api :: tools/lldb-server/TestGdbRemoteExitCode.py (2094 of 2110) XFAIL: lldb-shell :: Register/x86-64-write.test (2095 of 2110) PASS: lldb-unit :: Utility/./UtilityTests/StreamTest.ShiftOperatorPtr (2096 of 2110) PASS: lldb-api :: functionalities/target-new-solib-notifications/TestModuleLoadedNotifys.py (2097 of 2110) PASS: lldb-unit :: ObjectFile/ELF/./ObjectFileELFTests/ObjectFileELFTest.GetModuleSpecifications_EarlySectionHeaders (2098 of 2110) PASS: lldb-api :: lang/cpp/member-and-local-vars-with-same-name/TestMembersAndLocalsWithSameName.py (2099 of 2110) PASS: lldb-shell :: Driver/TestNoUseColor.test (2100 of 2110) PASS: lldb-api :: functionalities/step_scripted/TestStepScripted.py (2101 of 2110) PASS: lldb-unit :: Utility/./UtilityTests/UriParserTest.SchemeHostSeparator3 (2102 of 2110) UNSUPPORTED: lldb-shell :: Register/x86-64-ymm16-read.test (2103 of 2110) PASS: lldb-shell :: Driver/TestCommands.test (2104 of 2110) PASS: lldb-unit :: Host/./HostTests/FileSystemTest.Resolve (2105 of 2110) PASS: lldb-unit :: Utility/./UtilityTests/NameMatchesTest.Ignore (2106 of 2110) PASS: lldb-unit :: SymbolFile/DWARF/./SymbolFileDWARFTests/XcodeSDKModuleTests.TestModuleGetXcodeSDK (2107 of 2110) PASS: lldb-api :: lang/objc/objc-super/TestObjCSuper.py (2108 of 2110) PASS: lldb-api :: functionalities/data-formatter/data-formatter-stl/libcxx/variant/TestDataFormatterLibcxxVariant.py (2109 of 2110) PASS: lldb-api :: functionalities/inferior-crashing/TestInferiorCrashingStep.py (2110 of 2110) Slowest Tests: -------------------------------------------------------------------------- 649.32s: lldb-api :: tools/lldb-server/TestLldbGdbServer.py 257.15s: lldb-api :: lang/cpp/enum_types/TestCPP11EnumTypes.py 245.70s: lldb-api :: api/multithreaded/TestMultithreaded.py 209.97s: lldb-api :: lang/objc/hidden-ivars/TestHiddenIvars.py 204.19s: lldb-api :: lang/objc/foundation/TestObjCMethods.py 189.40s: lldb-api :: lang/objc/exceptions/TestObjCExceptions.py 142.69s: lldb-api :: lang/cpp/namespace/TestNamespaceLookup.py 136.01s: lldb-api :: lang/objc/real-definition/TestRealDefinition.py 135.78s: lldb-api :: lang/objc/objc-new-syntax/TestObjCNewSyntaxLiteral.py 124.16s: lldb-api :: types/TestIntegerTypeExpr.py 123.81s: lldb-api :: types/TestLongTypesExpr.py 113.90s: lldb-api :: lang/objc/foundation/TestObjCMethodsString.py 110.47s: lldb-api :: lang/objc/foundation/TestObjCMethodsNSError.py 104.13s: lldb-api :: lang/objc/objc-new-syntax/TestObjCNewSyntaxArray.py 102.21s: lldb-api :: lang/objc/objc-new-syntax/TestObjCNewSyntaxDictionary.py 96.38s: lldb-api :: commands/expression/import-std-module/stack/TestStackFromStdModule.py 91.57s: lldb-api :: functionalities/gdb_remote_client/TestWasm.py 91.36s: lldb-api :: lang/objcxx/objcxx-ivar-vector/TestIvarVector.py 86.58s: lldb-api :: functionalities/data-formatter/compactvectors/TestCompactVectors.py 86.23s: lldb-api :: lang/objc/conflicting-definition/TestConflictingDefinition.py

Hide Details

Tests Times: -------------------------------------------------------------------------- [ Range ] :: [ Percentage ] :: [ Count ] -------------------------------------------------------------------------- [600s,650s) :: [ ] :: [ 1/2110] [550s,600s) :: [ ] :: [ 0/2110] [500s,550s) :: [ ] :: [ 0/2110] [450s,500s) :: [ ] :: [ 0/2110] [400s,450s) :: [ ] :: [ 0/2110] [350s,400s) :: [ ] :: [ 0/2110] [300s,350s) :: [ ] :: [ 0/2110] [250s,300s) :: [ ] :: [ 1/2110] [200s,250s) :: [ ] :: [ 3/2110] [150s,200s) :: [ ] :: [ 1/2110] [100s,150s) :: [ ] :: [ 9/2110] [ 50s,100s) :: [ ] :: [ 47/2110] [ 0s, 50s) :: [************************************** ] :: [2048/2110] -------------------------------------------------------------------------- ******************** Failed Tests (3): lldb-api :: macosx/macCatalyst/TestMacCatalyst.py lldb-api :: python_api/target/TestTargetAPI.py lldb-api :: macosx/simulator/TestSimulatorPlatform.py

Hide Details

Hide Details

Testing Time: 4287.73s Unsupported : 182 Passed : 1919 Expectedly Failed: 6 Failed : 3 FAILED: tools/lldb/test/CMakeFiles/check-lldb-lit cd /Users/buildslave/jenkins/workspace/lldb-cmake-sanitized/lldb-build/tools/lldb/test && /usr/local/Frameworks/Python.framework/Versions/3.7/bin/python3.7 /Users/buildslave/jenkins/workspace/lldb-cmake-sanitized/lldb-build/./bin/llvm-lit -v --time-tests --shuffle --xunit-xml-output=/Users/buildslave/jenkins/workspace/lldb-cmake-sanitized/test/results.xml -v -j 4 --timeout 1200 /Users/buildslave/jenkins/workspace/lldb-cmake-sanitized/lldb-build/tools/lldb/test ninja: build stopped: subcommand failed. Command failed: Command '['/usr/bin/env', 'TERM=vt100', '/usr/local/bin/ninja', '-v', 'check-lldb']' returned non-zero exit status 1. Command: ['/usr/bin/env', 'TERM=vt100', '/usr/local/bin/ninja', '-v', 'check-lldb'] [Pipeline] } [Pipeline] // timeout [Pipeline] } [Pipeline] // stage [Pipeline] stage [Pipeline] { (Declarative: Post Actions) [Pipeline] scanForIssues [Clang (LLVM based)] Sleeping for 5 seconds due to JENKINS-32191... [Clang (LLVM based)] Parsing console log (workspace: '/Users/buildslave/jenkins/workspace/lldb-cmake-sanitized') [Clang (LLVM based)] Successfully parsed console log [Clang (LLVM based)] -> found 3 issues (skipped 0 duplicates) [Clang (LLVM based)] Post processing issues on 'green-dragon-23' with source code encoding 'UTF-8' [Clang (LLVM based)] Creating SCM blamer to obtain author and commit information for affected files [Clang (LLVM based)] Creating SCM miner to obtain statistics for affected repository files [Clang (LLVM based)] Resolving file names for all issues in source directory '/Users/buildslave/jenkins/workspace/lldb-cmake-sanitized' [Clang (LLVM based)] -> resolved paths in source directory (2 found, 0 not found) [Clang (LLVM based)] Resolving module names from module definitions (build.xml, pom.xml, or Manifest.mf files) [Clang (LLVM based)] -> resolved module names for 3 issues [Clang (LLVM based)] Resolving package names (or namespaces) by parsing the affected files [Clang (LLVM based)] -> resolved package names of 2 affected files [Clang (LLVM based)] No filter has been set, publishing all 3 issues [Clang (LLVM based)] Creating fingerprints for all affected code blocks to track issues over different builds [Clang (LLVM based)] -> created fingerprints for 3 issues (skipped 0 issues) [Clang (LLVM based)] Copying affected files to Jenkins' build folder '/Users/Shared/Jenkins/Home/jobs/lldb-cmake-sanitized/builds/1700/files-with-issues' [Clang (LLVM based)] -> 2 copied, 0 not in workspace, 0 not-found, 0 with I/O error [Pipeline] junit Recording test results [Pipeline] } [Pipeline] // stage [Pipeline] } [Pipeline] // withEnv [Pipeline] } [Pipeline] // node [Pipeline] End of Pipeline ERROR: script returned exit code 1 Finished: FAILURE