FailedConsole Output

Skipping 34,206 KB.. Full Log
     0x0000000000000002 0x000f0000 objc_registerThreadWithCollector
    [ 1063]   1063   X Code            0x00007fff660c9ca0                    0x000000000000009f 0x000f0000 objc_release
    [ 1064]   1064   X Code            0x00007fff660cdbfa                    0x000000000000002b 0x000f0000 objc_removeAssociatedObjects
    [ 1065]   1065   X Code            0x00007fff660d2934                    0x0000000000000150 0x000f0000 objc_removeExceptionHandler
    [ 1066]   1066   X Code            0x00007fff660c7d10                    0x0000000000000070 0x000f0000 objc_retain
    [ 1067]   1067   X Code            0x00007fff660ccce0                    0x0000000000000020 0x000f0000 objc_retainAutorelease
    [ 1068]   1068   X Code            0x00007fff660cd172                    0x000000000000004c 0x000f0000 objc_retainAutoreleaseReturnValue
    [ 1069]   1069   X Code            0x00007fff660cbb6a                    0x000000000000002e 0x000f0000 objc_retainAutoreleasedReturnValue
    [ 1070]   1070   X Code            0x00007fff660d0596                    0x0000000000000010 0x000f0000 objc_retainBlock
    [ 1071]   1071   X Code            0x00007fff660e4d21                    0x0000000000000021 0x000f0000 objc_retain_autorelease
    [ 1072]   1072   X Code            0x00007fff660e545f                    0x0000000000000004 0x000f0000 objc_retainedObject
    [ 1073]   1073   X Code            0x00007fff660d0581                    0x0000000000000015 0x000f0000 objc_setAssociatedObject
    [ 1074]   1074   X Code            0x00007fff660d5d52                    0x0000000000000001 0x000f0000 objc_setCollectionRatio
    [ 1075]   1075   X Code            0x00007fff660d5d51                    0x0000000000000001 0x000f0000 objc_setCollectionThreshold
    [ 1076]   1076   X Code            0x00007fff660ca8eb                    0x000000000000000a 0x000f0000 objc_setEnumerationMutationHandler
    [ 1077]   1077   X Code            0x00007fff660ca8a3                    0x000000000000000f 0x000f0000 objc_setExceptionMatcher
    [ 1078]   1078   X Code            0x00007fff660ca890                    0x0000000000000013 0x000f0000 objc_setExceptionPreprocessor
    [ 1079]   1079   X Code            0x00007fff660ca8ce                    0x000000000000001d 0x000f0000 objc_setForwardHandler
    [ 1080]   1080   X Code            0x00007fff660e05d9                    0x0000000000000016 0x000f0000 objc_setHook_getClass
    [ 1081]   1081   X Code            0x00007fff660e1c5d                    0x0000000000000016 0x000f0000 objc_setHook_getImageName
    [ 1082]   1082   X Code            0x00007fff660e1cd7                    0x0000000000000016 0x000f0000 objc_setHook_setAssociatedObject
    [ 1083]   1083   X Code            0x00007fff660cd875                    0x0000000000000106 0x000f0000 objc_setProperty
    [ 1084]   1084   X Code            0x00007fff660cf508                    0x00000000000000d1 0x000f0000 objc_setProperty_atomic
    [ 1085]   1085   X Code            0x00007fff660cf5d9                    0x00000000000000bd 0x000f0000 objc_setProperty_atomic_copy
    [ 1086]   1086   X Code            0x00007fff660d3364                    0x000000000000004a 0x000f0000 objc_setProperty_nonatomic
    [ 1087]   1087   X Code            0x00007fff660d05a6                    0x0000000000000044 0x000f0000 objc_setProperty_nonatomic_copy
    [ 1088]   1088   X Code            0x00007fff660ca8b2                    0x000000000000001c 0x000f0000 objc_setUncaughtExceptionHandler
    [ 1089]   1089   X Code            0x00007fff660d5d8a                    0x0000000000000001 0x000f0000 objc_set_collection_ratio
    [ 1090]   1090   X Code            0x00007fff660d5d89                    0x0000000000000001 0x000f0000 objc_set_collection_threshold
    [ 1091]   1091   X Code            0x00007fff660e4d1b                    0x0000000000000006 0x000f0000 objc_should_deallocate
    [ 1092]   1092   X Code            0x00007fff660d5d53                    0x0000000000000001 0x000f0000 objc_startCollectorThread
    [ 1093]   1093   X Code            0x00007fff660d5d8b                    0x0000000000000001 0x000f0000 objc_start_collector_thread
    [ 1094]   1094   X Code            0x00007fff660cbb28                    0x0000000000000042 0x000f0000 objc_storeStrong
    [ 1095]   1095   X Code            0x00007fff660cbd78                    0x000000000000022f 0x000f0000 objc_storeWeak
    [ 1096]   1096   X Code            0x00007fff660ccda6                    0x000000000000023a 0x000f0000 objc_storeWeakOrNil
    [ 1097]   1097   X Code            0x00007fff660cc424                    0x000000000000003f 0x000f0000 objc_sync_enter
    [ 1098]   1098   X Code            0x00007fff660cc7c1                    0x0000000000000043 0x000f0000 objc_sync_exit
    [ 1099]   1099   X Code            0x00007fff660e3071                    0x0000000000000048 0x000f0000 objc_sync_try_enter
    [ 1100]   1100   X Code            0x00007fff660d6868                    0x000000000000000d 0x000f0000 objc_terminate
    [ 1101]   1101   X Code            0x00007fff660d5d95                    0x0000000000000001 0x000f0000 objc_unregisterThreadWithCollector
    [ 1102]   1102   X Code            0x00007fff660e5463                    0x0000000000000004 0x000f0000 objc_unretainedObject
    [ 1103]   1103   X Code            0x00007fff660e5467                    0x0000000000000005 0x000f0000 objc_unretainedPointer
    [ 1104]   1104   X Code            0x00007fff660e470a                    0x0000000000000038 0x000f0000 objc_unsafeClaimAutoreleasedReturnValue
    [ 1105]   1105   X Code            0x00007fff660cf09c                    0x0000000000000024 0x000f0000 object_copy
    [ 1106]   1106   X Code            0x00007fff660e0eb9                    0x0000000000000007 0x000f0000 object_copyFromZone
    [ 1107]   1107   X Code            0x00007fff660c9d8c                    0x0000000000000032 0x000f0000 object_dispose
    [ 1108]   1108   X Code            0x00007fff660cacf4                    0x0000000000000050 0x000f0000 object_getClass
    [ 1109]   1109   X Code            0x00007fff660d1e38                    0x0000000000000068 0x000f0000 object_getClassName
    [ 1110]   1110   X Code            0x00007fff660cb844                    0x0000000000000065 0x000f0000 object_getIndexedIvars
    [ 1111]   1111   X Code            0x00007fff660d6230                    0x000000000000006d 0x000f0000 object_getInstanceVariable
    [ 1112]   1112   X Code            0x00007fff660d4e98                    0x000000000000006c 0x000f0000 object_getIvar
    [ 1113]   1113   X Code            0x00007fff660cdc6c                    0x000000000000007f 0x000f0000 object_getMethodImplementation
    [ 1114]   1114   X Code            0x00007fff660d5dd1                    0x0000000000000056 0x000f0000 object_getMethodImplementation_stret
    [ 1115]   1115   X Code            0x00007fff660d5da3                    0x000000000000002e 0x000f0000 object_isClass
    [ 1116]   1116   X Code            0x00007fff660cab72                    0x0000000000000182 0x000f0000 object_setClass
    [ 1117]   1117   X Code            0x00007fff660cfa7e                    0x00000000000000bc 0x000f0000 object_setInstanceVariable
    [ 1118]   1118   X Code            0x00007fff660d6177                    0x00000000000000b9 0x000f0000 object_setInstanceVariableWithStrongDefault
    [ 1119]   1119   X Code            0x00007fff660cfc50                    0x0000000000000094 0x000f0000 object_setIvar
    [ 1120]   1120   X Code            0x00007fff660d60dc                    0x000000000000009b 0x000f0000 object_setIvarWithStrongDefault
    [ 1121]   1121   X Code            0x00007fff660d1687                    0x0000000000000156 0x000f0000 property_copyAttributeList
    [ 1122]   1122   X Code            0x00007fff660dd571                    0x00000000000000cd 0x000f0000 property_copyAttributeValue
    [ 1123]   1123   X Code            0x00007fff660d1f22                    0x0000000000000011 0x000f0000 property_getAttributes
    [ 1124]   1124   X Code            0x00007fff660d167e                    0x0000000000000009 0x000f0000 property_getName
    [ 1125]   1125   X Code            0x00007fff660dddad                    0x0000000000000155 0x000f0000 protocol_addMethodDescription
    [ 1126]   1126   X Code            0x00007fff660ddfdf                    0x0000000000000137 0x000f0000 protocol_addProperty
    [ 1127]   1127   X Code            0x00007fff660ddc7c                    0x0000000000000131 0x000f0000 protocol_addProtocol
    [ 1128]   1128   X Code            0x00007fff660d2ae8                    0x0000000000000095 0x000f0000 protocol_conformsToProtocol
    [ 1129]   1129   X Code            0x00007fff660ce198                    0x000000000000016c 0x000f0000 protocol_copyMethodDescriptionList
    [ 1130]   1130   X Code            0x00007fff660dd8f5                    0x0000000000000011 0x000f0000 protocol_copyPropertyList
    [ 1131]   1131   X Code            0x00007fff660dd7f8                    0x00000000000000fd 0x000f0000 protocol_copyPropertyList2
    [ 1132]   1132   X Code            0x00007fff660ce034                    0x0000000000000164 0x000f0000 protocol_copyProtocolList
    [ 1133]   1133   X Code            0x00007fff660ce738                    0x0000000000000053 0x000f0000 protocol_getMethodDescription
    [ 1134]   1134   X Code            0x00007fff660ce647                    0x0000000000000019 0x000f0000 protocol_getName
    [ 1135]   1135   X Code            0x00007fff660dd63e                    0x00000000000000c8 0x000f0000 protocol_getProperty
    [ 1136]   1136   X Code            0x00007fff660d2a9b                    0x000000000000004d 0x000f0000 protocol_isEqual
    [ 1137]   1137   X Code            0x00007fff660cde1c                    0x0000000000000016 0x000f0000 sel_getName
    [ 1138]   1138   X Code            0x00007fff660d2fbb                    0x0000000000000017 0x000f0000 sel_getUid
    [ 1139]   1139   X Code            0x00007fff660d2c8a                    0x0000000000000017 0x000f0000 sel_isEqual
    [ 1140]   1140   X Code            0x00007fff660e2f8b                    0x00000000000000e6 0x000f0000 sel_isMapped
    [ 1141]   1141   X Code            0x00007fff660cb57c                    0x000000000000001d 0x000f0000 sel_registerName
    [ 1142]   1142     Trampoline      0x00007fff660e6c3a                    0x0000000000000006 0x00010300 _Block_copy
    [ 1143]   1143     Trampoline      0x00007fff660e6c40                    0x0000000000000006 0x00010300 _Block_has_signature
    [ 1144]   1144     Trampoline      0x00007fff660e6c46                    0x0000000000000006 0x00010300 _Block_release
    [ 1145]   1145     Trampoline      0x00007fff660e6c4c                    0x0000000000000006 0x00010300 _Block_use_stret
    [ 1146]   1146   X Undefined       0x0000000000000000                    0x0000000000000000 0x00010300 _DefaultRuneLocale
    [ 1147]   1147     Trampoline      0x00007fff660e6c52                    0x0000000000000006 0x00010300 _Exit
    [ 1148]   1148   X Undefined       0x0000000000000000                    0x0000000000000000 0x00010300 _NSConcreteStackBlock
    [ 1149]   1149     Trampoline      0x00007fff660e6c58                    0x0000000000000006 0x00010300 _NSGetEnviron
    [ 1150]   1150     Trampoline      0x00007fff660e6c5e                    0x0000000000000006 0x00010300 _Unwind_GetCFA
    [ 1151]   1151     Trampoline      0x00007fff660e6c64                    0x0000000000000006 0x00010300 _Unwind_GetIP
    [ 1152]   1152     Trampoline      0x00007fff660e6c6a                    0x0000000000000006 0x00010300 _Unwind_Resume
    [ 1153]   1153     Trampoline      0x00007fff660e6c70                    0x0000000000000006 0x00010100 std::set_terminate(void (*)())
    [ 1154]   1154     Trampoline      0x00007fff660e6c76                    0x0000000000000006 0x00010100 std::terminate()
    [ 1155]   1155   X Undefined       0x0000000000000000                    0x0000000000000000 0x00010340 ___chkstk_darwin
    [ 1156]   1156     Trampoline      0x00007fff660e6c7c                    0x0000000000000006 0x00010300 __bzero
    [ 1157]   1157     Trampoline      0x00007fff660e6c82                    0x0000000000000006 0x00010100 __cxa_allocate_exception
    [ 1158]   1158     Trampoline      0x00007fff660e6c88                    0x0000000000000006 0x00010100 __cxa_begin_catch
    [ 1159]   1159     Trampoline      0x00007fff660e6c8e                    0x0000000000000006 0x00010100 __cxa_current_exception_type
    [ 1160]   1160     Trampoline      0x00007fff660e6c94                    0x0000000000000006 0x00010100 __cxa_end_catch
    [ 1161]   1161     Trampoline      0x00007fff660e6c9a                    0x0000000000000006 0x00010100 __cxa_rethrow
    [ 1162]   1162     Trampoline      0x00007fff660e6ca0                    0x0000000000000006 0x00010100 __cxa_throw
    [ 1163]   1163     Trampoline      0x00007fff660e6ca6                    0x0000000000000006 0x00010300 __error
    [ 1164]   1164     Trampoline      0x00007fff660e6cac                    0x0000000000000006 0x00010100 __gxx_personality_v0
    [ 1165]   1165   X Undefined       0x0000000000000000                    0x0000000000000000 0x00010300 __progname
    [ 1166]   1166     Trampoline      0x00007fff660e6cb2                    0x0000000000000006 0x00010300 __stack_chk_fail
    [ 1167]   1167   X Undefined       0x0000000000000000                    0x0000000000000000 0x00010300 __stack_chk_guard
    [ 1168]   1168   X Undefined       0x0000000000000000                    0x0000000000000000 0x00010300 __stderrp
    [ 1169]   1169     Trampoline      0x00007fff660e6cb8                    0x0000000000000006 0x00010300 _dyld_for_each_objc_class
    [ 1170]   1170     Trampoline      0x00007fff660e6cbe                    0x0000000000000006 0x00010300 _dyld_for_each_objc_protocol
    [ 1171]   1171     Trampoline      0x00007fff660e6cc4                    0x0000000000000006 0x00010300 _dyld_get_objc_selector
    [ 1172]   1172     Trampoline      0x00007fff660e6cca                    0x0000000000000006 0x00010300 _dyld_get_shared_cache_range
    [ 1173]   1173     Trampoline      0x00007fff660e6cd0                    0x0000000000000006 0x00010300 _dyld_is_memory_immutable
    [ 1174]   1174     Trampoline      0x00007fff660e6cd6                    0x0000000000000006 0x00010300 _dyld_objc_notify_register
    [ 1175]   1175     Trampoline      0x00007fff660e6cdc                    0x0000000000000006 0x00010300 _simple_asl_log
    [ 1176]   1176     Trampoline      0x00007fff660e6ce2                    0x0000000000000006 0x00010300 abort
    [ 1177]   1177     Trampoline      0x00007fff660e6ce8                    0x0000000000000006 0x00010300 abort_with_reason
    [ 1178]   1178     Trampoline      0x00007fff660e6cee                    0x0000000000000006 0x00010300 arc4random_buf
    [ 1179]   1179     Trampoline      0x00007fff660e6cf4                    0x0000000000000006 0x00010300 asprintf
    [ 1180]   1180     Trampoline      0x00007fff660e6cfa                    0x0000000000000006 0x00010300 backtrace
    [ 1181]   1181     Trampoline      0x00007fff660e6d00                    0x0000000000000006 0x00010300 backtrace_symbols
    [ 1182]   1182     Trampoline      0x00007fff660e6d06                    0x0000000000000006 0x00010300 backtrace_symbols_fd
    [ 1183]   1183     Trampoline      0x00007fff660e6d0c                    0x0000000000000006 0x00010300 bcopy
    [ 1184]   1184     Trampoline      0x00007fff660e6d12                    0x0000000000000006 0x00010300 calloc
    [ 1185]   1185     Trampoline      0x00007fff660e6d18                    0x0000000000000006 0x00010300 clock_gettime_nsec_np
    [ 1186]   1186     Trampoline      0x00007fff660e6d1e                    0x0000000000000006 0x00010300 close
    [ 1187]   1187     Trampoline      0x00007fff660e6d24                    0x0000000000000006 0x00010300 dispatch_queue_get_label
    [ 1188]   1188     Trampoline      0x00007fff660e6d2a                    0x0000000000000006 0x00010300 dladdr
    [ 1189]   1189     Trampoline      0x00007fff660e6d30                    0x0000000000000006 0x00010300 dlerror
    [ 1190]   1190     Trampoline      0x00007fff660e6d36                    0x0000000000000006 0x00010300 dlopen
    [ 1191]   1191     Trampoline      0x00007fff660e6d3c                    0x0000000000000006 0x00010300 dlsym
    [ 1192]   1192     Trampoline      0x00007fff660e6d42                    0x0000000000000006 0x00010300 dyld_get_program_sdk_version
    [ 1193]   1193     Trampoline      0x00007fff660e6d48                    0x0000000000000006 0x00010300 dyld_image_header_containing_address
    [ 1194]   1194     Trampoline      0x00007fff660e6d4e                    0x0000000000000006 0x00010300 dyld_image_path_containing_address
    [ 1195]   1195     Trampoline      0x00007fff660e6d54                    0x0000000000000006 0x00010300 dyld_shared_cache_some_image_overridden
    [ 1196]   1196     Trampoline      0x00007fff660e6d5a                    0x0000000000000006 0x00010300 fileno
    [ 1197]   1197     Trampoline      0x00007fff660e6d60                    0x0000000000000006 0x00010300 fls
    [ 1198]   1198     Trampoline      0x00007fff660e6d66                    0x0000000000000006 0x00010300 free
    [ 1199]   1199     Trampoline      0x00007fff660e6d6c                    0x0000000000000006 0x00010300 fstat$INODE64
    [ 1200]   1200     Trampoline      0x00007fff660e6d72                    0x0000000000000006 0x00010300 fsync
    [ 1201]   1201     Trampoline      0x00007fff660e6d78                    0x0000000000000006 0x00010300 getenv
    [ 1202]   1202     Trampoline      0x00007fff660e6d7e                    0x0000000000000006 0x00010300 geteuid
    [ 1203]   1203     Trampoline      0x00007fff660e6d84                    0x0000000000000006 0x00010300 getpid
    [ 1204]   1204     Trampoline      0x00007fff660e6d8a                    0x0000000000000006 0x00010300 getsectiondata
    [ 1205]   1205     Trampoline      0x00007fff660e6d90                    0x0000000000000006 0x00010300 getsegmentdata
    [ 1206]   1206     Trampoline      0x00007fff660e6d96                    0x0000000000000006 0x00010300 issetugid
    [ 1207]   1207     Trampoline      0x00007fff660e6d9c                    0x0000000000000006 0x00010300 lstat$INODE64
    [ 1208]   1208     Trampoline      0x00007fff660e6da2                    0x0000000000000006 0x00010300 mach_error_string
    [ 1209]   1209     Trampoline      0x00007fff660e6da8                    0x0000000000000006 0x00010300 mach_port_deallocate
    [ 1210]   1210   X Undefined       0x0000000000000000                    0x0000000000000000 0x00010300 mach_task_self_
    [ 1211]   1211     Trampoline      0x00007fff660e6dae                    0x0000000000000006 0x00010300 malloc
    [ 1212]   1212     Trampoline      0x00007fff660e6db4                    0x0000000000000006 0x00010300 malloc_default_zone
    [ 1213]   1213     Trampoline      0x00007fff660e6dba                    0x0000000000000006 0x00010300 malloc_size
    [ 1214]   1214     Trampoline      0x00007fff660e6dc0                    0x0000000000000006 0x00010300 malloc_zone_batch_malloc
    [ 1215]   1215     Trampoline      0x00007fff660e6dc6                    0x0000000000000006 0x00010300 malloc_zone_calloc
    [ 1216]   1216     Trampoline      0x00007fff660e6dcc                    0x0000000000000006 0x00010300 malloc_zone_from_ptr
    [ 1217]   1217     Trampoline      0x00007fff660e6dd2                    0x0000000000000006 0x00010300 malloc_zone_malloc
    [ 1218]   1218     Trampoline      0x00007fff660e6dd8                    0x0000000000000006 0x00010300 malloc_zone_memalign
    [ 1219]   1219     Trampoline      0x00007fff660e6dde                    0x0000000000000006 0x00010300 memcmp
    [ 1220]   1220     Trampoline      0x00007fff660e6de4                    0x0000000000000006 0x00010300 memcpy
    [ 1221]   1221     Trampoline      0x00007fff660e6dea                    0x0000000000000006 0x00010300 memmove
    [ 1222]   1222     Trampoline      0x00007fff660e6df0                    0x0000000000000006 0x00010300 memset_pattern16
    [ 1223]   1223     Trampoline      0x00007fff660e6dfc                    0x0000000000000006 0x00010300 open
    [ 1224]   1224     Trampoline      0x00007fff660e6e02                    0x0000000000000006 0x00010300 os_unfair_lock_lock_with_options
    [ 1225]   1225     Trampoline      0x00007fff660e6e08                    0x0000000000000006 0x00010300 os_unfair_lock_unlock
    [ 1226]   1226     Trampoline      0x00007fff660e6e0e                    0x0000000000000006 0x00010300 os_unfair_recursive_lock_lock_with_options
    [ 1227]   1227     Trampoline      0x00007fff660e6e14                    0x0000000000000006 0x00010300 os_unfair_recursive_lock_trylock
    [ 1228]   1228     Trampoline      0x00007fff660e6e1a                    0x0000000000000006 0x00010300 os_unfair_recursive_lock_tryunlock4objc
    [ 1229]   1229     Trampoline      0x00007fff660e6e20                    0x0000000000000006 0x00010300 os_unfair_recursive_lock_unlock
    [ 1230]   1230     Trampoline      0x00007fff660e6e26                    0x0000000000000006 0x00010300 posix_memalign
    [ 1231]   1231     Trampoline      0x00007fff660e6e2c                    0x0000000000000006 0x00010300 pread
    [ 1232]   1232     Trampoline      0x00007fff660e6e32                    0x0000000000000006 0x00010300 pthread_cond_broadcast
    [ 1233]   1233     Trampoline      0x00007fff660e6e38                    0x0000000000000006 0x00010300 pthread_cond_wait
    [ 1234]   1234     Trampoline      0x00007fff660e6e3e                    0x0000000000000006 0x00010300 pthread_getname_np
    [ 1235]   1235     Trampoline      0x00007fff660e6e44                    0x0000000000000006 0x00010300 pthread_getspecific
    [ 1236]   1236     Trampoline      0x00007fff660e6e4a                    0x0000000000000006 0x00010300 pthread_is_threaded_np
    [ 1237]   1237     Trampoline      0x00007fff660e6e50                    0x0000000000000006 0x00010300 pthread_key_init_np
    [ 1238]   1238     Trampoline      0x00007fff660e6e56                    0x0000000000000006 0x00010300 pthread_mach_thread_np
    [ 1239]   1239     Trampoline      0x00007fff660e6e5c                    0x0000000000000006 0x00010300 pthread_mutex_lock
    [ 1240]   1240     Trampoline      0x00007fff660e6e62                    0x0000000000000006 0x00010300 pthread_mutex_unlock
    [ 1241]   1241     Trampoline      0x00007fff660e6e68                    0x0000000000000006 0x00010300 pthread_setspecific
    [ 1242]   1242     Trampoline      0x00007fff660e6e6e                    0x0000000000000006 0x00010300 realloc
    [ 1243]   1243     Trampoline      0x00007fff660e6e74                    0x0000000000000006 0x00010300 reallocf
    [ 1244]   1244     Trampoline      0x00007fff660e6e7a                    0x0000000000000006 0x00010300 snprintf
    [ 1245]   1245     Trampoline      0x00007fff660e6e80                    0x0000000000000006 0x00010300 sprintf
    [ 1246]   1246     Trampoline      0x00007fff660e6e86                    0x0000000000000006 0x00010300 strcat
    [ 1247]   1247     Trampoline      0x00007fff660e6e8c                    0x0000000000000006 0x00010300 strchr
    [ 1248]   1248     Trampoline      0x00007fff660e6e92                    0x0000000000000006 0x00010300 strcmp
    [ 1249]   1249     Trampoline      0x00007fff660e6e98                    0x0000000000000006 0x00010300 strcspn
    [ 1250]   1250     Trampoline      0x00007fff660e6e9e                    0x0000000000000006 0x00010300 strdup
    [ 1251]   1251     Trampoline      0x00007fff660e6ea4                    0x0000000000000006 0x00010300 strlcpy
    [ 1252]   1252     Trampoline      0x00007fff660e6eaa                    0x0000000000000006 0x00010300 strlen
    [ 1253]   1253     Trampoline      0x00007fff660e6eb0                    0x0000000000000006 0x00010300 strncmp
    [ 1254]   1254     Trampoline      0x00007fff660e6eb6                    0x0000000000000006 0x00010300 strncpy
    [ 1255]   1255     Trampoline      0x00007fff660e6ebc                    0x0000000000000006 0x00010300 strstr
    [ 1256]   1256     Trampoline      0x00007fff660e6ec2                    0x0000000000000006 0x00010300 task_restartable_ranges_register
    [ 1257]   1257     Trampoline      0x00007fff660e6ec8                    0x0000000000000006 0x00010300 task_restartable_ranges_synchronize
    [ 1258]   1258     Trampoline      0x00007fff660e6ece                    0x0000000000000006 0x00010300 task_threads
    [ 1259]   1259     Trampoline      0x00007fff660e6ed4                    0x0000000000000006 0x00010300 thread_get_state
    [ 1260]   1260     Trampoline      0x00007fff660e6eda                    0x0000000000000006 0x00010300 unw_get_proc_info
    [ 1261]   1261     Trampoline      0x00007fff660e6ee0                    0x0000000000000006 0x00010300 unw_get_reg
    [ 1262]   1262     Trampoline      0x00007fff660e6ee6                    0x0000000000000006 0x00010300 unw_getcontext
    [ 1263]   1263     Trampoline      0x00007fff660e6eec                    0x0000000000000006 0x00010300 unw_init_local
    [ 1264]   1264     Trampoline      0x00007fff660e6ef2                    0x0000000000000006 0x00010300 unw_step
    [ 1265]   1265     Trampoline      0x00007fff660e6ef8                    0x0000000000000006 0x00010300 vasprintf
    [ 1266]   1266     Trampoline      0x00007fff660e6efe                    0x0000000000000006 0x00010300 vm_allocate
    [ 1267]   1267     Trampoline      0x00007fff660e6f04                    0x0000000000000006 0x00010300 vm_deallocate
    [ 1268]   1268     Trampoline      0x00007fff660e6f0a                    0x0000000000000006 0x00010300 vm_remap
    [ 1269]   1269     Trampoline      0x00007fff660e6f10                    0x0000000000000006 0x00010300 write
    [ 1270]   1270   X Undefined       0x0000000000000000                    0x0000000000000000 0x00010300 dyld_stub_binder
    [ 1271]   1271  S  Trampoline      0x00007fff660e6df6                    0x0000000000000006 0x00000000 objc_release
0x61b000048e80:   BreakpointList with 0 Breakpoints:
0x61b000048ee0:   BreakpointList with 0 Breakpoints:

Hide Details

Hide Details

Expecting sub string: a.out Matched

Hide Details

Expecting sub string: Target Matched

Hide Details

Expecting sub string: Module Matched

Hide Details

Expecting sub string: Breakpoint Matched

Hide Details

PASS: LLDB (/Users/buildslave/jenkins/workspace/lldb-cmake-sanitized/lldb-build/bin/clang-x86_64) :: test_get_description_gmodules (TestTargetAPI.TargetAPITestCase) runCmd: settings clear -all output:

Hide Details

runCmd: settings set symbols.enable-external-lookup false output:

Hide Details

runCmd: settings set target.inherit-tcc true output:

Hide Details

runCmd: settings set target.auto-apply-fixits false output:

Hide Details

runCmd: settings set plugin.process.gdb-remote.packet-timeout 60 output:

Hide Details

runCmd: settings set symbols.clang-modules-cache-path "/Users/buildslave/jenkins/workspace/lldb-cmake-sanitized/lldb-build/lldb-test-build.noindex/module-cache-lldb/lldb-api" output:

Hide Details

runCmd: settings set use-color false output:

Hide Details

runCmd: setting set target.prefer-dynamic-value no-dynamic-values output:

Hide Details

runCmd: settings set target.env-vars ASAN_OPTIONS=detect_stack_use_after_return=1 DYLD_INSERT_LIBRARIES=/Users/buildslave/jenkins/workspace/lldb-cmake-sanitized/host-compiler/lib/clang/12.0.0/lib/darwin/libclang_rt.asan_osx_dynamic.dylib output:

Hide Details

PASS: LLDB (/Users/buildslave/jenkins/workspace/lldb-cmake-sanitized/lldb-build/bin/clang-x86_64) :: test_get_platform_dsym (TestTargetAPI.TargetAPITestCase) runCmd: settings clear -all output:

Hide Details

runCmd: settings set symbols.enable-external-lookup false output:

Hide Details

runCmd: settings set target.inherit-tcc true output:

Hide Details

runCmd: settings set target.auto-apply-fixits false output:

Hide Details

runCmd: settings set plugin.process.gdb-remote.packet-timeout 60 output:

Hide Details

runCmd: settings set symbols.clang-modules-cache-path "/Users/buildslave/jenkins/workspace/lldb-cmake-sanitized/lldb-build/lldb-test-build.noindex/module-cache-lldb/lldb-api" output:

Hide Details

runCmd: settings set use-color false output:

Hide Details

runCmd: setting set target.prefer-dynamic-value no-dynamic-values output:

Hide Details

runCmd: settings set target.env-vars ASAN_OPTIONS=detect_stack_use_after_return=1 DYLD_INSERT_LIBRARIES=/Users/buildslave/jenkins/workspace/lldb-cmake-sanitized/host-compiler/lib/clang/12.0.0/lib/darwin/libclang_rt.asan_osx_dynamic.dylib output:

Hide Details

PASS: LLDB (/Users/buildslave/jenkins/workspace/lldb-cmake-sanitized/lldb-build/bin/clang-x86_64) :: test_get_platform_dwarf (TestTargetAPI.TargetAPITestCase) UNSUPPORTED: LLDB (/Users/buildslave/jenkins/workspace/lldb-cmake-sanitized/lldb-build/bin/clang-x86_64) :: test_get_platform_dwo (TestTargetAPI.TargetAPITestCase) (test case does not fall in any category of interest for this run) runCmd: settings clear -all output:

Hide Details

runCmd: settings set symbols.enable-external-lookup false output:

Hide Details

runCmd: settings set target.inherit-tcc true output:

Hide Details

runCmd: settings set target.auto-apply-fixits false output:

Hide Details

runCmd: settings set plugin.process.gdb-remote.packet-timeout 60 output:

Hide Details

runCmd: settings set symbols.clang-modules-cache-path "/Users/buildslave/jenkins/workspace/lldb-cmake-sanitized/lldb-build/lldb-test-build.noindex/module-cache-lldb/lldb-api" output:

Hide Details

runCmd: settings set use-color false output:

Hide Details

runCmd: setting set target.prefer-dynamic-value no-dynamic-values output:

Hide Details

runCmd: settings set target.env-vars ASAN_OPTIONS=detect_stack_use_after_return=1 DYLD_INSERT_LIBRARIES=/Users/buildslave/jenkins/workspace/lldb-cmake-sanitized/host-compiler/lib/clang/12.0.0/lib/darwin/libclang_rt.asan_osx_dynamic.dylib output:

Hide Details

PASS: LLDB (/Users/buildslave/jenkins/workspace/lldb-cmake-sanitized/lldb-build/bin/clang-x86_64) :: test_get_platform_gmodules (TestTargetAPI.TargetAPITestCase) runCmd: settings clear -all output:

Hide Details

runCmd: settings set symbols.enable-external-lookup false output:

Hide Details

runCmd: settings set target.inherit-tcc true output:

Hide Details

runCmd: settings set target.auto-apply-fixits false output:

Hide Details

runCmd: settings set plugin.process.gdb-remote.packet-timeout 60 output:

Hide Details

runCmd: settings set symbols.clang-modules-cache-path "/Users/buildslave/jenkins/workspace/lldb-cmake-sanitized/lldb-build/lldb-test-build.noindex/module-cache-lldb/lldb-api" output:

Hide Details

runCmd: settings set use-color false output:

Hide Details

runCmd: setting set target.prefer-dynamic-value no-dynamic-values output:

Hide Details

runCmd: settings set target.env-vars ASAN_OPTIONS=detect_stack_use_after_return=1 DYLD_INSERT_LIBRARIES=/Users/buildslave/jenkins/workspace/lldb-cmake-sanitized/host-compiler/lib/clang/12.0.0/lib/darwin/libclang_rt.asan_osx_dynamic.dylib output:

Hide Details

looking at: a(1) returns 4 b(2) returns 5 a(3) returns 6 env: LLDB_SESSION_DIRNAME=/Users/buildslave/jenkins/workspace/lldb-cmake-sanitized/test/logs env: COLUMNS=80 env: LLVM_LIBS_DIR=/Users/buildslave/jenkins/workspace/lldb-cmake-sanitized/lldb-build/./lib env: LLDB_SRC=/Users/buildslave/jenkins/workspace/lldb-cmake-sanitized/llvm-project/lldb env: LLDBVSCODE_EXEC=/Users/buildslave/jenkins/workspace/lldb-cmake-sanitized/lldb-build/bin/lldb-vscode env: LLDB_DEBUGSERVER_PATH=/Users/buildslave/jenkins/workspace/lldb-cmake-sanitized/lldb-build/./bin/debugserver env: OS_ACTIVITY_DT_MODE=enable env: LLDB_COMMAND_TRACE=YES env: LLDB_FRAMEWORK=/Users/buildslave/jenkins/workspace/lldb-cmake-sanitized/lldb-build/lib env: PATH=/usr/local/bin:/usr/local/sbin:/usr/bin:/bin:/usr/sbin:/sbin:/usr/bin:/usr/local/bin env: ASAN_OPTIONS=detect_stack_use_after_return=1 env: __CF_USER_TEXT_ENCODING=0x1F5:0x0:0x0 env: TMPDIR=/var/folders/09/r4vw4v8n5kb67jl66zvlbljw0000gn/T/ env: LLDB_LIB_DIR=/Users/buildslave/jenkins/workspace/lldb-cmake-sanitized/lldb-build/bin env: LC_CTYPE=UTF-8 env: TERM=vt100 env: LLVM_DISABLE_CRASH_REPORT=1 env: LLDB_IMPLIB_DIR=/Users/buildslave/jenkins/workspace/lldb-cmake-sanitized/lldb-build/./lib env: LINES=24 env: LLDB_TEST=/Users/buildslave/jenkins/workspace/lldb-cmake-sanitized/llvm-project/lldb/packages/Python/lldbsuite/test

Hide Details

Hide Details

Expecting sub string: a(1) Matched

Hide Details

Expecting sub string: b(2) Matched

Hide Details

Expecting sub string: a(3) Matched

Hide Details

<bound method SBProcess.Kill of <lldb.SBProcess; proxy of <Swig Object of type 'lldb::SBProcess *' at 0x10a5b5c00> >>: success

Hide Details

PASS: LLDB (/Users/buildslave/jenkins/workspace/lldb-cmake-sanitized/lldb-build/bin/clang-x86_64) :: test_launch_new_process_and_redirect_stdout (TestTargetAPI.TargetAPITestCase) runCmd: settings clear -all output:

Hide Details

runCmd: settings set symbols.enable-external-lookup false output:

Hide Details

runCmd: settings set target.inherit-tcc true output:

Hide Details

runCmd: settings set target.auto-apply-fixits false output:

Hide Details

runCmd: settings set plugin.process.gdb-remote.packet-timeout 60 output:

Hide Details

runCmd: settings set symbols.clang-modules-cache-path "/Users/buildslave/jenkins/workspace/lldb-cmake-sanitized/lldb-build/lldb-test-build.noindex/module-cache-lldb/lldb-api" output:

Hide Details

runCmd: settings set use-color false output:

Hide Details

runCmd: setting set target.prefer-dynamic-value no-dynamic-values output:

Hide Details

runCmd: settings set target.env-vars ASAN_OPTIONS=detect_stack_use_after_return=1 DYLD_INSERT_LIBRARIES=/Users/buildslave/jenkins/workspace/lldb-cmake-sanitized/host-compiler/lib/clang/12.0.0/lib/darwin/libclang_rt.asan_osx_dynamic.dylib output:

Hide Details

runCmd: run output: Process 97527 exited with status = 0 (0x00000000)

Hide Details

Process 97527 launched: '/Users/buildslave/jenkins/workspace/lldb-cmake-sanitized/lldb-build/lldb-test-build.noindex/python_api/target/TestTargetAPI.test_launch_simple/b.out' (x86_64)

Hide Details

Hide Details

FAIL: LLDB (/Users/buildslave/jenkins/workspace/lldb-cmake-sanitized/lldb-build/bin/clang-x86_64) :: test_launch_simple (TestTargetAPI.TargetAPITestCase) <bound method SBProcess.Kill of <lldb.SBProcess; proxy of <Swig Object of type 'lldb::SBProcess *' at 0x10ad0c960> >>: success

Hide Details

runCmd: settings clear -all output:

Hide Details

runCmd: settings set symbols.enable-external-lookup false output:

Hide Details

runCmd: settings set target.inherit-tcc true output:

Hide Details

runCmd: settings set target.auto-apply-fixits false output:

Hide Details

runCmd: settings set plugin.process.gdb-remote.packet-timeout 60 output:

Hide Details

runCmd: settings set symbols.clang-modules-cache-path "/Users/buildslave/jenkins/workspace/lldb-cmake-sanitized/lldb-build/lldb-test-build.noindex/module-cache-lldb/lldb-api" output:

Hide Details

runCmd: settings set use-color false output:

Hide Details

runCmd: setting set target.prefer-dynamic-value no-dynamic-values output:

Hide Details

runCmd: settings set target.env-vars ASAN_OPTIONS=detect_stack_use_after_return=1 DYLD_INSERT_LIBRARIES=/Users/buildslave/jenkins/workspace/lldb-cmake-sanitized/host-compiler/lib/clang/12.0.0/lib/darwin/libclang_rt.asan_osx_dynamic.dylib output:

Hide Details

<bound method SBProcess.Kill of <lldb.SBProcess; proxy of <Swig Object of type 'lldb::SBProcess *' at 0x10a5b5c00> >>: success

Hide Details

PASS: LLDB (/Users/buildslave/jenkins/workspace/lldb-cmake-sanitized/lldb-build/bin/clang-x86_64) :: test_read_memory_dsym (TestTargetAPI.TargetAPITestCase) runCmd: settings clear -all output:

Hide Details

runCmd: settings set symbols.enable-external-lookup false output:

Hide Details

runCmd: settings set target.inherit-tcc true output:

Hide Details

runCmd: settings set target.auto-apply-fixits false output:

Hide Details

runCmd: settings set plugin.process.gdb-remote.packet-timeout 60 output:

Hide Details

runCmd: settings set symbols.clang-modules-cache-path "/Users/buildslave/jenkins/workspace/lldb-cmake-sanitized/lldb-build/lldb-test-build.noindex/module-cache-lldb/lldb-api" output:

Hide Details

runCmd: settings set use-color false output:

Hide Details

runCmd: setting set target.prefer-dynamic-value no-dynamic-values output:

Hide Details

runCmd: settings set target.env-vars ASAN_OPTIONS=detect_stack_use_after_return=1 DYLD_INSERT_LIBRARIES=/Users/buildslave/jenkins/workspace/lldb-cmake-sanitized/host-compiler/lib/clang/12.0.0/lib/darwin/libclang_rt.asan_osx_dynamic.dylib output:

Hide Details

<bound method SBProcess.Kill of <lldb.SBProcess; proxy of <Swig Object of type 'lldb::SBProcess *' at 0x10ad0c870> >>: success

Hide Details

PASS: LLDB (/Users/buildslave/jenkins/workspace/lldb-cmake-sanitized/lldb-build/bin/clang-x86_64) :: test_read_memory_dwarf (TestTargetAPI.TargetAPITestCase) UNSUPPORTED: LLDB (/Users/buildslave/jenkins/workspace/lldb-cmake-sanitized/lldb-build/bin/clang-x86_64) :: test_read_memory_dwo (TestTargetAPI.TargetAPITestCase) (test case does not fall in any category of interest for this run) runCmd: settings clear -all output:

Hide Details

runCmd: settings set symbols.enable-external-lookup false output:

Hide Details

runCmd: settings set target.inherit-tcc true output:

Hide Details

runCmd: settings set target.auto-apply-fixits false output:

Hide Details

runCmd: settings set plugin.process.gdb-remote.packet-timeout 60 output:

Hide Details

runCmd: settings set symbols.clang-modules-cache-path "/Users/buildslave/jenkins/workspace/lldb-cmake-sanitized/lldb-build/lldb-test-build.noindex/module-cache-lldb/lldb-api" output:

Hide Details

runCmd: settings set use-color false output:

Hide Details

runCmd: setting set target.prefer-dynamic-value no-dynamic-values output:

Hide Details

runCmd: settings set target.env-vars ASAN_OPTIONS=detect_stack_use_after_return=1 DYLD_INSERT_LIBRARIES=/Users/buildslave/jenkins/workspace/lldb-cmake-sanitized/host-compiler/lib/clang/12.0.0/lib/darwin/libclang_rt.asan_osx_dynamic.dylib output:

Hide Details

<bound method SBProcess.Kill of <lldb.SBProcess; proxy of <Swig Object of type 'lldb::SBProcess *' at 0x10a5b5c00> >>: success

Hide Details

PASS: LLDB (/Users/buildslave/jenkins/workspace/lldb-cmake-sanitized/lldb-build/bin/clang-x86_64) :: test_read_memory_gmodules (TestTargetAPI.TargetAPITestCase) runCmd: settings clear -all output:

Hide Details

runCmd: settings set symbols.enable-external-lookup false output:

Hide Details

runCmd: settings set target.inherit-tcc true output:

Hide Details

runCmd: settings set target.auto-apply-fixits false output:

Hide Details

runCmd: settings set plugin.process.gdb-remote.packet-timeout 60 output:

Hide Details

runCmd: settings set symbols.clang-modules-cache-path "/Users/buildslave/jenkins/workspace/lldb-cmake-sanitized/lldb-build/lldb-test-build.noindex/module-cache-lldb/lldb-api" output:

Hide Details

runCmd: settings set use-color false output:

Hide Details

runCmd: setting set target.prefer-dynamic-value no-dynamic-values output:

Hide Details

runCmd: settings set target.env-vars ASAN_OPTIONS=detect_stack_use_after_return=1 DYLD_INSERT_LIBRARIES=/Users/buildslave/jenkins/workspace/lldb-cmake-sanitized/host-compiler/lib/clang/12.0.0/lib/darwin/libclang_rt.asan_osx_dynamic.dylib output:

Hide Details

PASS: LLDB (/Users/buildslave/jenkins/workspace/lldb-cmake-sanitized/lldb-build/bin/clang-x86_64) :: test_resolve_file_address_dsym (TestTargetAPI.TargetAPITestCase) runCmd: settings clear -all output:

Hide Details

runCmd: settings set symbols.enable-external-lookup false output:

Hide Details

runCmd: settings set target.inherit-tcc true output:

Hide Details

runCmd: settings set target.auto-apply-fixits false output:

Hide Details

runCmd: settings set plugin.process.gdb-remote.packet-timeout 60 output:

Hide Details

runCmd: settings set symbols.clang-modules-cache-path "/Users/buildslave/jenkins/workspace/lldb-cmake-sanitized/lldb-build/lldb-test-build.noindex/module-cache-lldb/lldb-api" output:

Hide Details

runCmd: settings set use-color false output:

Hide Details

runCmd: setting set target.prefer-dynamic-value no-dynamic-values output:

Hide Details

runCmd: settings set target.env-vars ASAN_OPTIONS=detect_stack_use_after_return=1 DYLD_INSERT_LIBRARIES=/Users/buildslave/jenkins/workspace/lldb-cmake-sanitized/host-compiler/lib/clang/12.0.0/lib/darwin/libclang_rt.asan_osx_dynamic.dylib output:

Hide Details

PASS: LLDB (/Users/buildslave/jenkins/workspace/lldb-cmake-sanitized/lldb-build/bin/clang-x86_64) :: test_resolve_file_address_dwarf (TestTargetAPI.TargetAPITestCase) UNSUPPORTED: LLDB (/Users/buildslave/jenkins/workspace/lldb-cmake-sanitized/lldb-build/bin/clang-x86_64) :: test_resolve_file_address_dwo (TestTargetAPI.TargetAPITestCase) (test case does not fall in any category of interest for this run) runCmd: settings clear -all output:

Hide Details

runCmd: settings set symbols.enable-external-lookup false output:

Hide Details

runCmd: settings set target.inherit-tcc true output:

Hide Details

runCmd: settings set target.auto-apply-fixits false output:

Hide Details

runCmd: settings set plugin.process.gdb-remote.packet-timeout 60 output:

Hide Details

runCmd: settings set symbols.clang-modules-cache-path "/Users/buildslave/jenkins/workspace/lldb-cmake-sanitized/lldb-build/lldb-test-build.noindex/module-cache-lldb/lldb-api" output:

Hide Details

runCmd: settings set use-color false output:

Hide Details

runCmd: setting set target.prefer-dynamic-value no-dynamic-values output:

Hide Details

runCmd: settings set target.env-vars ASAN_OPTIONS=detect_stack_use_after_return=1 DYLD_INSERT_LIBRARIES=/Users/buildslave/jenkins/workspace/lldb-cmake-sanitized/host-compiler/lib/clang/12.0.0/lib/darwin/libclang_rt.asan_osx_dynamic.dylib output:

Hide Details

PASS: LLDB (/Users/buildslave/jenkins/workspace/lldb-cmake-sanitized/lldb-build/bin/clang-x86_64) :: test_resolve_file_address_gmodules (TestTargetAPI.TargetAPITestCase) runCmd: settings clear -all output:

Hide Details

runCmd: settings set symbols.enable-external-lookup false output:

Hide Details

runCmd: settings set target.inherit-tcc true output:

Hide Details

runCmd: settings set target.auto-apply-fixits false output:

Hide Details

runCmd: settings set plugin.process.gdb-remote.packet-timeout 60 output:

Hide Details

runCmd: settings set symbols.clang-modules-cache-path "/Users/buildslave/jenkins/workspace/lldb-cmake-sanitized/lldb-build/lldb-test-build.noindex/module-cache-lldb/lldb-api" output:

Hide Details

runCmd: settings set use-color false output:

Hide Details

runCmd: setting set target.prefer-dynamic-value no-dynamic-values output:

Hide Details

runCmd: settings set target.env-vars ASAN_OPTIONS=detect_stack_use_after_return=1 DYLD_INSERT_LIBRARIES=/Users/buildslave/jenkins/workspace/lldb-cmake-sanitized/host-compiler/lib/clang/12.0.0/lib/darwin/libclang_rt.asan_osx_dynamic.dylib output:

Hide Details

breakpoint1: SBBreakpoint: id = 1, file = 'main.c', line = 21, exact_match = 0, locations = 1

Hide Details

breakpoint2: SBBreakpoint: id = 2, file = 'main.c', line = 26, exact_match = 0, locations = 1

Hide Details

address1: a.out`a + 11 at main.c:21:13

Hide Details

address2: a.out`a + 63 at main.c:26:12

Hide Details

context1: Module: file = "/Users/buildslave/jenkins/workspace/lldb-cmake-sanitized/lldb-build/lldb-test-build.noindex/python_api/target/TestTargetAPI.test_resolve_symbol_context_with_address_dsym/a.out", arch = "x86_64" CompileUnit: id = {0x00000000}, file = "/Users/buildslave/jenkins/workspace/lldb-cmake-sanitized/llvm-project/lldb/test/API/python_api/target/main.c", language = "c99" Function: id = {0x7fffffff0000004e}, name = "a", range = [0x0000000100000dd0-0x0000000100000e18) FuncType: id = {0x7fffffff0000004e}, byte-size = 0, decl = main.c:19, compiler_type = "int (int)" Blocks: id = {0x7fffffff0000004e}, range = [0x100000dd0-0x100000e18) LineEntry: [0x0000000100000ddb-0x0000000100000ddf): /Users/buildslave/jenkins/workspace/lldb-cmake-sanitized/llvm-project/lldb/test/API/python_api/target/main.c:21:13, is_start_of_statement = TRUE, is_prologue_end = TRUE Symbol: id = {0x00000005}, range = [0x0000000100000dd0-0x0000000100000e20), name="a"

Hide Details

context2: Module: file = "/Users/buildslave/jenkins/workspace/lldb-cmake-sanitized/lldb-build/lldb-test-build.noindex/python_api/target/TestTargetAPI.test_resolve_symbol_context_with_address_dsym/a.out", arch = "x86_64" CompileUnit: id = {0x00000000}, file = "/Users/buildslave/jenkins/workspace/lldb-cmake-sanitized/llvm-project/lldb/test/API/python_api/target/main.c", language = "c99" Function: id = {0x7fffffff0000004e}, name = "a", range = [0x0000000100000dd0-0x0000000100000e18) FuncType: id = {0x7fffffff0000004e}, byte-size = 0, decl = main.c:19, compiler_type = "int (int)" Blocks: id = {0x7fffffff0000004e}, range = [0x100000dd0-0x100000e18) LineEntry: [0x0000000100000e0f-0x0000000100000e12): /Users/buildslave/jenkins/workspace/lldb-cmake-sanitized/llvm-project/lldb/test/API/python_api/target/main.c:26:12, is_start_of_statement = TRUE Symbol: id = {0x00000005}, range = [0x0000000100000dd0-0x0000000100000e20), name="a"

Hide Details

symbol1: id = {0x00000005}, range = [0x0000000100000dd0-0x0000000100000e20), name="a"

Hide Details

symbol2: id = {0x00000005}, range = [0x0000000100000dd0-0x0000000100000e20), name="a"

Hide Details

<bound method SBProcess.Kill of <lldb.SBProcess; proxy of <Swig Object of type 'lldb::SBProcess *' at 0x10a79c1e0> >>: success

Hide Details

PASS: LLDB (/Users/buildslave/jenkins/workspace/lldb-cmake-sanitized/lldb-build/bin/clang-x86_64) :: test_resolve_symbol_context_with_address_dsym (TestTargetAPI.TargetAPITestCase) runCmd: settings clear -all output:

Hide Details

runCmd: settings set symbols.enable-external-lookup false output:

Hide Details

runCmd: settings set target.inherit-tcc true output:

Hide Details

runCmd: settings set target.auto-apply-fixits false output:

Hide Details

runCmd: settings set plugin.process.gdb-remote.packet-timeout 60 output:

Hide Details

runCmd: settings set symbols.clang-modules-cache-path "/Users/buildslave/jenkins/workspace/lldb-cmake-sanitized/lldb-build/lldb-test-build.noindex/module-cache-lldb/lldb-api" output:

Hide Details

runCmd: settings set use-color false output:

Hide Details

runCmd: setting set target.prefer-dynamic-value no-dynamic-values output:

Hide Details

runCmd: settings set target.env-vars ASAN_OPTIONS=detect_stack_use_after_return=1 DYLD_INSERT_LIBRARIES=/Users/buildslave/jenkins/workspace/lldb-cmake-sanitized/host-compiler/lib/clang/12.0.0/lib/darwin/libclang_rt.asan_osx_dynamic.dylib output:

Hide Details

breakpoint1: SBBreakpoint: id = 1, file = 'main.c', line = 21, exact_match = 0, locations = 1

Hide Details

breakpoint2: SBBreakpoint: id = 2, file = 'main.c', line = 26, exact_match = 0, locations = 1

Hide Details

address1: a.out`a + 11 at main.c:21:13

Hide Details

address2: a.out`a + 63 at main.c:26:12

Hide Details

context1: Module: file = "/Users/buildslave/jenkins/workspace/lldb-cmake-sanitized/lldb-build/lldb-test-build.noindex/python_api/target/TestTargetAPI.test_resolve_symbol_context_with_address_dwarf/a.out", arch = "x86_64" CompileUnit: id = {0x00000000}, file = "/Users/buildslave/jenkins/workspace/lldb-cmake-sanitized/llvm-project/lldb/test/API/python_api/target/main.c", language = "unknown" Function: id = {0x10000004e}, name = "a", range = [0x0000000100000dd0-0x0000000100000e18) FuncType: id = {0x10000004e}, byte-size = 0, decl = main.c:19, compiler_type = "int (int)" Blocks: id = {0x10000004e}, range = [0x100000dd0-0x100000e18) LineEntry: [0x0000000100000ddb-0x0000000100000ddf): /Users/buildslave/jenkins/workspace/lldb-cmake-sanitized/llvm-project/lldb/test/API/python_api/target/main.c:21:13, is_start_of_statement = TRUE, is_prologue_end = TRUE Symbol: id = {0x00000005}, range = [0x0000000100000dd0-0x0000000100000e20), name="a"

Hide Details

context2: Module: file = "/Users/buildslave/jenkins/workspace/lldb-cmake-sanitized/lldb-build/lldb-test-build.noindex/python_api/target/TestTargetAPI.test_resolve_symbol_context_with_address_dwarf/a.out", arch = "x86_64" CompileUnit: id = {0x00000000}, file = "/Users/buildslave/jenkins/workspace/lldb-cmake-sanitized/llvm-project/lldb/test/API/python_api/target/main.c", language = "unknown" Function: id = {0x10000004e}, name = "a", range = [0x0000000100000dd0-0x0000000100000e18) FuncType: id = {0x10000004e}, byte-size = 0, decl = main.c:19, compiler_type = "int (int)" Blocks: id = {0x10000004e}, range = [0x100000dd0-0x100000e18) LineEntry: [0x0000000100000e0f-0x0000000100000e12): /Users/buildslave/jenkins/workspace/lldb-cmake-sanitized/llvm-project/lldb/test/API/python_api/target/main.c:26:12, is_start_of_statement = TRUE Symbol: id = {0x00000005}, range = [0x0000000100000dd0-0x0000000100000e20), name="a"

Hide Details

symbol1: id = {0x00000005}, range = [0x0000000100000dd0-0x0000000100000e20), name="a"

Hide Details

symbol2: id = {0x00000005}, range = [0x0000000100000dd0-0x0000000100000e20), name="a"

Hide Details

<bound method SBProcess.Kill of <lldb.SBProcess; proxy of <Swig Object of type 'lldb::SBProcess *' at 0x10a0afcf0> >>: success

Hide Details

PASS: LLDB (/Users/buildslave/jenkins/workspace/lldb-cmake-sanitized/lldb-build/bin/clang-x86_64) :: test_resolve_symbol_context_with_address_dwarf (TestTargetAPI.TargetAPITestCase) UNSUPPORTED: LLDB (/Users/buildslave/jenkins/workspace/lldb-cmake-sanitized/lldb-build/bin/clang-x86_64) :: test_resolve_symbol_context_with_address_dwo (TestTargetAPI.TargetAPITestCase) (test case does not fall in any category of interest for this run) runCmd: settings clear -all output:

Hide Details

runCmd: settings set symbols.enable-external-lookup false output:

Hide Details

runCmd: settings set target.inherit-tcc true output:

Hide Details

runCmd: settings set target.auto-apply-fixits false output:

Hide Details

runCmd: settings set plugin.process.gdb-remote.packet-timeout 60 output:

Hide Details

runCmd: settings set symbols.clang-modules-cache-path "/Users/buildslave/jenkins/workspace/lldb-cmake-sanitized/lldb-build/lldb-test-build.noindex/module-cache-lldb/lldb-api" output:

Hide Details

runCmd: settings set use-color false output:

Hide Details

runCmd: setting set target.prefer-dynamic-value no-dynamic-values output:

Hide Details

runCmd: settings set target.env-vars ASAN_OPTIONS=detect_stack_use_after_return=1 DYLD_INSERT_LIBRARIES=/Users/buildslave/jenkins/workspace/lldb-cmake-sanitized/host-compiler/lib/clang/12.0.0/lib/darwin/libclang_rt.asan_osx_dynamic.dylib output:

Hide Details

breakpoint1: SBBreakpoint: id = 1, file = 'main.c', line = 21, exact_match = 0, locations = 1

Hide Details

breakpoint2: SBBreakpoint: id = 2, file = 'main.c', line = 26, exact_match = 0, locations = 1

Hide Details

address1: a.out`a + 11 at main.c:21:13

Hide Details

address2: a.out`a + 63 at main.c:26:12

Hide Details

context1: Module: file = "/Users/buildslave/jenkins/workspace/lldb-cmake-sanitized/lldb-build/lldb-test-build.noindex/python_api/target/TestTargetAPI.test_resolve_symbol_context_with_address_gmodules/a.out", arch = "x86_64" CompileUnit: id = {0x00000000}, file = "/Users/buildslave/jenkins/workspace/lldb-cmake-sanitized/llvm-project/lldb/test/API/python_api/target/main.c", language = "unknown" Function: id = {0x100000072}, name = "a", range = [0x0000000100000dd0-0x0000000100000e18) FuncType: id = {0x100000072}, byte-size = 0, decl = main.c:19, compiler_type = "int (int)" Blocks: id = {0x100000072}, range = [0x100000dd0-0x100000e18) LineEntry: [0x0000000100000ddb-0x0000000100000ddf): /Users/buildslave/jenkins/workspace/lldb-cmake-sanitized/llvm-project/lldb/test/API/python_api/target/main.c:21:13, is_start_of_statement = TRUE, is_prologue_end = TRUE Symbol: id = {0x00000005}, range = [0x0000000100000dd0-0x0000000100000e20), name="a"

Hide Details

context2: Module: file = "/Users/buildslave/jenkins/workspace/lldb-cmake-sanitized/lldb-build/lldb-test-build.noindex/python_api/target/TestTargetAPI.test_resolve_symbol_context_with_address_gmodules/a.out", arch = "x86_64" CompileUnit: id = {0x00000000}, file = "/Users/buildslave/jenkins/workspace/lldb-cmake-sanitized/llvm-project/lldb/test/API/python_api/target/main.c", language = "unknown" Function: id = {0x100000072}, name = "a", range = [0x0000000100000dd0-0x0000000100000e18) FuncType: id = {0x100000072}, byte-size = 0, decl = main.c:19, compiler_type = "int (int)" Blocks: id = {0x100000072}, range = [0x100000dd0-0x100000e18) LineEntry: [0x0000000100000e0f-0x0000000100000e12): /Users/buildslave/jenkins/workspace/lldb-cmake-sanitized/llvm-project/lldb/test/API/python_api/target/main.c:26:12, is_start_of_statement = TRUE Symbol: id = {0x00000005}, range = [0x0000000100000dd0-0x0000000100000e20), name="a"

Hide Details

symbol1: id = {0x00000005}, range = [0x0000000100000dd0-0x0000000100000e20), name="a"

Hide Details

symbol2: id = {0x00000005}, range = [0x0000000100000dd0-0x0000000100000e20), name="a"

Hide Details

<bound method SBProcess.Kill of <lldb.SBProcess; proxy of <Swig Object of type 'lldb::SBProcess *' at 0x10a79c1e0> >>: success

Hide Details

PASS: LLDB (/Users/buildslave/jenkins/workspace/lldb-cmake-sanitized/lldb-build/bin/clang-x86_64) :: test_resolve_symbol_context_with_address_gmodules (TestTargetAPI.TargetAPITestCase) Restore dir to: /Users/buildslave/jenkins/workspace/lldb-cmake-sanitized/lldb-build/tools/lldb/test ====================================================================== FAIL: test_launch_simple (TestTargetAPI.TargetAPITestCase) ---------------------------------------------------------------------- Traceback (most recent call last): File "/Users/buildslave/jenkins/workspace/lldb-cmake-sanitized/llvm-project/lldb/packages/Python/lldbsuite/test/decorators.py", line 135, in wrapper return func(*args, **kwargs) File "/Users/buildslave/jenkins/workspace/lldb-cmake-sanitized/llvm-project/lldb/packages/Python/lldbsuite/test/decorators.py", line 345, in wrapper return func(self, *args, **kwargs) File "/Users/buildslave/jenkins/workspace/lldb-cmake-sanitized/llvm-project/lldb/test/API/python_api/target/TestTargetAPI.py", line 172, in test_launch_simple self.assertEqual(process.GetState(), lldb.eStateExited) AssertionError: 0 != 10 Config=x86_64-/Users/buildslave/jenkins/workspace/lldb-cmake-sanitized/lldb-build/bin/clang ---------------------------------------------------------------------- Ran 42 tests in 56.571s

Hide Details

RESULT: FAILED (31 passes, 1 failures, 0 errors, 10 skipped, 0 expected failures, 0 unexpected successes)

Hide Details

--

Hide Details

******************** PASS: lldb-unit :: Utility/./UtilityTests/UriParserTest.BadPort2 (1136 of 2110) PASS: lldb-shell :: Minidump/memory-region-from-module.yaml (1137 of 2110) PASS: lldb-unit :: Utility/./UtilityTests/BinaryStreamTest.PutULEB128ThreeBytes (1138 of 2110) PASS: lldb-api :: lang/cpp/subst_template_type_param/TestSubstTemplateTypeParam.py (1139 of 2110) PASS: lldb-unit :: Target/./TargetTests/ExecutionContextTest.GetByteOrder (1140 of 2110) PASS: lldb-unit :: UnwindAssembly/x86/./UnwindAssemblyx86Tests/Testx86AssemblyInspectionEngine.TestStackRealign8BitDisp_i386 (1141 of 2110) PASS: lldb-api :: lang/objc/real-definition/TestRealDefinition.py (1142 of 2110) PASS: lldb-api :: python_api/process/TestProcessAPI.py (1143 of 2110) PASS: lldb-api :: lang/objc/objc-static-method/TestObjCStaticMethod.py (1144 of 2110) PASS: lldb-shell :: SymbolFile/DWARF/compilercontext.ll (1145 of 2110) PASS: lldb-api :: functionalities/data-formatter/vector-types/TestVectorTypesFormatting.py (1146 of 2110) PASS: lldb-unit :: Target/./TargetTests/ModuleCacheTest.GetAndPutStrangeHostname (1147 of 2110) PASS: lldb-shell :: Settings/TestSettingsWrite.test (1148 of 2110) PASS: lldb-api :: lang/cpp/global_variables/TestCPPGlobalVariables.py (1149 of 2110) PASS: lldb-unit :: Utility/./UtilityTests/CompletionRequest.FakeLastArg (1150 of 2110) PASS: lldb-unit :: Utility/./UtilityTests/StreamTest.ShiftOperatorStrings (1151 of 2110) PASS: lldb-unit :: Process/minidump/./LLDBMinidumpTests/MinidumpParserTest.InvalidMinidump (1152 of 2110) UNSUPPORTED: lldb-api :: iohandler/unicode/TestUnicode.py (1153 of 2110) UNSUPPORTED: lldb-shell :: SymbolFile/Breakpad/stack-cfi-arm.yaml (1154 of 2110) PASS: lldb-unit :: Process/gdb-remote/./ProcessGdbRemoteTests/GDBRemoteCommunicationClientTest.GetMemoryRegionInfo (1155 of 2110) PASS: lldb-shell :: ObjectFile/ELF/base-address.yaml (1156 of 2110) PASS: lldb-unit :: Utility/./UtilityTests/ProcessInstanceInfoList.Yaml (1157 of 2110) PASS: lldb-api :: commands/expression/persistent_types/TestNestedPersistentTypes.py (1158 of 2110) PASS: lldb-unit :: Host/./HostTests/NativeProcessProtocolTest.SetBreakpointFailVerify (1159 of 2110) UNSUPPORTED: lldb-api :: functionalities/data-formatter/data-formatter-stl/libstdcpp/string/TestDataFormatterStdString.py (1160 of 2110) PASS: lldb-api :: tools/lldb-server/TestGdbRemote_vCont.py (1161 of 2110) PASS: lldb-api :: functionalities/thread/concurrent_events/TestConcurrentTwoBreakpointsOneDelaySignal.py (1162 of 2110) PASS: lldb-unit :: Utility/./UtilityTests/OptionsWithRawTest.EmptyArgsOnlySuffix (1163 of 2110) UNSUPPORTED: lldb-api :: commands/expression/multiline-completion/TestMultilineCompletion.py (1164 of 2110) PASS: lldb-unit :: Utility/./UtilityTests/StreamTest.PutULEB128 (1165 of 2110) PASS: lldb-unit :: Utility/./UtilityTests/PassiveReplayTest.InstrumentedBar (1166 of 2110) PASS: lldb-unit :: UnwindAssembly/x86/./UnwindAssemblyx86Tests/Testx86AssemblyInspectionEngine.TestDisassemblyMidFunctionEpilogues (1167 of 2110) UNSUPPORTED: lldb-api :: python_api/event/TestEvents.py (1168 of 2110) PASS: lldb-unit :: Target/./TargetTests/PathMappingListTest.RemapRoot (1169 of 2110) PASS: lldb-unit :: Utility/./UtilityTests/TildeExpressionResolver.ResolveFullPath (1170 of 2110) PASS: lldb-shell :: Minidump/disassemble-no-module.yaml (1171 of 2110) PASS: lldb-api :: linux/builtin_trap/TestBuiltinTrap.py (1172 of 2110) PASS: lldb-unit :: tools/lldb-server/tests/./LLDBServerTests/TestBase.LaunchModePreservesEnvironment (1173 of 2110) PASS: lldb-api :: functionalities/breakpoint/breakpoint_command/TestBreakpointCommand.py (1174 of 2110) PASS: lldb-api :: python_api/hello_world/TestHelloWorld.py (1175 of 2110) PASS: lldb-unit :: Utility/./UtilityTests/StringListTest.LongestCommonPrefix (1176 of 2110) UNSUPPORTED: lldb-api :: functionalities/tsan/cpp_global_location/TestTsanCPPGlobalLocation.py (1177 of 2110) PASS: lldb-unit :: Utility/./UtilityTests/StringLexerTest.NextIfList (1178 of 2110) PASS: lldb-api :: lang/objc/foundation/TestObjCMethodsNSError.py (1179 of 2110) PASS: lldb-unit :: Process/gdb-remote/./ProcessGdbRemoteTests/GDBRemoteClientBaseTest.SendContinueAndWait (1180 of 2110) PASS: lldb-api :: commands/expression/save_jit_objects/TestSaveJITObjects.py (1181 of 2110) PASS: lldb-unit :: Utility/./UtilityTests/UriParserTest.PortOverflow (1182 of 2110) PASS: lldb-unit :: Utility/./UtilityTests/BinaryStreamTest.PutULEB128FiveBytes (1183 of 2110) PASS: lldb-api :: macosx/duplicate-archive-members/TestDuplicateMembers.py (1184 of 2110) PASS: lldb-api :: functionalities/data-formatter/data-formatter-objc/TestDataFormatterObjCKVO.py (1185 of 2110) PASS: lldb-shell :: SymbolFile/Breakpad/unwind-via-stack-cfi.test (1186 of 2110) PASS: lldb-shell :: Reproducer/TestPythonImport.test (1187 of 2110) PASS: lldb-unit :: Utility/./UtilityTests/TimerTest.CategoryTimesNested (1188 of 2110) PASS: lldb-api :: functionalities/abbreviation/TestCommonShortSpellings.py (1189 of 2110) PASS: lldb-api :: lang/cpp/global_operators/TestCppGlobalOperators.py (1190 of 2110) PASS: lldb-unit :: UnwindAssembly/x86/./UnwindAssemblyx86Tests/Testx86AssemblyInspectionEngine.TestMovRSPtoRBP (1191 of 2110) UNSUPPORTED: lldb-api :: functionalities/darwin_log/source/debug/TestDarwinLogSourceDebug.py (1192 of 2110) PASS: lldb-unit :: Utility/./UtilityTests/StringListTest.CopyList (1193 of 2110) PASS: lldb-api :: commands/expression/import-std-module/forward_list/TestForwardListFromStdModule.py (1194 of 2110) PASS: lldb-unit :: Expression/./ExpressionTests/DiagnosticManagerTest.GetStringPreserveOrder (1195 of 2110) PASS: lldb-api :: commands/watchpoints/watchpoint_commands/command/TestWatchpointCommandPython.py (1196 of 2110) PASS: lldb-api :: functionalities/postmortem/minidump/TestMiniDump.py (1197 of 2110) PASS: lldb-shell :: Driver/TestError.test (1198 of 2110) PASS: lldb-unit :: ScriptInterpreter/Python/./ScriptInterpreterPythonTests/PythonDataObjectsTest.TestObjectAttributes (1199 of 2110) PASS: lldb-unit :: Utility/./UtilityTests/OptionsWithRawTest.WhitespaceInput (1200 of 2110) PASS: lldb-unit :: Utility/./UtilityTests/Flags.AllClear (1201 of 2110) PASS: lldb-api :: functionalities/mtc/simple/TestMTCSimple.py (1202 of 2110) PASS: lldb-unit :: Utility/./UtilityTests/AnsiTerminal.Empty (1203 of 2110) PASS: lldb-unit :: Utility/./UtilityTests/StringExtractorTest.DecodeHexU8_InvalidHex2 (1204 of 2110) PASS: lldb-unit :: Utility/./UtilityTests/ProcessInstanceInfo.Dump (1205 of 2110) PASS: lldb-unit :: Symbol/./SymbolTests/TestTypeSystemClang.TestGetTypeClassNested (1206 of 2110) PASS: lldb-shell :: ObjectFile/ELF/section-overlap.yaml (1207 of 2110) UNSUPPORTED: lldb-shell :: SymbolFile/PDB/udt-layout.test (1208 of 2110) PASS: lldb-shell :: Breakpoint/debug_rnglist_offset_pair.test (1209 of 2110) PASS: lldb-shell :: SymbolFile/DWARF/array-sizes.s (1210 of 2110) PASS: lldb-shell :: SymbolFile/DWARF/find-basic-variable.cpp (1211 of 2110) PASS: lldb-api :: lang/objc/objc-static-method-stripped/TestObjCStaticMethodStripped.py (1212 of 2110) PASS: lldb-unit :: Signals/./SignalsTests/UnixSignalsTest.VersionChange (1213 of 2110) PASS: lldb-api :: functionalities/archives/TestBSDArchives.py (1214 of 2110) PASS: lldb-unit :: Language/Highlighting/./HighlighterTests/HighlighterTest.ClangTrailingBackslashWithWhitespace (1215 of 2110) UNSUPPORTED: lldb-shell :: Register/x86-ymm-write.test (1216 of 2110) PASS: lldb-api :: lang/objc/self/TestObjCSelf.py (1217 of 2110) PASS: lldb-unit :: Utility/./UtilityTests/BinaryStreamTest.PutSLEB128MaxValue (1218 of 2110) PASS: lldb-api :: types/TestCharType.py (1219 of 2110) PASS: lldb-unit :: Host/./HostTests/File.GetWaitableHandleFileno (1220 of 2110) UNSUPPORTED: lldb-api :: functionalities/data-formatter/data-formatter-stl/libstdcpp/smart_ptr/TestDataFormatterStdSmartPtr.py (1221 of 2110) PASS: lldb-api :: lang/objc/objc-class-method/TestObjCClassMethod.py (1222 of 2110) PASS: lldb-unit :: Utility/./UtilityTests/StreamTest.PutHex8 (1223 of 2110) PASS: lldb-unit :: Signals/./SignalsTests/UnixSignalsTest.GetInfo (1224 of 2110) PASS: lldb-unit :: Utility/./UtilityTests/FileSpecTest.OperatorBool (1225 of 2110) PASS: lldb-unit :: Utility/./UtilityTests/DataExtractorTest.GetMaxS64 (1226 of 2110) PASS: lldb-unit :: ObjectFile/Breakpad/./ObjectFileBreakpadTests/PublicRecord.parse (1227 of 2110) PASS: lldb-unit :: Host/./HostTests/FileSystemTest.Readable (1228 of 2110) PASS: lldb-unit :: Utility/./UtilityTests/StringListTest.LongestCommonPrefixNoPrefix (1229 of 2110) PASS: lldb-api :: commands/expression/persistent_variables/TestPersistentVariables.py (1230 of 2110) UNSUPPORTED: lldb-shell :: ScriptInterpreter/Lua/convenience_variables.test (1231 of 2110) PASS: lldb-unit :: Core/./LLDBCoreTests/SourceFileCache.FindSourceFileNotFound (1232 of 2110) PASS: lldb-unit :: UnwindAssembly/x86/./UnwindAssemblyx86Tests/Testx86AssemblyInspectionEngine.TestPushR12 (1233 of 2110) PASS: lldb-unit :: Utility/./UtilityTests/StringExtractorTest.DecodeHexU8_Underflow (1234 of 2110) PASS: lldb-unit :: Utility/./UtilityTests/VMRange.Reset (1235 of 2110) PASS: lldb-api :: lang/cpp/nsimport/TestCppNsImport.py (1236 of 2110) UNSUPPORTED: lldb-shell :: SymbolFile/PDB/function-nested-block.test (1237 of 2110) PASS: lldb-shell :: SymbolFile/DWARF/dwp.s (1238 of 2110) PASS: lldb-api :: tools/lldb-server/TestGdbRemoteHostInfo.py (1239 of 2110) PASS: lldb-unit :: Host/./HostTests/SocketTest.DecodeHostAndPort (1240 of 2110) PASS: lldb-api :: types/TestShortType.py (1241 of 2110) PASS: lldb-api :: lang/cpp/unique-types/TestUniqueTypes.py (1242 of 2110) PASS: lldb-api :: lang/cpp/function_refs/TestFunctionRefs.py (1243 of 2110) PASS: lldb-shell :: Reproducer/TestMultipleTargets.test (1244 of 2110) PASS: lldb-unit :: Host/./HostTests/FileSystemTest.EmptyTest (1245 of 2110) UNSUPPORTED: lldb-api :: iohandler/completion/TestIOHandlerCompletion.py (1246 of 2110) PASS: lldb-unit :: Utility/./UtilityTests/VMRange.Comparison (1247 of 2110) PASS: lldb-shell :: Settings/TestDisassemblyFormat.test (1248 of 2110) PASS: lldb-unit :: Utility/./UtilityTests/BroadcasterTest.EventTypeHasListeners (1249 of 2110) PASS: lldb-shell :: Breakpoint/implicit_const_form_support.test (1250 of 2110) PASS: lldb-api :: functionalities/breakpoint/serialize/TestBreakpointSerialization.py (1251 of 2110) PASS: lldb-unit :: Utility/./UtilityTests/StringLexerTest.HasAtLeast (1252 of 2110) PASS: lldb-unit :: ScriptInterpreter/Python/./ScriptInterpreterPythonTests/PythonDataObjectsTest.TestPythonTupleSize (1253 of 2110) UNSUPPORTED: lldb-api :: functionalities/darwin_log/filter/exact_match/activity-chain/TestDarwinLogFilterMatchActivityChain.py (1254 of 2110) PASS: lldb-unit :: Utility/./UtilityTests/StreamTest.AddressRangeSize (1255 of 2110) PASS: lldb-unit :: Utility/./UtilityTests/BinaryStreamTest.PutSLEB128Zero (1256 of 2110) PASS: lldb-api :: functionalities/thread/exit_during_break/TestExitDuringBreak.py (1257 of 2110) PASS: lldb-unit :: ScriptInterpreter/Python/./ScriptInterpreterPythonTests/PythonDataObjectsTest.TestPythonDictionaryToStructuredDictionary (1258 of 2110) PASS: lldb-api :: tools/lldb-vscode/breakpoint/TestVSCode_setBreakpoints.py (1259 of 2110) PASS: lldb-shell :: Process/UnsupportedLanguage.test (1260 of 2110) PASS: lldb-shell :: Commands/command-breakpoint-col.test (1261 of 2110) PASS: lldb-unit :: UnwindAssembly/x86/./UnwindAssemblyx86Tests/Testx86AssemblyInspectionEngine.TestSimplei386ugmented (1262 of 2110) PASS: lldb-api :: functionalities/thread/backtrace_all/TestBacktraceAll.py (1263 of 2110) PASS: lldb-api :: functionalities/data-formatter/data-formatter-enum-format/TestDataFormatterEnumFormat.py (1264 of 2110) PASS: lldb-unit :: Expression/./ExpressionTests/DWARFExpression.DW_OP_stack_value (1265 of 2110) UNSUPPORTED: lldb-api :: linux/mix-dwo-and-regular-objects/TestMixedDwarfBinary.py (1266 of 2110) UNSUPPORTED: lldb-shell :: SymbolFile/PDB/calling-conventions.test (1267 of 2110) PASS: lldb-unit :: Interpreter/./InterpreterTests/CompletionTest.FileCompletionAbsolute (1268 of 2110) PASS: lldb-shell :: Reproducer/TestWorkingDir.test (1269 of 2110) PASS: lldb-unit :: Process/gdb-remote/./ProcessGdbRemoteTests/GDBRemoteCommunicationClientTest.GetModulesInfo_UUID20 (1270 of 2110) PASS: lldb-unit :: Utility/./UtilityTests/LogTest.Unregister (1271 of 2110) UNSUPPORTED: lldb-shell :: Register/x86-ymm-read.test (1272 of 2110) PASS: lldb-api :: functionalities/breakpoint/breakpoint_set_restart/TestBreakpointSetRestart.py (1273 of 2110) PASS: lldb-api :: python_api/interpreter/TestRunCommandInterpreterAPI.py (1274 of 2110) PASS: lldb-api :: functionalities/data-formatter/data-formatter-stl/libcxx/function/TestLibCxxFunction.py (1275 of 2110) PASS: lldb-shell :: SymbolFile/DWARF/find-method.cpp (1276 of 2110) PASS: lldb-api :: functionalities/breakpoint/global_constructor/TestBreakpointInGlobalConstructor.py (1277 of 2110) PASS: lldb-unit :: Utility/./UtilityTests/StringListTest.Assignment (1278 of 2110) PASS: lldb-unit :: Utility/./UtilityTests/FileSpecTest.AppendPathComponent (1279 of 2110) PASS: lldb-api :: lang/c/set_values/TestSetValues.py (1280 of 2110) PASS: lldb-unit :: Utility/./UtilityTests/StringExtractorTest.InitMisc (1281 of 2110) PASS: lldb-api :: tools/lldb-server/TestLldbGdbServer.py (1282 of 2110) PASS: lldb-shell :: Minidump/breakpad-symbols.test (1283 of 2110) PASS: lldb-api :: commands/target/stop-hook/delete/TestTargetStopHookDelete.py (1284 of 2110) PASS: lldb-api :: commands/frame/select/TestFrameSelect.py (1285 of 2110) PASS: lldb-unit :: Utility/./UtilityTests/ArgsTest.Yaml (1286 of 2110) PASS: lldb-api :: macosx/find-app-in-bundle/TestFindAppInBundle.py (1287 of 2110) PASS: lldb-unit :: SymbolFile/NativePDB/./SymbolFileNativePDBTests/PDBFPOProgramToDWARFExpressionTests.UnresolvedDependentCyclicRegisterAssignmentReference (1288 of 2110) PASS: lldb-api :: commands/watchpoints/multiple_hits/TestMultipleHits.py (1289 of 2110) PASS: lldb-shell :: Register/x86-64-ymm-read.test (1290 of 2110) PASS: lldb-unit :: Language/Highlighting/./HighlighterTests/HighlighterTest.ClangTrailingBackslashBeforeNewline (1291 of 2110) PASS: lldb-api :: functionalities/data-formatter/data-formatter-globals/TestDataFormatterGlobals.py (1292 of 2110) PASS: lldb-shell :: Register/x86-64-gp-read.test (1293 of 2110) PASS: lldb-unit :: Utility/./UtilityTests/FileSpecTest.CopyByAppendingPathComponent (1294 of 2110) PASS: lldb-api :: lang/cpp/unicode-literals/TestUnicodeLiterals.py (1295 of 2110) PASS: lldb-unit :: ObjectFile/ELF/./ObjectFileELFTests/ObjectFileELFTest.SectionsResolveConsistently (1296 of 2110) PASS: lldb-unit :: Utility/./UtilityTests/AnsiTerminal.AtStart (1297 of 2110) PASS: lldb-unit :: Symbol/./SymbolTests/TestTypeSystemClang.TestFunctionTemplateInRecordConstruction (1298 of 2110) PASS: lldb-api :: lang/objc/objc-runtime-ivars/TestRuntimeIvars.py (1299 of 2110) PASS: lldb-api :: lang/objc/foundation/TestSymbolTable.py (1300 of 2110) PASS: lldb-unit :: Utility/./UtilityTests/XcodeSDKTest.MergeTest (1301 of 2110) PASS: lldb-shell :: ObjectFile/PECOFF/sections.yaml (1302 of 2110) PASS: lldb-unit :: SymbolFile/DWARF/./SymbolFileDWARFTests/SymbolFileDWARFTests.TestAbbrevOutOfOrder (1303 of 2110) PASS: lldb-unit :: Utility/./UtilityTests/VMRange.CollectionContains (1304 of 2110) PASS: lldb-api :: lang/cpp/namespace_definitions/TestNamespaceDefinitions.py (1305 of 2110) PASS: lldb-api :: functionalities/thread/jump/TestThreadJump.py (1306 of 2110) PASS: lldb-api :: python_api/sbstructureddata/TestStructuredDataAPI.py (1307 of 2110) PASS: lldb-unit :: Host/./HostTests/NativeProcessProtocolTest.ReadCStringFromMemory_MaxSize (1308 of 2110) PASS: lldb-unit :: Utility/./UtilityTests/VMRange.Ordering (1309 of 2110) PASS: lldb-unit :: Utility/./UtilityTests/StreamTeeTest.Flush (1310 of 2110) PASS: lldb-api :: functionalities/signal/raise/TestRaise.py (1311 of 2110) PASS: lldb-unit :: Utility/./UtilityTests/SerializationRountripTest.SerializeDeserializeCStringArrayNullptrElem (1312 of 2110) PASS: lldb-api :: driver/batch_mode/TestBatchMode.py (1313 of 2110) PASS: lldb-unit :: Process/minidump/./LLDBMinidumpTests/MinidumpParserTest.GetMemoryRegionInfoFromMemory64List (1314 of 2110) PASS: lldb-api :: commands/help/TestHelp.py (1315 of 2110) PASS: lldb-api :: functionalities/param_entry_vals/basic_entry_values/TestBasicEntryValues.py (1316 of 2110) PASS: lldb-unit :: Utility/./UtilityTests/StringListTest.LongestCommonPrefixEmpty (1317 of 2110) PASS: lldb-unit :: Symbol/./SymbolTests/LineEntryTest.GetSameLineContiguousAddressRangeNoInlines (1318 of 2110) PASS: lldb-api :: functionalities/data-formatter/ostypeformatting/TestFormattersOsType.py (1319 of 2110) PASS: lldb-unit :: Utility/./UtilityTests/RangeTest.LessThan (1320 of 2110) PASS: lldb-unit :: ScriptInterpreter/Python/./ScriptInterpreterPythonTests/PythonDataObjectsTest.TestPythonStringToStructuredString (1321 of 2110) PASS: lldb-shell :: ObjectFile/Breakpad/breakpad-identification.test (1322 of 2110) PASS: lldb-api :: macosx/indirect_symbol/TestIndirectSymbols.py (1323 of 2110) PASS: lldb-api :: macosx/dyld-trie-symbols/TestDyldTrieSymbols.py (1324 of 2110) UNSUPPORTED: lldb-api :: commands/watchpoints/hello_watchlocation/TestWatchLocation.py (1325 of 2110) PASS: lldb-api :: commands/expression/rdar44436068/Test128BitsInteger.py (1326 of 2110) PASS: lldb-unit :: Utility/./UtilityTests/StringExtractorTest.GetNameColonValueNoColon (1327 of 2110) PASS: lldb-api :: functionalities/fat_archives/TestFatArchives.py (1328 of 2110) PASS: lldb-unit :: Utility/./UtilityTests/LogChannelTest.EnableOptions (1329 of 2110) PASS: lldb-api :: commands/expression/namespace_local_var_same_name_cpp_and_c/TestNamespaceLocalVarSameNameCppAndC.py (1330 of 2110) UNSUPPORTED: lldb-shell :: Reproducer/TestLuaImport.test (1331 of 2110) PASS: lldb-shell :: ObjectFile/PECOFF/invalid-export-table.yaml (1332 of 2110) PASS: lldb-api :: lang/c/step-target/TestStepTarget.py (1333 of 2110) PASS: lldb-api :: functionalities/data-formatter/data-formatter-cpp/TestDataFormatterCpp.py (1334 of 2110) PASS: lldb-unit :: Process/minidump/./LLDBMinidumpTests/MinidumpParserTest.GetThreadContext_x86_32_wow64 (1335 of 2110) PASS: lldb-unit :: Utility/./UtilityTests/StringExtractorTest.DecodeHexU8_Exact (1336 of 2110) PASS: lldb-unit :: Host/./HostTests/NativeProcessProtocolTest.SetBreakpointFailWrite (1337 of 2110) PASS: lldb-unit :: UnwindAssembly/x86/./UnwindAssemblyx86Tests/Testx86AssemblyInspectionEngine.Testi386IgnoredRegisters (1338 of 2110) PASS: lldb-api :: lang/c/tls_globals/TestTlsGlobals.py (1339 of 2110) PASS: lldb-unit :: Utility/./UtilityTests/StreamTest.PutPtr (1340 of 2110) PASS: lldb-api :: lang/objc/blocks/TestObjCIvarsInBlocks.py (1341 of 2110) PASS: lldb-shell :: Quit/TestQuitExitCodeHex0.test (1342 of 2110) PASS: lldb-unit :: UnwindAssembly/x86/./UnwindAssemblyx86Tests/Testx86AssemblyInspectionEngine.TestSimple32bitFrameFunction (1343 of 2110) PASS: lldb-shell :: Register/x86-64-read.test (1344 of 2110) PASS: lldb-unit :: Expression/./ExpressionTests/DWARFExpression.DW_OP_convert (1345 of 2110) UNSUPPORTED: lldb-api :: android/platform/TestDefaultCacheLineSize.py (1346 of 2110) PASS: lldb-unit :: Utility/./UtilityTests/StreamTest.PutNHex8 (1347 of 2110) UNSUPPORTED: lldb-shell :: SymbolFile/DWARF/debug-types-expressions.test (1348 of 2110) PASS: lldb-api :: lang/cpp/type_lookup/TestCppTypeLookup.py (1349 of 2110) PASS: lldb-unit :: Utility/./UtilityTests/StreamTest.PutMaxHex64ByteOrderBig (1350 of 2110) PASS: lldb-api :: functionalities/thread/concurrent_events/TestConcurrentWatchpointDelayWatchpointOneBreakpoint.py (1351 of 2110) UNSUPPORTED: lldb-api :: functionalities/darwin_log/filter/exact_match/subsystem/TestDarwinLogFilterMatchSubsystem.py (1352 of 2110) UNSUPPORTED: lldb-api :: commands/expression/macros/TestMacros.py (1353 of 2110) PASS: lldb-api :: commands/frame/recognizer/TestFrameRecognizer.py (1354 of 2110) PASS: lldb-api :: commands/expression/inline-namespace/TestInlineNamespace.py (1355 of 2110) PASS: lldb-unit :: ScriptInterpreter/Python/./ScriptInterpreterPythonTests/PythonDataObjectsTest.TestPythonTupleInitializerList2 (1356 of 2110) PASS: lldb-unit :: Language/Highlighting/./HighlighterTests/HighlighterTest.ClangIdentifiers (1357 of 2110) PASS: lldb-unit :: Symbol/./SymbolTests/TestClangASTImporter.DeportTypeTagDecl (1358 of 2110) PASS: lldb-api :: lang/objc/foundation/TestObjCMethods.py (1359 of 2110) PASS: lldb-api :: python_api/value/empty_class/TestValueAPIEmptyClass.py (1360 of 2110) PASS: lldb-shell :: ObjectFile/PECOFF/symbol.yaml (1361 of 2110) PASS: lldb-unit :: Process/gdb-remote/./ProcessGdbRemoteTests/GDBRemoteClientBaseTest.InterruptNoResponse (1362 of 2110) PASS: lldb-unit :: Utility/./UtilityTests/StreamTest.PutHex64ByteOrderBig (1363 of 2110) PASS: lldb-shell :: SymbolFile/Breakpad/unwind-via-raSearch.test (1364 of 2110) PASS: lldb-api :: functionalities/multidebugger_commands/TestMultipleDebuggersCommands.py (1365 of 2110) PASS: lldb-api :: functionalities/breakpoint/cpp/TestCPPBreakpointLocations.py (1366 of 2110) PASS: lldb-shell :: SymbolFile/DWARF/debug-types-basic.test (1367 of 2110) PASS: lldb-unit :: ObjectFile/Breakpad/./ObjectFileBreakpadTests/StackWinRecord.parse (1368 of 2110) PASS: lldb-shell :: Quit/TestQuitExitCode-30.test (1369 of 2110) PASS: lldb-api :: functionalities/data-formatter/data-formatter-stl/libcxx/forward_list/TestDataFormatterLibcxxForwardList.py (1370 of 2110) PASS: lldb-unit :: Utility/./UtilityTests/StringExtractorTest.GetHexBytes_Underflow (1371 of 2110) PASS: lldb-unit :: ScriptInterpreter/Python/./ScriptInterpreterPythonTests/PythonDataObjectsTest.TestPythonCallableCheck (1372 of 2110) PASS: lldb-unit :: Utility/./UtilityTests/StringExtractorTest.GetHexU8_Extra (1373 of 2110) PASS: lldb-api :: commands/target/create-deps/TestTargetCreateDeps.py (1374 of 2110) PASS: lldb-unit :: Utility/./UtilityTests/StringExtractorTest.DecodeHexU8_Underflow2 (1375 of 2110) PASS: lldb-unit :: Utility/./UtilityTests/StringListTest.CopyListEmpty (1376 of 2110) PASS: lldb-unit :: Utility/./UtilityTests/Flags.AnyClear (1377 of 2110) PASS: lldb-unit :: Thread/./ThreadTests/ThreadTest.GetPrivateStopInfo (1378 of 2110) PASS: lldb-unit :: Host/./HostTests/FileSystemTest.EnumerateDirectory (1379 of 2110) PASS: lldb-api :: functionalities/tail_call_frames/disambiguate_tail_call_seq/TestDisambiguateTailCallSeq.py (1380 of 2110) PASS: lldb-api :: types/TestDoubleTypesExpr.py (1381 of 2110) PASS: lldb-api :: functionalities/data-formatter/pyobjsynthprovider/TestPyObjSynthProvider.py (1382 of 2110) PASS: lldb-unit :: Utility/./UtilityTests/ScalarTest.Promotion (1383 of 2110) PASS: lldb-api :: macosx/DBGSourcePathRemapping/TestDSYMSourcePathRemapping.py (1384 of 2110) PASS: lldb-api :: lang/c/inlines/TestRedefinitionsInInlines.py (1385 of 2110) PASS: lldb-api :: functionalities/inferior-crashing/TestInferiorCrashingStep.py (1386 of 2110) PASS: lldb-unit :: Utility/./UtilityTests/StreamTest.PutCString (1387 of 2110) PASS: lldb-unit :: UnwindAssembly/x86/./UnwindAssemblyx86Tests/Testx86AssemblyInspectionEngine.TestPopESI (1388 of 2110) PASS: lldb-unit :: Utility/./UtilityTests/ArgsTest.GetArgumentArrayRef (1389 of 2110) PASS: lldb-unit :: Utility/./UtilityTests/StringExtractorTest.GetHexBytes_Partial (1390 of 2110) UNSUPPORTED: lldb-api :: python_api/disassemble-raw-data/TestDisassemble_VST1_64.py (1391 of 2110) PASS: lldb-shell :: SymbolFile/DWARF/DW_AT_loclists_base.s (1392 of 2110) PASS: lldb-api :: sample_test/TestSampleTest.py (1393 of 2110) UNSUPPORTED: lldb-api :: api/multiple-debuggers/TestMultipleDebuggers.py (1394 of 2110) UNSUPPORTED: lldb-api :: functionalities/asan/TestReportData.py (1395 of 2110) PASS: lldb-unit :: SymbolFile/NativePDB/./SymbolFileNativePDBTests/PDBFPOProgramToDWARFExpressionTests.InvalidOpBinary (1396 of 2110) PASS: lldb-unit :: Utility/./UtilityTests/StatusTest.ErrorCodeConstructor (1397 of 2110) PASS: lldb-api :: commands/expression/ir-interpreter-phi-nodes/TestIRInterpreterPHINodes.py (1398 of 2110) PASS: lldb-api :: commands/command/script/import/rdar-12586188/TestRdar12586188.py (1399 of 2110) PASS: lldb-unit :: Breakpoint/./LLDBBreakpointTests/BreakpointIDTest.StringIsBreakpointName (1400 of 2110) PASS: lldb-api :: functionalities/tail_call_frames/disambiguate_call_site/TestDisambiguateCallSite.py (1401 of 2110) PASS: lldb-api :: functionalities/breakpoint/comp_dir_symlink/TestCompDirSymLink.py (1402 of 2110) PASS: lldb-unit :: Process/gdb-remote/./ProcessGdbRemoteTests/GDBRemoteClientBaseTest.SendContinueAndAsyncPacket (1403 of 2110) PASS: lldb-shell :: SymbolFile/DWARF/dir-separator-no-comp-dir-relative-name.s (1404 of 2110) PASS: lldb-unit :: Core/./LLDBCoreTests/MangledTest.ResultForValidName (1405 of 2110) PASS: lldb-unit :: Process/gdb-remote/./ProcessGdbRemoteTests/GDBRemoteCommunicationClientTest.GetQOffsets (1406 of 2110) PASS: lldb-unit :: Process/minidump/./LLDBMinidumpTests/MinidumpParserTest.GetMiscInfoWindows (1407 of 2110) PASS: lldb-unit :: Utility/./UtilityTests/ArgsTest.TestArgv (1408 of 2110) PASS: lldb-api :: lang/cpp/template-specialization-type/TestTemplateSpecializationType.py (1409 of 2110) PASS: lldb-shell :: SymbolFile/DWARF/debug-names-compressed.cpp (1410 of 2110) PASS: lldb-unit :: Utility/./UtilityTests/ArchSpecTest.MergeFrom (1411 of 2110) PASS: lldb-unit :: Process/gdb-remote/./ProcessGdbRemoteTests/GDBRemoteCommunicationClientTest.WriteRegisterNoSuffix (1412 of 2110) PASS: lldb-api :: commands/command/script_alias/TestCommandScriptAlias.py (1413 of 2110) PASS: lldb-api :: python_api/debugger/TestDebuggerAPI.py (1414 of 2110) PASS: lldb-api :: commands/expression/codegen-crash-typedefdecl-not-in_declcontext/TestCodegenCrashTypedefDeclNotInDeclContext.py (1415 of 2110) PASS: lldb-api :: functionalities/tail_call_frames/unambiguous_sequence/TestUnambiguousTailCalls.py (1416 of 2110) PASS: lldb-api :: lang/cpp/diamond/TestDiamond.py (1417 of 2110) UNSUPPORTED: lldb-shell :: Register/x86-gp-read.test (1418 of 2110) PASS: lldb-unit :: SymbolFile/DWARF/./SymbolFileDWARFTests/SymbolFileDWARFTests.TestAbbrevOrder1Start5 (1419 of 2110) PASS: lldb-unit :: tools/lldb-server/tests/./LLDBServerTests/StandardStartupTest.TestStopReplyContainsThreadPcs (1420 of 2110) PASS: lldb-unit :: Utility/./UtilityTests/FileSpecTest.EqualDotsPosix (1421 of 2110) PASS: lldb-unit :: UnwindAssembly/x86/./UnwindAssemblyx86Tests/Testx86AssemblyInspectionEngine.Test64bitFramelessSmallStackFrame (1422 of 2110) PASS: lldb-unit :: Host/./HostTests/SocketTest.DomainGetConnectURI (1423 of 2110) PASS: lldb-api :: lang/cpp/auto/TestCPPAuto.py (1424 of 2110) PASS: lldb-shell :: Reproducer/TestGDBRemoteRepro.test (1425 of 2110) PASS: lldb-unit :: Utility/./UtilityTests/StringListTest.SplitIntoLinesEmpty (1426 of 2110) PASS: lldb-api :: functionalities/optimized_code/TestNoASanExceptionAfterEvalOP_piece.py (1427 of 2110) PASS: lldb-shell :: Driver/TestSingleQuote.test (1428 of 2110) UNSUPPORTED: lldb-api :: linux/add-symbols/TestTargetSymbolsAddCommand.py (1429 of 2110) PASS: lldb-shell :: SymbolFile/DWARF/debug_aranges-empty-section.s (1430 of 2110) PASS: lldb-unit :: Utility/./UtilityTests/StreamTest.AddressSuffix (1431 of 2110) PASS: lldb-api :: macosx/add-dsym/TestAddDsymMidExecutionCommand.py (1432 of 2110) PASS: lldb-unit :: ObjectFile/Breakpad/./ObjectFileBreakpadTests/StackCFIRecord.parse (1433 of 2110) PASS: lldb-shell :: Driver/TestTarget.test (1434 of 2110) UNSUPPORTED: lldb-shell :: Register/x86-zmm-write.test (1435 of 2110) PASS: lldb-api :: lang/c/strings/TestCStrings.py (1436 of 2110) PASS: lldb-api :: lang/cpp/operator-overload/TestOperatorOverload.py (1437 of 2110) PASS: lldb-unit :: UnwindAssembly/x86/./UnwindAssemblyx86Tests/Testx86AssemblyInspectionEngine.TestPushEDI (1438 of 2110) UNSUPPORTED: lldb-shell :: ObjectFile/ELF/minidebuginfo-no-lzma.yaml (1439 of 2110) PASS: lldb-api :: lang/cpp/multiple-inheritance/TestCppMultipleInheritance.py (1440 of 2110) PASS: lldb-shell :: Breakpoint/dummy-target.test (1441 of 2110) PASS: lldb-unit :: Utility/./UtilityTests/UriParserTest.Empty (1442 of 2110) PASS: lldb-unit :: Core/./LLDBCoreTests/CommunicationTest.SynchronizeWhileClosing (1443 of 2110) PASS: lldb-unit :: UnwindAssembly/x86/./UnwindAssemblyx86Tests/Testx86AssemblyInspectionEngine.TestPushR15 (1444 of 2110) PASS: lldb-unit :: Host/./HostTests/HostInfoTest.GetAugmentedArchSpec (1445 of 2110) PASS: lldb-unit :: Language/Highlighting/./HighlighterTests/HighlighterTest.ClangScalarLiterals (1446 of 2110) PASS: lldb-api :: api/check_public_api_headers/TestPublicAPIHeaders.py (1447 of 2110) PASS: lldb-api :: lang/c/anonymous/TestAnonymous.py (1448 of 2110) PASS: lldb-api :: functionalities/postmortem/elf-core/gcore/TestGCore.py (1449 of 2110) PASS: lldb-unit :: Utility/./UtilityTests/ArchSpecTest.OperatorBool (1450 of 2110) PASS: lldb-unit :: Core/./LLDBCoreTests/RichManglingContextTest.SwitchProvider (1451 of 2110) PASS: lldb-shell :: SymbolFile/DWARF/inline-function-address-shared.test (1452 of 2110) PASS: lldb-unit :: Utility/./UtilityTests/UriParserTest.BracketedHostnamePort (1453 of 2110) PASS: lldb-api :: functionalities/tail_call_frames/ambiguous_tail_call_seq1/TestAmbiguousTailCallSeq1.py (1454 of 2110) PASS: lldb-unit :: Utility/./UtilityTests/StringListTest.ForRange (1455 of 2110) PASS: lldb-api :: functionalities/completion/TestCompletion.py (1456 of 2110) PASS: lldb-api :: commands/log/invalid-args/TestInvalidArgsLog.py (1457 of 2110) PASS: lldb-api :: commands/expression/import-std-module/list-dbg-info-content/TestDbgInfoContentListFromStdModule.py (1458 of 2110) PASS: lldb-unit :: Utility/./UtilityTests/StringExtractorTest.GetHexU8_Exact_NoEof (1459 of 2110) PASS: lldb-unit :: Utility/./UtilityTests/StreamTest.PutHex16ByteOrderLittle (1460 of 2110) PASS: lldb-unit :: Utility/./UtilityTests/StringExtractorTest.DecodeHexU8_InvalidHex (1461 of 2110) PASS: lldb-api :: functionalities/thread/concurrent_events/TestConcurrentDelayedCrashWithBreakpointWatchpoint.py (1462 of 2110) PASS: lldb-unit :: SymbolFile/NativePDB/./SymbolFileNativePDBTests/PDBFPOProgramToDWARFExpressionTests.InvalidAssignmentSingle (1463 of 2110) UNSUPPORTED: lldb-api :: functionalities/breakpoint/hardware_breakpoints/hardware_breakpoint_on_multiple_threads/TestHWBreakMultiThread.py (1464 of 2110) UNSUPPORTED: lldb-api :: functionalities/tsan/multiple/TestTsanMultiple.py (1465 of 2110) PASS: lldb-api :: functionalities/data-formatter/data-formatter-python-synth/TestDataFormatterPythonSynth.py (1466 of 2110) PASS: lldb-api :: lang/cpp/template-function/TestTemplateFunctions.py (1467 of 2110) PASS: lldb-unit :: Utility/./UtilityTests/UriParserTest.BracketedHostnameWithColon (1468 of 2110) PASS: lldb-api :: commands/expression/context-object/TestContextObject.py (1469 of 2110) PASS: lldb-api :: functionalities/jitloader_gdb/TestJITLoaderGDB.py (1470 of 2110) PASS: lldb-api :: python_api/function_symbol/TestDisasmAPI.py (1471 of 2110) PASS: lldb-unit :: Utility/./UtilityTests/StreamTeeTest.AppendStream (1472 of 2110) PASS: lldb-unit :: Utility/./UtilityTests/StringExtractorTest.GetHexU8_InvalidHex_NoEof (1473 of 2110) PASS: lldb-api :: functionalities/breakpoint/breakpoint_options/TestBreakpointOptions.py (1474 of 2110) PASS: lldb-unit :: Utility/./UtilityTests/ScalarTest.RightShiftOperator (1475 of 2110) PASS: lldb-api :: lang/objc/objc-dyn-sbtype/TestObjCDynamicSBType.py (1476 of 2110) PASS: lldb-shell :: SymbolFile/DWARF/find-variable-dwo.cpp (1477 of 2110) PASS: lldb-unit :: Utility/./UtilityTests/StreamTest.PutStringAsRawHex8 (1478 of 2110) PASS: lldb-api :: python_api/lldbutil/TestSwigVersion.py (1479 of 2110) PASS: lldb-api :: functionalities/data-formatter/synthcapping/TestSyntheticCapping.py (1480 of 2110) UNSUPPORTED: lldb-api :: lang/objc/foundation/TestFoundationDisassembly.py (1481 of 2110) PASS: lldb-api :: lang/objc/foundation/TestObjectDescriptionAPI.py (1482 of 2110) PASS: lldb-unit :: Utility/./UtilityTests/ArchSpecTest.TestParseMachCPUDashSubtypeTripleSimple (1483 of 2110) PASS: lldb-unit :: Utility/./UtilityTests/StringListTest.GetMaxStringLengthDecreasingSize (1484 of 2110) PASS: lldb-unit :: Symbol/./SymbolTests/TestTypeSystemClang.TestGetTypeClassDeclType (1485 of 2110) PASS: lldb-shell :: SymbolFile/DWARF/dir-separator-windows.s (1486 of 2110) PASS: lldb-api :: functionalities/thread/concurrent_events/TestConcurrentWatchBreak.py (1487 of 2110) PASS: lldb-api :: functionalities/value_md5_crash/TestValueMD5Crash.py (1488 of 2110) PASS: lldb-unit :: Utility/./UtilityTests/RangeTest.ClearWithStarAddress (1489 of 2110) PASS: lldb-unit :: Utility/./UtilityTests/StreamTest.PutCharWhitespace (1490 of 2110) PASS: lldb-api :: functionalities/unwind/sigtramp/TestSigtrampUnwind.py (1491 of 2110) PASS: lldb-api :: python_api/objc_type/TestObjCType.py (1492 of 2110) PASS: lldb-api :: lang/objc/radar-9691614/TestObjCMethodReturningBOOL.py (1493 of 2110) PASS: lldb-unit :: Utility/./UtilityTests/RecordReplayTest.InstrumentedBarPtr (1494 of 2110) PASS: lldb-unit :: Host/./HostTests/MainLoopTest.ReadObject (1495 of 2110) UNSUPPORTED: lldb-api :: lang/objc/ptr_refs/TestPtrRefsObjC.py (1496 of 2110) PASS: lldb-api :: lang/cpp/char1632_t/TestChar1632T.py (1497 of 2110) UNSUPPORTED: lldb-api :: functionalities/tty/TestTerminal.py (1498 of 2110) PASS: lldb-unit :: Symbol/./SymbolTests/TestClangASTImporter.MetadataPropagation (1499 of 2110) PASS: lldb-shell :: Commands/command-script-import.test (1500 of 2110) PASS: lldb-unit :: Language/Highlighting/./HighlighterTests/HighlighterTest.ClangCursorPosEndOfLine (1501 of 2110) PASS: lldb-api :: functionalities/gdb_remote_client/TestGDBRemoteLoad.py (1502 of 2110) PASS: lldb-unit :: Expression/./ExpressionTests/DiagnosticManagerTest.AddDiagnostic (1503 of 2110) PASS: lldb-unit :: Utility/./UtilityTests/StringListTest.InsertStringAtIndexEnd (1504 of 2110) PASS: lldb-api :: commands/process/launch-with-shellexpand/TestLaunchWithShellExpand.py (1505 of 2110) PASS: lldb-api :: python_api/type/TestTypeList.py (1506 of 2110) PASS: lldb-unit :: Platform/./LLDBPlatformTests/PlatformDarwinTest.FindComponentInPath (1507 of 2110) PASS: lldb-unit :: Utility/./UtilityTests/StringExtractorTest.GetU32LittleEndian (1508 of 2110) PASS: lldb-api :: functionalities/data-formatter/data-formatter-stl/libcxx/bitset/TestDataFormatterLibcxxBitset.py (1509 of 2110) PASS: lldb-shell :: ObjectFile/ELF/minidebuginfo-corrupt-xz.yaml (1510 of 2110) PASS: lldb-unit :: Utility/./UtilityTests/StringListTest.InsertStringAtIndexStart (1511 of 2110) PASS: lldb-shell :: Settings/TestModuleCacheSanity.test (1512 of 2110) PASS: lldb-api :: lang/objcxx/objcxx-ivar-vector/TestIvarVector.py (1513 of 2110) PASS: lldb-api :: functionalities/data-formatter/stringprinter/TestStringPrinter.py (1514 of 2110) PASS: lldb-shell :: ObjectFile/MachO/symtab.yaml (1515 of 2110) PASS: lldb-unit :: Utility/./UtilityTests/UriParserTest.BadPort (1516 of 2110) PASS: lldb-unit :: Process/gdb-remote/./ProcessGdbRemoteTests/GDBRemoteCommunicationServerTest.SendErrorResponse_ErrorNumber (1517 of 2110) PASS: lldb-unit :: Utility/./UtilityTests/FileSpecTest.IsRelative (1518 of 2110) PASS: lldb-unit :: Process/gdb-remote/./ProcessGdbRemoteTests/GDBRemoteClientBaseTest.SendContinueDelegateInterface (1519 of 2110) PASS: lldb-shell :: SymbolFile/DWARF/find-basic-type.cpp (1520 of 2110) PASS: lldb-api :: terminal/TestSTTYBeforeAndAfter.py (1521 of 2110) PASS: lldb-api :: python_api/watchpoint/TestWatchpointIgnoreCount.py (1522 of 2110) PASS: lldb-api :: lang/c/global_variables/TestGlobalVariables.py (1523 of 2110) PASS: lldb-api :: lang/objc/modules-update/TestClangModulesUpdate.py (1524 of 2110) PASS: lldb-unit :: Target/./TargetTests/MemoryRegionInfoTest.Formatv (1525 of 2110) PASS: lldb-unit :: ScriptInterpreter/Python/./ScriptInterpreterPythonTests/PythonDataObjectsTest.TestPythonDictionaryValueEquality (1526 of 2110) PASS: lldb-unit :: Utility/./UtilityTests/BinaryStreamTest.PutSLEB128One (1527 of 2110) PASS: lldb-api :: functionalities/data-formatter/data-formatter-stl/libcxx/initializerlist/TestInitializerList.py (1528 of 2110) UNSUPPORTED: lldb-shell :: SymbolFile/PDB/type-quals.test (1529 of 2110) PASS: lldb-api :: lang/c/struct_types/TestStructTypes.py (1530 of 2110) PASS: lldb-unit :: Process/gdb-remote/./ProcessGdbRemoteTests/GDBRemoteCommunicationClientTest.SendGetDataPacket (1531 of 2110) PASS: lldb-shell :: ObjectFile/wasm/unified-debug-sections.yaml (1532 of 2110) PASS: lldb-api :: functionalities/pointer_num_children/TestPointerNumChildren.py (1533 of 2110) PASS: lldb-api :: functionalities/gdb_remote_client/TestNestedRegDefinitions.py (1534 of 2110) PASS: lldb-unit :: Symbol/./SymbolTests/LineEntryTest.GetSameLineContiguousAddressRangeOneInline (1535 of 2110) PASS: lldb-unit :: Utility/./UtilityTests/ProcessInfoTest.Constructor (1536 of 2110) PASS: lldb-unit :: Utility/./UtilityTests/Flags.Test (1537 of 2110) PASS: lldb-unit :: Process/gdb-remote/./ProcessGdbRemoteTests/GDBRemoteCommunicationTest.ReadPacket_checksum (1538 of 2110) PASS: lldb-unit :: Core/./LLDBCoreTests/ModuleSpecTest.TestELFFile (1539 of 2110) PASS: lldb-api :: functionalities/data-formatter/var-in-aggregate-misuse/TestVarInAggregateMisuse.py (1540 of 2110) PASS: lldb-api :: functionalities/breakpoint/breakpoint_language/TestBreakpointLanguage.py (1541 of 2110) UNSUPPORTED: lldb-api :: commands/target/auto-install-main-executable/TestAutoInstallMainExecutable.py (1542 of 2110) PASS: lldb-api :: functionalities/breakpoint/cpp_exception/TestCPPExceptionBreakpoint.py (1543 of 2110) PASS: lldb-shell :: ObjectFile/ELF/section-types.yaml (1544 of 2110) PASS: lldb-api :: lang/cpp/function-qualifiers/TestCppFunctionQualifiers.py (1545 of 2110) PASS: lldb-api :: functionalities/thread/exit_during_step/TestExitDuringStep.py (1546 of 2110) PASS: lldb-unit :: UnwindAssembly/x86/./UnwindAssemblyx86Tests/Testx86AssemblyInspectionEngine.TestPushRBX (1547 of 2110) PASS: lldb-api :: python_api/get-value-32bit-int/TestGetValue32BitInt.py (1548 of 2110) PASS: lldb-unit :: Core/./LLDBCoreTests/MangledTest.NameIndexes_FindFunctionSymbols (1549 of 2110) PASS: lldb-api :: lang/cpp/frame-var-anon-unions/TestFrameVariableAnonymousUnions.py (1550 of 2110) PASS: lldb-unit :: Utility/./UtilityTests/PassiveReplayTest.InstrumentedBarPtr (1551 of 2110) PASS: lldb-api :: commands/expression/import-std-module/shared_ptr-dbg-info-content/TestSharedPtrDbgInfoContentFromStdModule.py (1552 of 2110) PASS: lldb-shell :: SymbolFile/DWARF/dwarf5-index-is-used.cpp (1553 of 2110) PASS: lldb-api :: python_api/watchpoint/TestWatchpointIter.py (1554 of 2110) PASS: lldb-api :: functionalities/signal/TestSendSignal.py (1555 of 2110) PASS: lldb-api :: functionalities/data-formatter/refpointer-recursion/TestDataFormatterRefPtrRecursion.py (1556 of 2110) PASS: lldb-api :: commands/watchpoints/watchpoint_count/TestWatchpointCount.py (1557 of 2110) PASS: lldb-unit :: Host/./HostTests/FileSystemTest.GetByteSize (1558 of 2110) PASS: lldb-api :: commands/target/stop-hook/disable/TestTargetStopHookDisable.py (1559 of 2110) PASS: lldb-unit :: ScriptInterpreter/Python/./ScriptInterpreterPythonTests/PythonDataObjectsTest.TestPythonInteger (1560 of 2110) PASS: lldb-unit :: Utility/./UtilityTests/IndexToObjectTest.ObjectForIndex (1561 of 2110) PASS: lldb-api :: functionalities/thread/create_after_attach/TestCreateAfterAttach.py (1562 of 2110) UNSUPPORTED: lldb-api :: tools/lldb-server/TestGdbRemote_vContThreads.py (1563 of 2110) PASS: lldb-unit :: UnwindAssembly/x86/./UnwindAssemblyx86Tests/Testx86AssemblyInspectionEngine.TestSpArithx86_64Augmented (1564 of 2110) PASS: lldb-api :: python_api/lldbutil/iter/TestLLDBIterator.py (1565 of 2110) PASS: lldb-unit :: Symbol/./SymbolTests/PostfixExpression.ToDWARF (1566 of 2110) PASS: lldb-shell :: Reproducer/TestDriverOptions.test (1567 of 2110) UNSUPPORTED: lldb-shell :: SymbolFile/PDB/func-symbols.test (1568 of 2110) PASS: lldb-api :: commands/process/attach/TestProcessAttach.py (1569 of 2110) PASS: lldb-api :: lang/objc/modules-incomplete/TestIncompleteModules.py (1570 of 2110) PASS: lldb-api :: functionalities/gdb_remote_client/TestJLink6Armv7RegisterDefinition.py (1571 of 2110) PASS: lldb-unit :: Utility/./UtilityTests/StreamTest.PutBytesAsRawHex8ToBigEndian (1572 of 2110) PASS: lldb-unit :: Interpreter/./InterpreterTests/OptionArgParserTest.toScriptLanguage (1573 of 2110) PASS: lldb-api :: functionalities/inferior-changed/TestInferiorChanged.py (1574 of 2110) UNSUPPORTED: lldb-api :: functionalities/gdb_remote_client/TestWasm.py (1575 of 2110) PASS: lldb-api :: functionalities/thread/backtrace_limit/TestBacktraceLimit.py (1576 of 2110) PASS: lldb-unit :: Utility/./UtilityTests/UserIDResolver.GetGroupName (1577 of 2110) UNSUPPORTED: lldb-api :: functionalities/thread/thread_specific_break_plus_condition/TestThreadSpecificBpPlusCondition.py (1578 of 2110) PASS: lldb-unit :: Utility/./UtilityTests/RangeTest.Slide (1579 of 2110) PASS: lldb-api :: tools/lldb-vscode/step/TestVSCode_step.py (1580 of 2110) UNSUPPORTED: lldb-api :: tools/lldb-server/libraries-svr4/TestGdbRemoteLibrariesSvr4Support.py (1581 of 2110) PASS: lldb-shell :: SymbolFile/DWARF/dwarf5-debug_line.s (1582 of 2110) PASS: lldb-api :: commands/frame/diagnose/array/TestArray.py (1583 of 2110) PASS: lldb-api :: functionalities/data-formatter/data-formatter-disabling/TestDataFormatterDisabling.py (1584 of 2110) PASS: lldb-api :: commands/disassemble/basic/TestFrameDisassemble.py (1585 of 2110) PASS: lldb-unit :: Host/./HostTests/ProcessLaunchInfoTest.Constructor (1586 of 2110) PASS: lldb-unit :: tools/lldb-server/tests/./LLDBServerTests/TestBase.DebugserverEnv (1587 of 2110) PASS: lldb-shell :: Reproducer/TestDiscard.test (1588 of 2110) XFAIL: lldb-shell :: Register/x86-64-write.test (1589 of 2110) PASS: lldb-unit :: Utility/./UtilityTests/FileSpecTest.Yaml (1590 of 2110) PASS: lldb-api :: sanity/TestSettingSkipping.py (1591 of 2110) UNSUPPORTED: lldb-api :: lang/c/unicode/TestUnicodeSymbols.py (1592 of 2110) PASS: lldb-unit :: Utility/./UtilityTests/CompletionRequest.DuplicateFiltering (1593 of 2110) PASS: lldb-unit :: Utility/./UtilityTests/StringExtractorTest.GetHexBytesAvail_FullString (1594 of 2110) PASS: lldb-unit :: Utility/./UtilityTests/RangeTest.ContainsAddr (1595 of 2110) PASS: lldb-api :: functionalities/lazy-loading/TestLazyLoading.py (1596 of 2110) PASS: lldb-api :: api/log/TestAPILog.py (1597 of 2110) PASS: lldb-api :: functionalities/testid/TestTestId.py (1598 of 2110) PASS: lldb-shell :: Reproducer/TestReuseDirectory.test (1599 of 2110) PASS: lldb-api :: lang/cpp/thread_local/TestThreadLocal.py (1600 of 2110) PASS: lldb-shell :: SymbolFile/DWARF/debug-types-dwarf5.s (1601 of 2110) PASS: lldb-api :: lang/objc/conflicting-definition/TestConflictingDefinition.py (1602 of 2110) PASS: lldb-unit :: UnwindAssembly/x86/./UnwindAssemblyx86Tests/Testx86AssemblyInspectionEngine.TestPopR14 (1603 of 2110) PASS: lldb-unit :: Utility/./UtilityTests/StructuredDataTest.ParseJSONFromFile (1604 of 2110) PASS: lldb-unit :: DataFormatter/./LLDBFormatterTests/TypeMatcherTests.RegexName (1605 of 2110) PASS: lldb-api :: tools/lldb-server/register-reading/TestGdbRemoteGPacket.py (1606 of 2110) PASS: lldb-api :: functionalities/thread/concurrent_events/TestConcurrentWatchBreakDelay.py (1607 of 2110) PASS: lldb-api :: commands/expression/unwind_expression/TestUnwindExpression.py (1608 of 2110) PASS: lldb-shell :: SymbolFile/Breakpad/line-table-missing-file.test (1609 of 2110) PASS: lldb-api :: commands/expression/import-std-module/deque-dbg-info-content/TestDbgInfoContentDequeFromStdModule.py (1610 of 2110) UNSUPPORTED: lldb-shell :: ScriptInterpreter/Lua/independent_state.test (1611 of 2110) PASS: lldb-shell :: SymbolFile/DWARF/debug_loc.s (1612 of 2110) PASS: lldb-api :: functionalities/data-formatter/data-formatter-objc/TestDataFormatterObjCNSError.py (1613 of 2110) PASS: lldb-unit :: Language/Highlighting/./HighlighterTests/HighlighterTest.DefaultHighlighterWithCursorOutOfBounds (1614 of 2110) PASS: lldb-api :: types/TestShortTypeExpr.py (1615 of 2110) PASS: lldb-api :: functionalities/load_using_paths/TestLoadUsingPaths.py (1616 of 2110) PASS: lldb-api :: functionalities/breakpoint/objc/TestObjCBreakpoints.py (1617 of 2110) PASS: lldb-unit :: Utility/./UtilityTests/StringExtractorTest.GetHexU8_InvalidHex (1618 of 2110) PASS: lldb-shell :: SymbolFile/DWARF/split-dwarf-inlining.cpp (1619 of 2110) PASS: lldb-unit :: Host/./HostTests/MainLoopTest.UnmonitoredSignal (1620 of 2110) PASS: lldb-unit :: Utility/./UtilityTests/RangeDataVector.FindEntryThatContains_Overlap (1621 of 2110) PASS: lldb-unit :: Utility/./UtilityTests/StringExtractorTest.GetNameColonValueSuccess (1622 of 2110) PASS: lldb-unit :: Utility/./UtilityTests/RangeTest.ContainsEndInclusiveInvalid (1623 of 2110) PASS: lldb-api :: commands/expression/po_verbosity/TestPoVerbosity.py (1624 of 2110) PASS: lldb-api :: lang/c/array_types/TestArrayTypes.py (1625 of 2110) PASS: lldb-unit :: Utility/./UtilityTests/UriParserTest.MinimalPath (1626 of 2110) PASS: lldb-shell :: SymbolFile/DWARF/debug_ranges_and_rnglists.test (1627 of 2110) PASS: lldb-api :: lang/cpp/accelerator-table/TestCPPAccelerator.py (1628 of 2110) PASS: lldb-api :: lang/c/local_types/TestUseClosestType.py (1629 of 2110) PASS: lldb-unit :: Utility/./UtilityTests/ArchSpecTest.TripleComponentsWereSpecified (1630 of 2110) PASS: lldb-unit :: Process/gdb-remote/./ProcessGdbRemoteTests/GDBRemoteCommunicationServerTest.SendErrorResponse_UnimplementedError (1631 of 2110) PASS: lldb-api :: commands/expression/two-files/TestObjCTypeQueryFromOtherCompileUnit.py (1632 of 2110) PASS: lldb-unit :: Host/./HostTests/NativeProcessProtocolTest.ReadCStringFromMemory (1633 of 2110) PASS: lldb-api :: python_api/process/io/TestProcessIO.py (1634 of 2110) PASS: lldb-api :: commands/process/launch/TestProcessLaunch.py (1635 of 2110) PASS: lldb-shell :: Minidump/no-process-id.yaml (1636 of 2110) PASS: lldb-api :: lang/objc/objc-ivar-protocols/TestIvarProtocols.py (1637 of 2110) PASS: lldb-api :: functionalities/inferior-crashing/recursive-inferior/TestRecursiveInferior.py (1638 of 2110) PASS: lldb-api :: commands/settings/quoting/TestQuoting.py (1639 of 2110) PASS: lldb-api :: lang/c/forward/TestForwardDeclaration.py (1640 of 2110) PASS: lldb-api :: commands/expression/import-std-module/shared_ptr/TestSharedPtrFromStdModule.py (1641 of 2110) UNSUPPORTED: lldb-api :: commands/register/register/intel_xtended_registers/TestMPXRegisters.py (1642 of 2110) PASS: lldb-unit :: Utility/./UtilityTests/StreamTest.AddressEmptyPrefix (1643 of 2110) PASS: lldb-unit :: Symbol/./SymbolTests/TestTypeSystemClang.TestUnifyAccessSpecifiers (1644 of 2110) PASS: lldb-unit :: Process/gdb-remote/./ProcessGdbRemoteTests/GDBRemoteCommunicationClientTest.SendGetTraceConfigPacket (1645 of 2110) PASS: lldb-unit :: Utility/./UtilityTests/StreamTest.AddressPrefix (1646 of 2110) XFAIL: lldb-shell :: Unwind/prefer-debug-over-eh-frame.test (1647 of 2110) PASS: lldb-unit :: Utility/./UtilityTests/StreamTest.ShiftOperatorPtr (1648 of 2110) PASS: lldb-unit :: Signals/./SignalsTests/UnixSignalsTest.GetFilteredSignals (1649 of 2110) PASS: lldb-unit :: ScriptInterpreter/Python/./ScriptInterpreterPythonTests/PythonDataObjectsTest.TestTypeNameResolutionNoDot (1650 of 2110) PASS: lldb-shell :: Minidump/Windows/Sigsegv/sigsegv.test (1651 of 2110) PASS: lldb-shell :: ObjectFile/wasm/stripped-debug-sections.yaml (1652 of 2110) PASS: lldb-unit :: ScriptInterpreter/Python/./ScriptInterpreterPythonTests/PythonDataObjectsTest.TestPythonTupleInitializerList (1653 of 2110) PASS: lldb-unit :: Utility/./UtilityTests/UriParserTest.TypicalPortPathIPv4 (1654 of 2110) PASS: lldb-unit :: Editline/./EditlineTests/EditlineTestFixture.EditlineReceivesMultiLineText (1655 of 2110) PASS: lldb-api :: python_api/name_lookup/TestNameLookup.py (1656 of 2110) PASS: lldb-unit :: Expression/./ExpressionTests/DiagnosticManagerTest.PutStringSeverities (1657 of 2110) PASS: lldb-api :: commands/expression/function_template_specialization_temp_args/TestFunctionTemplateSpecializationTempArgs.py (1658 of 2110) PASS: lldb-unit :: Utility/./UtilityTests/ArgsTest.DoubleQuotedItem (1659 of 2110) PASS: lldb-api :: functionalities/postmortem/netbsd-core/TestNetBSDCore.py (1660 of 2110) PASS: lldb-unit :: Utility/./UtilityTests/GeneratorTest.YamlMultiProvider (1661 of 2110) PASS: lldb-api :: commands/target/stop-hooks/TestStopHooks.py (1662 of 2110) PASS: lldb-shell :: Breakpoint/debug_rnglist_rlestartend.test (1663 of 2110) PASS: lldb-unit :: Utility/./UtilityTests/VMRange.Clear (1664 of 2110) PASS: lldb-unit :: Utility/./UtilityTests/RegularExpression.Match (1665 of 2110) PASS: lldb-api :: commands/expression/import-std-module/vector/TestVectorFromStdModule.py (1666 of 2110) PASS: lldb-api :: tools/lldb-vscode/console/TestVSCode_console.py (1667 of 2110) PASS: lldb-api :: types/TestFloatTypes.py (1668 of 2110) PASS: lldb-unit :: Host/./HostTests/SocketTest.TCPListen0GetPort (1669 of 2110) PASS: lldb-unit :: Process/minidump/./LLDBMinidumpTests/MinidumpParserTest.GetPidWow64 (1670 of 2110) PASS: lldb-api :: commands/expression/regression-access-function-template-in-record/TestRegressionAccessFunctionTemplateInRecord.py (1671 of 2110) PASS: lldb-api :: functionalities/data-formatter/data-formatter-stl/libcxx/queue/TestDataFormatterLibcxxQueue.py (1672 of 2110) PASS: lldb-api :: types/TestDoubleTypes.py (1673 of 2110) PASS: lldb-api :: lang/cpp/breakpoint-commands/TestCPPBreakpointCommands.py (1674 of 2110) PASS: lldb-unit :: Utility/./UtilityTests/BinaryStreamTest.PutULEB128OneByte (1675 of 2110) PASS: lldb-api :: commands/expression/context-object-objc/TestContextObjectObjc.py (1676 of 2110) PASS: lldb-api :: lang/objc/objc-ivar-stripped/TestObjCIvarStripped.py (1677 of 2110) PASS: lldb-api :: lang/objcxx/cxx-bridged-po/TestObjCXXBridgedPO.py (1678 of 2110) PASS: lldb-shell :: Reproducer/TestProcessList.test (1679 of 2110) PASS: lldb-shell :: SymbolFile/Breakpad/unwind-via-stack-win-no-memory-info.yaml (1680 of 2110) PASS: lldb-unit :: Utility/./UtilityTests/StreamTest.AddressRange (1681 of 2110) PASS: lldb-unit :: Utility/./UtilityTests/RangeTest.Copy (1682 of 2110) PASS: lldb-api :: lang/cpp/member-and-local-vars-with-same-name/TestMembersAndLocalsWithSameName.py (1683 of 2110) PASS: lldb-unit :: Utility/./UtilityTests/StreamTest.QuotedCString (1684 of 2110) PASS: lldb-unit :: Language/Highlighting/./HighlighterTests/HighlighterTest.ClangCommas (1685 of 2110) PASS: lldb-unit :: Host/./HostTests/ConnectionFileDescriptorTest.TCPGetURIv4 (1686 of 2110) PASS: lldb-unit :: Utility/./UtilityTests/StringExtractorTest.GetU64BigEndian (1687 of 2110) PASS: lldb-unit :: Utility/./UtilityTests/StringListTest.SplitIntoLines (1688 of 2110) PASS: lldb-unit :: Symbol/./SymbolTests/TestTypeSystemClang.TestNotDeletingUserCopyCstrDueToMoveCStr (1689 of 2110) PASS: lldb-unit :: Expression/./ExpressionTests/DiagnosticManagerTest.GetStringBasic (1690 of 2110) PASS: lldb-api :: commands/expression/invalid-args/TestInvalidArgsExpression.py (1691 of 2110) PASS: lldb-unit :: Host/./HostTests/ConnectionFileDescriptorTest.TCPGetURIv6 (1692 of 2110) PASS: lldb-shell :: SymbolFile/NativePDB/globals-bss.cpp (1693 of 2110) PASS: lldb-unit :: Utility/./UtilityTests/RegularExpression.Empty (1694 of 2110) PASS: lldb-unit :: Utility/./UtilityTests/UriParserTest.Minimal (1695 of 2110) PASS: lldb-api :: commands/thread/select/TestThreadSelect.py (1696 of 2110) PASS: lldb-api :: tools/lldb-server/TestGdbRemoteRegisterState.py (1697 of 2110) PASS: lldb-api :: functionalities/data-formatter/ptr_ref_typedef/TestPtrRef2Typedef.py (1698 of 2110) PASS: lldb-unit :: Core/./LLDBCoreTests/StreamCallbackTest.Callback (1699 of 2110) PASS: lldb-shell :: ObjectFile/wasm/embedded-debug-sections.yaml (1700 of 2110) PASS: lldb-unit :: DataFormatter/./LLDBFormatterTests/TypeMatcherTests.GetMatchStringRegex (1701 of 2110) UNSUPPORTED: lldb-api :: commands/expression/call-restarts/TestCallThatRestarts.py (1702 of 2110) PASS: lldb-unit :: Host/./HostTests/FileSystemTest.MakeAbsolute (1703 of 2110) PASS: lldb-unit :: Utility/./UtilityTests/RangeTest.SizeTypes (1704 of 2110) PASS: lldb-shell :: SymbolFile/DWARF/module-ownership.mm (1705 of 2110) PASS: lldb-shell :: ObjectFile/ELF/PT_LOAD-empty.yaml (1706 of 2110) PASS: lldb-unit :: Utility/./UtilityTests/StreamTeeTest.GetStreamAtIndexOutOfBounds (1707 of 2110) PASS: lldb-unit :: Utility/./UtilityTests/StreamTeeTest.Constructor1Stream (1708 of 2110) PASS: lldb-shell :: SymbolFile/NativePDB/s_constant.cpp (1709 of 2110) UNSUPPORTED: lldb-shell :: ScriptInterpreter/Lua/persistent_state.test (1710 of 2110) PASS: lldb-api :: api/command-return-object/TestSBCommandReturnObject.py (1711 of 2110) PASS: lldb-unit :: Utility/./UtilityTests/StringListTest.Clear (1712 of 2110) PASS: lldb-unit :: Utility/./UtilityTests/StringLexerTest.NextIf (1713 of 2110) PASS: lldb-shell :: SymbolFile/DWARF/deterministic-build.cpp (1714 of 2110) PASS: lldb-api :: lang/c/const_variables/TestConstVariables.py (1715 of 2110) PASS: lldb-unit :: Utility/./UtilityTests/StreamTest.PutRawBytesToBigEndian (1716 of 2110) PASS: lldb-api :: lang/cpp/typedef/TestCppTypedef.py (1717 of 2110) PASS: lldb-unit :: Utility/./UtilityTests/ArchSpecTest.MergeFromMachOUnknown (1718 of 2110) PASS: lldb-unit :: Utility/./UtilityTests/ConstStringTest.CompareStringRef (1719 of 2110) PASS: lldb-unit :: Process/minidump/./LLDBMinidumpTests/MinidumpParserTest.GetPidWindows (1720 of 2110) PASS: lldb-api :: commands/log/basic/TestLogging.py (1721 of 2110) PASS: lldb-unit :: Utility/./UtilityTests/OptionsWithRawTest.ArgsButNoLeadingDash (1722 of 2110) PASS: lldb-api :: functionalities/data-formatter/nssetsynth/TestNSSetSynthetic.py (1723 of 2110) PASS: lldb-unit :: Utility/./UtilityTests/StringExtractorTest.GetHexBytes_OddPair2 (1724 of 2110) PASS: lldb-unit :: DataFormatter/./LLDBFormatterTests/TypeMatcherTests.CreatedBySameMatchString (1725 of 2110) PASS: lldb-unit :: Symbol/./SymbolTests/TestTypeSystemClang.TestDeletingImplicitCopyCstrDueToMoveCStr (1726 of 2110) PASS: lldb-api :: functionalities/breakpoint/move_nearest/TestMoveNearest.py (1727 of 2110) UNSUPPORTED: lldb-api :: commands/watchpoints/multi_watchpoint_slots/TestWatchpointMultipleSlots.py (1728 of 2110) PASS: lldb-unit :: UnwindAssembly/x86/./UnwindAssemblyx86Tests/Testx86AssemblyInspectionEngine.TestPushEBX (1729 of 2110) PASS: lldb-api :: functionalities/thread/concurrent_events/TestConcurrentManyWatchpoints.py (1730 of 2110) PASS: lldb-unit :: DataFormatter/./LLDBFormatterTests/StringPrinterTests.CxxUTF8 (1731 of 2110) UNSUPPORTED: lldb-api :: functionalities/asan/TestMemoryHistory.py (1732 of 2110) UNSUPPORTED: lldb-shell :: Process/Windows/exception_access_violation.cpp (1733 of 2110) PASS: lldb-shell :: Quit/TestQuitExitCode30.test (1734 of 2110) PASS: lldb-api :: lang/objc/foundation/TestConstStrings.py (1735 of 2110) PASS: lldb-unit :: Language/Highlighting/./HighlighterTests/HighlighterTest.ClangEmptyInput (1736 of 2110) UNSUPPORTED: lldb-shell :: Unwind/eh-frame-augment-noop.test (1737 of 2110) PASS: lldb-api :: lang/cpp/limit-debug-info/TestWithLimitDebugInfo.py (1738 of 2110) PASS: lldb-unit :: Utility/./UtilityTests/DataExtractorTest.GetCStr (1739 of 2110) PASS: lldb-api :: lang/c/step_over_no_deadlock/TestStepOverDoesntBlock.py (1740 of 2110) PASS: lldb-api :: macosx/function-starts/TestFunctionStarts.py (1741 of 2110) PASS: lldb-unit :: Host/./HostTests/MainLoopTest.DetectsEOF (1742 of 2110) UNSUPPORTED: lldb-shell :: Register/x86-64-zmm-read.test (1743 of 2110) PASS: lldb-unit :: Interpreter/./InterpreterTests/CompletionTest.DirCompletionUsername (1744 of 2110) PASS: lldb-unit :: Utility/./UtilityTests/ListenerTest.GetEventImmediate (1745 of 2110) UNSUPPORTED: lldb-shell :: Unwind/eh-frame-small-fde.test (1746 of 2110) PASS: lldb-unit :: Process/minidump/./LLDBMinidumpTests/MinidumpParserTest.GetExceptionStream (1747 of 2110) PASS: lldb-unit :: Core/./LLDBCoreTests/ModuleSpecTest.TestMachOFile (1748 of 2110) PASS: lldb-shell :: Commands/command-regex-unalias.test (1749 of 2110) UNSUPPORTED: lldb-api :: benchmarks/libcxxlist/TestBenchmarkLibcxxList.py (1750 of 2110) PASS: lldb-shell :: ObjectFile/ELF/netbsd-core-amd64.test (1751 of 2110) UNSUPPORTED: lldb-api :: benchmarks/frame_variable/TestFrameVariableResponse.py (1752 of 2110) PASS: lldb-shell :: Commands/command-source.test (1753 of 2110) PASS: lldb-api :: python_api/formatters/TestFormattersSBAPI.py (1754 of 2110) PASS: lldb-shell :: ObjectFile/Breakpad/discontiguous-sections.test (1755 of 2110) PASS: lldb-unit :: Utility/./UtilityTests/UriParserTest.BracketedHostnameWithPortIPv4 (1756 of 2110) PASS: lldb-api :: functionalities/gdb_remote_client/TestGDBRemoteClient.py (1757 of 2110) PASS: lldb-api :: functionalities/data-formatter/data-formatter-objc/TestDataFormatterObjCNSContainer.py (1758 of 2110) PASS: lldb-api :: python_api/disassemble-raw-data/TestDisassembleRawData.py (1759 of 2110) PASS: lldb-unit :: Host/./HostTests/NativeProcessProtocolTest.ReadMemoryWithoutTrap (1760 of 2110) PASS: lldb-unit :: Utility/./UtilityTests/NameMatchesTest.StartsWith (1761 of 2110) PASS: lldb-api :: tools/lldb-vscode/breakpoint/TestVSCode_setFunctionBreakpoints.py (1762 of 2110) PASS: lldb-unit :: Utility/./UtilityTests/FileSpecTest.FileAndDirectoryComponents (1763 of 2110) PASS: lldb-unit :: Utility/./UtilityTests/NameMatchesTest.Contains (1764 of 2110) PASS: lldb-api :: macosx/safe-to-func-call/TestSafeFuncCalls.py (1765 of 2110) PASS: lldb-api :: functionalities/breakpoint/scripted_bkpt/TestScriptedResolver.py (1766 of 2110) PASS: lldb-api :: python_api/section/TestSectionAPI.py (1767 of 2110) PASS: lldb-unit :: Host/./HostTests/FileSystemTest.GetPermissions (1768 of 2110) PASS: lldb-api :: commands/watchpoints/watchpoint_set_command/TestWatchLocationWithWatchSet.py (1769 of 2110) PASS: lldb-api :: commands/expression/argument_passing_restrictions/TestArgumentPassingRestrictions.py (1770 of 2110) PASS: lldb-unit :: Host/./HostTests/MainLoopTest.Signal (1771 of 2110) UNSUPPORTED: lldb-api :: commands/gui/basicdebug/TestGuiBasicDebug.py (1772 of 2110) PASS: lldb-api :: tools/lldb-server/inferior-crash/TestGdbRemoteSegFault.py (1773 of 2110) PASS: lldb-unit :: Utility/./UtilityTests/StringListTest.DefaultConstructor (1774 of 2110) UNSUPPORTED: lldb-api :: macosx/macCatalystAppMacOSFramework/TestMacCatalystAppWithMacOSFramework.py (1775 of 2110) XFAIL: lldb-shell :: Register/x86-mm-xmm-read.test (1776 of 2110) PASS: lldb-unit :: Utility/./UtilityTests/StringExtractorTest.GetHexBytesAvail_Underflow (1777 of 2110) PASS: lldb-unit :: Utility/./UtilityTests/ArgsTest.TestOverwriteArgs (1778 of 2110) PASS: lldb-api :: lang/objc/direct-dispatch-step/TestObjCDirectDispatchStepping.py (1779 of 2110) UNSUPPORTED: lldb-shell :: Unwind/unwind-plan-dwarf-dump.test (1780 of 2110) PASS: lldb-api :: commands/expression/deleting-implicit-copy-constructor/TestDeletingImplicitCopyConstructor.py (1781 of 2110) PASS: lldb-shell :: Host/TestCustomShell.test (1782 of 2110) PASS: lldb-unit :: ScriptInterpreter/Python/./ScriptInterpreterPythonTests/PythonDataObjectsTest.TestOwnedReferences (1783 of 2110) PASS: lldb-shell :: Reproducer/TestCaptureEnvOverride.test (1784 of 2110) PASS: lldb-unit :: Utility/./UtilityTests/StringExtractorTest.GetHexBytes (1785 of 2110) PASS: lldb-shell :: SymbolFile/Breakpad/stack-cfi-parsing.test (1786 of 2110) PASS: lldb-unit :: ObjectFile/ELF/./ObjectFileELFTests/ObjectFileELFTest.GetSymtab_NoSymEntryPointArmThumbAddressClass (1787 of 2110) PASS: lldb-api :: tools/lldb-vscode/module/TestVSCode_module.py (1788 of 2110) PASS: lldb-api :: functionalities/type_lookup/TestTypeLookup.py (1789 of 2110) UNSUPPORTED: lldb-api :: functionalities/breakpoint/breakpoint_callback_command_source/TestBreakpointCallbackCommandSource.py (1790 of 2110) PASS: lldb-api :: lang/objc/ivar-IMP/TestObjCiVarIMP.py (1791 of 2110) PASS: lldb-api :: commands/expression/radar_9673664/TestExprHelpExamples.py (1792 of 2110) PASS: lldb-api :: functionalities/data-formatter/data-formatter-synthtype/TestDataFormatterSynthType.py (1793 of 2110) PASS: lldb-unit :: Process/gdb-remote/./ProcessGdbRemoteTests/GDBRemoteCommunicationClientTest.SendGetMetaDataPacket (1794 of 2110) PASS: lldb-unit :: Utility/./UtilityTests/SerializationRountripTest.SerializeDeserializeCStringArrayNullptr (1795 of 2110) PASS: lldb-api :: commands/expression/test/TestExprs2.py (1796 of 2110) UNSUPPORTED: lldb-shell :: Breakpoint/ppc64-localentry.test (1797 of 2110) PASS: lldb-shell :: ObjectFile/ELF/PT_LOAD-overlap-PT_INTERP.yaml (1798 of 2110) PASS: lldb-api :: commands/quit/TestQuit.py (1799 of 2110) UNSUPPORTED: lldb-shell :: ScriptInterpreter/Lua/command_script_import.test (1800 of 2110) PASS: lldb-unit :: Utility/./UtilityTests/Predicate.WaitForValueNotEqualTo (1801 of 2110) UNSUPPORTED: lldb-api :: functionalities/exec/TestExec.py (1802 of 2110) PASS: lldb-api :: functionalities/data-formatter/type_summary_list_arg/TestTypeSummaryListArg.py (1803 of 2110) PASS: lldb-api :: commands/process/signal/TestProcessSignal.py (1804 of 2110) PASS: lldb-unit :: Utility/./UtilityTests/AnsiTerminal.KnownPrefix (1805 of 2110) PASS: lldb-api :: functionalities/tail_call_frames/ambiguous_tail_call_seq2/TestAmbiguousTailCallSeq2.py (1806 of 2110) PASS: lldb-api :: functionalities/history/TestHistoryRecall.py (1807 of 2110) PASS: lldb-api :: commands/expression/call-throws/TestCallThatThrows.py (1808 of 2110) PASS: lldb-unit :: Host/./HostTests/HostInfoTest.GetXcodeSDK (1809 of 2110) PASS: lldb-api :: functionalities/breakpoint/dummy_target_breakpoints/TestBreakpointsWithNoTargets.py (1810 of 2110) PASS: lldb-api :: commands/expression/fixits/TestFixIts.py (1811 of 2110) PASS: lldb-api :: python_api/thread/TestThreadAPI.py (1812 of 2110) PASS: lldb-api :: functionalities/data-formatter/nsarraysynth/TestNSArraySynthetic.py (1813 of 2110) UNSUPPORTED: lldb-shell :: ExecControl/StopHook/stop-hook-threads.test (1814 of 2110) PASS: lldb-unit :: Utility/./UtilityTests/SerializationRountripTest.SerializeDeserializePodPointers (1815 of 2110) UNSUPPORTED: lldb-api :: benchmarks/turnaround/TestCompileRunToBreakpointTurnaround.py (1816 of 2110) PASS: lldb-api :: lang/objc/modules-cache/TestClangModulesCache.py (1817 of 2110) PASS: lldb-api :: lang/cpp/template/TestTemplateArgs.py (1818 of 2110) PASS: lldb-shell :: Driver/TestNoUseColor.test (1819 of 2110) PASS: lldb-unit :: DataFormatter/./LLDBFormatterTests/TypeMatcherTests.ExactName (1820 of 2110) PASS: lldb-api :: lang/cpp/dynamic-value/TestCppValueCast.py (1821 of 2110) PASS: lldb-shell :: SymbolFile/DWARF/DW_TAG_variable-DW_AT_const_value.s (1822 of 2110) PASS: lldb-api :: commands/watchpoints/watchpoint_commands/TestWatchpointCommands.py (1823 of 2110) PASS: lldb-shell :: Driver/TestCommands.test (1824 of 2110) PASS: lldb-unit :: Utility/./UtilityTests/StreamTeeTest.Constructor2Streams (1825 of 2110) PASS: lldb-api :: commands/target/stop-hook/enable/TestTargetStopHookEnable.py (1826 of 2110) PASS: lldb-unit :: DataFormatter/./LLDBFormatterTests/StringPrinterTests.CxxASCII (1827 of 2110) PASS: lldb-unit :: Utility/./UtilityTests/StreamTest.PutChar (1828 of 2110) PASS: lldb-unit :: Core/./LLDBCoreTests/MangledTest.EmptyForInvalidName (1829 of 2110) PASS: lldb-unit :: Expression/./ExpressionTests/DiagnosticManagerTest.GetStringMultipleDiags (1830 of 2110) PASS: lldb-api :: functionalities/reproducers/attach/TestReproducerAttach.py (1831 of 2110) PASS: lldb-unit :: Utility/./UtilityTests/Flags.GetBitSize (1832 of 2110) PASS: lldb-api :: functionalities/data-formatter/data-formatter-stl/libcxx/unique_ptr/TestDataFormatterLibcxxUniquePtr.py (1833 of 2110) PASS: lldb-unit :: Utility/./UtilityTests/StringListTest.InsertStringAtIndexStdString (1834 of 2110) PASS: lldb-shell :: Driver/TestUseColor.test (1835 of 2110) UNSUPPORTED: lldb-api :: functionalities/darwin_log/basic/TestDarwinLogBasic.py (1836 of 2110) PASS: lldb-api :: functionalities/data-formatter/data-formatter-stl/libcxx/vbool/TestDataFormatterLibcxxVBool.py (1837 of 2110) PASS: lldb-unit :: Utility/./UtilityTests/StreamTest.PutCStringWithStringRef (1838 of 2110) PASS: lldb-unit :: Signals/./SignalsTests/UnixSignalsTest.Iteration (1839 of 2110) PASS: lldb-unit :: Utility/./UtilityTests/StringExtractorTest.InitEmpty (1840 of 2110) PASS: lldb-unit :: UnwindAssembly/x86/./UnwindAssemblyx86Tests/Testx86AssemblyInspectionEngine.TestPopRBX (1841 of 2110) PASS: lldb-api :: functionalities/data-formatter/type_summary_list_script/TestTypeSummaryListScript.py (1842 of 2110) UNSUPPORTED: lldb-api :: functionalities/thread/concurrent_events/TestConcurrentManySignals.py (1843 of 2110) PASS: lldb-api :: functionalities/thread/thread_exit/TestThreadExit.py (1844 of 2110) PASS: lldb-unit :: SymbolFile/DWARF/./SymbolFileDWARFTests/XcodeSDKModuleTests.TestModuleGetXcodeSDK (1845 of 2110) PASS: lldb-unit :: ScriptInterpreter/Python/./ScriptInterpreterPythonTests/PythonDataObjectsTest.TestPythonListToStructuredList (1846 of 2110) PASS: lldb-unit :: Symbol/./SymbolTests/TestTypeSystemClang.TestFunctionTemplateConstruction (1847 of 2110) UNSUPPORTED: lldb-api :: tools/lldb-server/registers-target-xml-reading/TestGdbRemoteTargetXmlPacket.py (1848 of 2110) PASS: lldb-unit :: Utility/./UtilityTests/UriParserTest.SchemeHostSeparator (1849 of 2110) PASS: lldb-api :: lang/cpp/std-function-step-into-callable/TestStdFunctionStepIntoCallable.py (1850 of 2110) PASS: lldb-api :: lang/c/stepping/TestThreadStepping.py (1851 of 2110) PASS: lldb-unit :: UnwindAssembly/x86/./UnwindAssemblyx86Tests/Testx86AssemblyInspectionEngine.TestPushEDX (1852 of 2110) PASS: lldb-api :: functionalities/breakpoint/breakpoint_ids/TestBreakpointIDs.py (1853 of 2110) PASS: lldb-api :: functionalities/data-formatter/format-propagation/TestFormatPropagation.py (1854 of 2110) PASS: lldb-shell :: ObjectFile/MachO/lc_build_version.yaml (1855 of 2110) PASS: lldb-api :: python_api/module_section/TestModuleAndSection.py (1856 of 2110) PASS: lldb-api :: tools/lldb-server/TestGdbRemoteExitCode.py (1857 of 2110) UNSUPPORTED: lldb-api :: functionalities/data-formatter/data-formatter-stl/libstdcpp/map/TestDataFormatterStdMap.py (1858 of 2110) PASS: lldb-shell :: Reproducer/Modules/TestModuleCXX.test (1859 of 2110) PASS: lldb-unit :: ScriptInterpreter/Python/./ScriptInterpreterPythonTests/PythonDataObjectsTest.TestPythonTupleToStructuredList (1860 of 2110) PASS: lldb-api :: functionalities/gdb_remote_client/TestPlatformClient.py (1861 of 2110) UNSUPPORTED: lldb-api :: commands/register/register/intel_xtended_registers/mpx_bound_violation/TestBoundViolation.py (1862 of 2110) PASS: lldb-shell :: Settings/TestFrameFormatMangling.test (1863 of 2110) UNSUPPORTED: lldb-api :: functionalities/data-formatter/data-formatter-stl/libstdcpp/iterator/TestDataFormatterStdIterator.py (1864 of 2110) PASS: lldb-unit :: Utility/./UtilityTests/BinaryStreamTest.PutSLEB128FourBytes (1865 of 2110) PASS: lldb-unit :: Utility/./UtilityTests/StringExtractorTest.GetNameColonValueContainsColon (1866 of 2110) PASS: lldb-api :: lang/objc/objc-new-syntax/TestObjCNewSyntaxArray.py (1867 of 2110) UNSUPPORTED: lldb-shell :: Register/arm-gp-read.test (1868 of 2110) PASS: lldb-unit :: Utility/./UtilityTests/LogTest.Register (1869 of 2110) PASS: lldb-api :: macosx/save_crashlog/TestSaveCrashlog.py (1870 of 2110) PASS: lldb-api :: lang/c/local_variables/TestLocalVariables.py (1871 of 2110) PASS: lldb-api :: functionalities/gdb_remote_client/TestWriteMemory.py (1872 of 2110) PASS: lldb-api :: functionalities/thread/concurrent_events/TestConcurrentCrashWithWatchpoint.py (1873 of 2110) PASS: lldb-shell :: ObjectFile/PECOFF/sections-names.yaml (1874 of 2110) PASS: lldb-api :: python_api/lldbutil/process/TestPrintStackTraces.py (1875 of 2110) PASS: lldb-api :: functionalities/dlopen_other_executable/TestDlopenOtherExecutable.py (1876 of 2110) PASS: lldb-unit :: Utility/./UtilityTests/VMRange.IsValid (1877 of 2110) PASS: lldb-api :: lang/cpp/signed_types/TestSignedTypes.py (1878 of 2110) PASS: lldb-unit :: Host/./HostTests/FileSystemTest.Resolve (1879 of 2110) PASS: lldb-unit :: Utility/./UtilityTests/EventTest.DumpEventDataBytes (1880 of 2110) PASS: lldb-shell :: SymbolFile/DWARF/debug-types-address-ranges.s (1881 of 2110) PASS: lldb-api :: lang/cpp/namespace_conflicts/TestNamespaceConflicts.py (1882 of 2110) PASS: lldb-shell :: Settings/TestFrameFormatNoColor.test (1883 of 2110) PASS: lldb-api :: functionalities/breakpoint/auto_continue/TestBreakpointAutoContinue.py (1884 of 2110) UNSUPPORTED: lldb-shell :: SymbolFile/DWARF/DW_TAG_GNU_call_site-DW_AT_low_pc.s (1885 of 2110) PASS: lldb-api :: commands/expression/import-std-module/forward_list-dbg-info-content/TestDbgInfoContentForwardListFromStdModule.py (1886 of 2110) PASS: lldb-unit :: UnwindAssembly/x86/./UnwindAssemblyx86Tests/Testx86AssemblyInspectionEngine.TestDisassemblyJunkBytes (1887 of 2110) PASS: lldb-shell :: SymbolFile/DWARF/dir-separator-no-comp-dir.s (1888 of 2110) PASS: lldb-unit :: Utility/./UtilityTests/PassiveReplayTest.InstrumentedFooInvalid (1889 of 2110) PASS: lldb-api :: lang/cpp/chained-calls/TestCppChainedCalls.py (1890 of 2110) PASS: lldb-unit :: Utility/./UtilityTests/RegularExpression.CopyAssignment (1891 of 2110) UNSUPPORTED: lldb-api :: linux/thread/create_during_instruction_step/TestCreateDuringInstructionStep.py (1892 of 2110) PASS: lldb-unit :: SymbolFile/DWARF/./SymbolFileDWARFTests/SymbolFileDWARFTests.TestAbbrevInvalidNULLTag (1893 of 2110) PASS: lldb-api :: functionalities/data-formatter/data-formatter-stl/libstdcpp/unique_ptr/invalid/TestDataFormatterInvalidStdUniquePtr.py (1894 of 2110) PASS: lldb-api :: lang/objc/foundation/TestObjCMethodsNSArray.py (1895 of 2110) PASS: lldb-shell :: Heap/heap-cstr.test (1896 of 2110) PASS: lldb-api :: lang/cpp/overloaded-functions/TestOverloadedFunctions.py (1897 of 2110) PASS: lldb-unit :: Utility/./UtilityTests/AnsiTerminal.Twice (1898 of 2110) PASS: lldb-unit :: Utility/./UtilityTests/StringLexerTest.Peek (1899 of 2110) PASS: lldb-shell :: SymbolFile/NativePDB/ast-functions.cpp (1900 of 2110) UNSUPPORTED: lldb-shell :: ObjectFile/ELF/minidebuginfo-set-and-hit-breakpoint.test (1901 of 2110) PASS: lldb-unit :: Symbol/./SymbolTests/TestTypeSystemClang.TestRemoveFastQualifiers (1902 of 2110) PASS: lldb-shell :: Settings/TestDisableColor.test (1903 of 2110) PASS: lldb-unit :: UnwindAssembly/x86/./UnwindAssemblyx86Tests/Testx86AssemblyInspectionEngine.TestPushImm (1904 of 2110) PASS: lldb-shell :: Settings/TestLineMarkerColor.test (1905 of 2110) PASS: lldb-unit :: ScriptInterpreter/Python/./ScriptInterpreterPythonTests/PythonDataObjectsTest.TestPythonString (1906 of 2110) PASS: lldb-api :: commands/expression/ignore-artificial-constructors/TestIgnoreArtificialConstructors.py (1907 of 2110) UNSUPPORTED: lldb-shell :: SymbolFile/NativePDB/ast-functions-msvc.cpp (1908 of 2110) PASS: lldb-shell :: SymbolFile/DWARF/limit-debug-info.s (1909 of 2110) PASS: lldb-unit :: Language/Highlighting/./HighlighterTests/HighlighterTest.ClangCursorPos (1910 of 2110) PASS: lldb-unit :: Utility/./UtilityTests/UriParserTest.SchemeHostSeparator3 (1911 of 2110) PASS: lldb-api :: functionalities/data-formatter/data-formatter-ptr-to-array/TestPtrToArrayFormatting.py (1912 of 2110) UNSUPPORTED: lldb-api :: benchmarks/stepping/TestSteppingSpeed.py (1913 of 2110) PASS: lldb-shell :: SymbolFile/DWARF/dwarf5-atomic.s (1914 of 2110) PASS: lldb-unit :: Utility/./UtilityTests/StateTest.Formatv (1915 of 2110) PASS: lldb-api :: commands/expression/import_builtin_fileid/TestImportBuiltinFileID.py (1916 of 2110) PASS: lldb-api :: functionalities/postmortem/minidump-new/TestMiniDumpUUID.py (1917 of 2110) PASS: lldb-api :: functionalities/data-formatter/typedef_array/TestTypedefArray.py (1918 of 2110) PASS: lldb-unit :: Process/minidump/./LLDBMinidumpTests/RegisterContextMinidump.ConvertMinidumpContext_x86_32 (1919 of 2110) PASS: lldb-unit :: Process/minidump/./LLDBMinidumpTests/MinidumpParserTest.MinidumpModuleOrder (1920 of 2110) PASS: lldb-api :: functionalities/step_scripted/TestStepScripted.py (1921 of 2110) PASS: lldb-unit :: Utility/./UtilityTests/StringListTest.SplitIntoLinesSingleTrailingCR (1922 of 2110) PASS: lldb-api :: functionalities/thread/concurrent_events/TestConcurrentTwoWatchpointThreads.py (1923 of 2110) PASS: lldb-unit :: Utility/./UtilityTests/FileSpecTest.RemoveLastPathComponent (1924 of 2110) PASS: lldb-api :: functionalities/thread/concurrent_events/TestConcurrentDelayWatchBreak.py (1925 of 2110) UNSUPPORTED: lldb-shell :: Watchpoint/netbsd-nouserdbregs.test (1926 of 2110) PASS: lldb-api :: python_api/sbvalue_persist/TestSBValuePersist.py (1927 of 2110) PASS: lldb-unit :: Utility/./UtilityTests/CompletionRequest.TryCompleteCurrentArgBad (1928 of 2110) PASS: lldb-shell :: ExecControl/StopHook/stop-hook.test (1929 of 2110) PASS: lldb-unit :: Utility/./UtilityTests/AnsiTerminal.AtEnd (1930 of 2110) PASS: lldb-unit :: Utility/./UtilityTests/StringListTest.JoinSingle (1931 of 2110) PASS: lldb-shell :: Unwind/thread-step-out-ret-addr-check.test (1932 of 2110) PASS: lldb-shell :: SymbolFile/DWARF/debug_loclists-dwo.s (1933 of 2110) PASS: lldb-unit :: Language/Highlighting/./HighlighterTests/HighlighterTest.ClangPreserveNewLine (1934 of 2110) PASS: lldb-api :: functionalities/data-formatter/data-formatter-synth/TestDataFormatterSynth.py (1935 of 2110) PASS: lldb-unit :: Symbol/./SymbolTests/SymbolsTest.LocateExecutableSymbolFileForUnknownExecutableAndMissingSymbolFile (1936 of 2110) PASS: lldb-unit :: Expression/./ExpressionTests/CppModuleConfigurationTest.Sysroot (1937 of 2110) PASS: lldb-unit :: Expression/./ExpressionTests/DWARFExpression.DW_OP_pick (1938 of 2110) PASS: lldb-unit :: Utility/./UtilityTests/ArgsTest.TestUnknownEscape (1939 of 2110) PASS: lldb-unit :: DataFormatter/./LLDBFormatterTests/TypeMatcherTests.CreatedBySameMatchStringExactNamePrefixes (1940 of 2110) PASS: lldb-api :: commands/expression/import-std-module/unique_ptr/TestUniquePtrFromStdModule.py (1941 of 2110) PASS: lldb-unit :: ScriptInterpreter/Python/./ScriptInterpreterPythonTests/PythonDataObjectsTest.TestResetting (1942 of 2110) PASS: lldb-api :: lang/cpp/constructors/TestCppConstructors.py (1943 of 2110) PASS: lldb-unit :: Utility/./UtilityTests/BroadcasterTest.BroadcastEvent (1944 of 2110) PASS: lldb-unit :: Utility/./UtilityTests/BinaryStreamTest.PutSLEB128ThreeBytes (1945 of 2110) PASS: lldb-api :: tools/lldb-server/commandline/TestStubReverseConnect.py (1946 of 2110) PASS: lldb-unit :: ScriptInterpreter/Python/./ScriptInterpreterPythonTests/PythonDataObjectsTest.TestExceptions (1947 of 2110) PASS: lldb-unit :: Utility/./UtilityTests/XcodeSDKTest.ParseTest (1948 of 2110) PASS: lldb-unit :: Language/Highlighting/./HighlighterTests/HighlighterTest.ClangTrailingBackslashMissingNewLine (1949 of 2110) UNSUPPORTED: lldb-api :: functionalities/signal/handle-segv/TestHandleSegv.py (1950 of 2110) PASS: lldb-unit :: UnwindAssembly/x86/./UnwindAssemblyx86Tests/Testx86AssemblyInspectionEngine.TestSubRSP (1951 of 2110) PASS: lldb-unit :: UnwindAssembly/x86/./UnwindAssemblyx86Tests/Testx86AssemblyInspectionEngine.TestPushR13 (1952 of 2110) PASS: lldb-unit :: Platform/./LLDBPlatformTests/PlatformAppleSimulatorTest.TestSimHasSimEnvionament (1953 of 2110) PASS: lldb-unit :: Utility/./UtilityTests/LogChannelEnabledTest.LogVerboseThread (1954 of 2110) PASS: lldb-unit :: Utility/./UtilityTests/StreamTeeTest.GetStreamAtIndexOutOfBoundsEmpty (1955 of 2110) PASS: lldb-api :: functionalities/memory/cache/TestMemoryCache.py (1956 of 2110) PASS: lldb-api :: commands/expression/import-std-module/stack/TestStackFromStdModule.py (1957 of 2110) PASS: lldb-api :: commands/expression/no-deadlock/TestExprDoesntBlock.py (1958 of 2110) PASS: lldb-unit :: Host/./HostTests/HostInfoTest.GetHostname (1959 of 2110) PASS: lldb-api :: functionalities/data-formatter/setvaluefromcstring/TestSetValueFromCString.py (1960 of 2110) PASS: lldb-api :: functionalities/postmortem/elf-core/TestLinuxCore.py (1961 of 2110) PASS: lldb-unit :: Utility/./UtilityTests/StringListTest.AppendList (1962 of 2110) PASS: lldb-unit :: Utility/./UtilityTests/StreamTest.PutRawBytesToLittleEndian (1963 of 2110) PASS: lldb-unit :: Language/Highlighting/./HighlighterTests/HighlighterTest.ClangSquareBrackets (1964 of 2110) PASS: lldb-api :: functionalities/var_path/TestVarPath.py (1965 of 2110) PASS: lldb-api :: types/TestLongTypesExpr.py (1966 of 2110) PASS: lldb-api :: lang/objc/modules-auto-import/TestModulesAutoImport.py (1967 of 2110) PASS: lldb-unit :: UnwindAssembly/x86/./UnwindAssemblyx86Tests/Testx86AssemblyInspectionEngine.TestPushRBP (1968 of 2110) PASS: lldb-unit :: SymbolFile/DWARF/./SymbolFileDWARFTests/SymbolFileDWARFTests.ParseArangesNonzeroSegmentSize (1969 of 2110) PASS: lldb-unit :: Utility/./UtilityTests/ScalarTest.Scalar_512 (1970 of 2110) PASS: lldb-api :: functionalities/gdb_remote_client/TestIOSSimulator.py (1971 of 2110) PASS: lldb-api :: functionalities/data-formatter/data-formatter-stl/libcxx/atomic/TestLibCxxAtomic.py (1972 of 2110) PASS: lldb-api :: python_api/watchpoint/watchlocation/TestTargetWatchAddress.py (1973 of 2110) PASS: lldb-api :: commands/target/create-no-such-arch/TestNoSuchArch.py (1974 of 2110) PASS: lldb-shell :: ObjectFile/ELF/netbsd-exec-8.99.30-amd64.yaml (1975 of 2110) PASS: lldb-shell :: ObjectFile/PECOFF/section-types.yaml (1976 of 2110) PASS: lldb-unit :: Utility/./UtilityTests/RangeTest.ContainsRange (1977 of 2110) PASS: lldb-shell :: ObjectFile/ELF/avr-basic-info.yaml (1978 of 2110) PASS: lldb-unit :: ScriptInterpreter/Python/./ScriptInterpreterPythonTests/PythonDataObjectsTest.TestRun (1979 of 2110) PASS: lldb-api :: functionalities/breakpoint/breakpoint_by_file_colon_line/TestBreakpointByFileColonLine.py (1980 of 2110) PASS: lldb-api :: tools/lldb-server/TestGdbRemoteKill.py (1981 of 2110) PASS: lldb-unit :: Utility/./UtilityTests/RegisterValueTest.GetSet8 (1982 of 2110) PASS: lldb-unit :: Symbol/./SymbolTests/TestTypeSystemClang.TestGetTypeClassTypeOf (1983 of 2110) PASS: lldb-api :: python_api/watchpoint/watchlocation/TestSetWatchlocation.py (1984 of 2110) PASS: lldb-api :: types/TestIntegerType.py (1985 of 2110) PASS: lldb-api :: lang/cpp/const_this/TestConstThis.py (1986 of 2110) PASS: lldb-shell :: SymbolFile/Breakpad/line-table.test (1987 of 2110) PASS: lldb-unit :: Utility/./UtilityTests/AnsiTerminal.Incomplete (1988 of 2110) PASS: lldb-unit :: Symbol/./SymbolTests/LineEntryTest.GetSameLineContiguousAddressRangeNestedInline (1989 of 2110) UNSUPPORTED: lldb-shell :: Register/aarch64-gp-read.test (1990 of 2110) UNSUPPORTED: lldb-api :: functionalities/darwin_log/filter/exact_match/message/TestDarwinLogFilterMatchMessage.py (1991 of 2110) PASS: lldb-shell :: SymbolFile/DWARF/DW_AT_declaration-with-children.s (1992 of 2110) PASS: lldb-unit :: Process/minidump/./LLDBMinidumpTests/MinidumpParserTest.GetPid (1993 of 2110) PASS: lldb-unit :: debugserver/./debugserverTests/RNBSocket.LoopBackConnectIPv4 (1994 of 2110) PASS: lldb-unit :: Utility/./UtilityTests/TimeoutTest.Construction (1995 of 2110) PASS: lldb-api :: commands/expression/cast_int_to_anonymous_enum/TestCastIntToAnonymousEnum.py (1996 of 2110) PASS: lldb-unit :: Symbol/./SymbolTests/TestClangASTImporter.MetadataPropagationAfterCopying (1997 of 2110) UNSUPPORTED: lldb-api :: functionalities/data-formatter/data-formatter-stl/libstdcpp/unique_ptr/TestDataFormatterStdUniquePtr.py (1998 of 2110) PASS: lldb-unit :: Utility/./UtilityTests/Flags.AnySet (1999 of 2110) PASS: lldb-unit :: Utility/./UtilityTests/BinaryStreamTest.PutSLEB128NineBytes (2000 of 2110) PASS: lldb-unit :: Utility/./UtilityTests/UriParserTest.MinimalPortPath (2001 of 2110) PASS: lldb-unit :: Utility/./UtilityTests/OptionsWithRawTest.TerminatedQuote (2002 of 2110) PASS: lldb-api :: commands/watchpoints/watchpoint_on_vectors/TestValueOfVectorVariable.py (2003 of 2110) PASS: lldb-unit :: UnwindAssembly/x86/./UnwindAssemblyx86Tests/Testx86AssemblyInspectionEngine.TestPopRBPWithREX (2004 of 2110) PASS: lldb-unit :: Utility/./UtilityTests/BinaryStreamTest.PutSLEB128SixBytes (2005 of 2110) PASS: lldb-api :: commands/expression/import-std-module/vector-dbg-info-content/TestDbgInfoContentVectorFromStdModule.py (2006 of 2110) PASS: lldb-unit :: UnwindAssembly/x86/./UnwindAssemblyx86Tests/Testx86AssemblyInspectionEngine.TestAddESP (2007 of 2110) PASS: lldb-unit :: Host/./HostTests/SocketAddressTest.Set (2008 of 2110) PASS: lldb-unit :: ScriptInterpreter/Python/./ScriptInterpreterPythonTests/PythonDataObjectsTest.TestGlobalNameResolutionWithDot (2009 of 2110) PASS: lldb-unit :: Utility/./UtilityTests/StringListTest.JoinNonSpace (2010 of 2110) PASS: lldb-api :: commands/watchpoints/watchpoint_size/TestWatchpointSizes.py (2011 of 2110) PASS: lldb-unit :: Utility/./UtilityTests/BinaryStreamTest.PutSLEB128TwoBytes (2012 of 2110) PASS: lldb-api :: functionalities/process_group/TestChangeProcessGroup.py (2013 of 2110) PASS: lldb-api :: lang/objc/foundation/TestObjCMethodsString.py (2014 of 2110) PASS: lldb-unit :: UnwindAssembly/x86/./UnwindAssemblyx86Tests/Testx86AssemblyInspectionEngine.TestLEAVE (2015 of 2110) PASS: lldb-api :: commands/breakpoint/command/list/TestBreakpointCommandList.py (2016 of 2110) PASS: lldb-unit :: Utility/./UtilityTests/RangeTest.LessThanInvalid (2017 of 2110) PASS: lldb-unit :: Utility/./UtilityTests/RangeDataVector.CustomSort (2018 of 2110) PASS: lldb-api :: macosx/thread-names/TestInterruptThreadNames.py (2019 of 2110) XFAIL: lldb-shell :: Register/x86-mm-xmm-write.test (2020 of 2110) PASS: lldb-api :: python_api/frame/get-variables/TestGetVariables.py (2021 of 2110) PASS: lldb-unit :: Utility/./UtilityTests/ConstStringTest.format_provider (2022 of 2110) PASS: lldb-api :: commands/disassemble/basic/TestDisassembleBreakpoint.py (2023 of 2110) PASS: lldb-unit :: Symbol/./SymbolTests/TestTypeSystemClang.TestBuiltinTypeForEncodingAndBitSize (2024 of 2110) PASS: lldb-api :: functionalities/data-formatter/data-formatter-skip-summary/TestDataFormatterSkipSummary.py (2025 of 2110) PASS: lldb-api :: python_api/value/TestValueAPI.py (2026 of 2110) PASS: lldb-shell :: Settings/TestEchoCommands.test (2027 of 2110) PASS: lldb-shell :: SymbolFile/DWARF/dir-separator-posix.s (2028 of 2110) PASS: lldb-shell :: SymbolFile/DWARF/inline-function-address.ll (2029 of 2110) PASS: lldb-api :: functionalities/data-formatter/data-formatter-objc/TestDataFormatterObjCPlain.py (2030 of 2110) PASS: lldb-api :: tools/lldb-vscode/stackTrace/TestVSCode_stackTrace.py (2031 of 2110) PASS: lldb-shell :: Minidump/Windows/find-module.test (2032 of 2110) PASS: lldb-unit :: Utility/./UtilityTests/ScalarTest.SetValueFromCString (2033 of 2110) PASS: lldb-api :: lang/cpp/this_class_type_mixing/TestThisClassTypeMixing.py (2034 of 2110) PASS: lldb-api :: functionalities/return-value/TestReturnValue.py (2035 of 2110) PASS: lldb-shell :: ObjectFile/PECOFF/uuid.yaml (2036 of 2110) PASS: lldb-unit :: SymbolFile/DWARF/./SymbolFileDWARFTests/SymbolFileDWARFTests.TestAbbrevOrder1Start1 (2037 of 2110) PASS: lldb-api :: functionalities/signal/handle-abrt/TestHandleAbort.py (2038 of 2110) PASS: lldb-unit :: Utility/./UtilityTests/StreamTest.PutSLEB128 (2039 of 2110) PASS: lldb-unit :: Language/CLanguages/./LanguageCLanguagesTests/CLanguages.LookupCLanguagesByLanguageType (2040 of 2110) PASS: lldb-api :: macosx/find-dsym/bundle-with-dot-in-filename/TestBundleWithDotInFilename.py (2041 of 2110) PASS: lldb-api :: functionalities/deleted-executable/TestDeletedExecutable.py (2042 of 2110) PASS: lldb-api :: commands/expression/dont_allow_jit/TestAllowJIT.py (2043 of 2110) PASS: lldb-unit :: Host/./HostTests/SocketTest.TCPGetAddress (2044 of 2110) PASS: lldb-shell :: Reproducer/TestSynchronous.test (2045 of 2110) PASS: lldb-api :: functionalities/data-formatter/data-formatter-stl/libcxx/map/TestDataFormatterLibccMap.py (2046 of 2110) PASS: lldb-api :: commands/apropos/basic/TestApropos.py (2047 of 2110) PASS: lldb-api :: lang/objc/objc-checker/TestObjCCheckers.py (2048 of 2110) PASS: lldb-api :: functionalities/thread/concurrent_events/TestConcurrentWatchpointWithDelayWatchpointThreads.py (2049 of 2110) PASS: lldb-api :: python_api/interpreter/TestCommandInterpreterAPI.py (2050 of 2110) UNSUPPORTED: lldb-api :: functionalities/darwin_log/filter/regex/category/TestDarwinLogFilterRegexCategory.py (2051 of 2110) PASS: lldb-unit :: Utility/./UtilityTests/StatusTest.Formatv (2052 of 2110) PASS: lldb-unit :: Utility/./UtilityTests/StreamTest.PutHex32ByteOrderLittle (2053 of 2110) PASS: lldb-unit :: Utility/./UtilityTests/DataExtractorTest.GetFloat (2054 of 2110) PASS: lldb-shell :: SymbolFile/DWARF/childless-compile-unit.s (2055 of 2110) PASS: lldb-shell :: ObjectFile/ELF/short-build-id.yaml (2056 of 2110) PASS: lldb-unit :: Utility/./UtilityTests/FileSpecTest.GuessPathStyle (2057 of 2110) PASS: lldb-api :: functionalities/data-formatter/nsdictionarysynth/TestNSDictionarySynthetic.py (2058 of 2110) PASS: lldb-unit :: ObjectFile/ELF/./ObjectFileELFTests/ObjectFileELFTest.GetSymtab_NoSymEntryPointArmAddressClass (2059 of 2110) PASS: lldb-unit :: Utility/./UtilityTests/StringListTest.InsertStringAtIndexMove (2060 of 2110) PASS: lldb-unit :: Utility/./UtilityTests/StreamTeeTest.SetStreamAtIndexOverwrite (2061 of 2110) PASS: lldb-api :: functionalities/tail_call_frames/inlining_and_tail_calls/TestInliningAndTailCalls.py (2062 of 2110) PASS: lldb-unit :: Utility/./UtilityTests/OptionsWithRawTest.UnterminatedQuote (2063 of 2110) PASS: lldb-unit :: Process/./ProcessEventDataTests/ProcessEventDataTest.ShouldStop (2064 of 2110) PASS: lldb-unit :: Utility/./UtilityTests/CompletionRequest.TestCompletionOwnership (2065 of 2110) PASS: lldb-unit :: UnwindAssembly/x86/./UnwindAssemblyx86Tests/Testx86AssemblyInspectionEngine.TestPopRBP (2066 of 2110) PASS: lldb-unit :: Process/gdb-remote/./ProcessGdbRemoteTests/GDBRemoteCommunicationClientTest.TestPacketSpeedJSON (2067 of 2110) PASS: lldb-api :: python_api/lldbutil/frame/TestFrameUtils.py (2068 of 2110) PASS: lldb-api :: tools/lldb-server/inferior-crash/TestGdbRemoteAbort.py (2069 of 2110) PASS: lldb-api :: iohandler/resize/TestIOHandlerResizeNoEditline.py (2070 of 2110) PASS: lldb-api :: commands/watchpoints/watchpoint_events/TestWatchpointEvents.py (2071 of 2110) PASS: lldb-api :: api/listeners/TestListener.py (2072 of 2110) PASS: lldb-api :: functionalities/data-formatter/data-formatter-stl/libcxx/tuple/TestDataFormatterLibcxxTuple.py (2073 of 2110) UNSUPPORTED: lldb-api :: functionalities/data-formatter/data-formatter-stl/libstdcpp/list/TestDataFormatterStdList.py (2074 of 2110) PASS: lldb-unit :: UnwindAssembly/x86/./UnwindAssemblyx86Tests/Testx86AssemblyInspectionEngine.TestStackRealignMSVC_i386 (2075 of 2110) PASS: lldb-api :: macosx/find-dsym/deep-bundle/TestDeepBundle.py (2076 of 2110) PASS: lldb-api :: tools/lldb-vscode/breakpoint/TestVSCode_setExceptionBreakpoints.py (2077 of 2110) PASS: lldb-api :: commands/session/save/TestSessionSave.py (2078 of 2110) PASS: lldb-unit :: Expression/./ExpressionTests/DiagnosticManagerTest.GetStringNoDiags (2079 of 2110) UNSUPPORTED: lldb-api :: linux/sepdebugsymlink/TestTargetSymbolsSepDebugSymlink.py (2080 of 2110) PASS: lldb-unit :: Language/Highlighting/./HighlighterTests/HighlighterTest.ClangBraces (2081 of 2110) PASS: lldb-api :: functionalities/data-formatter/varscript_formatting/TestDataFormatterVarScriptFormatting.py (2082 of 2110) PASS: lldb-api :: functionalities/breakpoint/step_over_breakpoint/TestStepOverBreakpoint.py (2083 of 2110) UNSUPPORTED: lldb-api :: functionalities/darwin_log/filter/regex/activity/TestDarwinLogFilterRegexActivity.py (2084 of 2110) PASS: lldb-api :: commands/target/dump-symtab-demangle/TestDumpSymtabDemangle.py (2085 of 2110) PASS: lldb-api :: lang/cpp/virtual-functions/TestCppVirtualFunctions.py (2086 of 2110) PASS: lldb-shell :: SymbolFile/DWARF/find-function-regex.cpp (2087 of 2110) PASS: lldb-api :: commands/platform/basic/TestPlatformCommand.py (2088 of 2110) PASS: lldb-api :: lang/cpp/namespace/TestNamespace.py (2089 of 2110) PASS: lldb-api :: types/TestRecursiveTypes.py (2090 of 2110) PASS: lldb-unit :: Utility/./UtilityTests/SubsystemRAIITest.SubsystemWithErrorFailure (2091 of 2110) PASS: lldb-unit :: Utility/./UtilityTests/StructuredDataTest.StringDump (2092 of 2110) PASS: lldb-unit :: Utility/./UtilityTests/UUIDTest.RelationalOperators (2093 of 2110) PASS: lldb-shell :: SymbolFile/DWARF/debug_loc_and_loclists.s (2094 of 2110) PASS: lldb-api :: python_api/sbvalue_const_addrof/TestSBValueConstAddrOf.py (2095 of 2110) PASS: lldb-unit :: Utility/./UtilityTests/ConstStringTest.YAML (2096 of 2110) PASS: lldb-api :: lang/objc/modules-compile-error/TestModulesCompileError.py (2097 of 2110) PASS: lldb-shell :: SymbolFile/NativePDB/locate-pdb.cpp (2098 of 2110) PASS: lldb-unit :: Process/minidump/./LLDBMinidumpTests/MinidumpParserTest.GetLinuxProcStatus_no_stream (2099 of 2110) PASS: lldb-unit :: Utility/./UtilityTests/ArgsTest.ReplaceArgumentAtIndexFarOutOfRange (2100 of 2110) UNSUPPORTED: lldb-api :: functionalities/data-formatter/data-formatter-stl/libstdcpp/vector/TestDataFormatterStdVector.py (2101 of 2110) PASS: lldb-shell :: Expr/TestMultilineExpr.test (2102 of 2110) UNSUPPORTED: lldb-shell :: Register/x86-64-xmm16-write.test (2103 of 2110) PASS: lldb-unit :: Utility/./UtilityTests/ArgsTest.ReplaceArgumentAtIndexLonger (2104 of 2110) PASS: lldb-unit :: Symbol/./SymbolTests/TestClangASTImporter.CopyTypeTagDecl (2105 of 2110) PASS: lldb-unit :: SymbolFile/NativePDB/./SymbolFileNativePDBTests/PDBFPOProgramToDWARFExpressionTests.InvalidOpUnary (2106 of 2110) PASS: lldb-unit :: Utility/./UtilityTests/ArgsTest.ReplaceArgumentAtIndexEqual (2107 of 2110) PASS: lldb-api :: lang/objc/objc-baseclass-sbtype/TestObjCBaseClassSBType.py (2108 of 2110) UNSUPPORTED: lldb-api :: lang/objc/objc-dynamic-value/TestObjCDynamicValue.py (2109 of 2110) PASS: lldb-api :: lang/objc/objc-struct-argument/TestObjCStructArgument.py (2110 of 2110) Slowest Tests: -------------------------------------------------------------------------- 648.64s: lldb-api :: tools/lldb-server/TestLldbGdbServer.py 256.84s: lldb-api :: lang/cpp/enum_types/TestCPP11EnumTypes.py 252.03s: lldb-api :: lang/objc/hidden-ivars/TestHiddenIvars.py 249.47s: lldb-api :: api/multithreaded/TestMultithreaded.py 203.40s: lldb-api :: lang/objc/foundation/TestObjCMethods.py 143.39s: lldb-api :: lang/objc/exceptions/TestObjCExceptions.py 140.67s: lldb-api :: lang/cpp/namespace/TestNamespaceLookup.py 138.72s: lldb-api :: lang/objc/objc-new-syntax/TestObjCNewSyntaxLiteral.py 133.61s: lldb-api :: lang/objc/real-definition/TestRealDefinition.py 121.65s: lldb-api :: python_api/exprpath_synthetic/TestExprPathSynthetic.py 120.72s: lldb-api :: types/TestLongTypesExpr.py 107.18s: lldb-api :: lang/objc/foundation/TestObjCMethodsString.py 104.97s: lldb-api :: lang/objc/foundation/TestObjCMethodsNSError.py 104.60s: lldb-api :: lang/objc/objc-new-syntax/TestObjCNewSyntaxArray.py 103.97s: lldb-api :: lang/objc/objc-new-syntax/TestObjCNewSyntaxDictionary.py 91.54s: lldb-api :: functionalities/gdb_remote_client/TestWasm.py 86.85s: lldb-api :: commands/settings/TestSettings.py 86.51s: lldb-api :: functionalities/data-formatter/compactvectors/TestCompactVectors.py 85.51s: lldb-api :: tools/lldb-server/TestGdbRemoteThreadsInStopReply.py 83.75s: lldb-api :: types/TestCharTypeExpr.py

Hide Details

Tests Times: -------------------------------------------------------------------------- [ Range ] :: [ Percentage ] :: [ Count ] -------------------------------------------------------------------------- [600s,650s) :: [ ] :: [ 1/2110] [550s,600s) :: [ ] :: [ 0/2110] [500s,550s) :: [ ] :: [ 0/2110] [450s,500s) :: [ ] :: [ 0/2110] [400s,450s) :: [ ] :: [ 0/2110] [350s,400s) :: [ ] :: [ 0/2110] [300s,350s) :: [ ] :: [ 0/2110] [250s,300s) :: [ ] :: [ 2/2110] [200s,250s) :: [ ] :: [ 2/2110] [150s,200s) :: [ ] :: [ 0/2110] [100s,150s) :: [ ] :: [ 10/2110] [ 50s,100s) :: [ ] :: [ 45/2110] [ 0s, 50s) :: [************************************** ] :: [2050/2110] -------------------------------------------------------------------------- ******************** Failed Tests (3): lldb-api :: macosx/simulator/TestSimulatorPlatform.py lldb-api :: macosx/macCatalyst/TestMacCatalyst.py lldb-api :: python_api/target/TestTargetAPI.py

Hide Details

Hide Details

Testing Time: 4252.81s Unsupported : 182 Passed : 1919 Expectedly Failed: 6 Failed : 3 FAILED: tools/lldb/test/CMakeFiles/check-lldb-lit cd /Users/buildslave/jenkins/workspace/lldb-cmake-sanitized/lldb-build/tools/lldb/test && /usr/local/Frameworks/Python.framework/Versions/3.7/bin/python3.7 /Users/buildslave/jenkins/workspace/lldb-cmake-sanitized/lldb-build/./bin/llvm-lit -v --time-tests --shuffle --xunit-xml-output=/Users/buildslave/jenkins/workspace/lldb-cmake-sanitized/test/results.xml -v -j 4 --timeout 1200 /Users/buildslave/jenkins/workspace/lldb-cmake-sanitized/lldb-build/tools/lldb/test ninja: build stopped: subcommand failed. Command failed: Command '['/usr/bin/env', 'TERM=vt100', '/usr/local/bin/ninja', '-v', 'check-lldb']' returned non-zero exit status 1. Command: ['/usr/bin/env', 'TERM=vt100', '/usr/local/bin/ninja', '-v', 'check-lldb'] [Pipeline] } [Pipeline] // timeout [Pipeline] } [Pipeline] // stage [Pipeline] stage [Pipeline] { (Declarative: Post Actions) [Pipeline] scanForIssues [Clang (LLVM based)] Sleeping for 5 seconds due to JENKINS-32191... [Clang (LLVM based)] Parsing console log (workspace: '/Users/buildslave/jenkins/workspace/lldb-cmake-sanitized') [Clang (LLVM based)] Successfully parsed console log [Clang (LLVM based)] -> found 3 issues (skipped 0 duplicates) [Clang (LLVM based)] Post processing issues on 'green-dragon-23' with source code encoding 'UTF-8' [Clang (LLVM based)] Creating SCM blamer to obtain author and commit information for affected files [Clang (LLVM based)] Creating SCM miner to obtain statistics for affected repository files [Clang (LLVM based)] Resolving file names for all issues in source directory '/Users/buildslave/jenkins/workspace/lldb-cmake-sanitized' [Clang (LLVM based)] -> resolved paths in source directory (2 found, 0 not found) [Clang (LLVM based)] Resolving module names from module definitions (build.xml, pom.xml, or Manifest.mf files) [Clang (LLVM based)] -> resolved module names for 3 issues [Clang (LLVM based)] Resolving package names (or namespaces) by parsing the affected files [Clang (LLVM based)] -> resolved package names of 2 affected files [Clang (LLVM based)] No filter has been set, publishing all 3 issues [Clang (LLVM based)] Creating fingerprints for all affected code blocks to track issues over different builds [Clang (LLVM based)] -> created fingerprints for 3 issues (skipped 0 issues) [Clang (LLVM based)] Copying affected files to Jenkins' build folder '/Users/Shared/Jenkins/Home/jobs/lldb-cmake-sanitized/builds/1701/files-with-issues' [Clang (LLVM based)] -> 2 copied, 0 not in workspace, 0 not-found, 0 with I/O error [Pipeline] junit Recording test results [Pipeline] } [Pipeline] // stage [Pipeline] } [Pipeline] // withEnv [Pipeline] } [Pipeline] // node [Pipeline] End of Pipeline ERROR: script returned exit code 1 Finished: FAILURE